lucene-dev mailing list archives

Site index · List index
Message view « Date » · « Thread »
Top « Date » · « Thread »
From Apache Jenkins Server <jenk...@builds.apache.org>
Subject [JENKINS] Lucene-Solr-Tests-8.x - Build # 191 - Unstable
Date Tue, 07 May 2019 14:09:49 GMT
Build: https://builds.apache.org/job/Lucene-Solr-Tests-8.x/191/

2 tests failed.
FAILED:  org.apache.solr.security.JWTAuthPluginIntegrationTest.createCollectionUpdateAndQueryDistributed

Error Message:
Expected metric minimums for prefix SECURITY./authentication/pki.: {failMissingCredentials=0, authenticated=12, passThrough=0, failWrongCredentials=0, requests=12, errors=0}, but got: {failMissingCredentials=0, authenticated=4, passThrough=0, totalTime=24197899, failWrongCredentials=0, requestTimes=363, requests=4, errors=0}

Stack Trace:
java.lang.AssertionError: Expected metric minimums for prefix SECURITY./authentication/pki.: {failMissingCredentials=0, authenticated=12, passThrough=0, failWrongCredentials=0, requests=12, errors=0}, but got: {failMissingCredentials=0, authenticated=4, passThrough=0, totalTime=24197899, failWrongCredentials=0, requestTimes=363, requests=4, errors=0}
	at __randomizedtesting.SeedInfo.seed([D144B5E0BE5D5D08:D76CB78EDCEACBBB]:0)
	at org.junit.Assert.fail(Assert.java:88)
	at org.junit.Assert.assertTrue(Assert.java:41)
	at org.apache.solr.cloud.SolrCloudAuthTestCase.assertAuthMetricsMinimums(SolrCloudAuthTestCase.java:129)
	at org.apache.solr.cloud.SolrCloudAuthTestCase.assertPkiAuthMetricsMinimums(SolrCloudAuthTestCase.java:74)
	at org.apache.solr.security.JWTAuthPluginIntegrationTest.createCollectionUpdateAndQueryDistributed(JWTAuthPluginIntegrationTest.java:173)
	at sun.reflect.NativeMethodAccessorImpl.invoke0(Native Method)
	at sun.reflect.NativeMethodAccessorImpl.invoke(NativeMethodAccessorImpl.java:62)
	at sun.reflect.DelegatingMethodAccessorImpl.invoke(DelegatingMethodAccessorImpl.java:43)
	at java.lang.reflect.Method.invoke(Method.java:498)
	at com.carrotsearch.randomizedtesting.RandomizedRunner.invoke(RandomizedRunner.java:1750)
	at com.carrotsearch.randomizedtesting.RandomizedRunner$8.evaluate(RandomizedRunner.java:938)
	at com.carrotsearch.randomizedtesting.RandomizedRunner$9.evaluate(RandomizedRunner.java:974)
	at com.carrotsearch.randomizedtesting.RandomizedRunner$10.evaluate(RandomizedRunner.java:988)
	at com.carrotsearch.randomizedtesting.rules.SystemPropertiesRestoreRule$1.evaluate(SystemPropertiesRestoreRule.java:57)
	at org.apache.lucene.util.TestRuleSetupTeardownChained$1.evaluate(TestRuleSetupTeardownChained.java:49)
	at org.apache.lucene.util.AbstractBeforeAfterRule$1.evaluate(AbstractBeforeAfterRule.java:45)
	at org.apache.lucene.util.TestRuleThreadAndTestName$1.evaluate(TestRuleThreadAndTestName.java:48)
	at org.apache.lucene.util.TestRuleIgnoreAfterMaxFailures$1.evaluate(TestRuleIgnoreAfterMaxFailures.java:64)
	at org.apache.lucene.util.TestRuleMarkFailure$1.evaluate(TestRuleMarkFailure.java:47)
	at com.carrotsearch.randomizedtesting.rules.StatementAdapter.evaluate(StatementAdapter.java:36)
	at com.carrotsearch.randomizedtesting.ThreadLeakControl$StatementRunner.run(ThreadLeakControl.java:368)
	at com.carrotsearch.randomizedtesting.ThreadLeakControl.forkTimeoutingTask(ThreadLeakControl.java:817)
	at com.carrotsearch.randomizedtesting.ThreadLeakControl$3.evaluate(ThreadLeakControl.java:468)
	at com.carrotsearch.randomizedtesting.RandomizedRunner.runSingleTest(RandomizedRunner.java:947)
	at com.carrotsearch.randomizedtesting.RandomizedRunner$5.evaluate(RandomizedRunner.java:832)
	at com.carrotsearch.randomizedtesting.RandomizedRunner$6.evaluate(RandomizedRunner.java:883)
	at com.carrotsearch.randomizedtesting.RandomizedRunner$7.evaluate(RandomizedRunner.java:894)
	at com.carrotsearch.randomizedtesting.rules.StatementAdapter.evaluate(StatementAdapter.java:36)
	at com.carrotsearch.randomizedtesting.rules.SystemPropertiesRestoreRule$1.evaluate(SystemPropertiesRestoreRule.java:57)
	at org.apache.lucene.util.AbstractBeforeAfterRule$1.evaluate(AbstractBeforeAfterRule.java:45)
	at com.carrotsearch.randomizedtesting.rules.StatementAdapter.evaluate(StatementAdapter.java:36)
	at org.apache.lucene.util.TestRuleStoreClassName$1.evaluate(TestRuleStoreClassName.java:41)
	at com.carrotsearch.randomizedtesting.rules.NoShadowingOrOverridesOnMethodsRule$1.evaluate(NoShadowingOrOverridesOnMethodsRule.java:40)
	at com.carrotsearch.randomizedtesting.rules.NoShadowingOrOverridesOnMethodsRule$1.evaluate(NoShadowingOrOverridesOnMethodsRule.java:40)
	at com.carrotsearch.randomizedtesting.rules.StatementAdapter.evaluate(StatementAdapter.java:36)
	at com.carrotsearch.randomizedtesting.rules.StatementAdapter.evaluate(StatementAdapter.java:36)
	at com.carrotsearch.randomizedtesting.rules.StatementAdapter.evaluate(StatementAdapter.java:36)
	at org.apache.lucene.util.TestRuleAssertionsRequired$1.evaluate(TestRuleAssertionsRequired.java:53)
	at org.apache.lucene.util.TestRuleMarkFailure$1.evaluate(TestRuleMarkFailure.java:47)
	at org.apache.lucene.util.TestRuleIgnoreAfterMaxFailures$1.evaluate(TestRuleIgnoreAfterMaxFailures.java:64)
	at org.apache.lucene.util.TestRuleIgnoreTestSuites$1.evaluate(TestRuleIgnoreTestSuites.java:54)
	at com.carrotsearch.randomizedtesting.rules.StatementAdapter.evaluate(StatementAdapter.java:36)
	at com.carrotsearch.randomizedtesting.ThreadLeakControl$StatementRunner.run(ThreadLeakControl.java:368)
	at java.lang.Thread.run(Thread.java:748)


FAILED:  org.apache.solr.security.hadoop.TestSolrCloudWithHadoopAuthPlugin.testBasics

Error Message:
Expected metric minimums for prefix SECURITY./authentication.: {failMissingCredentials=0, authenticated=8, passThrough=0, failWrongCredentials=8, requests=16, errors=0}, but got: {failMissingCredentials=0, authenticated=8, passThrough=0, totalTime=46847684, failWrongCredentials=6, requestTimes=3162, requests=14, errors=0}

Stack Trace:
java.lang.AssertionError: Expected metric minimums for prefix SECURITY./authentication.: {failMissingCredentials=0, authenticated=8, passThrough=0, failWrongCredentials=8, requests=16, errors=0}, but got: {failMissingCredentials=0, authenticated=8, passThrough=0, totalTime=46847684, failWrongCredentials=6, requestTimes=3162, requests=14, errors=0}
	at __randomizedtesting.SeedInfo.seed([D144B5E0BE5D5D08:EC9C1BCC86B30378]:0)
	at org.junit.Assert.fail(Assert.java:88)
	at org.junit.Assert.assertTrue(Assert.java:41)
	at org.apache.solr.cloud.SolrCloudAuthTestCase.assertAuthMetricsMinimums(SolrCloudAuthTestCase.java:129)
	at org.apache.solr.cloud.SolrCloudAuthTestCase.assertAuthMetricsMinimums(SolrCloudAuthTestCase.java:83)
	at org.apache.solr.security.hadoop.TestSolrCloudWithHadoopAuthPlugin.testCollectionCreateSearchDelete(TestSolrCloudWithHadoopAuthPlugin.java:139)
	at org.apache.solr.security.hadoop.TestSolrCloudWithHadoopAuthPlugin.testBasics(TestSolrCloudWithHadoopAuthPlugin.java:108)
	at sun.reflect.NativeMethodAccessorImpl.invoke0(Native Method)
	at sun.reflect.NativeMethodAccessorImpl.invoke(NativeMethodAccessorImpl.java:62)
	at sun.reflect.DelegatingMethodAccessorImpl.invoke(DelegatingMethodAccessorImpl.java:43)
	at java.lang.reflect.Method.invoke(Method.java:498)
	at com.carrotsearch.randomizedtesting.RandomizedRunner.invoke(RandomizedRunner.java:1750)
	at com.carrotsearch.randomizedtesting.RandomizedRunner$8.evaluate(RandomizedRunner.java:938)
	at com.carrotsearch.randomizedtesting.RandomizedRunner$9.evaluate(RandomizedRunner.java:974)
	at com.carrotsearch.randomizedtesting.RandomizedRunner$10.evaluate(RandomizedRunner.java:988)
	at com.carrotsearch.randomizedtesting.rules.SystemPropertiesRestoreRule$1.evaluate(SystemPropertiesRestoreRule.java:57)
	at org.apache.lucene.util.TestRuleSetupTeardownChained$1.evaluate(TestRuleSetupTeardownChained.java:49)
	at org.apache.lucene.util.AbstractBeforeAfterRule$1.evaluate(AbstractBeforeAfterRule.java:45)
	at org.apache.lucene.util.TestRuleThreadAndTestName$1.evaluate(TestRuleThreadAndTestName.java:48)
	at org.apache.lucene.util.TestRuleIgnoreAfterMaxFailures$1.evaluate(TestRuleIgnoreAfterMaxFailures.java:64)
	at org.apache.lucene.util.TestRuleMarkFailure$1.evaluate(TestRuleMarkFailure.java:47)
	at com.carrotsearch.randomizedtesting.rules.StatementAdapter.evaluate(StatementAdapter.java:36)
	at com.carrotsearch.randomizedtesting.ThreadLeakControl$StatementRunner.run(ThreadLeakControl.java:368)
	at com.carrotsearch.randomizedtesting.ThreadLeakControl.forkTimeoutingTask(ThreadLeakControl.java:817)
	at com.carrotsearch.randomizedtesting.ThreadLeakControl$3.evaluate(ThreadLeakControl.java:468)
	at com.carrotsearch.randomizedtesting.RandomizedRunner.runSingleTest(RandomizedRunner.java:947)
	at com.carrotsearch.randomizedtesting.RandomizedRunner$5.evaluate(RandomizedRunner.java:832)
	at com.carrotsearch.randomizedtesting.RandomizedRunner$6.evaluate(RandomizedRunner.java:883)
	at com.carrotsearch.randomizedtesting.RandomizedRunner$7.evaluate(RandomizedRunner.java:894)
	at com.carrotsearch.randomizedtesting.rules.StatementAdapter.evaluate(StatementAdapter.java:36)
	at com.carrotsearch.randomizedtesting.rules.SystemPropertiesRestoreRule$1.evaluate(SystemPropertiesRestoreRule.java:57)
	at org.apache.lucene.util.AbstractBeforeAfterRule$1.evaluate(AbstractBeforeAfterRule.java:45)
	at com.carrotsearch.randomizedtesting.rules.StatementAdapter.evaluate(StatementAdapter.java:36)
	at org.apache.lucene.util.TestRuleStoreClassName$1.evaluate(TestRuleStoreClassName.java:41)
	at com.carrotsearch.randomizedtesting.rules.NoShadowingOrOverridesOnMethodsRule$1.evaluate(NoShadowingOrOverridesOnMethodsRule.java:40)
	at com.carrotsearch.randomizedtesting.rules.NoShadowingOrOverridesOnMethodsRule$1.evaluate(NoShadowingOrOverridesOnMethodsRule.java:40)
	at com.carrotsearch.randomizedtesting.rules.StatementAdapter.evaluate(StatementAdapter.java:36)
	at com.carrotsearch.randomizedtesting.rules.StatementAdapter.evaluate(StatementAdapter.java:36)
	at com.carrotsearch.randomizedtesting.rules.StatementAdapter.evaluate(StatementAdapter.java:36)
	at org.apache.lucene.util.TestRuleAssertionsRequired$1.evaluate(TestRuleAssertionsRequired.java:53)
	at org.apache.lucene.util.TestRuleMarkFailure$1.evaluate(TestRuleMarkFailure.java:47)
	at org.apache.lucene.util.TestRuleIgnoreAfterMaxFailures$1.evaluate(TestRuleIgnoreAfterMaxFailures.java:64)
	at org.apache.lucene.util.TestRuleIgnoreTestSuites$1.evaluate(TestRuleIgnoreTestSuites.java:54)
	at com.carrotsearch.randomizedtesting.rules.StatementAdapter.evaluate(StatementAdapter.java:36)
	at com.carrotsearch.randomizedtesting.ThreadLeakControl$StatementRunner.run(ThreadLeakControl.java:368)
	at java.lang.Thread.run(Thread.java:748)




Build Log:
[...truncated 13622 lines...]
   [junit4] Suite: org.apache.solr.security.JWTAuthPluginIntegrationTest
   [junit4]   2> 813145 INFO  (SUITE-JWTAuthPluginIntegrationTest-seed#[D144B5E0BE5D5D08]-worker) [    ] o.a.s.SolrTestCaseJ4 SecureRandom sanity checks: test.solr.allowed.securerandom=null & java.security.egd=file:/dev/./urandom
   [junit4]   2> Creating dataDir: /x1/jenkins/jenkins-slave/workspace/Lucene-Solr-Tests-8.x/solr/build/solr-core/test/J2/temp/solr.security.JWTAuthPluginIntegrationTest_D144B5E0BE5D5D08-001/init-core-data-001
   [junit4]   2> 813145 WARN  (SUITE-JWTAuthPluginIntegrationTest-seed#[D144B5E0BE5D5D08]-worker) [    ] o.a.s.SolrTestCaseJ4 startTrackingSearchers: numOpens=18 numCloses=18
   [junit4]   2> 813145 INFO  (SUITE-JWTAuthPluginIntegrationTest-seed#[D144B5E0BE5D5D08]-worker) [    ] o.a.s.SolrTestCaseJ4 Using TrieFields (NUMERIC_POINTS_SYSPROP=false) w/NUMERIC_DOCVALUES_SYSPROP=false
   [junit4]   2> 813148 INFO  (SUITE-JWTAuthPluginIntegrationTest-seed#[D144B5E0BE5D5D08]-worker) [    ] o.a.s.SolrTestCaseJ4 Randomized ssl (false) and clientAuth (false) via: @org.apache.solr.SolrTestCaseJ4$SuppressSSL(bugUrl=None)
   [junit4]   2> 813151 INFO  (TEST-JWTAuthPluginIntegrationTest.createCollectionUpdateAndQueryDistributed-seed#[D144B5E0BE5D5D08]) [    ] o.a.s.SolrTestCaseJ4 ###Starting createCollectionUpdateAndQueryDistributed
   [junit4]   2> 813153 INFO  (TEST-JWTAuthPluginIntegrationTest.createCollectionUpdateAndQueryDistributed-seed#[D144B5E0BE5D5D08]) [    ] o.a.s.c.MiniSolrCloudCluster Starting cluster of 2 servers in /x1/jenkins/jenkins-slave/workspace/Lucene-Solr-Tests-8.x/solr/build/solr-core/test/J2/temp/solr.security.JWTAuthPluginIntegrationTest_D144B5E0BE5D5D08-001/tempDir-001
   [junit4]   2> 813153 INFO  (TEST-JWTAuthPluginIntegrationTest.createCollectionUpdateAndQueryDistributed-seed#[D144B5E0BE5D5D08]) [    ] o.a.s.c.ZkTestServer STARTING ZK TEST SERVER
   [junit4]   2> 813154 INFO  (ZkTestServer Run Thread) [    ] o.a.s.c.ZkTestServer client port:0.0.0.0/0.0.0.0:0
   [junit4]   2> 813154 INFO  (ZkTestServer Run Thread) [    ] o.a.s.c.ZkTestServer Starting server
   [junit4]   2> 813254 INFO  (TEST-JWTAuthPluginIntegrationTest.createCollectionUpdateAndQueryDistributed-seed#[D144B5E0BE5D5D08]) [    ] o.a.s.c.ZkTestServer start zk server on port:40446
   [junit4]   2> 813254 INFO  (TEST-JWTAuthPluginIntegrationTest.createCollectionUpdateAndQueryDistributed-seed#[D144B5E0BE5D5D08]) [    ] o.a.s.c.ZkTestServer parse host and port list: 127.0.0.1:40446
   [junit4]   2> 813254 INFO  (TEST-JWTAuthPluginIntegrationTest.createCollectionUpdateAndQueryDistributed-seed#[D144B5E0BE5D5D08]) [    ] o.a.s.c.ZkTestServer connecting to 127.0.0.1 40446
   [junit4]   2> 813258 INFO  (zkConnectionManagerCallback-7461-thread-1) [    ] o.a.s.c.c.ConnectionManager zkClient has connected
   [junit4]   2> 813261 INFO  (zkConnectionManagerCallback-7463-thread-1) [    ] o.a.s.c.c.ConnectionManager zkClient has connected
   [junit4]   2> 813263 INFO  (zkConnectionManagerCallback-7465-thread-1) [    ] o.a.s.c.c.ConnectionManager zkClient has connected
   [junit4]   2> 813266 WARN  (jetty-launcher-7466-thread-1) [    ] o.e.j.s.AbstractConnector Ignoring deprecated socket close linger time
   [junit4]   2> 813266 WARN  (jetty-launcher-7466-thread-2) [    ] o.e.j.s.AbstractConnector Ignoring deprecated socket close linger time
   [junit4]   2> 813266 INFO  (jetty-launcher-7466-thread-1) [    ] o.a.s.c.s.e.JettySolrRunner Start Jetty (original configured port=0)
   [junit4]   2> 813266 INFO  (jetty-launcher-7466-thread-2) [    ] o.a.s.c.s.e.JettySolrRunner Start Jetty (original configured port=0)
   [junit4]   2> 813266 INFO  (jetty-launcher-7466-thread-2) [    ] o.a.s.c.s.e.JettySolrRunner Trying to start Jetty on port 0 try number 1 ...
   [junit4]   2> 813266 INFO  (jetty-launcher-7466-thread-1) [    ] o.a.s.c.s.e.JettySolrRunner Trying to start Jetty on port 0 try number 1 ...
   [junit4]   2> 813266 INFO  (jetty-launcher-7466-thread-2) [    ] o.e.j.s.Server jetty-9.4.14.v20181114; built: 2018-11-14T21:20:31.478Z; git: c4550056e785fb5665914545889f21dc136ad9e6; jvm 1.8.0_191-b12
   [junit4]   2> 813266 INFO  (jetty-launcher-7466-thread-1) [    ] o.e.j.s.Server jetty-9.4.14.v20181114; built: 2018-11-14T21:20:31.478Z; git: c4550056e785fb5665914545889f21dc136ad9e6; jvm 1.8.0_191-b12
   [junit4]   2> 813268 INFO  (jetty-launcher-7466-thread-1) [    ] o.e.j.s.session DefaultSessionIdManager workerName=node0
   [junit4]   2> 813268 INFO  (jetty-launcher-7466-thread-1) [    ] o.e.j.s.session No SessionScavenger set, using defaults
   [junit4]   2> 813268 INFO  (jetty-launcher-7466-thread-1) [    ] o.e.j.s.session node0 Scavenging every 600000ms
   [junit4]   2> 813268 INFO  (jetty-launcher-7466-thread-2) [    ] o.e.j.s.session DefaultSessionIdManager workerName=node0
   [junit4]   2> 813268 INFO  (jetty-launcher-7466-thread-2) [    ] o.e.j.s.session No SessionScavenger set, using defaults
   [junit4]   2> 813268 INFO  (jetty-launcher-7466-thread-2) [    ] o.e.j.s.session node0 Scavenging every 600000ms
   [junit4]   2> 813268 INFO  (jetty-launcher-7466-thread-1) [    ] o.e.j.s.h.ContextHandler Started o.e.j.s.ServletContextHandler@3664609d{/solr,null,AVAILABLE}
   [junit4]   2> 813269 INFO  (jetty-launcher-7466-thread-2) [    ] o.e.j.s.h.ContextHandler Started o.e.j.s.ServletContextHandler@4763977{/solr,null,AVAILABLE}
   [junit4]   2> 813269 INFO  (jetty-launcher-7466-thread-2) [    ] o.e.j.s.AbstractConnector Started ServerConnector@733c3b4b{HTTP/1.1,[http/1.1, h2c]}{127.0.0.1:44760}
   [junit4]   2> 813269 INFO  (jetty-launcher-7466-thread-2) [    ] o.e.j.s.Server Started @813404ms
   [junit4]   2> 813269 INFO  (jetty-launcher-7466-thread-2) [    ] o.a.s.c.s.e.JettySolrRunner Jetty properties: {hostContext=/solr, hostPort=44760}
   [junit4]   2> 813269 ERROR (jetty-launcher-7466-thread-2) [    ] o.a.s.u.StartupLoggingUtils Missing Java Option solr.log.dir. Logging may be missing or incomplete.
   [junit4]   2> 813269 INFO  (jetty-launcher-7466-thread-2) [    ] o.a.s.s.SolrDispatchFilter Using logger factory org.apache.logging.slf4j.Log4jLoggerFactory
   [junit4]   2> 813271 INFO  (jetty-launcher-7466-thread-1) [    ] o.e.j.s.AbstractConnector Started ServerConnector@78c894a7{HTTP/1.1,[http/1.1, h2c]}{127.0.0.1:34407}
   [junit4]   2> 813271 INFO  (jetty-launcher-7466-thread-1) [    ] o.e.j.s.Server Started @813406ms
   [junit4]   2> 813271 INFO  (jetty-launcher-7466-thread-1) [    ] o.a.s.c.s.e.JettySolrRunner Jetty properties: {hostContext=/solr, hostPort=34407}
   [junit4]   2> 813271 ERROR (jetty-launcher-7466-thread-1) [    ] o.a.s.u.StartupLoggingUtils Missing Java Option solr.log.dir. Logging may be missing or incomplete.
   [junit4]   2> 813271 INFO  (jetty-launcher-7466-thread-2) [    ] o.a.s.s.SolrDispatchFilter  ___      _       Welcome to Apache Solr™ version 8.2.0
   [junit4]   2> 813271 INFO  (jetty-launcher-7466-thread-1) [    ] o.a.s.s.SolrDispatchFilter Using logger factory org.apache.logging.slf4j.Log4jLoggerFactory
   [junit4]   2> 813271 INFO  (jetty-launcher-7466-thread-2) [    ] o.a.s.s.SolrDispatchFilter / __| ___| |_ _   Starting in cloud mode on port null
   [junit4]   2> 813271 INFO  (jetty-launcher-7466-thread-2) [    ] o.a.s.s.SolrDispatchFilter \__ \/ _ \ | '_|  Install dir: null
   [junit4]   2> 813271 INFO  (jetty-launcher-7466-thread-2) [    ] o.a.s.s.SolrDispatchFilter |___/\___/_|_|    Start time: 2019-05-07T13:15:56.708Z
   [junit4]   2> 813272 INFO  (jetty-launcher-7466-thread-1) [    ] o.a.s.s.SolrDispatchFilter  ___      _       Welcome to Apache Solr™ version 8.2.0
   [junit4]   2> 813272 INFO  (jetty-launcher-7466-thread-1) [    ] o.a.s.s.SolrDispatchFilter / __| ___| |_ _   Starting in cloud mode on port null
   [junit4]   2> 813272 INFO  (jetty-launcher-7466-thread-1) [    ] o.a.s.s.SolrDispatchFilter \__ \/ _ \ | '_|  Install dir: null
   [junit4]   2> 813272 INFO  (jetty-launcher-7466-thread-1) [    ] o.a.s.s.SolrDispatchFilter |___/\___/_|_|    Start time: 2019-05-07T13:15:56.709Z
   [junit4]   2> 813284 INFO  (zkConnectionManagerCallback-7468-thread-1) [    ] o.a.s.c.c.ConnectionManager zkClient has connected
   [junit4]   2> 813284 INFO  (zkConnectionManagerCallback-7470-thread-1) [    ] o.a.s.c.c.ConnectionManager zkClient has connected
   [junit4]   2> 813285 INFO  (jetty-launcher-7466-thread-2) [    ] o.a.s.s.SolrDispatchFilter solr.xml found in ZooKeeper. Loading...
   [junit4]   2> 813288 INFO  (jetty-launcher-7466-thread-1) [    ] o.a.s.s.SolrDispatchFilter solr.xml found in ZooKeeper. Loading...
   [junit4]   2> 813484 INFO  (jetty-launcher-7466-thread-2) [    ] o.a.s.h.c.HttpShardHandlerFactory Host whitelist initialized: WhitelistHostChecker [whitelistHosts=null, whitelistHostCheckingEnabled=true]
   [junit4]   2> 813486 WARN  (jetty-launcher-7466-thread-2) [    ] o.e.j.u.s.S.config No Client EndPointIdentificationAlgorithm configured for SslContextFactory@2248f9a1[provider=null,keyStore=null,trustStore=null]
   [junit4]   2> 813490 WARN  (jetty-launcher-7466-thread-2) [    ] o.e.j.u.s.S.config No Client EndPointIdentificationAlgorithm configured for SslContextFactory@407bb605[provider=null,keyStore=null,trustStore=null]
   [junit4]   2> 813491 INFO  (jetty-launcher-7466-thread-2) [    ] o.a.s.c.ZkContainer Zookeeper client=127.0.0.1:40446/solr
   [junit4]   2> 813493 INFO  (zkConnectionManagerCallback-7478-thread-1) [    ] o.a.s.c.c.ConnectionManager zkClient has connected
   [junit4]   2> 813497 INFO  (zkConnectionManagerCallback-7480-thread-1) [    ] o.a.s.c.c.ConnectionManager zkClient has connected
   [junit4]   2> 813515 INFO  (jetty-launcher-7466-thread-1) [    ] o.a.s.h.c.HttpShardHandlerFactory Host whitelist initialized: WhitelistHostChecker [whitelistHosts=null, whitelistHostCheckingEnabled=true]
   [junit4]   2> 813517 WARN  (jetty-launcher-7466-thread-1) [    ] o.e.j.u.s.S.config No Client EndPointIdentificationAlgorithm configured for SslContextFactory@7f4739f[provider=null,keyStore=null,trustStore=null]
   [junit4]   2> 813521 WARN  (jetty-launcher-7466-thread-1) [    ] o.e.j.u.s.S.config No Client EndPointIdentificationAlgorithm configured for SslContextFactory@54f26dc4[provider=null,keyStore=null,trustStore=null]
   [junit4]   2> 813522 INFO  (jetty-launcher-7466-thread-1) [    ] o.a.s.c.ZkContainer Zookeeper client=127.0.0.1:40446/solr
   [junit4]   2> 813525 INFO  (zkConnectionManagerCallback-7488-thread-1) [    ] o.a.s.c.c.ConnectionManager zkClient has connected
   [junit4]   2> 813529 INFO  (zkConnectionManagerCallback-7490-thread-1) [    ] o.a.s.c.c.ConnectionManager zkClient has connected
   [junit4]   2> 813545 INFO  (jetty-launcher-7466-thread-1) [n:127.0.0.1:34407_solr    ] o.a.s.c.OverseerElectionContext I am going to be the leader 127.0.0.1:34407_solr
   [junit4]   2> 813546 INFO  (jetty-launcher-7466-thread-1) [n:127.0.0.1:34407_solr    ] o.a.s.c.Overseer Overseer (id=73261471238979592-127.0.0.1:34407_solr-n_0000000000) starting
   [junit4]   2> 813556 INFO  (zkConnectionManagerCallback-7497-thread-1) [    ] o.a.s.c.c.ConnectionManager zkClient has connected
   [junit4]   2> 813562 INFO  (jetty-launcher-7466-thread-1) [n:127.0.0.1:34407_solr    ] o.a.s.c.s.i.ZkClientClusterStateProvider Cluster at 127.0.0.1:40446/solr ready
   [junit4]   2> 813564 INFO  (jetty-launcher-7466-thread-1) [n:127.0.0.1:34407_solr    ] o.a.s.c.ZkController Register node as live in ZooKeeper:/live_nodes/127.0.0.1:34407_solr
   [junit4]   2> 813567 INFO  (OverseerStateUpdate-73261471238979592-127.0.0.1:34407_solr-n_0000000000) [n:127.0.0.1:34407_solr    ] o.a.s.c.Overseer Starting to work on the main queue : 127.0.0.1:34407_solr
   [junit4]   2> 813571 INFO  (jetty-launcher-7466-thread-1) [n:127.0.0.1:34407_solr    ] o.a.s.c.CoreContainer Initializing authentication plugin: solr.JWTAuthPlugin
   [junit4]   2> 813584 INFO  (zkCallback-7496-thread-1) [    ] o.a.s.c.c.ZkStateReader Updated live nodes from ZooKeeper... (0) -> (1)
   [junit4]   2> 813588 INFO  (OverseerStateUpdate-73261471238979592-127.0.0.1:34407_solr-n_0000000000) [n:127.0.0.1:34407_solr    ] o.a.s.c.c.ZkStateReader Updated live nodes from ZooKeeper... (0) -> (1)
   [junit4]   2> 813618 WARN  (jetty-launcher-7466-thread-1) [n:127.0.0.1:34407_solr    ] o.a.s.s.JWTAuthPlugin Warning: No adminUiScope provided, fallback to 'solr' as required scope. If this is not correct, the Admin UI login may not work
   [junit4]   2> 813636 INFO  (jetty-launcher-7466-thread-2) [n:127.0.0.1:44760_solr    ] o.a.s.c.c.ZkStateReader Updated live nodes from ZooKeeper... (0) -> (1)
   [junit4]   2> 813640 INFO  (jetty-launcher-7466-thread-2) [n:127.0.0.1:44760_solr    ] o.a.s.c.ZkController Publish node=127.0.0.1:44760_solr as DOWN
   [junit4]   2> 813642 INFO  (jetty-launcher-7466-thread-2) [n:127.0.0.1:44760_solr    ] o.a.s.c.TransientSolrCoreCacheDefault Allocating transient cache for 2147483647 transient cores
   [junit4]   2> 813642 INFO  (jetty-launcher-7466-thread-2) [n:127.0.0.1:44760_solr    ] o.a.s.c.ZkController Register node as live in ZooKeeper:/live_nodes/127.0.0.1:44760_solr
   [junit4]   2> 813644 INFO  (jetty-launcher-7466-thread-2) [n:127.0.0.1:44760_solr    ] o.a.s.c.CoreContainer Initializing authentication plugin: solr.JWTAuthPlugin
   [junit4]   2> 813644 WARN  (jetty-launcher-7466-thread-2) [n:127.0.0.1:44760_solr    ] o.a.s.s.JWTAuthPlugin Warning: No adminUiScope provided, fallback to 'solr' as required scope. If this is not correct, the Admin UI login may not work
   [junit4]   2> 813664 INFO  (zkCallback-7496-thread-1) [    ] o.a.s.c.c.ZkStateReader Updated live nodes from ZooKeeper... (1) -> (2)
   [junit4]   2> 813668 INFO  (zkCallback-7479-thread-1) [    ] o.a.s.c.c.ZkStateReader Updated live nodes from ZooKeeper... (1) -> (2)
   [junit4]   2> 813669 INFO  (zkCallback-7489-thread-2) [    ] o.a.s.c.c.ZkStateReader Updated live nodes from ZooKeeper... (1) -> (2)
   [junit4]   2> 813726 INFO  (jetty-launcher-7466-thread-1) [n:127.0.0.1:34407_solr    ] o.a.s.h.a.MetricsHistoryHandler No .system collection, keeping metrics history in memory.
   [junit4]   2> 813760 INFO  (zkConnectionManagerCallback-7503-thread-1) [    ] o.a.s.c.c.ConnectionManager zkClient has connected
   [junit4]   2> 813763 INFO  (jetty-launcher-7466-thread-2) [n:127.0.0.1:44760_solr    ] o.a.s.c.c.ZkStateReader Updated live nodes from ZooKeeper... (0) -> (2)
   [junit4]   2> 813767 INFO  (jetty-launcher-7466-thread-2) [n:127.0.0.1:44760_solr    ] o.a.s.c.s.i.ZkClientClusterStateProvider Cluster at 127.0.0.1:40446/solr ready
   [junit4]   2> 813787 INFO  (jetty-launcher-7466-thread-2) [n:127.0.0.1:44760_solr    ] o.a.s.h.a.MetricsHistoryHandler No .system collection, keeping metrics history in memory.
   [junit4]   2> 813790 INFO  (jetty-launcher-7466-thread-1) [n:127.0.0.1:34407_solr    ] o.a.s.m.r.SolrJmxReporter JMX monitoring for 'solr_34407.solr.node' (registry 'solr.node') enabled at server: com.sun.jmx.mbeanserver.JmxMBeanServer@1555fa2d
   [junit4]   2> 813828 INFO  (jetty-launcher-7466-thread-1) [n:127.0.0.1:34407_solr    ] o.a.s.m.r.SolrJmxReporter JMX monitoring for 'solr_34407.solr.jvm' (registry 'solr.jvm') enabled at server: com.sun.jmx.mbeanserver.JmxMBeanServer@1555fa2d
   [junit4]   2> 813832 INFO  (jetty-launcher-7466-thread-1) [n:127.0.0.1:34407_solr    ] o.a.s.m.r.SolrJmxReporter JMX monitoring for 'solr_34407.solr.jetty' (registry 'solr.jetty') enabled at server: com.sun.jmx.mbeanserver.JmxMBeanServer@1555fa2d
   [junit4]   2> 813835 INFO  (jetty-launcher-7466-thread-1) [n:127.0.0.1:34407_solr    ] o.a.s.c.CorePropertiesLocator Found 0 core definitions underneath /x1/jenkins/jenkins-slave/workspace/Lucene-Solr-Tests-8.x/solr/build/solr-core/test/J2/temp/solr.security.JWTAuthPluginIntegrationTest_D144B5E0BE5D5D08-001/tempDir-001/node1/.
   [junit4]   2> 813836 INFO  (jetty-launcher-7466-thread-2) [n:127.0.0.1:44760_solr    ] o.a.s.m.r.SolrJmxReporter JMX monitoring for 'solr_44760.solr.node' (registry 'solr.node') enabled at server: com.sun.jmx.mbeanserver.JmxMBeanServer@1555fa2d
   [junit4]   2> 813858 INFO  (jetty-launcher-7466-thread-2) [n:127.0.0.1:44760_solr    ] o.a.s.m.r.SolrJmxReporter JMX monitoring for 'solr_44760.solr.jvm' (registry 'solr.jvm') enabled at server: com.sun.jmx.mbeanserver.JmxMBeanServer@1555fa2d
   [junit4]   2> 813858 INFO  (jetty-launcher-7466-thread-2) [n:127.0.0.1:44760_solr    ] o.a.s.m.r.SolrJmxReporter JMX monitoring for 'solr_44760.solr.jetty' (registry 'solr.jetty') enabled at server: com.sun.jmx.mbeanserver.JmxMBeanServer@1555fa2d
   [junit4]   2> 813860 INFO  (jetty-launcher-7466-thread-2) [n:127.0.0.1:44760_solr    ] o.a.s.c.CorePropertiesLocator Found 0 core definitions underneath /x1/jenkins/jenkins-slave/workspace/Lucene-Solr-Tests-8.x/solr/build/solr-core/test/J2/temp/solr.security.JWTAuthPluginIntegrationTest_D144B5E0BE5D5D08-001/tempDir-001/node2/.
   [junit4]   2> 813917 INFO  (zkConnectionManagerCallback-7509-thread-1) [    ] o.a.s.c.c.ConnectionManager zkClient has connected
   [junit4]   2> 813918 INFO  (TEST-JWTAuthPluginIntegrationTest.createCollectionUpdateAndQueryDistributed-seed#[D144B5E0BE5D5D08]) [    ] o.a.s.c.c.ZkStateReader Updated live nodes from ZooKeeper... (0) -> (2)
   [junit4]   2> 813926 INFO  (TEST-JWTAuthPluginIntegrationTest.createCollectionUpdateAndQueryDistributed-seed#[D144B5E0BE5D5D08]) [    ] o.a.s.c.s.i.ZkClientClusterStateProvider Cluster at 127.0.0.1:40446/solr ready
   [junit4]   2> 814510 INFO  (qtp1912852269-18603) [n:127.0.0.1:34407_solr    ] o.a.s.h.a.CollectionsHandler Invoked Collection Action :create with params name=jwtColl&action=CREATE&numShards=2 and sendToOCPQueue=true
   [junit4]   2> 814522 INFO  (OverseerThreadFactory-5098-thread-1-processing-n:127.0.0.1:34407_solr) [n:127.0.0.1:34407_solr    ] o.a.s.c.a.c.CreateCollectionCmd Create collection jwtColl
   [junit4]   2> 814532 INFO  (OverseerThreadFactory-5098-thread-1-processing-n:127.0.0.1:34407_solr) [n:127.0.0.1:34407_solr    ] o.a.s.c.c.ZkConfigManager Copying zk node /configs/_default/managed-schema to /configs/jwtColl.AUTOCREATED/managed-schema
   [junit4]   2> 814534 INFO  (OverseerThreadFactory-5098-thread-1-processing-n:127.0.0.1:34407_solr) [n:127.0.0.1:34407_solr    ] o.a.s.c.c.ZkConfigManager Copying zk node /configs/_default/protwords.txt to /configs/jwtColl.AUTOCREATED/protwords.txt
   [junit4]   2> 814536 INFO  (OverseerThreadFactory-5098-thread-1-processing-n:127.0.0.1:34407_solr) [n:127.0.0.1:34407_solr    ] o.a.s.c.c.ZkConfigManager Copying zk node /configs/_default/solrconfig.xml to /configs/jwtColl.AUTOCREATED/solrconfig.xml
   [junit4]   2> 814538 INFO  (OverseerThreadFactory-5098-thread-1-processing-n:127.0.0.1:34407_solr) [n:127.0.0.1:34407_solr    ] o.a.s.c.c.ZkConfigManager Copying zk node /configs/_default/synonyms.txt to /configs/jwtColl.AUTOCREATED/synonyms.txt
   [junit4]   2> 814539 INFO  (OverseerThreadFactory-5098-thread-1-processing-n:127.0.0.1:34407_solr) [n:127.0.0.1:34407_solr    ] o.a.s.c.c.ZkConfigManager Copying zk node /configs/_default/stopwords.txt to /configs/jwtColl.AUTOCREATED/stopwords.txt
   [junit4]   2> 814542 INFO  (OverseerThreadFactory-5098-thread-1-processing-n:127.0.0.1:34407_solr) [n:127.0.0.1:34407_solr    ] o.a.s.c.c.ZkConfigManager Copying zk node /configs/_default/lang/contractions_it.txt to /configs/jwtColl.AUTOCREATED/lang/contractions_it.txt
   [junit4]   2> 814544 INFO  (OverseerThreadFactory-5098-thread-1-processing-n:127.0.0.1:34407_solr) [n:127.0.0.1:34407_solr    ] o.a.s.c.c.ZkConfigManager Copying zk node /configs/_default/lang/contractions_ca.txt to /configs/jwtColl.AUTOCREATED/lang/contractions_ca.txt
   [junit4]   2> 814545 INFO  (OverseerThreadFactory-5098-thread-1-processing-n:127.0.0.1:34407_solr) [n:127.0.0.1:34407_solr    ] o.a.s.c.c.ZkConfigManager Copying zk node /configs/_default/lang/stemdict_nl.txt to /configs/jwtColl.AUTOCREATED/lang/stemdict_nl.txt
   [junit4]   2> 814547 INFO  (OverseerThreadFactory-5098-thread-1-processing-n:127.0.0.1:34407_solr) [n:127.0.0.1:34407_solr    ] o.a.s.c.c.ZkConfigManager Copying zk node /configs/_default/lang/stopwords_no.txt to /configs/jwtColl.AUTOCREATED/lang/stopwords_no.txt
   [junit4]   2> 814549 INFO  (OverseerThreadFactory-5098-thread-1-processing-n:127.0.0.1:34407_solr) [n:127.0.0.1:34407_solr    ] o.a.s.c.c.ZkConfigManager Copying zk node /configs/_default/lang/stopwords_hy.txt to /configs/jwtColl.AUTOCREATED/lang/stopwords_hy.txt
   [junit4]   2> 814550 INFO  (OverseerThreadFactory-5098-thread-1-processing-n:127.0.0.1:34407_solr) [n:127.0.0.1:34407_solr    ] o.a.s.c.c.ZkConfigManager Copying zk node /configs/_default/lang/stopwords_id.txt to /configs/jwtColl.AUTOCREATED/lang/stopwords_id.txt
   [junit4]   2> 814552 INFO  (OverseerThreadFactory-5098-thread-1-processing-n:127.0.0.1:34407_solr) [n:127.0.0.1:34407_solr    ] o.a.s.c.c.ZkConfigManager Copying zk node /configs/_default/lang/stopwords_hi.txt to /configs/jwtColl.AUTOCREATED/lang/stopwords_hi.txt
   [junit4]   2> 814554 INFO  (OverseerThreadFactory-5098-thread-1-processing-n:127.0.0.1:34407_solr) [n:127.0.0.1:34407_solr    ] o.a.s.c.c.ZkConfigManager Copying zk node /configs/_default/lang/stopwords_ga.txt to /configs/jwtColl.AUTOCREATED/lang/stopwords_ga.txt
   [junit4]   2> 814555 INFO  (OverseerThreadFactory-5098-thread-1-processing-n:127.0.0.1:34407_solr) [n:127.0.0.1:34407_solr    ] o.a.s.c.c.ZkConfigManager Copying zk node /configs/_default/lang/stopwords_da.txt to /configs/jwtColl.AUTOCREATED/lang/stopwords_da.txt
   [junit4]   2> 814557 INFO  (OverseerThreadFactory-5098-thread-1-processing-n:127.0.0.1:34407_solr) [n:127.0.0.1:34407_solr    ] o.a.s.c.c.ZkConfigManager Copying zk node /configs/_default/lang/stopwords_ja.txt to /configs/jwtColl.AUTOCREATED/lang/stopwords_ja.txt
   [junit4]   2> 814568 INFO  (OverseerThreadFactory-5098-thread-1-processing-n:127.0.0.1:34407_solr) [n:127.0.0.1:34407_solr    ] o.a.s.c.c.ZkConfigManager Copying zk node /configs/_default/lang/stopwords_pt.txt to /configs/jwtColl.AUTOCREATED/lang/stopwords_pt.txt
   [junit4]   2> 814570 INFO  (OverseerThreadFactory-5098-thread-1-processing-n:127.0.0.1:34407_solr) [n:127.0.0.1:34407_solr    ] o.a.s.c.c.ZkConfigManager Copying zk node /configs/_default/lang/stopwords_hu.txt to /configs/jwtColl.AUTOCREATED/lang/stopwords_hu.txt
   [junit4]   2> 814572 INFO  (OverseerThreadFactory-5098-thread-1-processing-n:127.0.0.1:34407_solr) [n:127.0.0.1:34407_solr    ] o.a.s.c.c.ZkConfigManager Copying zk node /configs/_default/lang/stopwords_el.txt to /configs/jwtColl.AUTOCREATED/lang/stopwords_el.txt
   [junit4]   2> 814574 INFO  (OverseerThreadFactory-5098-thread-1-processing-n:127.0.0.1:34407_solr) [n:127.0.0.1:34407_solr    ] o.a.s.c.c.ZkConfigManager Copying zk node /configs/_default/lang/stopwords_ru.txt to /configs/jwtColl.AUTOCREATED/lang/stopwords_ru.txt
   [junit4]   2> 814576 INFO  (OverseerThreadFactory-5098-thread-1-processing-n:127.0.0.1:34407_solr) [n:127.0.0.1:34407_solr    ] o.a.s.c.c.ZkConfigManager Copying zk node /configs/_default/lang/stopwords_tr.txt to /configs/jwtColl.AUTOCREATED/lang/stopwords_tr.txt
   [junit4]   2> 814578 INFO  (OverseerThreadFactory-5098-thread-1-processing-n:127.0.0.1:34407_solr) [n:127.0.0.1:34407_solr    ] o.a.s.c.c.ZkConfigManager Copying zk node /configs/_default/lang/stopwords_ar.txt to /configs/jwtColl.AUTOCREATED/lang/stopwords_ar.txt
   [junit4]   2> 814579 INFO  (OverseerThreadFactory-5098-thread-1-processing-n:127.0.0.1:34407_solr) [n:127.0.0.1:34407_solr    ] o.a.s.c.c.ZkConfigManager Copying zk node /configs/_default/lang/userdict_ja.txt to /configs/jwtColl.AUTOCREATED/lang/userdict_ja.txt
   [junit4]   2> 814581 INFO  (OverseerThreadFactory-5098-thread-1-processing-n:127.0.0.1:34407_solr) [n:127.0.0.1:34407_solr    ] o.a.s.c.c.ZkConfigManager Copying zk node /configs/_default/lang/stopwords_eu.txt to /configs/jwtColl.AUTOCREATED/lang/stopwords_eu.txt
   [junit4]   2> 814583 INFO  (OverseerThreadFactory-5098-thread-1-processing-n:127.0.0.1:34407_solr) [n:127.0.0.1:34407_solr    ] o.a.s.c.c.ZkConfigManager Copying zk node /configs/_default/lang/stopwords_it.txt to /configs/jwtColl.AUTOCREATED/lang/stopwords_it.txt
   [junit4]   2> 814585 INFO  (OverseerThreadFactory-5098-thread-1-processing-n:127.0.0.1:34407_solr) [n:127.0.0.1:34407_solr    ] o.a.s.c.c.ZkConfigManager Copying zk node /configs/_default/lang/stopwords_cz.txt to /configs/jwtColl.AUTOCREATED/lang/stopwords_cz.txt
   [junit4]   2> 814587 INFO  (OverseerThreadFactory-5098-thread-1-processing-n:127.0.0.1:34407_solr) [n:127.0.0.1:34407_solr    ] o.a.s.c.c.ZkConfigManager Copying zk node /configs/_default/lang/stoptags_ja.txt to /configs/jwtColl.AUTOCREATED/lang/stoptags_ja.txt
   [junit4]   2> 814589 INFO  (OverseerThreadFactory-5098-thread-1-processing-n:127.0.0.1:34407_solr) [n:127.0.0.1:34407_solr    ] o.a.s.c.c.ZkConfigManager Copying zk node /configs/_default/lang/contractions_fr.txt to /configs/jwtColl.AUTOCREATED/lang/contractions_fr.txt
   [junit4]   2> 814591 INFO  (OverseerThreadFactory-5098-thread-1-processing-n:127.0.0.1:34407_solr) [n:127.0.0.1:34407_solr    ] o.a.s.c.c.ZkConfigManager Copying zk node /configs/_default/lang/stopwords_de.txt to /configs/jwtColl.AUTOCREATED/lang/stopwords_de.txt
   [junit4]   2> 814597 INFO  (OverseerThreadFactory-5098-thread-1-processing-n:127.0.0.1:34407_solr) [n:127.0.0.1:34407_solr    ] o.a.s.c.c.ZkConfigManager Copying zk node /configs/_default/lang/stopwords_fa.txt to /configs/jwtColl.AUTOCREATED/lang/stopwords_fa.txt
   [junit4]   2> 814608 INFO  (OverseerThreadFactory-5098-thread-1-processing-n:127.0.0.1:34407_solr) [n:127.0.0.1:34407_solr    ] o.a.s.c.c.ZkConfigManager Copying zk node /configs/_default/lang/contractions_ga.txt to /configs/jwtColl.AUTOCREATED/lang/contractions_ga.txt
   [junit4]   2> 814613 INFO  (OverseerThreadFactory-5098-thread-1-processing-n:127.0.0.1:34407_solr) [n:127.0.0.1:34407_solr    ] o.a.s.c.c.ZkConfigManager Copying zk node /configs/_default/lang/stopwords_ca.txt to /configs/jwtColl.AUTOCREATED/lang/stopwords_ca.txt
   [junit4]   2> 814616 INFO  (OverseerThreadFactory-5098-thread-1-processing-n:127.0.0.1:34407_solr) [n:127.0.0.1:34407_solr    ] o.a.s.c.c.ZkConfigManager Copying zk node /configs/_default/lang/stopwords_nl.txt to /configs/jwtColl.AUTOCREATED/lang/stopwords_nl.txt
   [junit4]   2> 814619 INFO  (OverseerThreadFactory-5098-thread-1-processing-n:127.0.0.1:34407_solr) [n:127.0.0.1:34407_solr    ] o.a.s.c.c.ZkConfigManager Copying zk node /configs/_default/lang/stopwords_bg.txt to /configs/jwtColl.AUTOCREATED/lang/stopwords_bg.txt
   [junit4]   2> 814622 INFO  (OverseerThreadFactory-5098-thread-1-processing-n:127.0.0.1:34407_solr) [n:127.0.0.1:34407_solr    ] o.a.s.c.c.ZkConfigManager Copying zk node /configs/_default/lang/stopwords_en.txt to /configs/jwtColl.AUTOCREATED/lang/stopwords_en.txt
   [junit4]   2> 814625 INFO  (OverseerThreadFactory-5098-thread-1-processing-n:127.0.0.1:34407_solr) [n:127.0.0.1:34407_solr    ] o.a.s.c.c.ZkConfigManager Copying zk node /configs/_default/lang/stopwords_es.txt to /configs/jwtColl.AUTOCREATED/lang/stopwords_es.txt
   [junit4]   2> 814634 INFO  (OverseerThreadFactory-5098-thread-1-processing-n:127.0.0.1:34407_solr) [n:127.0.0.1:34407_solr    ] o.a.s.c.c.ZkConfigManager Copying zk node /configs/_default/lang/stopwords_lv.txt to /configs/jwtColl.AUTOCREATED/lang/stopwords_lv.txt
   [junit4]   2> 814638 INFO  (OverseerThreadFactory-5098-thread-1-processing-n:127.0.0.1:34407_solr) [n:127.0.0.1:34407_solr    ] o.a.s.c.c.ZkConfigManager Copying zk node /configs/_default/lang/stopwords_ro.txt to /configs/jwtColl.AUTOCREATED/lang/stopwords_ro.txt
   [junit4]   2> 814640 INFO  (OverseerThreadFactory-5098-thread-1-processing-n:127.0.0.1:34407_solr) [n:127.0.0.1:34407_solr    ] o.a.s.c.c.ZkConfigManager Copying zk node /configs/_default/lang/stopwords_th.txt to /configs/jwtColl.AUTOCREATED/lang/stopwords_th.txt
   [junit4]   2> 814642 INFO  (OverseerThreadFactory-5098-thread-1-processing-n:127.0.0.1:34407_solr) [n:127.0.0.1:34407_solr    ] o.a.s.c.c.ZkConfigManager Copying zk node /configs/_default/lang/stopwords_fr.txt to /configs/jwtColl.AUTOCREATED/lang/stopwords_fr.txt
   [junit4]   2> 814644 INFO  (OverseerThreadFactory-5098-thread-1-processing-n:127.0.0.1:34407_solr) [n:127.0.0.1:34407_solr    ] o.a.s.c.c.ZkConfigManager Copying zk node /configs/_default/lang/stopwords_sv.txt to /configs/jwtColl.AUTOCREATED/lang/stopwords_sv.txt
   [junit4]   2> 814646 INFO  (OverseerThreadFactory-5098-thread-1-processing-n:127.0.0.1:34407_solr) [n:127.0.0.1:34407_solr    ] o.a.s.c.c.ZkConfigManager Copying zk node /configs/_default/lang/stopwords_fi.txt to /configs/jwtColl.AUTOCREATED/lang/stopwords_fi.txt
   [junit4]   2> 814652 INFO  (OverseerThreadFactory-5098-thread-1-processing-n:127.0.0.1:34407_solr) [n:127.0.0.1:34407_solr    ] o.a.s.c.c.ZkConfigManager Copying zk node /configs/_default/lang/hyphenations_ga.txt to /configs/jwtColl.AUTOCREATED/lang/hyphenations_ga.txt
   [junit4]   2> 814655 INFO  (OverseerThreadFactory-5098-thread-1-processing-n:127.0.0.1:34407_solr) [n:127.0.0.1:34407_solr    ] o.a.s.c.c.ZkConfigManager Copying zk node /configs/_default/lang/stopwords_gl.txt to /configs/jwtColl.AUTOCREATED/lang/stopwords_gl.txt
   [junit4]   2> 814661 INFO  (OverseerThreadFactory-5098-thread-1-processing-n:127.0.0.1:34407_solr) [n:127.0.0.1:34407_solr    ] o.a.s.c.c.ZkConfigManager Copying zk node /configs/_default/params.json to /configs/jwtColl.AUTOCREATED/params.json
   [junit4]   2> 814791 INFO  (qtp675102255-18609) [n:127.0.0.1:44760_solr    ] o.a.s.s.HttpSolrCall [admin] webapp=null path=/admin/info/key params={omitHeader=true&wt=json} status=0 QTime=0
   [junit4]   2> 814792 INFO  (qtp1912852269-18606) [    ] o.a.s.s.PKIAuthenticationPlugin New Key obtained from  node: 127.0.0.1:44760_solr / MIIBIjANBgkqhkiG9w0BAQEFAAOCAQ8AMIIBCgKCAQEAg3UEKJtcVb7/gE3xIr2We/k8aNnaFdMkJessr3pDFvXGbda5Kwa77PJgU7fIIb5Mtdhey9BeMTgv7JLgv2jr/WqCv7b/SR0ibrfYVOyQ+hA9H2rDG5nvTsSXojV6If67EEgCZWBk+nrU2YtL+BIo6nPYoZWuqKWz4X2wv6Rkg01bbNqiI1xTeRUkID9vZfX7Go6MVkB6xbrJKt9QiVlwwdLs7xs0sdhhQY2cJQJitde5f2QGyP9hBhmryqqgs2iSkh4IEmPEiO/CbOh7zwg+SuaZxCJHklskZKDqwRZ87MvgFNObbNflesyigbyjtS5XALaHf+Ee+CLHbh6uu8lgoQIDAQAB
   [junit4]   2> 814809 INFO  (qtp1912852269-18606) [n:127.0.0.1:34407_solr    ] o.a.s.s.HttpSolrCall [admin] webapp=null path=/admin/metrics params={prefix=CONTAINER.fs.usableSpace,CONTAINER.fs.totalSpace,CORE.coreName&wt=javabin&version=2&group=solr.node,solr.core} status=0 QTime=2
   [junit4]   2> 814819 INFO  (qtp675102255-18612) [n:127.0.0.1:44760_solr    ] o.a.s.s.HttpSolrCall [admin] webapp=null path=/admin/info/key params={omitHeader=true&wt=json} status=0 QTime=0
   [junit4]   2> 814823 INFO  (qtp675102255-18608) [    ] o.a.s.s.PKIAuthenticationPlugin New Key obtained from  node: 127.0.0.1:44760_solr / MIIBIjANBgkqhkiG9w0BAQEFAAOCAQ8AMIIBCgKCAQEAg3UEKJtcVb7/gE3xIr2We/k8aNnaFdMkJessr3pDFvXGbda5Kwa77PJgU7fIIb5Mtdhey9BeMTgv7JLgv2jr/WqCv7b/SR0ibrfYVOyQ+hA9H2rDG5nvTsSXojV6If67EEgCZWBk+nrU2YtL+BIo6nPYoZWuqKWz4X2wv6Rkg01bbNqiI1xTeRUkID9vZfX7Go6MVkB6xbrJKt9QiVlwwdLs7xs0sdhhQY2cJQJitde5f2QGyP9hBhmryqqgs2iSkh4IEmPEiO/CbOh7zwg+SuaZxCJHklskZKDqwRZ87MvgFNObbNflesyigbyjtS5XALaHf+Ee+CLHbh6uu8lgoQIDAQAB
   [junit4]   2> 814824 INFO  (qtp675102255-18608) [n:127.0.0.1:44760_solr    ] o.a.s.s.HttpSolrCall [admin] webapp=null path=/admin/metrics params={prefix=CONTAINER.fs.usableSpace,CONTAINER.fs.totalSpace,CORE.coreName&wt=javabin&version=2&group=solr.node,solr.core} status=0 QTime=0
   [junit4]   2> 814834 INFO  (OverseerStateUpdate-73261471238979592-127.0.0.1:34407_solr-n_0000000000) [n:127.0.0.1:34407_solr    ] o.a.s.c.o.SliceMutator createReplica() {
   [junit4]   2>   "operation":"ADDREPLICA",
   [junit4]   2>   "collection":"jwtColl",
   [junit4]   2>   "shard":"shard1",
   [junit4]   2>   "core":"jwtColl_shard1_replica_n1",
   [junit4]   2>   "state":"down",
   [junit4]   2>   "base_url":"http://127.0.0.1:44760/solr",
   [junit4]   2>   "type":"NRT",
   [junit4]   2>   "waitForFinalState":"false"} 
   [junit4]   2> 814839 INFO  (OverseerStateUpdate-73261471238979592-127.0.0.1:34407_solr-n_0000000000) [n:127.0.0.1:34407_solr    ] o.a.s.c.o.SliceMutator createReplica() {
   [junit4]   2>   "operation":"ADDREPLICA",
   [junit4]   2>   "collection":"jwtColl",
   [junit4]   2>   "shard":"shard2",
   [junit4]   2>   "core":"jwtColl_shard2_replica_n2",
   [junit4]   2>   "state":"down",
   [junit4]   2>   "base_url":"http://127.0.0.1:34407/solr",
   [junit4]   2>   "type":"NRT",
   [junit4]   2>   "waitForFinalState":"false"} 
   [junit4]   2> 815061 INFO  (qtp675102255-18600) [n:127.0.0.1:44760_solr    x:jwtColl_shard1_replica_n1] o.a.s.h.a.CoreAdminOperation core create command qt=/admin/cores&coreNodeName=core_node3&collection.configName=jwtColl.AUTOCREATED&newCollection=true&name=jwtColl_shard1_replica_n1&action=CREATE&numShards=2&collection=jwtColl&shard=shard1&wt=javabin&version=2&replicaType=NRT
   [junit4]   2> 815063 INFO  (qtp1912852269-18601) [n:127.0.0.1:34407_solr    x:jwtColl_shard2_replica_n2] o.a.s.h.a.CoreAdminOperation core create command qt=/admin/cores&coreNodeName=core_node4&collection.configName=jwtColl.AUTOCREATED&newCollection=true&name=jwtColl_shard2_replica_n2&action=CREATE&numShards=2&collection=jwtColl&shard=shard2&wt=javabin&version=2&replicaType=NRT
   [junit4]   2> 815063 INFO  (qtp1912852269-18601) [n:127.0.0.1:34407_solr    x:jwtColl_shard2_replica_n2] o.a.s.c.TransientSolrCoreCacheDefault Allocating transient cache for 2147483647 transient cores
   [junit4]   2> 816087 INFO  (qtp1912852269-18601) [n:127.0.0.1:34407_solr c:jwtColl s:shard2 r:core_node4 x:jwtColl_shard2_replica_n2] o.a.s.c.RequestParams conf resource params.json loaded . version : 0 
   [junit4]   2> 816087 INFO  (qtp1912852269-18601) [n:127.0.0.1:34407_solr c:jwtColl s:shard2 r:core_node4 x:jwtColl_shard2_replica_n2] o.a.s.c.RequestParams request params refreshed to version 0
   [junit4]   2> 816088 WARN  (qtp1912852269-18601) [n:127.0.0.1:34407_solr c:jwtColl s:shard2 r:core_node4 x:jwtColl_shard2_replica_n2] o.a.s.c.SolrConfig Couldn't add files from /x1/jenkins/jenkins-slave/workspace/Lucene-Solr-Tests-8.x/solr/build/solr-core/test/J2/temp/solr.security.JWTAuthPluginIntegrationTest_D144B5E0BE5D5D08-001/tempDir-001/node1/jwtColl_shard2_replica_n2/../../../../contrib/extraction/lib filtered by .*\.jar to classpath: /x1/jenkins/jenkins-slave/workspace/Lucene-Solr-Tests-8.x/solr/build/solr-core/test/J2/temp/solr.security.JWTAuthPluginIntegrationTest_D144B5E0BE5D5D08-001/tempDir-001/node1/jwtColl_shard2_replica_n2/../../../../contrib/extraction/lib
   [junit4]   2> 816088 WARN  (qtp1912852269-18601) [n:127.0.0.1:34407_solr c:jwtColl s:shard2 r:core_node4 x:jwtColl_shard2_replica_n2] o.a.s.c.SolrConfig Couldn't add files from /x1/jenkins/jenkins-slave/workspace/Lucene-Solr-Tests-8.x/solr/build/solr-core/test/J2/temp/solr.security.JWTAuthPluginIntegrationTest_D144B5E0BE5D5D08-001/tempDir-001/node1/jwtColl_shard2_replica_n2/../../../../dist filtered by solr-cell-\d.*\.jar to classpath: /x1/jenkins/jenkins-slave/workspace/Lucene-Solr-Tests-8.x/solr/build/solr-core/test/J2/temp/solr.security.JWTAuthPluginIntegrationTest_D144B5E0BE5D5D08-001/tempDir-001/node1/jwtColl_shard2_replica_n2/../../../../dist
   [junit4]   2> 816089 WARN  (qtp1912852269-18601) [n:127.0.0.1:34407_solr c:jwtColl s:shard2 r:core_node4 x:jwtColl_shard2_replica_n2] o.a.s.c.SolrConfig Couldn't add files from /x1/jenkins/jenkins-slave/workspace/Lucene-Solr-Tests-8.x/solr/build/solr-core/test/J2/temp/solr.security.JWTAuthPluginIntegrationTest_D144B5E0BE5D5D08-001/tempDir-001/node1/jwtColl_shard2_replica_n2/../../../../contrib/clustering/lib filtered by .*\.jar to classpath: /x1/jenkins/jenkins-slave/workspace/Lucene-Solr-Tests-8.x/solr/build/solr-core/test/J2/temp/solr.security.JWTAuthPluginIntegrationTest_D144B5E0BE5D5D08-001/tempDir-001/node1/jwtColl_shard2_replica_n2/../../../../contrib/clustering/lib
   [junit4]   2> 816089 INFO  (qtp675102255-18600) [n:127.0.0.1:44760_solr c:jwtColl s:shard1 r:core_node3 x:jwtColl_shard1_replica_n1] o.a.s.c.RequestParams conf resource params.json loaded . version : 0 
   [junit4]   2> 816089 WARN  (qtp1912852269-18601) [n:127.0.0.1:34407_solr c:jwtColl s:shard2 r:core_node4 x:jwtColl_shard2_replica_n2] o.a.s.c.SolrConfig Couldn't add files from /x1/jenkins/jenkins-slave/workspace/Lucene-Solr-Tests-8.x/solr/build/solr-core/test/J2/temp/solr.security.JWTAuthPluginIntegrationTest_D144B5E0BE5D5D08-001/tempDir-001/node1/jwtColl_shard2_replica_n2/../../../../dist filtered by solr-clustering-\d.*\.jar to classpath: /x1/jenkins/jenkins-slave/workspace/Lucene-Solr-Tests-8.x/solr/build/solr-core/test/J2/temp/solr.security.JWTAuthPluginIntegrationTest_D144B5E0BE5D5D08-001/tempDir-001/node1/jwtColl_shard2_replica_n2/../../../../dist
   [junit4]   2> 816089 INFO  (qtp675102255-18600) [n:127.0.0.1:44760_solr c:jwtColl s:shard1 r:core_node3 x:jwtColl_shard1_replica_n1] o.a.s.c.RequestParams request params refreshed to version 0
   [junit4]   2> 816089 WARN  (qtp1912852269-18601) [n:127.0.0.1:34407_solr c:jwtColl s:shard2 r:core_node4 x:jwtColl_shard2_replica_n2] o.a.s.c.SolrConfig Couldn't add files from /x1/jenkins/jenkins-slave/workspace/Lucene-Solr-Tests-8.x/solr/build/solr-core/test/J2/temp/solr.security.JWTAuthPluginIntegrationTest_D144B5E0BE5D5D08-001/tempDir-001/node1/jwtColl_shard2_replica_n2/../../../../contrib/langid/lib filtered by .*\.jar to classpath: /x1/jenkins/jenkins-slave/workspace/Lucene-Solr-Tests-8.x/solr/build/solr-core/test/J2/temp/solr.security.JWTAuthPluginIntegrationTest_D144B5E0BE5D5D08-001/tempDir-001/node1/jwtColl_shard2_replica_n2/../../../../contrib/langid/lib
   [junit4]   2> 816090 WARN  (qtp1912852269-18601) [n:127.0.0.1:34407_solr c:jwtColl s:shard2 r:core_node4 x:jwtColl_shard2_replica_n2] o.a.s.c.SolrConfig Couldn't add files from /x1/jenkins/jenkins-slave/workspace/Lucene-Solr-Tests-8.x/solr/build/solr-core/test/J2/temp/solr.security.JWTAuthPluginIntegrationTest_D144B5E0BE5D5D08-001/tempDir-001/node1/jwtColl_shard2_replica_n2/../../../../dist filtered by solr-langid-\d.*\.jar to classpath: /x1/jenkins/jenkins-slave/workspace/Lucene-Solr-Tests-8.x/solr/build/solr-core/test/J2/temp/solr.security.JWTAuthPluginIntegrationTest_D144B5E0BE5D5D08-001/tempDir-001/node1/jwtColl_shard2_replica_n2/../../../../dist
   [junit4]   2> 816090 WARN  (qtp675102255-18600) [n:127.0.0.1:44760_solr c:jwtColl s:shard1 r:core_node3 x:jwtColl_shard1_replica_n1] o.a.s.c.SolrConfig Couldn't add files from /x1/jenkins/jenkins-slave/workspace/Lucene-Solr-Tests-8.x/solr/build/solr-core/test/J2/temp/solr.security.JWTAuthPluginIntegrationTest_D144B5E0BE5D5D08-001/tempDir-001/node2/jwtColl_shard1_replica_n1/../../../../contrib/extraction/lib filtered by .*\.jar to classpath: /x1/jenkins/jenkins-slave/workspace/Lucene-Solr-Tests-8.x/solr/build/solr-core/test/J2/temp/solr.security.JWTAuthPluginIntegrationTest_D144B5E0BE5D5D08-001/tempDir-001/node2/jwtColl_shard1_replica_n1/../../../../contrib/extraction/lib
   [junit4]   2> 816090 WARN  (qtp1912852269-18601) [n:127.0.0.1:34407_solr c:jwtColl s:shard2 r:core_node4 x:jwtColl_shard2_replica_n2] o.a.s.c.SolrConfig Couldn't add files from /x1/jenkins/jenkins-slave/workspace/Lucene-Solr-Tests-8.x/solr/build/solr-core/test/J2/temp/solr.security.JWTAuthPluginIntegrationTest_D144B5E0BE5D5D08-001/tempDir-001/node1/jwtColl_shard2_replica_n2/../../../../contrib/velocity/lib filtered by .*\.jar to classpath: /x1/jenkins/jenkins-slave/workspace/Lucene-Solr-Tests-8.x/solr/build/solr-core/test/J2/temp/solr.security.JWTAuthPluginIntegrationTest_D144B5E0BE5D5D08-001/tempDir-001/node1/jwtColl_shard2_replica_n2/../../../../contrib/velocity/lib
   [junit4]   2> 816090 WARN  (qtp675102255-18600) [n:127.0.0.1:44760_solr c:jwtColl s:shard1 r:core_node3 x:jwtColl_shard1_replica_n1] o.a.s.c.SolrConfig Couldn't add files from /x1/jenkins/jenkins-slave/workspace/Lucene-Solr-Tests-8.x/solr/build/solr-core/test/J2/temp/solr.security.JWTAuthPluginIntegrationTest_D144B5E0BE5D5D08-001/tempDir-001/node2/jwtColl_shard1_replica_n1/../../../../dist filtered by solr-cell-\d.*\.jar to classpath: /x1/jenkins/jenkins-slave/workspace/Lucene-Solr-Tests-8.x/solr/build/solr-core/test/J2/temp/solr.security.JWTAuthPluginIntegrationTest_D144B5E0BE5D5D08-001/tempDir-001/node2/jwtColl_shard1_replica_n1/../../../../dist
   [junit4]   2> 816090 WARN  (qtp1912852269-18601) [n:127.0.0.1:34407_solr c:jwtColl s:shard2 r:core_node4 x:jwtColl_shard2_replica_n2] o.a.s.c.SolrConfig Couldn't add files from /x1/jenkins/jenkins-slave/workspace/Lucene-Solr-Tests-8.x/solr/build/solr-core/test/J2/temp/solr.security.JWTAuthPluginIntegrationTest_D144B5E0BE5D5D08-001/tempDir-001/node1/jwtColl_shard2_replica_n2/../../../../dist filtered by solr-velocity-\d.*\.jar to classpath: /x1/jenkins/jenkins-slave/workspace/Lucene-Solr-Tests-8.x/solr/build/solr-core/test/J2/temp/solr.security.JWTAuthPluginIntegrationTest_D144B5E0BE5D5D08-001/tempDir-001/node1/jwtColl_shard2_replica_n2/../../../../dist
   [junit4]   2> 816090 WARN  (qtp675102255-18600) [n:127.0.0.1:44760_solr c:jwtColl s:shard1 r:core_node3 x:jwtColl_shard1_replica_n1] o.a.s.c.SolrConfig Couldn't add files from /x1/jenkins/jenkins-slave/workspace/Lucene-Solr-Tests-8.x/solr/build/solr-core/test/J2/temp/solr.security.JWTAuthPluginIntegrationTest_D144B5E0BE5D5D08-001/tempDir-001/node2/jwtColl_shard1_replica_n1/../../../../contrib/clustering/lib filtered by .*\.jar to classpath: /x1/jenkins/jenkins-slave/workspace/Lucene-Solr-Tests-8.x/solr/build/solr-core/test/J2/temp/solr.security.JWTAuthPluginIntegrationTest_D144B5E0BE5D5D08-001/tempDir-001/node2/jwtColl_shard1_replica_n1/../../../../contrib/clustering/lib
   [junit4]   2> 816090 WARN  (qtp675102255-18600) [n:127.0.0.1:44760_solr c:jwtColl s:shard1 r:core_node3 x:jwtColl_shard1_replica_n1] o.a.s.c.SolrConfig Couldn't add files from /x1/jenkins/jenkins-slave/workspace/Lucene-Solr-Tests-8.x/solr/build/solr-core/test/J2/temp/solr.security.JWTAuthPluginIntegrationTest_D144B5E0BE5D5D08-001/tempDir-001/node2/jwtColl_shard1_replica_n1/../../../../dist filtered by solr-clustering-\d.*\.jar to classpath: /x1/jenkins/jenkins-slave/workspace/Lucene-Solr-Tests-8.x/solr/build/solr-core/test/J2/temp/solr.security.JWTAuthPluginIntegrationTest_D144B5E0BE5D5D08-001/tempDir-001/node2/jwtColl_shard1_replica_n1/../../../../dist
   [junit4]   2> 816090 WARN  (qtp1912852269-18601) [n:127.0.0.1:34407_solr c:jwtColl s:shard2 r:core_node4 x:jwtColl_shard2_replica_n2] o.a.s.c.SolrConfig Couldn't add files from /x1/jenkins/jenkins-slave/workspace/Lucene-Solr-Tests-8.x/solr/build/solr-core/test/J2/temp/solr.security.JWTAuthPluginIntegrationTest_D144B5E0BE5D5D08-001/tempDir-001/node1/jwtColl_shard2_replica_n2/../../../../dist filtered by solr-ltr-\d.*\.jar to classpath: /x1/jenkins/jenkins-slave/workspace/Lucene-Solr-Tests-8.x/solr/build/solr-core/test/J2/temp/solr.security.JWTAuthPluginIntegrationTest_D144B5E0BE5D5D08-001/tempDir-001/node1/jwtColl_shard2_replica_n2/../../../../dist
   [junit4]   2> 816091 WARN  (qtp675102255-18600) [n:127.0.0.1:44760_solr c:jwtColl s:shard1 r:core_node3 x:jwtColl_shard1_replica_n1] o.a.s.c.SolrConfig Couldn't add files from /x1/jenkins/jenkins-slave/workspace/Lucene-Solr-Tests-8.x/solr/build/solr-core/test/J2/temp/solr.security.JWTAuthPluginIntegrationTest_D144B5E0BE5D5D08-001/tempDir-001/node2/jwtColl_shard1_replica_n1/../../../../contrib/langid/lib filtered by .*\.jar to classpath: /x1/jenkins/jenkins-slave/workspace/Lucene-Solr-Tests-8.x/solr/build/solr-core/test/J2/temp/solr.security.JWTAuthPluginIntegrationTest_D144B5E0BE5D5D08-001/tempDir-001/node2/jwtColl_shard1_replica_n1/../../../../contrib/langid/lib
   [junit4]   2> 816091 WARN  (qtp675102255-18600) [n:127.0.0.1:44760_solr c:jwtColl s:shard1 r:core_node3 x:jwtColl_shard1_replica_n1] o.a.s.c.SolrConfig Couldn't add files from /x1/jenkins/jenkins-slave/workspace/Lucene-Solr-Tests-8.x/solr/build/solr-core/test/J2/temp/solr.security.JWTAuthPluginIntegrationTest_D144B5E0BE5D5D08-001/tempDir-001/node2/jwtColl_shard1_replica_n1/../../../../dist filtered by solr-langid-\d.*\.jar to classpath: /x1/jenkins/jenkins-slave/workspace/Lucene-Solr-Tests-8.x/solr/build/solr-core/test/J2/temp/solr.security.JWTAuthPluginIntegrationTest_D144B5E0BE5D5D08-001/tempDir-001/node2/jwtColl_shard1_replica_n1/../../../../dist
   [junit4]   2> 816091 INFO  (qtp1912852269-18601) [n:127.0.0.1:34407_solr c:jwtColl s:shard2 r:core_node4 x:jwtColl_shard2_replica_n2] o.a.s.c.SolrConfig Using Lucene MatchVersion: 8.2.0
   [junit4]   2> 816091 WARN  (qtp675102255-18600) [n:127.0.0.1:44760_solr c:jwtColl s:shard1 r:core_node3 x:jwtColl_shard1_replica_n1] o.a.s.c.SolrConfig Couldn't add files from /x1/jenkins/jenkins-slave/workspace/Lucene-Solr-Tests-8.x/solr/build/solr-core/test/J2/temp/solr.security.JWTAuthPluginIntegrationTest_D144B5E0BE5D5D08-001/tempDir-001/node2/jwtColl_shard1_replica_n1/../../../../contrib/velocity/lib filtered by .*\.jar to classpath: /x1/jenkins/jenkins-slave/workspace/Lucene-Solr-Tests-8.x/solr/build/solr-core/test/J2/temp/solr.security.JWTAuthPluginIntegrationTest_D144B5E0BE5D5D08-001/tempDir-001/node2/jwtColl_shard1_replica_n1/../../../../contrib/velocity/lib
   [junit4]   2> 816091 WARN  (qtp675102255-18600) [n:127.0.0.1:44760_solr c:jwtColl s:shard1 r:core_node3 x:jwtColl_shard1_replica_n1] o.a.s.c.SolrConfig Couldn't add files from /x1/jenkins/jenkins-slave/workspace/Lucene-Solr-Tests-8.x/solr/build/solr-core/test/J2/temp/solr.security.JWTAuthPluginIntegrationTest_D144B5E0BE5D5D08-001/tempDir-001/node2/jwtColl_shard1_replica_n1/../../../../dist filtered by solr-velocity-\d.*\.jar to classpath: /x1/jenkins/jenkins-slave/workspace/Lucene-Solr-Tests-8.x/solr/build/solr-core/test/J2/temp/solr.security.JWTAuthPluginIntegrationTest_D144B5E0BE5D5D08-001/tempDir-001/node2/jwtColl_shard1_replica_n1/../../../../dist
   [junit4]   2> 816091 WARN  (qtp675102255-18600) [n:127.0.0.1:44760_solr c:jwtColl s:shard1 r:core_node3 x:jwtColl_shard1_replica_n1] o.a.s.c.SolrConfig Couldn't add files from /x1/jenkins/jenkins-slave/workspace/Lucene-Solr-Tests-8.x/solr/build/solr-core/test/J2/temp/solr.security.JWTAuthPluginIntegrationTest_D144B5E0BE5D5D08-001/tempDir-001/node2/jwtColl_shard1_replica_n1/../../../../dist filtered by solr-ltr-\d.*\.jar to classpath: /x1/jenkins/jenkins-slave/workspace/Lucene-Solr-Tests-8.x/solr/build/solr-core/test/J2/temp/solr.security.JWTAuthPluginIntegrationTest_D144B5E0BE5D5D08-001/tempDir-001/node2/jwtColl_shard1_replica_n1/../../../../dist
   [junit4]   2> 816092 INFO  (qtp675102255-18600) [n:127.0.0.1:44760_solr c:jwtColl s:shard1 r:core_node3 x:jwtColl_shard1_replica_n1] o.a.s.c.SolrConfig Using Lucene MatchVersion: 8.2.0
   [junit4]   2> 816145 INFO  (qtp675102255-18600) [n:127.0.0.1:44760_solr c:jwtColl s:shard1 r:core_node3 x:jwtColl_shard1_replica_n1] o.a.s.s.IndexSchema [jwtColl_shard1_replica_n1] Schema name=default-config
   [junit4]   2> 816162 INFO  (qtp1912852269-18601) [n:127.0.0.1:34407_solr c:jwtColl s:shard2 r:core_node4 x:jwtColl_shard2_replica_n2] o.a.s.s.IndexSchema [jwtColl_shard2_replica_n2] Schema name=default-config
   [junit4]   2> 816596 INFO  (qtp675102255-18600) [n:127.0.0.1:44760_solr c:jwtColl s:shard1 r:core_node3 x:jwtColl_shard1_replica_n1] o.a.s.s.IndexSchema Loaded schema default-config/1.6 with uniqueid field id
   [junit4]   2> 816610 INFO  (qtp1912852269-18601) [n:127.0.0.1:34407_solr c:jwtColl s:shard2 r:core_node4 x:jwtColl_shard2_replica_n2] o.a.s.s.IndexSchema Loaded schema default-config/1.6 with uniqueid field id
   [junit4]   2> 816673 INFO  (qtp675102255-18600) [n:127.0.0.1:44760_solr c:jwtColl s:shard1 r:core_node3 x:jwtColl_shard1_replica_n1] o.a.s.c.CoreContainer Creating SolrCore 'jwtColl_shard1_replica_n1' using configuration from collection jwtColl, trusted=true
   [junit4]   2> 816674 INFO  (qtp675102255-18600) [n:127.0.0.1:44760_solr c:jwtColl s:shard1 r:core_node3 x:jwtColl_shard1_replica_n1] o.a.s.m.r.SolrJmxReporter JMX monitoring for 'solr_44760.solr.core.jwtColl.shard1.replica_n1' (registry 'solr.core.jwtColl.shard1.replica_n1') enabled at server: com.sun.jmx.mbeanserver.JmxMBeanServer@1555fa2d
   [junit4]   2> 816674 INFO  (qtp675102255-18600) [n:127.0.0.1:44760_solr c:jwtColl s:shard1 r:core_node3 x:jwtColl_shard1_replica_n1] o.a.s.c.SolrCore [[jwtColl_shard1_replica_n1] ] Opening new SolrCore at [/x1/jenkins/jenkins-slave/workspace/Lucene-Solr-Tests-8.x/solr/build/solr-core/test/J2/temp/solr.security.JWTAuthPluginIntegrationTest_D144B5E0BE5D5D08-001/tempDir-001/node2/jwtColl_shard1_replica_n1], dataDir=[/x1/jenkins/jenkins-slave/workspace/Lucene-Solr-Tests-8.x/solr/build/solr-core/test/J2/temp/solr.security.JWTAuthPluginIntegrationTest_D144B5E0BE5D5D08-001/tempDir-001/node2/./jwtColl_shard1_replica_n1/data/]
   [junit4]   2> 816681 INFO  (qtp675102255-18600) [n:127.0.0.1:44760_solr c:jwtColl s:shard1 r:core_node3 x:jwtColl_shard1_replica_n1] o.a.s.r.XSLTResponseWriter xsltCacheLifetimeSeconds=5
   [junit4]   2> 816715 INFO  (qtp1912852269-18601) [n:127.0.0.1:34407_solr c:jwtColl s:shard2 r:core_node4 x:jwtColl_shard2_replica_n2] o.a.s.c.CoreContainer Creating SolrCore 'jwtColl_shard2_replica_n2' using configuration from collection jwtColl, trusted=true
   [junit4]   2> 816716 INFO  (qtp1912852269-18601) [n:127.0.0.1:34407_solr c:jwtColl s:shard2 r:core_node4 x:jwtColl_shard2_replica_n2] o.a.s.m.r.SolrJmxReporter JMX monitoring for 'solr_34407.solr.core.jwtColl.shard2.replica_n2' (registry 'solr.core.jwtColl.shard2.replica_n2') enabled at server: com.sun.jmx.mbeanserver.JmxMBeanServer@1555fa2d
   [junit4]   2> 816716 INFO  (qtp1912852269-18601) [n:127.0.0.1:34407_solr c:jwtColl s:shard2 r:core_node4 x:jwtColl_shard2_replica_n2] o.a.s.c.SolrCore [[jwtColl_shard2_replica_n2] ] Opening new SolrCore at [/x1/jenkins/jenkins-slave/workspace/Lucene-Solr-Tests-8.x/solr/build/solr-core/test/J2/temp/solr.security.JWTAuthPluginIntegrationTest_D144B5E0BE5D5D08-001/tempDir-001/node1/jwtColl_shard2_replica_n2], dataDir=[/x1/jenkins/jenkins-slave/workspace/Lucene-Solr-Tests-8.x/solr/build/solr-core/test/J2/temp/solr.security.JWTAuthPluginIntegrationTest_D144B5E0BE5D5D08-001/tempDir-001/node1/./jwtColl_shard2_replica_n2/data/]
   [junit4]   2> 816727 INFO  (qtp1912852269-18601) [n:127.0.0.1:34407_solr c:jwtColl s:shard2 r:core_node4 x:jwtColl_shard2_replica_n2] o.a.s.r.XSLTResponseWriter xsltCacheLifetimeSeconds=5
   [junit4]   2> 816828 INFO  (qtp675102255-18600) [n:127.0.0.1:44760_solr c:jwtColl s:shard1 r:core_node3 x:jwtColl_shard1_replica_n1] o.a.s.u.UpdateHandler Using UpdateLog implementation: org.apache.solr.update.UpdateLog
   [junit4]   2> 816828 INFO  (qtp675102255-18600) [n:127.0.0.1:44760_solr c:jwtColl s:shard1 r:core_node3 x:jwtColl_shard1_replica_n1] o.a.s.u.UpdateLog Initializing UpdateLog: dataDir= defaultSyncLevel=FLUSH numRecordsToKeep=100 maxNumLogsToKeep=10 numVersionBuckets=65536
   [junit4]   2> 816831 INFO  (qtp675102255-18600) [n:127.0.0.1:44760_solr c:jwtColl s:shard1 r:core_node3 x:jwtColl_shard1_replica_n1] o.a.s.u.CommitTracker Hard AutoCommit: if uncommitted for 15000ms; 
   [junit4]   2> 816831 INFO  (qtp675102255-18600) [n:127.0.0.1:44760_solr c:jwtColl s:shard1 r:core_node3 x:jwtColl_shard1_replica_n1] o.a.s.u.CommitTracker Soft AutoCommit: disabled
   [junit4]   2> 816833 INFO  (qtp675102255-18600) [n:127.0.0.1:44760_solr c:jwtColl s:shard1 r:core_node3 x:jwtColl_shard1_replica_n1] o.a.s.s.SolrIndexSearcher Opening [Searcher@3a95c90f[jwtColl_shard1_replica_n1] main]
   [junit4]   2> 816835 INFO  (qtp675102255-18600) [n:127.0.0.1:44760_solr c:jwtColl s:shard1 r:core_node3 x:jwtColl_shard1_replica_n1] o.a.s.r.ManagedResourceStorage Configured ZooKeeperStorageIO with znodeBase: /configs/jwtColl.AUTOCREATED
   [junit4]   2> 816836 INFO  (qtp675102255-18600) [n:127.0.0.1:44760_solr c:jwtColl s:shard1 r:core_node3 x:jwtColl_shard1_replica_n1] o.a.s.r.ManagedResourceStorage Loaded null at path _rest_managed.json using ZooKeeperStorageIO:path=/configs/jwtColl.AUTOCREATED
   [junit4]   2> 816836 INFO  (qtp675102255-18600) [n:127.0.0.1:44760_solr c:jwtColl s:shard1 r:core_node3 x:jwtColl_shard1_replica_n1] o.a.s.s.ZkIndexSchemaReader Creating ZooKeeper watch for the managed schema at /configs/jwtColl.AUTOCREATED/managed-schema
   [junit4]   2> 816838 INFO  (qtp675102255-18600) [n:127.0.0.1:44760_solr c:jwtColl s:shard1 r:core_node3 x:jwtColl_shard1_replica_n1] o.a.s.s.ZkIndexSchemaReader Current schema version 0 is already the latest
   [junit4]   2> 816839 INFO  (qtp675102255-18600) [n:127.0.0.1:44760_solr c:jwtColl s:shard1 r:core_node3 x:jwtColl_shard1_replica_n1] o.a.s.h.c.SpellCheckComponent Initializing spell checkers
   [junit4]   2> 816839 INFO  (qtp675102255-18600) [n:127.0.0.1:44760_solr c:jwtColl s:shard1 r:core_node3 x:jwtColl_shard1_replica_n1] o.a.s.s.DirectSolrSpellChecker init: {name=default,field=_text_,classname=solr.DirectSolrSpellChecker,distanceMeasure=internal,accuracy=0.5,maxEdits=2,minPrefix=1,maxInspections=5,minQueryLength=4,maxQueryFrequency=0.01}
   [junit4]   2> 816841 INFO  (qtp675102255-18600) [n:127.0.0.1:44760_solr c:jwtColl s:shard1 r:core_node3 x:jwtColl_shard1_replica_n1] o.a.s.h.ReplicationHandler Commits will be reserved for 10000ms.
   [junit4]   2> 816841 INFO  (qtp675102255-18600) [n:127.0.0.1:44760_solr c:jwtColl s:shard1 r:core_node3 x:jwtColl_shard1_replica_n1] o.a.s.u.UpdateLog Could not find max version in index or recent updates, using new clock 1632879205708464128
   [junit4]   2> 816845 INFO  (searcherExecutor-5107-thread-1-processing-n:127.0.0.1:44760_solr x:jwtColl_shard1_replica_n1 c:jwtColl s:shard1 r:core_node3) [n:127.0.0.1:44760_solr c:jwtColl s:shard1 r:core_node3 x:jwtColl_shard1_replica_n1] o.a.s.c.QuerySenderListener QuerySenderListener sending requests to Searcher@3a95c90f[jwtColl_shard1_replica_n1] main{ExitableDirectoryReader(UninvertingDirectoryReader())}
   [junit4]   2> 816845 INFO  (searcherExecutor-5107-thread-1-processing-n:127.0.0.1:44760_solr x:jwtColl_shard1_replica_n1 c:jwtColl s:shard1 r:core_node3) [n:127.0.0.1:44760_solr c:jwtColl s:shard1 r:core_node3 x:jwtColl_shard1_replica_n1] o.a.s.c.QuerySenderListener QuerySenderListener done.
   [junit4]   2> 816845 INFO  (searcherExecutor-5107-thread-1-processing-n:127.0.0.1:44760_solr x:jwtColl_shard1_replica_n1 c:jwtColl s:shard1 r:core_node3) [n:127.0.0.1:44760_solr c:jwtColl s:shard1 r:core_node3 x:jwtColl_shard1_replica_n1] o.a.s.h.c.SpellCheckComponent Loading spell index for spellchecker: default
   [junit4]   2> 816847 INFO  (searcherExecutor-5107-thread-1-processing-n:127.0.0.1:44760_solr x:jwtColl_shard1_replica_n1 c:jwtColl s:shard1 r:core_node3) [n:127.0.0.1:44760_solr c:jwtColl s:shard1 r:core_node3 x:jwtColl_shard1_replica_n1] o.a.s.c.SolrCore [jwtColl_shard1_replica_n1] Registered new searcher Searcher@3a95c90f[jwtColl_shard1_replica_n1] main{ExitableDirectoryReader(UninvertingDirectoryReader())}
   [junit4]   2> 816850 INFO  (qtp675102255-18600) [n:127.0.0.1:44760_solr c:jwtColl s:shard1 r:core_node3 x:jwtColl_shard1_replica_n1] o.a.s.c.ZkShardTerms Successful update of terms at /collections/jwtColl/terms/shard1 to Terms{values={core_node3=0}, version=0}
   [junit4]   2> 816850 INFO  (qtp675102255-18600) [n:127.0.0.1:44760_solr c:jwtColl s:shard1 r:core_node3 x:jwtColl_shard1_replica_n1] o.a.s.c.ShardLeaderElectionContextBase make sure parent is created /collections/jwtColl/leaders/shard1
   [junit4]   2> 816854 INFO  (qtp675102255-18600) [n:127.0.0.1:44760_solr c:jwtColl s:shard1 r:core_node3 x:jwtColl_shard1_replica_n1] o.a.s.c.ShardLeaderElectionContext Enough replicas found to continue.
   [junit4]   2> 816855 INFO  (qtp675102255-18600) [n:127.0.0.1:44760_solr c:jwtColl s:shard1 r:core_node3 x:jwtColl_shard1_replica_n1] o.a.s.c.ShardLeaderElectionContext I may be the new leader - try and sync
   [junit4]   2> 816855 INFO  (qtp675102255-18600) [n:127.0.0.1:44760_solr c:jwtColl s:shard1 r:core_node3 x:jwtColl_shard1_replica_n1] o.a.s.c.SyncStrategy Sync replicas to http://127.0.0.1:44760/solr/jwtColl_shard1_replica_n1/
   [junit4]   2> 816855 INFO  (qtp675102255-18600) [n:127.0.0.1:44760_solr c:jwtColl s:shard1 r:core_node3 x:jwtColl_shard1_replica_n1] o.a.s.c.SyncStrategy Sync Success - now sync replicas to me
   [junit4]   2> 816855 INFO  (qtp675102255-18600) [n:127.0.0.1:44760_solr c:jwtColl s:shard1 r:core_node3 x:jwtColl_shard1_replica_n1] o.a.s.c.SyncStrategy http://127.0.0.1:44760/solr/jwtColl_shard1_replica_n1/ has no replicas
   [junit4]   2> 816855 INFO  (qtp675102255-18600) [n:127.0.0.1:44760_solr c:jwtColl s:shard1 r:core_node3 x:jwtColl_shard1_replica_n1] o.a.s.c.ShardLeaderElectionContextBase Creating leader registration node /collections/jwtColl/leaders/shard1/leader after winning as /collections/jwtColl/leader_elect/shard1/election/73261471238979590-core_node3-n_0000000000
   [junit4]   2> 816858 INFO  (qtp675102255-18600) [n:127.0.0.1:44760_solr c:jwtColl s:shard1 r:core_node3 x:jwtColl_shard1_replica_n1] o.a.s.c.ShardLeaderElectionContext I am the new leader: http://127.0.0.1:44760/solr/jwtColl_shard1_replica_n1/ shard1
   [junit4]   2> 816867 INFO  (qtp1912852269-18601) [n:127.0.0.1:34407_solr c:jwtColl s:shard2 r:core_node4 x:jwtColl_shard2_replica_n2] o.a.s.u.UpdateHandler Using UpdateLog implementation: org.apache.solr.update.UpdateLog
   [junit4]   2> 816867 INFO  (qtp1912852269-18601) [n:127.0.0.1:34407_solr c:jwtColl s:shard2 r:core_node4 x:jwtColl_shard2_replica_n2] o.a.s.u.UpdateLog Initializing UpdateLog: dataDir= defaultSyncLevel=FLUSH numRecordsToKeep=100 maxNumLogsToKeep=10 numVersionBuckets=65536
   [junit4]   2> 816904 INFO  (qtp1912852269-18601) [n:127.0.0.1:34407_solr c:jwtColl s:shard2 r:core_node4 x:jwtColl_shard2_replica_n2] o.a.s.u.CommitTracker Hard AutoCommit: if uncommitted for 15000ms; 
   [junit4]   2> 816904 INFO  (qtp1912852269-18601) [n:127.0.0.1:34407_solr c:jwtColl s:shard2 r:core_node4 x:jwtColl_shard2_replica_n2] o.a.s.u.CommitTracker Soft AutoCommit: disabled
   [junit4]   2> 816907 INFO  (qtp1912852269-18601) [n:127.0.0.1:34407_solr c:jwtColl s:shard2 r:core_node4 x:jwtColl_shard2_replica_n2] o.a.s.s.SolrIndexSearcher Opening [Searcher@28e83d82[jwtColl_shard2_replica_n2] main]
   [junit4]   2> 816909 INFO  (qtp1912852269-18601) [n:127.0.0.1:34407_solr c:jwtColl s:shard2 r:core_node4 x:jwtColl_shard2_replica_n2] o.a.s.r.ManagedResourceStorage Configured ZooKeeperStorageIO with znodeBase: /configs/jwtColl.AUTOCREATED
   [junit4]   2> 816910 INFO  (qtp1912852269-18601) [n:127.0.0.1:34407_solr c:jwtColl s:shard2 r:core_node4 x:jwtColl_shard2_replica_n2] o.a.s.r.ManagedResourceStorage Loaded null at path _rest_managed.json using ZooKeeperStorageIO:path=/configs/jwtColl.AUTOCREATED
   [junit4]   2> 816910 INFO  (qtp1912852269-18601) [n:127.0.0.1:34407_solr c:jwtColl s:shard2 r:core_node4 x:jwtColl_shard2_replica_n2] o.a.s.s.ZkIndexSchemaReader Creating ZooKeeper watch for the managed schema at /configs/jwtColl.AUTOCREATED/managed-schema
   [junit4]   2> 816911 INFO  (qtp1912852269-18601) [n:127.0.0.1:34407_solr c:jwtColl s:shard2 r:core_node4 x:jwtColl_shard2_replica_n2] o.a.s.s.ZkIndexSchemaReader Current schema version 0 is already the latest
   [junit4]   2> 816912 INFO  (qtp1912852269-18601) [n:127.0.0.1:34407_solr c:jwtColl s:shard2 r:core_node4 x:jwtColl_shard2_replica_n2] o.a.s.h.c.SpellCheckComponent Initializing spell checkers
   [junit4]   2> 816912 INFO  (qtp1912852269-18601) [n:127.0.0.1:34407_solr c:jwtColl s:shard2 r:core_node4 x:jwtColl_shard2_replica_n2] o.a.s.s.DirectSolrSpellChecker init: {name=default,field=_text_,classname=solr.DirectSolrSpellChecker,distanceMeasure=internal,accuracy=0.5,maxEdits=2,minPrefix=1,maxInspections=5,minQueryLength=4,maxQueryFrequency=0.01}
   [junit4]   2> 816914 INFO  (qtp1912852269-18601) [n:127.0.0.1:34407_solr c:jwtColl s:shard2 r:core_node4 x:jwtColl_shard2_replica_n2] o.a.s.h.ReplicationHandler Commits will be reserved for 10000ms.
   [junit4]   2> 816914 INFO  (qtp1912852269-18601) [n:127.0.0.1:34407_solr c:jwtColl s:shard2 r:core_node4 x:jwtColl_shard2_replica_n2] o.a.s.u.UpdateLog Could not find max version in index or recent updates, using new clock 1632879205785010176
   [junit4]   2> 816917 INFO  (searcherExecutor-5108-thread-1-processing-n:127.0.0.1:34407_solr x:jwtColl_shard2_replica_n2 c:jwtColl s:shard2 r:core_node4) [n:127.0.0.1:34407_solr c:jwtColl s:shard2 r:core_node4 x:jwtColl_shard2_replica_n2] o.a.s.c.QuerySenderListener QuerySenderListener sending requests to Searcher@28e83d82[jwtColl_shard2_replica_n2] main{ExitableDirectoryReader(UninvertingDirectoryReader())}
   [junit4]   2> 816917 INFO  (searcherExecutor-5108-thread-1-processing-n:127.0.0.1:34407_solr x:jwtColl_shard2_replica_n2 c:jwtColl s:shard2 r:core_node4) [n:127.0.0.1:34407_solr c:jwtColl s:shard2 r:core_node4 x:jwtColl_shard2_replica_n2] o.a.s.c.QuerySenderListener QuerySenderListener done.
   [junit4]   2> 816917 INFO  (searcherExecutor-5108-thread-1-processing-n:127.0.0.1:34407_solr x:jwtColl_shard2_replica_n2 c:jwtColl s:shard2 r:core_node4) [n:127.0.0.1:34407_solr c:jwtColl s:shard2 r:core_node4 x:jwtColl_shard2_replica_n2] o.a.s.h.c.SpellCheckComponent Loading spell index for spellchecker: default
   [junit4]   2> 816918 INFO  (searcherExecutor-5108-thread-1-processing-n:127.0.0.1:34407_solr x:jwtColl_shard2_replica_n2 c:jwtColl s:shard2 r:core_node4) [n:127.0.0.1:34407_solr c:jwtColl s:shard2 r:core_node4 x:jwtColl_shard2_replica_n2] o.a.s.c.SolrCore [jwtColl_shard2_replica_n2] Registered new searcher Searcher@28e83d82[jwtColl_shard2_replica_n2] main{ExitableDirectoryReader(UninvertingDirectoryReader())}
   [junit4]   2> 816921 INFO  (qtp1912852269-18601) [n:127.0.0.1:34407_solr c:jwtColl s:shard2 r:core_node4 x:jwtColl_shard2_replica_n2] o.a.s.c.ZkShardTerms Successful update of terms at /collections/jwtColl/terms/shard2 to Terms{values={core_node4=0}, version=0}
   [junit4]   2> 816922 INFO  (qtp1912852269-18601) [n:127.0.0.1:34407_solr c:jwtColl s:shard2 r:core_node4 x:jwtColl_shard2_replica_n2] o.a.s.c.ShardLeaderElectionContextBase make sure parent is created /collections/jwtColl/leaders/shard2
   [junit4]   2> 816927 INFO  (qtp1912852269-18601) [n:127.0.0.1:34407_solr c:jwtColl s:shard2 r:core_node4 x:jwtColl_shard2_replica_n2] o.a.s.c.ShardLeaderElectionContext Enough replicas found to continue.
   [junit4]   2> 816927 INFO  (qtp1912852269-18601) [n:127.0.0.1:34407_solr c:jwtColl s:shard2 r:core_node4 x:jwtColl_shard2_replica_n2] o.a.s.c.ShardLeaderElectionContext I may be the new leader - try and sync
   [junit4]   2> 816927 INFO  (qtp1912852269-18601) [n:127.0.0.1:34407_solr c:jwtColl s:shard2 r:core_node4 x:jwtColl_shard2_replica_n2] o.a.s.c.SyncStrategy Sync replicas to http://127.0.0.1:34407/solr/jwtColl_shard2_replica_n2/
   [junit4]   2> 816927 INFO  (qtp1912852269-18601) [n:127.0.0.1:34407_solr c:jwtColl s:shard2 r:core_node4 x:jwtColl_shard2_replica_n2] o.a.s.c.SyncStrategy Sync Success - now sync replicas to me
   [junit4]   2> 816928 INFO  (qtp1912852269-18601) [n:127.0.0.1:34407_solr c:jwtColl s:shard2 r:core_node4 x:jwtColl_shard2_replica_n2] o.a.s.c.SyncStrategy http://127.0.0.1:34407/solr/jwtColl_shard2_replica_n2/ has no replicas
   [junit4]   2> 816928 INFO  (qtp1912852269-18601) [n:127.0.0.1:34407_solr c:jwtColl s:shard2 r:core_node4 x:jwtColl_shard2_replica_n2] o.a.s.c.ShardLeaderElectionContextBase Creating leader registration node /collections/jwtColl/leaders/shard2/leader after winning as /collections/jwtColl/leader_elect/shard2/election/73261471238979592-core_node4-n_0000000000
   [junit4]   2> 816934 INFO  (qtp1912852269-18601) [n:127.0.0.1:34407_solr c:jwtColl s:shard2 r:core_node4 x:jwtColl_shard2_replica_n2] o.a.s.c.ShardLeaderElectionContext I am the new leader: http://127.0.0.1:34407/solr/jwtColl_shard2_replica_n2/ shard2
   [junit4]   2> 817038 INFO  (zkCallback-7479-thread-1) [    ] o.a.s.c.c.ZkStateReader A cluster state change: [WatchedEvent state:SyncConnected type:NodeDataChanged path:/collections/jwtColl/state.json] for collection [jwtColl] has occurred - updating... (live nodes size: [2])
   [junit4]   2> 817038 INFO  (zkCallback-7489-thread-2) [    ] o.a.s.c.c.ZkStateReader A cluster state change: [WatchedEvent state:SyncConnected type:NodeDataChanged path:/collections/jwtColl/state.json] for collection [jwtColl] has occurred - updating... (live nodes size: [2])
   [junit4]   2> 817038 INFO  (zkCallback-7489-thread-1) [    ] o.a.s.c.c.ZkStateReader A cluster state change: [WatchedEvent state:SyncConnected type:NodeDataChanged path:/collections/jwtColl/state.json] for collection [jwtColl] has occurred - updating... (live nodes size: [2])
   [junit4]   2> 817038 INFO  (zkCallback-7479-thread-2) [    ] o.a.s.c.c.ZkStateReader A cluster state change: [WatchedEvent state:SyncConnected type:NodeDataChanged path:/collections/jwtColl/state.json] for collection [jwtColl] has occurred - updating... (live nodes size: [2])
   [junit4]   2> 817039 INFO  (qtp675102255-18600) [n:127.0.0.1:44760_solr c:jwtColl s:shard1 r:core_node3 x:jwtColl_shard1_replica_n1] o.a.s.c.ZkController I am the leader, no recovery necessary
   [junit4]   2> 817040 INFO  (qtp1912852269-18601) [n:127.0.0.1:34407_solr c:jwtColl s:shard2 r:core_node4 x:jwtColl_shard2_replica_n2] o.a.s.c.ZkController I am the leader, no recovery necessary
   [junit4]   2> 817042 INFO  (qtp675102255-18600) [n:127.0.0.1:44760_solr c:jwtColl s:shard1 r:core_node3 x:jwtColl_shard1_replica_n1] o.a.s.s.HttpSolrCall [admin] webapp=null path=/admin/cores params={qt=/admin/cores&coreNodeName=core_node3&collection.configName=jwtColl.AUTOCREATED&newCollection=true&name=jwtColl_shard1_replica_n1&action=CREATE&numShards=2&collection=jwtColl&shard=shard1&wt=javabin&version=2&replicaType=NRT} status=0 QTime=1981
   [junit4]   2> 817044 INFO  (qtp1912852269-18601) [n:127.0.0.1:34407_solr c:jwtColl s:shard2 r:core_node4 x:jwtColl_shard2_replica_n2] o.a.s.s.HttpSolrCall [admin] webapp=null path=/admin/cores params={qt=/admin/cores&coreNodeName=core_node4&collection.configName=jwtColl.AUTOCREATED&newCollection=true&name=jwtColl_shard2_replica_n2&action=CREATE&numShards=2&collection=jwtColl&shard=shard2&wt=javabin&version=2&replicaType=NRT} status=0 QTime=1981
   [junit4]   2> 817048 INFO  (qtp1912852269-18603) [n:127.0.0.1:34407_solr    ] o.a.s.h.a.CollectionsHandler Wait for new collection to be active for at most 45 seconds. Check all shard replicas
   [junit4]   2> 817146 INFO  (zkCallback-7479-thread-2) [    ] o.a.s.c.c.ZkStateReader A cluster state change: [WatchedEvent state:SyncConnected type:NodeDataChanged path:/collections/jwtColl/state.json] for collection [jwtColl] has occurred - updating... (live nodes size: [2])
   [junit4]   2> 817146 INFO  (zkCallback-7479-thread-1) [    ] o.a.s.c.c.ZkStateReader A cluster state change: [WatchedEvent state:SyncConnected type:NodeDataChanged path:/collections/jwtColl/state.json] for collection [jwtColl] has occurred - updating... (live nodes size: [2])
   [junit4]   2> 817146 INFO  (zkCallback-7489-thread-2) [    ] o.a.s.c.c.ZkStateReader A cluster state change: [WatchedEvent state:SyncConnected type:NodeDataChanged path:/collections/jwtColl/state.json] for collection [jwtColl] has occurred - updating... (live nodes size: [2])
   [junit4]   2> 817146 INFO  (zkCallback-7489-thread-1) [    ] o.a.s.c.c.ZkStateReader A cluster state change: [WatchedEvent state:SyncConnected type:NodeDataChanged path:/collections/jwtColl/state.json] for collection [jwtColl] has occurred - updating... (live nodes size: [2])
   [junit4]   2> 817146 INFO  (zkCallback-7479-thread-3) [    ] o.a.s.c.c.ZkStateReader A cluster state change: [WatchedEvent state:SyncConnected type:NodeDataChanged path:/collections/jwtColl/state.json] for collection [jwtColl] has occurred - updating... (live nodes size: [2])
   [junit4]   2> 817147 INFO  (zkCallback-7489-thread-3) [    ] o.a.s.c.c.ZkStateReader A cluster state change: [WatchedEvent state:SyncConnected type:NodeDataChanged path:/collections/jwtColl/state.json] for collection [jwtColl] has occurred - updating... (live nodes size: [2])
   [junit4]   2> 817148 INFO  (qtp1912852269-18603) [n:127.0.0.1:34407_solr    ] o.a.s.s.HttpSolrCall [admin] webapp=null path=/admin/collections params={name=jwtColl&action=CREATE&numShards=2} status=0 QTime=2639
   [junit4]   2> 817176 INFO  (TEST-JWTAuthPluginIntegrationTest.createCollectionUpdateAndQueryDistributed-seed#[D144B5E0BE5D5D08]) [    ] o.a.s.c.SolrCloudAuthTestCase First metrics count assert failed, pausing 2s before re-attempt
   [junit4]   2> 818525 INFO  (OverseerCollectionConfigSetProcessor-73261471238979592-127.0.0.1:34407_solr-n_0000000000) [n:127.0.0.1:34407_solr    ] o.a.s.c.OverseerTaskQueue Response ZK path: /overseer/collection-queue-work/qnr-0000000000 doesn't exist.  Requestor may have disconnected from ZooKeeper
   [junit4]   2> 819180 INFO  (jetty-closer-7512-thread-2) [    ] o.a.s.c.CoreContainer Shutting down CoreContainer instance=2063688161
   [junit4]   2> 819181 INFO  (jetty-closer-7512-thread-2) [    ] o.a.s.c.ZkController Remove node as live in ZooKeeper:/live_nodes/127.0.0.1:44760_solr
   [junit4]   2> 819181 INFO  (jetty-closer-7512-thread-1) [    ] o.a.s.c.CoreContainer Shutting down CoreContainer instance=634303413
   [junit4]   2> 819181 INFO  (jetty-closer-7512-thread-1) [    ] o.a.s.c.ZkController Remove node as live in ZooKeeper:/live_nodes/127.0.0.1:34407_solr
   [junit4]   2> 819181 INFO  (jetty-closer-7512-thread-2) [    ] o.a.s.c.ZkController Publish this node as DOWN...
   [junit4]   2> 819181 INFO  (jetty-closer-7512-thread-2) [    ] o.a.s.c.ZkController Publish node=127.0.0.1:44760_solr as DOWN
   [junit4]   2> 819181 INFO  (jetty-closer-7512-thread-1) [    ] o.a.s.c.ZkController Publish this node as DOWN...
   [junit4]   2> 819181 INFO  (jetty-closer-7512-thread-1) [    ] o.a.s.c.ZkController Publish node=127.0.0.1:34407_solr as DOWN
   [junit4]   2> 819185 INFO  (coreCloseExecutor-5117-thread-1) [n:127.0.0.1:44760_solr c:jwtColl s:shard1 r:core_node3 x:jwtColl_shard1_replica_n1] o.a.s.c.SolrCore [jwtColl_shard1_replica_n1]  CLOSING SolrCore org.apache.solr.core.SolrCore@5cf4e5aa
   [junit4]   2> 819185 INFO  (coreCloseExecutor-5117-thread-1) [n:127.0.0.1:44760_solr c:jwtColl s:shard1 r:core_node3 x:jwtColl_shard1_replica_n1] o.a.s.m.SolrMetricManager Closing metric reporters for registry=solr.core.jwtColl.shard1.replica_n1, tag=5cf4e5aa
   [junit4]   2> 819185 INFO  (coreCloseExecutor-5117-thread-1) [n:127.0.0.1:44760_solr c:jwtColl s:shard1 r:core_node3 x:jwtColl_shard1_replica_n1] o.a.s.m.r.SolrJmxReporter Closing reporter [org.apache.solr.metrics.reporters.SolrJmxReporter@2318358b: rootName = solr_44760, domain = solr.core.jwtColl.shard1.replica_n1, service url = null, agent id = null] for registry solr.core.jwtColl.shard1.replica_n1 / com.codahale.metrics.MetricRegistry@15248d18
   [junit4]   2> 819185 INFO  (zkCallback-7489-thread-1) [    ] o.a.s.c.c.ZkStateReader A cluster state change: [WatchedEvent state:SyncConnected type:NodeDataChanged path:/collections/jwtColl/state.json] for collection [jwtColl] has occurred - updating... (live nodes size: [2])
   [junit4]   2> 819185 INFO  (zkCallback-7489-thread-2) [    ] o.a.s.c.c.ZkStateReader A cluster state change: [WatchedEvent state:SyncConnected type:NodeDataChanged path:/collections/jwtColl/state.json] for collection [jwtColl] has occurred - updating... (live nodes size: [2])
   [junit4]   2> 819189 INFO  (zkCallback-7479-thread-3) [    ] o.a.s.c.c.ZkStateReader A cluster state change: [WatchedEvent state:SyncConnected type:NodeDataChanged path:/collections/jwtColl/state.json] for collection [jwtColl] has occurred - updating... (live nodes size: [2])
   [junit4]   2> 819189 INFO  (zkCallback-7489-thread-3) [    ] o.a.s.c.c.ZkStateReader A cluster state change: [WatchedEvent state:SyncConnected type:NodeDataChanged path:/collections/jwtColl/state.json] for collection [jwtColl] has occurred - updating... (live nodes size: [2])
   [junit4]   2> 819189 INFO  (zkCallback-7479-thread-1) [    ] o.a.s.c.c.ZkStateReader A cluster state change: [WatchedEvent state:SyncConnected type:NodeDataChanged path:/collections/jwtColl/state.json] for collection [jwtColl] has occurred - updating... (live nodes size: [2])
   [junit4]   2> 819189 INFO  (zkCallback-7479-thread-2) [    ] o.a.s.c.c.ZkStateReader A cluster state change: [WatchedEvent state:SyncConnected type:NodeDataChanged path:/collections/jwtColl/state.json] for collection [jwtColl] has occurred - updating... (live nodes size: [2])
   [junit4]   2> 819190 INFO  (coreCloseExecutor-5118-thread-1) [n:127.0.0.1:34407_solr c:jwtColl s:shard2 r:core_node4 x:jwtColl_shard2_replica_n2] o.a.s.c.SolrCore [jwtColl_shard2_replica_n2]  CLOSING SolrCore org.apache.solr.core.SolrCore@6ad28018
   [junit4]   2> 819190 INFO  (coreCloseExecutor-5118-thread-1) [n:127.0.0.1:34407_solr c:jwtColl s:shard2 r:core_node4 x:jwtColl_shard2_replica_n2] o.a.s.m.SolrMetricManager Closing metric reporters for registry=solr.core.jwtColl.shard2.replica_n2, tag=6ad28018
   [junit4]   2> 819190 INFO  (coreCloseExecutor-5118-thread-1) [n:127.0.0.1:34407_solr c:jwtColl s:shard2 r:core_node4 x:jwtColl_shard2_replica_n2] o.a.s.m.r.SolrJmxReporter Closing reporter [org.apache.solr.metrics.reporters.SolrJmxReporter@70b76046: rootName = solr_34407, domain = solr.core.jwtColl.shard2.replica_n2, service url = null, agent id = null] for registry solr.core.jwtColl.shard2.replica_n2 / com.codahale.metrics.MetricRegistry@5618aed
   [junit4]   2> 819202 INFO  (coreCloseExecutor-5117-thread-1) [n:127.0.0.1:44760_solr c:jwtColl s:shard1 r:core_node3 x:jwtColl_shard1_replica_n1] o.a.s.m.SolrMetricManager Closing metric reporters for registry=solr.collection.jwtColl.shard1.leader, tag=5cf4e5aa
   [junit4]   2> 819204 INFO  (jetty-closer-7512-thread-2) [    ] o.a.s.m.SolrMetricManager Closing metric reporters for registry=solr.node, tag=null
   [junit4]   2> 819204 INFO  (jetty-closer-7512-thread-2) [    ] o.a.s.m.r.SolrJmxReporter Closing reporter [org.apache.solr.metrics.reporters.SolrJmxReporter@67e085b5: rootName = solr_44760, domain = solr.node, service url = null, agent id = null] for registry solr.node / com.codahale.metrics.MetricRegistry@5f946e10
   [junit4]   2> 819207 INFO  (coreCloseExecutor-5118-thread-1) [n:127.0.0.1:34407_solr c:jwtColl s:shard2 r:core_node4 x:jwtColl_shard2_replica_n2] o.a.s.m.SolrMetricManager Closing metric reporters for registry=solr.collection.jwtColl.shard2.leader, tag=6ad28018
   [junit4]   2> 819209 INFO  (jetty-closer-7512-thread-1) [    ] o.a.s.m.SolrMetricManager Closing metric reporters for registry=solr.node, tag=null
   [junit4]   2> 819209 INFO  (jetty-closer-7512-thread-1) [    ] o.a.s.m.r.SolrJmxReporter Closing reporter [org.apache.solr.metrics.reporters.SolrJmxReporter@2893cfb4: rootName = solr_34407, domain = solr.node, service url = null, agent id = null] for registry solr.node / com.codahale.metrics.MetricRegistry@741c4c42
   [junit4]   2> 819213 INFO  (jetty-closer-7512-thread-2) [    ] o.a.s.m.SolrMetricManager Closing metric reporters for registry=solr.jvm, tag=null
   [junit4]   2> 819213 INFO  (jetty-closer-7512-thread-2) [    ] o.a.s.m.r.SolrJmxReporter Closing reporter [org.apache.solr.metrics.reporters.SolrJmxReporter@1c92c27d: rootName = solr_44760, domain = solr.jvm, service url = null, agent id = null] for registry solr.jvm / com.codahale.metrics.MetricRegistry@50cd4db3
   [junit4]   2> 819219 INFO  (jetty-closer-7512-thread-1) [    ] o.a.s.m.SolrMetricManager Closing metric reporters for registry=solr.jvm, tag=null
   [junit4]   2> 819219 INFO  (jetty-closer-7512-thread-1) [    ] o.a.s.m.r.SolrJmxReporter Closing reporter [org.apache.solr.metrics.reporters.SolrJmxReporter@1df1f5e9: rootName = solr_34407, domain = solr.jvm, service url = null, agent id = null] for registry solr.jvm / com.codahale.metrics.MetricRegistry@50cd4db3
   [junit4]   2> 819222 INFO  (jetty-closer-7512-thread-1) [    ] o.a.s.m.SolrMetricManager Closing metric reporters for registry=solr.jetty, tag=null
   [junit4]   2> 819224 INFO  (jetty-closer-7512-thread-2) [    ] o.a.s.m.SolrMetricManager Closing metric reporters for registry=solr.jetty, tag=null
   [junit4]   2> 819224 INFO  (jetty-closer-7512-thread-2) [    ] o.a.s.m.r.SolrJmxReporter Closing reporter [org.apache.solr.metrics.reporters.SolrJmxReporter@47234f29: rootName = solr_44760, domain = solr.jetty, service url = null, agent id = null] for registry solr.jetty / com.codahale.metrics.MetricRegistry@3abd199a
   [junit4]   2> 819224 INFO  (jetty-closer-7512-thread-2) [    ] o.a.s.m.SolrMetricManager Closing metric reporters for registry=solr.cluster, tag=null
   [junit4]   2> 819225 INFO  (jetty-closer-7512-thread-1) [    ] o.a.s.m.r.SolrJmxReporter Closing reporter [org.apache.solr.metrics.reporters.SolrJmxReporter@d20c9f3: rootName = solr_34407, domain = solr.jetty, service url = null, agent id = null] for registry solr.jetty / com.codahale.metrics.MetricRegistry@3abd199a
   [junit4]   2> 819225 INFO  (jetty-closer-7512-thread-1) [    ] o.a.s.m.SolrMetricManager Closing metric reporters for registry=solr.cluster, tag=null
   [junit4]   2> 819228 INFO  (jetty-closer-7512-thread-1) [    ] o.a.s.c.Overseer Overseer (id=73261471238979592-127.0.0.1:34407_solr-n_0000000000) closing
   [junit4]   2> 819228 INFO  (OverseerStateUpdate-73261471238979592-127.0.0.1:34407_solr-n_0000000000) [n:127.0.0.1:34407_solr    ] o.a.s.c.Overseer Overseer Loop exiting : 127.0.0.1:34407_solr
   [junit4]   2> 819229 INFO  (zkCallback-7496-thread-1) [    ] o.a.s.c.c.ZkStateReader Updated live nodes from ZooKeeper... (2) -> (1)
   [junit4]   2> 819229 INFO  (zkCallback-7502-thread-1) [    ] o.a.s.c.c.ZkStateReader Updated live nodes from ZooKeeper... (2) -> (1)
   [junit4]   2> 819229 INFO  (OverseerAutoScalingTriggerThread-73261471238979592-127.0.0.1:34407_solr-n_0000000000) [    ] o.a.s.c.a.OverseerTriggerThread OverseerTriggerThread woken up but we are closed, exiting.
   [junit4]   2> 819232 INFO  (closeThreadPool-7520-thread-2) [    ] o.a.s.c.Overseer Overseer (id=73261471238979592-127.0.0.1:34407_solr-n_0000000000) closing
   [junit4]   2> 819233 INFO  (zkCallback-7496-thread-1) [    ] o.a.s.c.c.ZkStateReader Updated live nodes from ZooKeeper... (1) -> (0)
   [junit4]   2> 819233 INFO  (zkCallback-7502-thread-1) [    ] o.a.s.c.c.ZkStateReader Updated live nodes from ZooKeeper... (1) -> (0)
   [junit4]   2> 819235 INFO  (closeThreadPool-7520-thread-1) [    ] o.a.s.c.Overseer Overseer (id=73261471238979592-127.0.0.1:34407_solr-n_0000000000) closing
   [junit4]   2> 819237 INFO  (jetty-closer-7512-thread-2) [    ] o.e.j.s.AbstractConnector Stopped ServerConnector@733c3b4b{HTTP/1.1,[http/1.1, h2c]}{127.0.0.1:0}
   [junit4]   2> 819237 INFO  (jetty-closer-7512-thread-2) [    ] o.e.j.s.h.ContextHandler Stopped o.e.j.s.ServletContextHandler@4763977{/solr,null,UNAVAILABLE}
   [junit4]   2> 819237 INFO  (jetty-closer-7512-thread-2) [    ] o.e.j.s.session node0 Stopped scavenging
   [junit4]   2> 819238 INFO  (jetty-closer-7512-thread-1) [    ] o.e.j.s.AbstractConnector Stopped ServerConnector@78c894a7{HTTP/1.1,[http/1.1, h2c]}{127.0.0.1:0}
   [junit4]   2> 819238 INFO  (jetty-closer-7512-thread-1) [    ] o.e.j.s.h.ContextHandler Stopped o.e.j.s.ServletContextHandler@3664609d{/solr,nu

[...truncated too long message...]

ivy-configure:
[ivy:configure] :: loading settings :: file = /x1/jenkins/jenkins-slave/workspace/Lucene-Solr-Tests-8.x/lucene/top-level-ivy-settings.xml

resolve:

ivy-availability-check:
[loadresource] Do not set property disallowed.ivy.jars.list as its length is 0.

-ivy-fail-disallowed-ivy-version:

ivy-fail:

ivy-fail:

ivy-configure:
[ivy:configure] :: loading settings :: file = /x1/jenkins/jenkins-slave/workspace/Lucene-Solr-Tests-8.x/lucene/top-level-ivy-settings.xml

resolve:

ivy-availability-check:
[loadresource] Do not set property disallowed.ivy.jars.list as its length is 0.

-ivy-fail-disallowed-ivy-version:

ivy-fail:

ivy-configure:
[ivy:configure] :: loading settings :: file = /x1/jenkins/jenkins-slave/workspace/Lucene-Solr-Tests-8.x/lucene/top-level-ivy-settings.xml

resolve:

ivy-availability-check:
[loadresource] Do not set property disallowed.ivy.jars.list as its length is 0.

-ivy-fail-disallowed-ivy-version:

ivy-fail:

ivy-fail:

ivy-configure:
[ivy:configure] :: loading settings :: file = /x1/jenkins/jenkins-slave/workspace/Lucene-Solr-Tests-8.x/lucene/top-level-ivy-settings.xml

resolve:

ivy-availability-check:
[loadresource] Do not set property disallowed.ivy.jars.list as its length is 0.

-ivy-fail-disallowed-ivy-version:

ivy-fail:

ivy-configure:
[ivy:configure] :: loading settings :: file = /x1/jenkins/jenkins-slave/workspace/Lucene-Solr-Tests-8.x/lucene/top-level-ivy-settings.xml

resolve:

ivy-availability-check:
[loadresource] Do not set property disallowed.ivy.jars.list as its length is 0.

-ivy-fail-disallowed-ivy-version:

ivy-fail:

ivy-fail:

ivy-configure:
[ivy:configure] :: loading settings :: file = /x1/jenkins/jenkins-slave/workspace/Lucene-Solr-Tests-8.x/lucene/top-level-ivy-settings.xml

resolve:

ivy-availability-check:
[loadresource] Do not set property disallowed.ivy.jars.list as its length is 0.

-ivy-fail-disallowed-ivy-version:

ivy-fail:

ivy-fail:

ivy-configure:
[ivy:configure] :: loading settings :: file = /x1/jenkins/jenkins-slave/workspace/Lucene-Solr-Tests-8.x/lucene/top-level-ivy-settings.xml

resolve:

ivy-availability-check:
[loadresource] Do not set property disallowed.ivy.jars.list as its length is 0.

-ivy-fail-disallowed-ivy-version:

ivy-fail:

ivy-fail:

ivy-configure:
[ivy:configure] :: loading settings :: file = /x1/jenkins/jenkins-slave/workspace/Lucene-Solr-Tests-8.x/lucene/top-level-ivy-settings.xml

resolve:

ivy-availability-check:
[loadresource] Do not set property disallowed.ivy.jars.list as its length is 0.

-ivy-fail-disallowed-ivy-version:

ivy-fail:

ivy-fail:

ivy-configure:
[ivy:configure] :: loading settings :: file = /x1/jenkins/jenkins-slave/workspace/Lucene-Solr-Tests-8.x/lucene/top-level-ivy-settings.xml

resolve:

ivy-availability-check:
[loadresource] Do not set property disallowed.ivy.jars.list as its length is 0.

-ivy-fail-disallowed-ivy-version:

ivy-fail:

ivy-fail:

ivy-configure:
[ivy:configure] :: loading settings :: file = /x1/jenkins/jenkins-slave/workspace/Lucene-Solr-Tests-8.x/lucene/top-level-ivy-settings.xml

resolve:

ivy-availability-check:
[loadresource] Do not set property disallowed.ivy.jars.list as its length is 0.

-ivy-fail-disallowed-ivy-version:

ivy-fail:

ivy-fail:

ivy-configure:
[ivy:configure] :: loading settings :: file = /x1/jenkins/jenkins-slave/workspace/Lucene-Solr-Tests-8.x/lucene/top-level-ivy-settings.xml

resolve:

ivy-availability-check:
[loadresource] Do not set property disallowed.ivy.jars.list as its length is 0.

-ivy-fail-disallowed-ivy-version:

ivy-fail:

ivy-fail:

ivy-configure:
[ivy:configure] :: loading settings :: file = /x1/jenkins/jenkins-slave/workspace/Lucene-Solr-Tests-8.x/lucene/top-level-ivy-settings.xml

resolve:

ivy-availability-check:
[loadresource] Do not set property disallowed.ivy.jars.list as its length is 0.

-ivy-fail-disallowed-ivy-version:

ivy-fail:

ivy-fail:

ivy-configure:
[ivy:configure] :: loading settings :: file = /x1/jenkins/jenkins-slave/workspace/Lucene-Solr-Tests-8.x/lucene/top-level-ivy-settings.xml

resolve:

ivy-availability-check:
[loadresource] Do not set property disallowed.ivy.jars.list as its length is 0.

-ivy-fail-disallowed-ivy-version:

ivy-fail:

ivy-fail:

ivy-configure:
[ivy:configure] :: loading settings :: file = /x1/jenkins/jenkins-slave/workspace/Lucene-Solr-Tests-8.x/lucene/top-level-ivy-settings.xml

resolve:

ivy-availability-check:
[loadresource] Do not set property disallowed.ivy.jars.list as its length is 0.

-ivy-fail-disallowed-ivy-version:

ivy-fail:

ivy-fail:

ivy-configure:
[ivy:configure] :: loading settings :: file = /x1/jenkins/jenkins-slave/workspace/Lucene-Solr-Tests-8.x/lucene/top-level-ivy-settings.xml

resolve:

jar-checksums:
    [mkdir] Created dir: /x1/jenkins/jenkins-slave/workspace/Lucene-Solr-Tests-8.x/solr/null2120448717
     [copy] Copying 239 files to /x1/jenkins/jenkins-slave/workspace/Lucene-Solr-Tests-8.x/solr/null2120448717
   [delete] Deleting directory /x1/jenkins/jenkins-slave/workspace/Lucene-Solr-Tests-8.x/solr/null2120448717

check-working-copy:
[ivy:cachepath] :: resolving dependencies :: #;working@lucene1-us-west
[ivy:cachepath] 	confs: [default]
[ivy:cachepath] 	found org.eclipse.jgit#org.eclipse.jgit;5.3.0.201903130848-r in public
[ivy:cachepath] 	found com.jcraft#jsch;0.1.54 in public
[ivy:cachepath] 	found com.jcraft#jzlib;1.1.1 in public
[ivy:cachepath] 	found com.googlecode.javaewah#JavaEWAH;1.1.6 in public
[ivy:cachepath] 	found org.slf4j#slf4j-api;1.7.2 in public
[ivy:cachepath] 	found org.bouncycastle#bcpg-jdk15on;1.60 in public
[ivy:cachepath] 	found org.bouncycastle#bcprov-jdk15on;1.60 in public
[ivy:cachepath] 	found org.bouncycastle#bcpkix-jdk15on;1.60 in public
[ivy:cachepath] 	found org.slf4j#slf4j-nop;1.7.2 in public
[ivy:cachepath] :: resolution report :: resolve 30ms :: artifacts dl 2ms
	---------------------------------------------------------------------
	|                  |            modules            ||   artifacts   |
	|       conf       | number| search|dwnlded|evicted|| number|dwnlded|
	---------------------------------------------------------------------
	|      default     |   9   |   0   |   0   |   0   ||   9   |   0   |
	---------------------------------------------------------------------
[wc-checker] Initializing working copy...
[wc-checker] Checking working copy status...

-jenkins-base:

BUILD SUCCESSFUL
Total time: 108 minutes 40 seconds
Archiving artifacts
java.lang.InterruptedException: no matches found within 10000
	at hudson.FilePath$ValidateAntFileMask.hasMatch(FilePath.java:2847)
	at hudson.FilePath$ValidateAntFileMask.invoke(FilePath.java:2726)
	at hudson.FilePath$ValidateAntFileMask.invoke(FilePath.java:2707)
	at hudson.FilePath$FileCallableWrapper.call(FilePath.java:3086)
Also:   hudson.remoting.Channel$CallSiteStackTrace: Remote call to lucene
		at hudson.remoting.Channel.attachCallSiteStackTrace(Channel.java:1741)
		at hudson.remoting.UserRequest$ExceptionResponse.retrieve(UserRequest.java:357)
		at hudson.remoting.Channel.call(Channel.java:955)
		at hudson.FilePath.act(FilePath.java:1072)
		at hudson.FilePath.act(FilePath.java:1061)
		at hudson.FilePath.validateAntFileMask(FilePath.java:2705)
		at hudson.tasks.ArtifactArchiver.perform(ArtifactArchiver.java:243)
		at hudson.tasks.BuildStepCompatibilityLayer.perform(BuildStepCompatibilityLayer.java:81)
		at hudson.tasks.BuildStepMonitor$1.perform(BuildStepMonitor.java:20)
		at hudson.model.AbstractBuild$AbstractBuildExecution.perform(AbstractBuild.java:744)
		at hudson.model.AbstractBuild$AbstractBuildExecution.performAllBuildSteps(AbstractBuild.java:690)
		at hudson.model.Build$BuildExecution.post2(Build.java:186)
		at hudson.model.AbstractBuild$AbstractBuildExecution.post(AbstractBuild.java:635)
		at hudson.model.Run.execute(Run.java:1835)
		at hudson.model.FreeStyleBuild.run(FreeStyleBuild.java:43)
		at hudson.model.ResourceController.execute(ResourceController.java:97)
		at hudson.model.Executor.run(Executor.java:429)
Caused: hudson.FilePath$TunneledInterruptedException
	at hudson.FilePath$FileCallableWrapper.call(FilePath.java:3088)
	at hudson.remoting.UserRequest.perform(UserRequest.java:212)
	at hudson.remoting.UserRequest.perform(UserRequest.java:54)
	at hudson.remoting.Request$2.run(Request.java:369)
	at hudson.remoting.InterceptingExecutorService$1.call(InterceptingExecutorService.java:72)
	at java.util.concurrent.FutureTask.run(FutureTask.java:266)
	at java.util.concurrent.ThreadPoolExecutor.runWorker(ThreadPoolExecutor.java:1142)
	at java.util.concurrent.ThreadPoolExecutor$Worker.run(ThreadPoolExecutor.java:617)
	at java.lang.Thread.run(Thread.java:748)
Caused: java.lang.InterruptedException: java.lang.InterruptedException: no matches found within 10000
	at hudson.FilePath.act(FilePath.java:1074)
	at hudson.FilePath.act(FilePath.java:1061)
	at hudson.FilePath.validateAntFileMask(FilePath.java:2705)
	at hudson.tasks.ArtifactArchiver.perform(ArtifactArchiver.java:243)
	at hudson.tasks.BuildStepCompatibilityLayer.perform(BuildStepCompatibilityLayer.java:81)
	at hudson.tasks.BuildStepMonitor$1.perform(BuildStepMonitor.java:20)
	at hudson.model.AbstractBuild$AbstractBuildExecution.perform(AbstractBuild.java:744)
	at hudson.model.AbstractBuild$AbstractBuildExecution.performAllBuildSteps(AbstractBuild.java:690)
	at hudson.model.Build$BuildExecution.post2(Build.java:186)
	at hudson.model.AbstractBuild$AbstractBuildExecution.post(AbstractBuild.java:635)
	at hudson.model.Run.execute(Run.java:1835)
	at hudson.model.FreeStyleBuild.run(FreeStyleBuild.java:43)
	at hudson.model.ResourceController.execute(ResourceController.java:97)
	at hudson.model.Executor.run(Executor.java:429)
No artifacts found that match the file pattern "**/*.events,heapdumps/**,**/hs_err_pid*". Configuration error?
Recording test results
Build step 'Publish JUnit test result report' changed build result to UNSTABLE
Email was triggered for: Unstable (Test Failures)
Sending email for trigger: Unstable (Test Failures)

Mime
View raw message