lucene-dev mailing list archives

Site index · List index
Message view « Date » · « Thread »
Top « Date » · « Thread »
From Policeman Jenkins Server <jenk...@thetaphi.de>
Subject [JENKINS] Lucene-Solr-8.x-MacOSX (64bit/jdk-11.0.2) - Build # 115 - Still Failing!
Date Thu, 02 May 2019 09:49:07 GMT
Build: https://jenkins.thetaphi.de/job/Lucene-Solr-8.x-MacOSX/115/
Java: 64bit/jdk-11.0.2 -XX:-UseCompressedOops -XX:+UseG1GC

1 tests failed.
FAILED:  org.apache.solr.update.TestInPlaceUpdatesDistrib.test

Error Message:
Thread pool didn't terminate within 15 secs

Stack Trace:
java.lang.AssertionError: Thread pool didn't terminate within 15 secs
	at __randomizedtesting.SeedInfo.seed([273338CDBB2FF314:AF67071715D39EEC]:0)
	at org.junit.Assert.fail(Assert.java:88)
	at org.junit.Assert.assertTrue(Assert.java:41)
	at org.apache.solr.update.TestInPlaceUpdatesDistrib.reorderedDBQsResurrectionTest(TestInPlaceUpdatesDistrib.java:852)
	at org.apache.solr.update.TestInPlaceUpdatesDistrib.test(TestInPlaceUpdatesDistrib.java:179)
	at java.base/jdk.internal.reflect.NativeMethodAccessorImpl.invoke0(Native Method)
	at java.base/jdk.internal.reflect.NativeMethodAccessorImpl.invoke(NativeMethodAccessorImpl.java:62)
	at java.base/jdk.internal.reflect.DelegatingMethodAccessorImpl.invoke(DelegatingMethodAccessorImpl.java:43)
	at java.base/java.lang.reflect.Method.invoke(Method.java:566)
	at com.carrotsearch.randomizedtesting.RandomizedRunner.invoke(RandomizedRunner.java:1750)
	at com.carrotsearch.randomizedtesting.RandomizedRunner$8.evaluate(RandomizedRunner.java:938)
	at com.carrotsearch.randomizedtesting.RandomizedRunner$9.evaluate(RandomizedRunner.java:974)
	at com.carrotsearch.randomizedtesting.RandomizedRunner$10.evaluate(RandomizedRunner.java:988)
	at org.apache.solr.BaseDistributedSearchTestCase$ShardsRepeatRule$ShardsFixedStatement.callStatement(BaseDistributedSearchTestCase.java:1082)
	at org.apache.solr.BaseDistributedSearchTestCase$ShardsRepeatRule$ShardsStatement.evaluate(BaseDistributedSearchTestCase.java:1054)
	at com.carrotsearch.randomizedtesting.rules.SystemPropertiesRestoreRule$1.evaluate(SystemPropertiesRestoreRule.java:57)
	at org.apache.lucene.util.TestRuleSetupTeardownChained$1.evaluate(TestRuleSetupTeardownChained.java:49)
	at org.apache.lucene.util.AbstractBeforeAfterRule$1.evaluate(AbstractBeforeAfterRule.java:45)
	at org.apache.lucene.util.TestRuleThreadAndTestName$1.evaluate(TestRuleThreadAndTestName.java:48)
	at org.apache.lucene.util.TestRuleIgnoreAfterMaxFailures$1.evaluate(TestRuleIgnoreAfterMaxFailures.java:64)
	at org.apache.lucene.util.TestRuleMarkFailure$1.evaluate(TestRuleMarkFailure.java:47)
	at com.carrotsearch.randomizedtesting.rules.StatementAdapter.evaluate(StatementAdapter.java:36)
	at com.carrotsearch.randomizedtesting.ThreadLeakControl$StatementRunner.run(ThreadLeakControl.java:368)
	at com.carrotsearch.randomizedtesting.ThreadLeakControl.forkTimeoutingTask(ThreadLeakControl.java:817)
	at com.carrotsearch.randomizedtesting.ThreadLeakControl$3.evaluate(ThreadLeakControl.java:468)
	at com.carrotsearch.randomizedtesting.RandomizedRunner.runSingleTest(RandomizedRunner.java:947)
	at com.carrotsearch.randomizedtesting.RandomizedRunner$5.evaluate(RandomizedRunner.java:832)
	at com.carrotsearch.randomizedtesting.RandomizedRunner$6.evaluate(RandomizedRunner.java:883)
	at com.carrotsearch.randomizedtesting.RandomizedRunner$7.evaluate(RandomizedRunner.java:894)
	at com.carrotsearch.randomizedtesting.rules.StatementAdapter.evaluate(StatementAdapter.java:36)
	at com.carrotsearch.randomizedtesting.rules.SystemPropertiesRestoreRule$1.evaluate(SystemPropertiesRestoreRule.java:57)
	at org.apache.lucene.util.AbstractBeforeAfterRule$1.evaluate(AbstractBeforeAfterRule.java:45)
	at com.carrotsearch.randomizedtesting.rules.StatementAdapter.evaluate(StatementAdapter.java:36)
	at org.apache.lucene.util.TestRuleStoreClassName$1.evaluate(TestRuleStoreClassName.java:41)
	at com.carrotsearch.randomizedtesting.rules.NoShadowingOrOverridesOnMethodsRule$1.evaluate(NoShadowingOrOverridesOnMethodsRule.java:40)
	at com.carrotsearch.randomizedtesting.rules.NoShadowingOrOverridesOnMethodsRule$1.evaluate(NoShadowingOrOverridesOnMethodsRule.java:40)
	at com.carrotsearch.randomizedtesting.rules.StatementAdapter.evaluate(StatementAdapter.java:36)
	at com.carrotsearch.randomizedtesting.rules.StatementAdapter.evaluate(StatementAdapter.java:36)
	at org.apache.lucene.util.TestRuleAssertionsRequired$1.evaluate(TestRuleAssertionsRequired.java:53)
	at org.apache.lucene.util.TestRuleMarkFailure$1.evaluate(TestRuleMarkFailure.java:47)
	at org.apache.lucene.util.TestRuleIgnoreAfterMaxFailures$1.evaluate(TestRuleIgnoreAfterMaxFailures.java:64)
	at org.apache.lucene.util.TestRuleIgnoreTestSuites$1.evaluate(TestRuleIgnoreTestSuites.java:54)
	at com.carrotsearch.randomizedtesting.rules.StatementAdapter.evaluate(StatementAdapter.java:36)
	at com.carrotsearch.randomizedtesting.ThreadLeakControl$StatementRunner.run(ThreadLeakControl.java:368)
	at java.base/java.lang.Thread.run(Thread.java:834)




Build Log:
[...truncated 15767 lines...]
   [junit4] Suite: org.apache.solr.update.TestInPlaceUpdatesDistrib
   [junit4]   2> Creating dataDir: /Users/jenkins/workspace/Lucene-Solr-8.x-MacOSX/solr/build/solr-core/test/J0/temp/solr.update.TestInPlaceUpdatesDistrib_273338CDBB2FF314-001/init-core-data-001
   [junit4]   2> 3246181 INFO  (SUITE-TestInPlaceUpdatesDistrib-seed#[273338CDBB2FF314]-worker) [    ] o.a.s.BaseDistributedSearchTestCase Setting hostContext system property: /
   [junit4]   2> 3246182 INFO  (SUITE-TestInPlaceUpdatesDistrib-seed#[273338CDBB2FF314]-worker) [    ] o.a.s.c.SolrResourceLoader [null] Added 2 libs to classloader, from paths: [/Users/jenkins/workspace/Lucene-Solr-8.x-MacOSX/solr/core/src/test-files/solr/collection1/lib, /Users/jenkins/workspace/Lucene-Solr-8.x-MacOSX/solr/core/src/test-files/solr/collection1/lib/classes]
   [junit4]   2> 3246195 INFO  (SUITE-TestInPlaceUpdatesDistrib-seed#[273338CDBB2FF314]-worker) [    ] o.a.s.c.SolrConfig Using Lucene MatchVersion: 8.2.0
   [junit4]   2> 3246204 INFO  (SUITE-TestInPlaceUpdatesDistrib-seed#[273338CDBB2FF314]-worker) [    ] o.a.s.s.IndexSchema [null] Schema name=inplace-updates
   [junit4]   2> 3246206 INFO  (SUITE-TestInPlaceUpdatesDistrib-seed#[273338CDBB2FF314]-worker) [    ] o.a.s.s.IndexSchema Loaded schema inplace-updates/1.6 with uniqueid field id
   [junit4]   2> 3246374 INFO  (SUITE-TestInPlaceUpdatesDistrib-seed#[273338CDBB2FF314]-worker) [    ] o.a.s.h.c.HttpShardHandlerFactory Host whitelist initialized: WhitelistHostChecker [whitelistHosts=null, whitelistHostCheckingEnabled=false]
   [junit4]   2> 3246375 WARN  (SUITE-TestInPlaceUpdatesDistrib-seed#[273338CDBB2FF314]-worker) [    ] o.e.j.u.s.S.config No Client EndPointIdentificationAlgorithm configured for SslContextFactory@636b8cca[provider=null,keyStore=null,trustStore=null]
   [junit4]   2> 3246378 WARN  (SUITE-TestInPlaceUpdatesDistrib-seed#[273338CDBB2FF314]-worker) [    ] o.e.j.u.s.S.config No Client EndPointIdentificationAlgorithm configured for SslContextFactory@2d4480b2[provider=null,keyStore=null,trustStore=null]
   [junit4]   2> 3246396 INFO  (SUITE-TestInPlaceUpdatesDistrib-seed#[273338CDBB2FF314]-worker) [    ] o.a.s.c.TransientSolrCoreCacheDefault Allocating transient cache for 2147483647 transient cores
   [junit4]   2> 3246396 INFO  (SUITE-TestInPlaceUpdatesDistrib-seed#[273338CDBB2FF314]-worker) [    ] o.a.s.h.a.MetricsHistoryHandler No .system collection, keeping metrics history in memory.
   [junit4]   2> 3246419 INFO  (SUITE-TestInPlaceUpdatesDistrib-seed#[273338CDBB2FF314]-worker) [    ] o.a.s.m.r.SolrJmxReporter JMX monitoring for 'solr.node' (registry 'solr.node') enabled at server: com.sun.jmx.mbeanserver.JmxMBeanServer@1dc4e626
   [junit4]   2> 3246425 INFO  (SUITE-TestInPlaceUpdatesDistrib-seed#[273338CDBB2FF314]-worker) [    ] o.a.s.m.r.SolrJmxReporter JMX monitoring for 'solr.jvm' (registry 'solr.jvm') enabled at server: com.sun.jmx.mbeanserver.JmxMBeanServer@1dc4e626
   [junit4]   2> 3246425 INFO  (SUITE-TestInPlaceUpdatesDistrib-seed#[273338CDBB2FF314]-worker) [    ] o.a.s.m.r.SolrJmxReporter JMX monitoring for 'solr.jetty' (registry 'solr.jetty') enabled at server: com.sun.jmx.mbeanserver.JmxMBeanServer@1dc4e626
   [junit4]   2> 3246426 INFO  (coreLoadExecutor-18473-thread-1) [    x:collection1] o.a.s.c.SolrResourceLoader [null] Added 2 libs to classloader, from paths: [/Users/jenkins/workspace/Lucene-Solr-8.x-MacOSX/solr/core/src/test-files/solr/collection1/lib, /Users/jenkins/workspace/Lucene-Solr-8.x-MacOSX/solr/core/src/test-files/solr/collection1/lib/classes]
   [junit4]   2> 3246440 INFO  (coreLoadExecutor-18473-thread-1) [    x:collection1] o.a.s.c.SolrConfig Using Lucene MatchVersion: 8.2.0
   [junit4]   2> 3246446 INFO  (coreLoadExecutor-18473-thread-1) [    x:collection1] o.a.s.s.IndexSchema [collection1] Schema name=inplace-updates
   [junit4]   2> 3246452 INFO  (coreLoadExecutor-18473-thread-1) [    x:collection1] o.a.s.s.IndexSchema Loaded schema inplace-updates/1.6 with uniqueid field id
   [junit4]   2> 3246452 INFO  (coreLoadExecutor-18473-thread-1) [    x:collection1] o.a.s.c.CoreContainer Creating SolrCore 'collection1' using configuration from instancedir /Users/jenkins/workspace/Lucene-Solr-8.x-MacOSX/solr/core/src/test-files/solr/collection1, trusted=true
   [junit4]   2> 3246453 INFO  (coreLoadExecutor-18473-thread-1) [    x:collection1] o.a.s.m.r.SolrJmxReporter JMX monitoring for 'solr.core.collection1' (registry 'solr.core.collection1') enabled at server: com.sun.jmx.mbeanserver.JmxMBeanServer@1dc4e626
   [junit4]   2> 3246453 INFO  (coreLoadExecutor-18473-thread-1) [    x:collection1] o.a.s.c.SolrCore [[collection1] ] Opening new SolrCore at [/Users/jenkins/workspace/Lucene-Solr-8.x-MacOSX/solr/core/src/test-files/solr/collection1], dataDir=[/Users/jenkins/workspace/Lucene-Solr-8.x-MacOSX/solr/build/solr-core/test/J0/temp/solr.update.TestInPlaceUpdatesDistrib_273338CDBB2FF314-001/init-core-data-001/]
   [junit4]   2> 3246460 WARN  (coreLoadExecutor-18473-thread-1) [    x:collection1] o.a.s.c.RequestHandlers INVALID paramSet a in requestHandler {type = requestHandler,name = /dump,class = DumpRequestHandler,attributes = {initParams=a, name=/dump, class=DumpRequestHandler},args = {defaults={a=A,b=B}}}
   [junit4]   2> 3246498 INFO  (coreLoadExecutor-18473-thread-1) [    x:collection1] o.a.s.u.UpdateHandler Using UpdateLog implementation: org.apache.solr.update.UpdateLog
   [junit4]   2> 3246498 INFO  (coreLoadExecutor-18473-thread-1) [    x:collection1] o.a.s.u.UpdateLog Initializing UpdateLog: dataDir= defaultSyncLevel=FLUSH numRecordsToKeep=100 maxNumLogsToKeep=10 numVersionBuckets=65536
   [junit4]   2> 3246511 INFO  (coreLoadExecutor-18473-thread-1) [    x:collection1] o.a.s.u.CommitTracker Hard AutoCommit: disabled
   [junit4]   2> 3246516 INFO  (coreLoadExecutor-18473-thread-1) [    x:collection1] o.a.s.u.CommitTracker Soft AutoCommit: disabled
   [junit4]   2> 3246521 INFO  (coreLoadExecutor-18473-thread-1) [    x:collection1] o.a.s.s.SolrIndexSearcher Opening [Searcher@29309b58[collection1] main]
   [junit4]   2> 3246529 WARN  (coreLoadExecutor-18473-thread-1) [    x:collection1] o.a.s.r.ManagedResourceStorage Cannot write to config directory /Users/jenkins/workspace/Lucene-Solr-8.x-MacOSX/solr/core/src/test-files/solr/collection1/conf; switching to use InMemory storage instead.
   [junit4]   2> 3246530 INFO  (coreLoadExecutor-18473-thread-1) [    x:collection1] o.a.s.h.ReplicationHandler Commits will be reserved for 10000ms.
   [junit4]   2> 3246530 INFO  (coreLoadExecutor-18473-thread-1) [    x:collection1] o.a.s.u.UpdateLog Could not find max version in index or recent updates, using new clock 1632411947183898624
   [junit4]   2> 3246533 INFO  (searcherExecutor-18474-thread-1-processing-x:collection1) [    x:collection1] o.a.s.c.SolrCore [collection1] Registered new searcher Searcher@29309b58[collection1] main{ExitableDirectoryReader(UninvertingDirectoryReader())}
   [junit4]   2> 3246539 INFO  (TEST-TestInPlaceUpdatesDistrib.test-seed#[273338CDBB2FF314]) [    ] o.a.s.c.ZkTestServer STARTING ZK TEST SERVER
   [junit4]   2> 3246539 INFO  (ZkTestServer Run Thread) [    ] o.a.s.c.ZkTestServer client port:0.0.0.0/0.0.0.0:0
   [junit4]   2> 3246539 INFO  (ZkTestServer Run Thread) [    ] o.a.s.c.ZkTestServer Starting server
   [junit4]   2> 3246648 INFO  (TEST-TestInPlaceUpdatesDistrib.test-seed#[273338CDBB2FF314]) [    ] o.a.s.c.ZkTestServer start zk server on port:59546
   [junit4]   2> 3246648 INFO  (TEST-TestInPlaceUpdatesDistrib.test-seed#[273338CDBB2FF314]) [    ] o.a.s.c.ZkTestServer parse host and port list: 127.0.0.1:59546
   [junit4]   2> 3246648 INFO  (TEST-TestInPlaceUpdatesDistrib.test-seed#[273338CDBB2FF314]) [    ] o.a.s.c.ZkTestServer connecting to 127.0.0.1 59546
   [junit4]   2> 3246664 INFO  (zkConnectionManagerCallback-21096-thread-1) [    ] o.a.s.c.c.ConnectionManager zkClient has connected
   [junit4]   2> 3246668 INFO  (zkConnectionManagerCallback-21098-thread-1) [    ] o.a.s.c.c.ConnectionManager zkClient has connected
   [junit4]   2> 3246669 INFO  (TEST-TestInPlaceUpdatesDistrib.test-seed#[273338CDBB2FF314]) [    ] o.a.s.c.ZkTestServer put /Users/jenkins/workspace/Lucene-Solr-8.x-MacOSX/solr/core/src/test-files/solr/collection1/conf/solrconfig-tlog.xml to /configs/conf1/solrconfig.xml
   [junit4]   2> 3246671 INFO  (TEST-TestInPlaceUpdatesDistrib.test-seed#[273338CDBB2FF314]) [    ] o.a.s.c.ZkTestServer put /Users/jenkins/workspace/Lucene-Solr-8.x-MacOSX/solr/core/src/test-files/solr/collection1/conf/schema-inplace-updates.xml to /configs/conf1/schema.xml
   [junit4]   2> 3246673 INFO  (TEST-TestInPlaceUpdatesDistrib.test-seed#[273338CDBB2FF314]) [    ] o.a.s.c.ZkTestServer put /Users/jenkins/workspace/Lucene-Solr-8.x-MacOSX/solr/core/src/test-files/solr/collection1/conf/solrconfig.snippet.randomindexconfig.xml to /configs/conf1/solrconfig.snippet.randomindexconfig.xml
   [junit4]   2> 3246674 INFO  (TEST-TestInPlaceUpdatesDistrib.test-seed#[273338CDBB2FF314]) [    ] o.a.s.c.ZkTestServer put /Users/jenkins/workspace/Lucene-Solr-8.x-MacOSX/solr/core/src/test-files/solr/collection1/conf/stopwords.txt to /configs/conf1/stopwords.txt
   [junit4]   2> 3246676 INFO  (TEST-TestInPlaceUpdatesDistrib.test-seed#[273338CDBB2FF314]) [    ] o.a.s.c.ZkTestServer put /Users/jenkins/workspace/Lucene-Solr-8.x-MacOSX/solr/core/src/test-files/solr/collection1/conf/protwords.txt to /configs/conf1/protwords.txt
   [junit4]   2> 3246677 INFO  (TEST-TestInPlaceUpdatesDistrib.test-seed#[273338CDBB2FF314]) [    ] o.a.s.c.ZkTestServer put /Users/jenkins/workspace/Lucene-Solr-8.x-MacOSX/solr/core/src/test-files/solr/collection1/conf/currency.xml to /configs/conf1/currency.xml
   [junit4]   2> 3246679 INFO  (TEST-TestInPlaceUpdatesDistrib.test-seed#[273338CDBB2FF314]) [    ] o.a.s.c.ZkTestServer put /Users/jenkins/workspace/Lucene-Solr-8.x-MacOSX/solr/core/src/test-files/solr/collection1/conf/enumsConfig.xml to /configs/conf1/enumsConfig.xml
   [junit4]   2> 3246680 INFO  (TEST-TestInPlaceUpdatesDistrib.test-seed#[273338CDBB2FF314]) [    ] o.a.s.c.ZkTestServer put /Users/jenkins/workspace/Lucene-Solr-8.x-MacOSX/solr/core/src/test-files/solr/collection1/conf/open-exchange-rates.json to /configs/conf1/open-exchange-rates.json
   [junit4]   2> 3246681 INFO  (TEST-TestInPlaceUpdatesDistrib.test-seed#[273338CDBB2FF314]) [    ] o.a.s.c.ZkTestServer put /Users/jenkins/workspace/Lucene-Solr-8.x-MacOSX/solr/core/src/test-files/solr/collection1/conf/mapping-ISOLatin1Accent.txt to /configs/conf1/mapping-ISOLatin1Accent.txt
   [junit4]   2> 3246683 INFO  (TEST-TestInPlaceUpdatesDistrib.test-seed#[273338CDBB2FF314]) [    ] o.a.s.c.ZkTestServer put /Users/jenkins/workspace/Lucene-Solr-8.x-MacOSX/solr/core/src/test-files/solr/collection1/conf/old_synonyms.txt to /configs/conf1/old_synonyms.txt
   [junit4]   2> 3246685 INFO  (TEST-TestInPlaceUpdatesDistrib.test-seed#[273338CDBB2FF314]) [    ] o.a.s.c.ZkTestServer put /Users/jenkins/workspace/Lucene-Solr-8.x-MacOSX/solr/core/src/test-files/solr/collection1/conf/synonyms.txt to /configs/conf1/synonyms.txt
   [junit4]   2> 3246686 INFO  (TEST-TestInPlaceUpdatesDistrib.test-seed#[273338CDBB2FF314]) [    ] o.a.s.c.AbstractFullDistribZkTestBase Will use NRT replicas unless explicitly asked otherwise
   [junit4]   2> 3247165 WARN  (TEST-TestInPlaceUpdatesDistrib.test-seed#[273338CDBB2FF314]) [    ] o.e.j.s.AbstractConnector Ignoring deprecated socket close linger time
   [junit4]   2> 3247166 INFO  (TEST-TestInPlaceUpdatesDistrib.test-seed#[273338CDBB2FF314]) [    ] o.a.s.c.s.e.JettySolrRunner Start Jetty (original configured port=0)
   [junit4]   2> 3247166 INFO  (TEST-TestInPlaceUpdatesDistrib.test-seed#[273338CDBB2FF314]) [    ] o.a.s.c.s.e.JettySolrRunner Trying to start Jetty on port 0 try number 1 ...
   [junit4]   2> 3247166 INFO  (TEST-TestInPlaceUpdatesDistrib.test-seed#[273338CDBB2FF314]) [    ] o.e.j.s.Server jetty-9.4.14.v20181114; built: 2018-11-14T21:20:31.478Z; git: c4550056e785fb5665914545889f21dc136ad9e6; jvm 11.0.2+9
   [junit4]   2> 3247171 INFO  (TEST-TestInPlaceUpdatesDistrib.test-seed#[273338CDBB2FF314]) [    ] o.e.j.s.session DefaultSessionIdManager workerName=node0
   [junit4]   2> 3247171 INFO  (TEST-TestInPlaceUpdatesDistrib.test-seed#[273338CDBB2FF314]) [    ] o.e.j.s.session No SessionScavenger set, using defaults
   [junit4]   2> 3247171 INFO  (TEST-TestInPlaceUpdatesDistrib.test-seed#[273338CDBB2FF314]) [    ] o.e.j.s.session node0 Scavenging every 600000ms
   [junit4]   2> 3247172 INFO  (TEST-TestInPlaceUpdatesDistrib.test-seed#[273338CDBB2FF314]) [    ] o.e.j.s.h.ContextHandler Started o.e.j.s.ServletContextHandler@37bdb00a{/,null,AVAILABLE}
   [junit4]   2> 3247173 INFO  (TEST-TestInPlaceUpdatesDistrib.test-seed#[273338CDBB2FF314]) [    ] o.e.j.s.AbstractConnector Started ServerConnector@6609a325{HTTP/1.1,[http/1.1, h2c]}{127.0.0.1:59558}
   [junit4]   2> 3247173 INFO  (TEST-TestInPlaceUpdatesDistrib.test-seed#[273338CDBB2FF314]) [    ] o.e.j.s.Server Started @3247230ms
   [junit4]   2> 3247173 INFO  (TEST-TestInPlaceUpdatesDistrib.test-seed#[273338CDBB2FF314]) [    ] o.a.s.c.s.e.JettySolrRunner Jetty properties: {hostContext=/, solr.data.dir=/Users/jenkins/workspace/Lucene-Solr-8.x-MacOSX/solr/build/solr-core/test/J0/temp/solr.update.TestInPlaceUpdatesDistrib_273338CDBB2FF314-001/tempDir-001/control/data, hostPort=59558, coreRootDirectory=/Users/jenkins/workspace/Lucene-Solr-8.x-MacOSX/solr/build/solr-core/test/J0/temp/solr.update.TestInPlaceUpdatesDistrib_273338CDBB2FF314-001/control-001/cores, replicaType=NRT}
   [junit4]   2> 3247174 ERROR (TEST-TestInPlaceUpdatesDistrib.test-seed#[273338CDBB2FF314]) [    ] o.a.s.u.StartupLoggingUtils Missing Java Option solr.log.dir. Logging may be missing or incomplete.
   [junit4]   2> 3247174 INFO  (TEST-TestInPlaceUpdatesDistrib.test-seed#[273338CDBB2FF314]) [    ] o.a.s.s.SolrDispatchFilter Using logger factory org.apache.logging.slf4j.Log4jLoggerFactory
   [junit4]   2> 3247174 INFO  (TEST-TestInPlaceUpdatesDistrib.test-seed#[273338CDBB2FF314]) [    ] o.a.s.s.SolrDispatchFilter  ___      _       Welcome to Apache Solr? version 8.2.0
   [junit4]   2> 3247175 INFO  (TEST-TestInPlaceUpdatesDistrib.test-seed#[273338CDBB2FF314]) [    ] o.a.s.s.SolrDispatchFilter / __| ___| |_ _   Starting in cloud mode on port null
   [junit4]   2> 3247175 INFO  (TEST-TestInPlaceUpdatesDistrib.test-seed#[273338CDBB2FF314]) [    ] o.a.s.s.SolrDispatchFilter \__ \/ _ \ | '_|  Install dir: null
   [junit4]   2> 3247175 INFO  (TEST-TestInPlaceUpdatesDistrib.test-seed#[273338CDBB2FF314]) [    ] o.a.s.s.SolrDispatchFilter |___/\___/_|_|    Start time: 2019-05-02T09:29:08.469206Z
   [junit4]   2> 3247178 INFO  (zkConnectionManagerCallback-21100-thread-1) [    ] o.a.s.c.c.ConnectionManager zkClient has connected
   [junit4]   2> 3247181 INFO  (TEST-TestInPlaceUpdatesDistrib.test-seed#[273338CDBB2FF314]) [    ] o.a.s.s.SolrDispatchFilter Loading solr.xml from SolrHome (not found in ZooKeeper)
   [junit4]   2> 3247181 INFO  (TEST-TestInPlaceUpdatesDistrib.test-seed#[273338CDBB2FF314]) [    ] o.a.s.c.SolrXmlConfig Loading container configuration from /Users/jenkins/workspace/Lucene-Solr-8.x-MacOSX/solr/build/solr-core/test/J0/temp/solr.update.TestInPlaceUpdatesDistrib_273338CDBB2FF314-001/control-001/solr.xml
   [junit4]   2> 3247189 INFO  (TEST-TestInPlaceUpdatesDistrib.test-seed#[273338CDBB2FF314]) [    ] o.a.s.c.SolrXmlConfig Configuration parameter autoReplicaFailoverWorkLoopDelay is ignored
   [junit4]   2> 3247189 INFO  (TEST-TestInPlaceUpdatesDistrib.test-seed#[273338CDBB2FF314]) [    ] o.a.s.c.SolrXmlConfig Configuration parameter autoReplicaFailoverBadNodeExpiration is ignored
   [junit4]   2> 3247192 INFO  (TEST-TestInPlaceUpdatesDistrib.test-seed#[273338CDBB2FF314]) [    ] o.a.s.c.SolrXmlConfig MBean server found: com.sun.jmx.mbeanserver.JmxMBeanServer@1dc4e626, but no JMX reporters were configured - adding default JMX reporter.
   [junit4]   2> 3247298 INFO  (TEST-TestInPlaceUpdatesDistrib.test-seed#[273338CDBB2FF314]) [    ] o.a.s.h.c.HttpShardHandlerFactory Host whitelist initialized: WhitelistHostChecker [whitelistHosts=null, whitelistHostCheckingEnabled=false]
   [junit4]   2> 3247303 WARN  (TEST-TestInPlaceUpdatesDistrib.test-seed#[273338CDBB2FF314]) [    ] o.e.j.u.s.S.config No Client EndPointIdentificationAlgorithm configured for SslContextFactory@ff15fa9[provider=null,keyStore=null,trustStore=null]
   [junit4]   2> 3247308 WARN  (TEST-TestInPlaceUpdatesDistrib.test-seed#[273338CDBB2FF314]) [    ] o.e.j.u.s.S.config No Client EndPointIdentificationAlgorithm configured for SslContextFactory@79ba7bb2[provider=null,keyStore=null,trustStore=null]
   [junit4]   2> 3247309 INFO  (TEST-TestInPlaceUpdatesDistrib.test-seed#[273338CDBB2FF314]) [    ] o.a.s.c.ZkContainer Zookeeper client=127.0.0.1:59546/solr
   [junit4]   2> 3247313 INFO  (zkConnectionManagerCallback-21107-thread-1) [    ] o.a.s.c.c.ConnectionManager zkClient has connected
   [junit4]   2> 3247317 INFO  (zkConnectionManagerCallback-21109-thread-1) [    ] o.a.s.c.c.ConnectionManager zkClient has connected
   [junit4]   2> 3247426 INFO  (TEST-TestInPlaceUpdatesDistrib.test-seed#[273338CDBB2FF314]) [    ] o.a.s.c.OverseerElectionContext I am going to be the leader 127.0.0.1:59558_
   [junit4]   2> 3247427 INFO  (TEST-TestInPlaceUpdatesDistrib.test-seed#[273338CDBB2FF314]) [    ] o.a.s.c.Overseer Overseer (id=72069047430873092-127.0.0.1:59558_-n_0000000000) starting
   [junit4]   2> 3247436 INFO  (zkConnectionManagerCallback-21116-thread-1) [    ] o.a.s.c.c.ConnectionManager zkClient has connected
   [junit4]   2> 3247439 INFO  (TEST-TestInPlaceUpdatesDistrib.test-seed#[273338CDBB2FF314]) [    ] o.a.s.c.s.i.ZkClientClusterStateProvider Cluster at 127.0.0.1:59546/solr ready
   [junit4]   2> 3247440 INFO  (OverseerStateUpdate-72069047430873092-127.0.0.1:59558_-n_0000000000) [n:127.0.0.1:59558_    ] o.a.s.c.Overseer Starting to work on the main queue : 127.0.0.1:59558_
   [junit4]   2> 3247447 INFO  (TEST-TestInPlaceUpdatesDistrib.test-seed#[273338CDBB2FF314]) [    ] o.a.s.c.ZkController Register node as live in ZooKeeper:/live_nodes/127.0.0.1:59558_
   [junit4]   2> 3247452 INFO  (zkCallback-21108-thread-1) [    ] o.a.s.c.c.ZkStateReader Updated live nodes from ZooKeeper... (0) -> (1)
   [junit4]   2> 3247452 INFO  (zkCallback-21115-thread-1) [    ] o.a.s.c.c.ZkStateReader Updated live nodes from ZooKeeper... (0) -> (1)
   [junit4]   2> 3247468 INFO  (TEST-TestInPlaceUpdatesDistrib.test-seed#[273338CDBB2FF314]) [    ] o.a.s.h.a.MetricsHistoryHandler No .system collection, keeping metrics history in memory.
   [junit4]   2> 3247531 INFO  (TEST-TestInPlaceUpdatesDistrib.test-seed#[273338CDBB2FF314]) [    ] o.a.s.m.r.SolrJmxReporter JMX monitoring for 'solr.node' (registry 'solr.node') enabled at server: com.sun.jmx.mbeanserver.JmxMBeanServer@1dc4e626
   [junit4]   2> 3247540 INFO  (TEST-TestInPlaceUpdatesDistrib.test-seed#[273338CDBB2FF314]) [    ] o.a.s.m.r.SolrJmxReporter JMX monitoring for 'solr.jvm' (registry 'solr.jvm') enabled at server: com.sun.jmx.mbeanserver.JmxMBeanServer@1dc4e626
   [junit4]   2> 3247540 INFO  (TEST-TestInPlaceUpdatesDistrib.test-seed#[273338CDBB2FF314]) [    ] o.a.s.m.r.SolrJmxReporter JMX monitoring for 'solr.jetty' (registry 'solr.jetty') enabled at server: com.sun.jmx.mbeanserver.JmxMBeanServer@1dc4e626
   [junit4]   2> 3247542 INFO  (TEST-TestInPlaceUpdatesDistrib.test-seed#[273338CDBB2FF314]) [    ] o.a.s.c.CorePropertiesLocator Found 0 core definitions underneath /Users/jenkins/workspace/Lucene-Solr-8.x-MacOSX/solr/build/solr-core/test/J0/temp/solr.update.TestInPlaceUpdatesDistrib_273338CDBB2FF314-001/control-001/cores
   [junit4]   2> 3247564 INFO  (zkConnectionManagerCallback-21122-thread-1) [    ] o.a.s.c.c.ConnectionManager zkClient has connected
   [junit4]   2> 3247566 INFO  (TEST-TestInPlaceUpdatesDistrib.test-seed#[273338CDBB2FF314]) [    ] o.a.s.c.c.ZkStateReader Updated live nodes from ZooKeeper... (0) -> (1)
   [junit4]   2> 3247567 INFO  (TEST-TestInPlaceUpdatesDistrib.test-seed#[273338CDBB2FF314]) [    ] o.a.s.c.s.i.ZkClientClusterStateProvider Cluster at 127.0.0.1:59546/solr ready
   [junit4]   2> 3247569 INFO  (qtp1996517632-53851) [n:127.0.0.1:59558_    ] o.a.s.h.a.CollectionsHandler Invoked Collection Action :create with params collection.configName=conf1&name=control_collection&nrtReplicas=1&action=CREATE&numShards=1&createNodeSet=127.0.0.1:59558_&wt=javabin&version=2 and sendToOCPQueue=true
   [junit4]   2> 3247573 INFO  (OverseerThreadFactory-18488-thread-1) [    ] o.a.s.c.a.c.CreateCollectionCmd Create collection control_collection
   [junit4]   2> 3247688 INFO  (qtp1996517632-53853) [n:127.0.0.1:59558_    x:control_collection_shard1_replica_n1] o.a.s.h.a.CoreAdminOperation core create command qt=/admin/cores&collection.configName=conf1&newCollection=true&name=control_collection_shard1_replica_n1&action=CREATE&numShards=1&collection=control_collection&shard=shard1&wt=javabin&version=2&replicaType=NRT
   [junit4]   2> 3247688 INFO  (qtp1996517632-53853) [n:127.0.0.1:59558_    x:control_collection_shard1_replica_n1] o.a.s.c.TransientSolrCoreCacheDefault Allocating transient cache for 4 transient cores
   [junit4]   2> 3248702 INFO  (qtp1996517632-53853) [n:127.0.0.1:59558_ c:control_collection s:shard1  x:control_collection_shard1_replica_n1] o.a.s.c.SolrConfig Using Lucene MatchVersion: 8.2.0
   [junit4]   2> 3248712 INFO  (qtp1996517632-53853) [n:127.0.0.1:59558_ c:control_collection s:shard1  x:control_collection_shard1_replica_n1] o.a.s.s.IndexSchema [control_collection_shard1_replica_n1] Schema name=inplace-updates
   [junit4]   2> 3248726 INFO  (qtp1996517632-53853) [n:127.0.0.1:59558_ c:control_collection s:shard1  x:control_collection_shard1_replica_n1] o.a.s.s.IndexSchema Loaded schema inplace-updates/1.6 with uniqueid field id
   [junit4]   2> 3248726 INFO  (qtp1996517632-53853) [n:127.0.0.1:59558_ c:control_collection s:shard1  x:control_collection_shard1_replica_n1] o.a.s.c.CoreContainer Creating SolrCore 'control_collection_shard1_replica_n1' using configuration from collection control_collection, trusted=true
   [junit4]   2> 3248726 INFO  (qtp1996517632-53853) [n:127.0.0.1:59558_ c:control_collection s:shard1  x:control_collection_shard1_replica_n1] o.a.s.m.r.SolrJmxReporter JMX monitoring for 'solr.core.control_collection.shard1.replica_n1' (registry 'solr.core.control_collection.shard1.replica_n1') enabled at server: com.sun.jmx.mbeanserver.JmxMBeanServer@1dc4e626
   [junit4]   2> 3248726 INFO  (qtp1996517632-53853) [n:127.0.0.1:59558_ c:control_collection s:shard1  x:control_collection_shard1_replica_n1] o.a.s.c.SolrCore [[control_collection_shard1_replica_n1] ] Opening new SolrCore at [/Users/jenkins/workspace/Lucene-Solr-8.x-MacOSX/solr/build/solr-core/test/J0/temp/solr.update.TestInPlaceUpdatesDistrib_273338CDBB2FF314-001/control-001/cores/control_collection_shard1_replica_n1], dataDir=[/Users/jenkins/workspace/Lucene-Solr-8.x-MacOSX/solr/build/solr-core/test/J0/temp/solr.update.TestInPlaceUpdatesDistrib_273338CDBB2FF314-001/control-001/cores/control_collection_shard1_replica_n1/data/]
   [junit4]   2> 3248727 WARN  (qtp1996517632-53853) [n:127.0.0.1:59558_ c:control_collection s:shard1  x:control_collection_shard1_replica_n1] o.a.s.c.RequestHandlers INVALID paramSet a in requestHandler {type = requestHandler,name = /dump,class = DumpRequestHandler,attributes = {initParams=a, name=/dump, class=DumpRequestHandler},args = {defaults={a=A,b=B}}}
   [junit4]   2> 3248783 INFO  (qtp1996517632-53853) [n:127.0.0.1:59558_ c:control_collection s:shard1  x:control_collection_shard1_replica_n1] o.a.s.u.UpdateHandler Using UpdateLog implementation: org.apache.solr.update.UpdateLog
   [junit4]   2> 3248783 INFO  (qtp1996517632-53853) [n:127.0.0.1:59558_ c:control_collection s:shard1  x:control_collection_shard1_replica_n1] o.a.s.u.UpdateLog Initializing UpdateLog: dataDir= defaultSyncLevel=FLUSH numRecordsToKeep=100 maxNumLogsToKeep=10 numVersionBuckets=65536
   [junit4]   2> 3248786 INFO  (qtp1996517632-53853) [n:127.0.0.1:59558_ c:control_collection s:shard1  x:control_collection_shard1_replica_n1] o.a.s.u.CommitTracker Hard AutoCommit: disabled
   [junit4]   2> 3248786 INFO  (qtp1996517632-53853) [n:127.0.0.1:59558_ c:control_collection s:shard1  x:control_collection_shard1_replica_n1] o.a.s.u.CommitTracker Soft AutoCommit: disabled
   [junit4]   2> 3248787 INFO  (qtp1996517632-53853) [n:127.0.0.1:59558_ c:control_collection s:shard1  x:control_collection_shard1_replica_n1] o.a.s.s.SolrIndexSearcher Opening [Searcher@1361adf4[control_collection_shard1_replica_n1] main]
   [junit4]   2> 3248788 INFO  (qtp1996517632-53853) [n:127.0.0.1:59558_ c:control_collection s:shard1  x:control_collection_shard1_replica_n1] o.a.s.r.ManagedResourceStorage Configured ZooKeeperStorageIO with znodeBase: /configs/conf1
   [junit4]   2> 3248789 INFO  (qtp1996517632-53853) [n:127.0.0.1:59558_ c:control_collection s:shard1  x:control_collection_shard1_replica_n1] o.a.s.r.ManagedResourceStorage Loaded null at path _rest_managed.json using ZooKeeperStorageIO:path=/configs/conf1
   [junit4]   2> 3248789 INFO  (qtp1996517632-53853) [n:127.0.0.1:59558_ c:control_collection s:shard1  x:control_collection_shard1_replica_n1] o.a.s.h.ReplicationHandler Commits will be reserved for 10000ms.
   [junit4]   2> 3248789 INFO  (qtp1996517632-53853) [n:127.0.0.1:59558_ c:control_collection s:shard1  x:control_collection_shard1_replica_n1] o.a.s.u.UpdateLog Could not find max version in index or recent updates, using new clock 1632411949552631808
   [junit4]   2> 3248792 INFO  (searcherExecutor-18493-thread-1-processing-n:127.0.0.1:59558_ x:control_collection_shard1_replica_n1 c:control_collection s:shard1) [n:127.0.0.1:59558_ c:control_collection s:shard1  x:control_collection_shard1_replica_n1] o.a.s.c.SolrCore [control_collection_shard1_replica_n1] Registered new searcher Searcher@1361adf4[control_collection_shard1_replica_n1] main{ExitableDirectoryReader(UninvertingDirectoryReader())}
   [junit4]   2> 3248796 INFO  (qtp1996517632-53853) [n:127.0.0.1:59558_ c:control_collection s:shard1  x:control_collection_shard1_replica_n1] o.a.s.c.ZkShardTerms Successful update of terms at /collections/control_collection/terms/shard1 to Terms{values={core_node2=0}, version=0}
   [junit4]   2> 3248796 INFO  (qtp1996517632-53853) [n:127.0.0.1:59558_ c:control_collection s:shard1  x:control_collection_shard1_replica_n1] o.a.s.c.ShardLeaderElectionContextBase make sure parent is created /collections/control_collection/leaders/shard1
   [junit4]   2> 3248802 INFO  (qtp1996517632-53853) [n:127.0.0.1:59558_ c:control_collection s:shard1  x:control_collection_shard1_replica_n1] o.a.s.c.ShardLeaderElectionContext Enough replicas found to continue.
   [junit4]   2> 3248802 INFO  (qtp1996517632-53853) [n:127.0.0.1:59558_ c:control_collection s:shard1  x:control_collection_shard1_replica_n1] o.a.s.c.ShardLeaderElectionContext I may be the new leader - try and sync
   [junit4]   2> 3248802 INFO  (qtp1996517632-53853) [n:127.0.0.1:59558_ c:control_collection s:shard1  x:control_collection_shard1_replica_n1] o.a.s.c.SyncStrategy Sync replicas to http://127.0.0.1:59558/control_collection_shard1_replica_n1/
   [junit4]   2> 3248802 INFO  (qtp1996517632-53853) [n:127.0.0.1:59558_ c:control_collection s:shard1  x:control_collection_shard1_replica_n1] o.a.s.c.SyncStrategy Sync Success - now sync replicas to me
   [junit4]   2> 3248803 INFO  (qtp1996517632-53853) [n:127.0.0.1:59558_ c:control_collection s:shard1  x:control_collection_shard1_replica_n1] o.a.s.c.SyncStrategy http://127.0.0.1:59558/control_collection_shard1_replica_n1/ has no replicas
   [junit4]   2> 3248803 INFO  (qtp1996517632-53853) [n:127.0.0.1:59558_ c:control_collection s:shard1  x:control_collection_shard1_replica_n1] o.a.s.c.ShardLeaderElectionContextBase Creating leader registration node /collections/control_collection/leaders/shard1/leader after winning as /collections/control_collection/leader_elect/shard1/election/72069047430873092-core_node2-n_0000000000
   [junit4]   2> 3248805 INFO  (qtp1996517632-53853) [n:127.0.0.1:59558_ c:control_collection s:shard1  x:control_collection_shard1_replica_n1] o.a.s.c.ShardLeaderElectionContext I am the new leader: http://127.0.0.1:59558/control_collection_shard1_replica_n1/ shard1
   [junit4]   2> 3248911 INFO  (zkCallback-21108-thread-1) [    ] o.a.s.c.c.ZkStateReader A cluster state change: [WatchedEvent state:SyncConnected type:NodeDataChanged path:/collections/control_collection/state.json] for collection [control_collection] has occurred - updating... (live nodes size: [1])
   [junit4]   2> 3248911 INFO  (zkCallback-21108-thread-2) [    ] o.a.s.c.c.ZkStateReader A cluster state change: [WatchedEvent state:SyncConnected type:NodeDataChanged path:/collections/control_collection/state.json] for collection [control_collection] has occurred - updating... (live nodes size: [1])
   [junit4]   2> 3248912 INFO  (qtp1996517632-53853) [n:127.0.0.1:59558_ c:control_collection s:shard1  x:control_collection_shard1_replica_n1] o.a.s.c.ZkController I am the leader, no recovery necessary
   [junit4]   2> 3249019 INFO  (zkCallback-21108-thread-2) [    ] o.a.s.c.c.ZkStateReader A cluster state change: [WatchedEvent state:SyncConnected type:NodeDataChanged path:/collections/control_collection/state.json] for collection [control_collection] has occurred - updating... (live nodes size: [1])
   [junit4]   2> 3249019 INFO  (zkCallback-21108-thread-1) [    ] o.a.s.c.c.ZkStateReader A cluster state change: [WatchedEvent state:SyncConnected type:NodeDataChanged path:/collections/control_collection/state.json] for collection [control_collection] has occurred - updating... (live nodes size: [1])
   [junit4]   2> 3249020 INFO  (zkCallback-21108-thread-3) [    ] o.a.s.c.c.ZkStateReader A cluster state change: [WatchedEvent state:SyncConnected type:NodeDataChanged path:/collections/control_collection/state.json] for collection [control_collection] has occurred - updating... (live nodes size: [1])
   [junit4]   2> 3249021 INFO  (qtp1996517632-53853) [n:127.0.0.1:59558_ c:control_collection s:shard1  x:control_collection_shard1_replica_n1] o.a.s.s.HttpSolrCall [admin] webapp=null path=/admin/cores params={qt=/admin/cores&collection.configName=conf1&newCollection=true&name=control_collection_shard1_replica_n1&action=CREATE&numShards=1&collection=control_collection&shard=shard1&wt=javabin&version=2&replicaType=NRT} status=0 QTime=1332
   [junit4]   2> 3249032 INFO  (qtp1996517632-53851) [n:127.0.0.1:59558_    ] o.a.s.h.a.CollectionsHandler Wait for new collection to be active for at most 45 seconds. Check all shard replicas
   [junit4]   2> 3249032 INFO  (qtp1996517632-53851) [n:127.0.0.1:59558_    ] o.a.s.s.HttpSolrCall [admin] webapp=null path=/admin/collections params={collection.configName=conf1&name=control_collection&nrtReplicas=1&action=CREATE&numShards=1&createNodeSet=127.0.0.1:59558_&wt=javabin&version=2} status=0 QTime=1462
   [junit4]   2> 3249037 INFO  (zkConnectionManagerCallback-21128-thread-1) [    ] o.a.s.c.c.ConnectionManager zkClient has connected
   [junit4]   2> 3249039 INFO  (TEST-TestInPlaceUpdatesDistrib.test-seed#[273338CDBB2FF314]) [    ] o.a.s.c.c.ZkStateReader Updated live nodes from ZooKeeper... (0) -> (1)
   [junit4]   2> 3249041 INFO  (TEST-TestInPlaceUpdatesDistrib.test-seed#[273338CDBB2FF314]) [    ] o.a.s.c.s.i.ZkClientClusterStateProvider Cluster at 127.0.0.1:59546/solr ready
   [junit4]   2> 3249041 INFO  (TEST-TestInPlaceUpdatesDistrib.test-seed#[273338CDBB2FF314]) [    ] o.a.s.c.ChaosMonkey monkey: init - expire sessions:false cause connection loss:false
   [junit4]   2> 3249042 INFO  (qtp1996517632-53852) [n:127.0.0.1:59558_    ] o.a.s.h.a.CollectionsHandler Invoked Collection Action :create with params collection.configName=conf1&name=collection1&nrtReplicas=1&action=CREATE&numShards=1&createNodeSet=&stateFormat=1&wt=javabin&version=2 and sendToOCPQueue=true
   [junit4]   2> 3249046 INFO  (OverseerThreadFactory-18488-thread-2) [    ] o.a.s.c.a.c.CreateCollectionCmd Create collection collection1
   [junit4]   2> 3249046 INFO  (OverseerCollectionConfigSetProcessor-72069047430873092-127.0.0.1:59558_-n_0000000000) [    ] o.a.s.c.OverseerTaskQueue Response ZK path: /overseer/collection-queue-work/qnr-0000000000 doesn't exist.  Requestor may have disconnected from ZooKeeper
   [junit4]   2> 3249266 WARN  (OverseerThreadFactory-18488-thread-2) [    ] o.a.s.c.a.c.CreateCollectionCmd It is unusual to create a collection (collection1) without cores.
   [junit4]   2> 3249268 INFO  (qtp1996517632-53852) [n:127.0.0.1:59558_    ] o.a.s.h.a.CollectionsHandler Wait for new collection to be active for at most 45 seconds. Check all shard replicas
   [junit4]   2> 3249270 INFO  (qtp1996517632-53852) [n:127.0.0.1:59558_    ] o.a.s.s.HttpSolrCall [admin] webapp=null path=/admin/collections params={collection.configName=conf1&name=collection1&nrtReplicas=1&action=CREATE&numShards=1&createNodeSet=&stateFormat=1&wt=javabin&version=2} status=0 QTime=227
   [junit4]   2> 3249271 INFO  (TEST-TestInPlaceUpdatesDistrib.test-seed#[273338CDBB2FF314]) [    ] o.a.s.c.AbstractFullDistribZkTestBase Creating jetty instances pullReplicaCount=0 numOtherReplicas=3
   [junit4]   2> 3249529 INFO  (TEST-TestInPlaceUpdatesDistrib.test-seed#[273338CDBB2FF314]) [    ] o.a.s.c.AbstractFullDistribZkTestBase create jetty 1 in directory /Users/jenkins/workspace/Lucene-Solr-8.x-MacOSX/solr/build/solr-core/test/J0/temp/solr.update.TestInPlaceUpdatesDistrib_273338CDBB2FF314-001/shard-1-001 of type NRT
   [junit4]   2> 3249530 WARN  (closeThreadPool-21129-thread-1) [    ] o.e.j.s.AbstractConnector Ignoring deprecated socket close linger time
   [junit4]   2> 3249530 INFO  (closeThreadPool-21129-thread-1) [    ] o.a.s.c.s.e.JettySolrRunner Start Jetty (original configured port=0)
   [junit4]   2> 3249530 INFO  (closeThreadPool-21129-thread-1) [    ] o.a.s.c.s.e.JettySolrRunner Trying to start Jetty on port 0 try number 1 ...
   [junit4]   2> 3249530 INFO  (closeThreadPool-21129-thread-1) [    ] o.e.j.s.Server jetty-9.4.14.v20181114; built: 2018-11-14T21:20:31.478Z; git: c4550056e785fb5665914545889f21dc136ad9e6; jvm 11.0.2+9
   [junit4]   2> 3249532 INFO  (closeThreadPool-21129-thread-1) [    ] o.e.j.s.session DefaultSessionIdManager workerName=node0
   [junit4]   2> 3249532 INFO  (closeThreadPool-21129-thread-1) [    ] o.e.j.s.session No SessionScavenger set, using defaults
   [junit4]   2> 3249532 INFO  (closeThreadPool-21129-thread-1) [    ] o.e.j.s.session node0 Scavenging every 660000ms
   [junit4]   2> 3249532 INFO  (closeThreadPool-21129-thread-1) [    ] o.e.j.s.h.ContextHandler Started o.e.j.s.ServletContextHandler@38c86115{/,null,AVAILABLE}
   [junit4]   2> 3249532 INFO  (closeThreadPool-21129-thread-1) [    ] o.e.j.s.AbstractConnector Started ServerConnector@16953289{HTTP/1.1,[http/1.1, h2c]}{127.0.0.1:59569}
   [junit4]   2> 3249532 INFO  (closeThreadPool-21129-thread-1) [    ] o.e.j.s.Server Started @3249589ms
   [junit4]   2> 3249532 INFO  (closeThreadPool-21129-thread-1) [    ] o.a.s.c.s.e.JettySolrRunner Jetty properties: {hostContext=/, solrconfig=solrconfig.xml, solr.data.dir=/Users/jenkins/workspace/Lucene-Solr-8.x-MacOSX/solr/build/solr-core/test/J0/temp/solr.update.TestInPlaceUpdatesDistrib_273338CDBB2FF314-001/tempDir-001/jetty1, hostPort=59569, coreRootDirectory=/Users/jenkins/workspace/Lucene-Solr-8.x-MacOSX/solr/build/solr-core/test/J0/../../../../../../../../../Users/jenkins/workspace/Lucene-Solr-8.x-MacOSX/solr/build/solr-core/test/J0/temp/solr.update.TestInPlaceUpdatesDistrib_273338CDBB2FF314-001/shard-1-001/cores}
   [junit4]   2> 3249533 ERROR (closeThreadPool-21129-thread-1) [    ] o.a.s.u.StartupLoggingUtils Missing Java Option solr.log.dir. Logging may be missing or incomplete.
   [junit4]   2> 3249533 INFO  (closeThreadPool-21129-thread-1) [    ] o.a.s.s.SolrDispatchFilter Using logger factory org.apache.logging.slf4j.Log4jLoggerFactory
   [junit4]   2> 3249533 INFO  (closeThreadPool-21129-thread-1) [    ] o.a.s.s.SolrDispatchFilter  ___      _       Welcome to Apache Solr? version 8.2.0
   [junit4]   2> 3249533 INFO  (closeThreadPool-21129-thread-1) [    ] o.a.s.s.SolrDispatchFilter / __| ___| |_ _   Starting in cloud mode on port null
   [junit4]   2> 3249533 INFO  (closeThreadPool-21129-thread-1) [    ] o.a.s.s.SolrDispatchFilter \__ \/ _ \ | '_|  Install dir: null
   [junit4]   2> 3249533 INFO  (closeThreadPool-21129-thread-1) [    ] o.a.s.s.SolrDispatchFilter |___/\___/_|_|    Start time: 2019-05-02T09:29:10.827167Z
   [junit4]   2> 3249536 INFO  (zkConnectionManagerCallback-21131-thread-1) [    ] o.a.s.c.c.ConnectionManager zkClient has connected
   [junit4]   2> 3249538 INFO  (closeThreadPool-21129-thread-1) [    ] o.a.s.s.SolrDispatchFilter Loading solr.xml from SolrHome (not found in ZooKeeper)
   [junit4]   2> 3249538 INFO  (closeThreadPool-21129-thread-1) [    ] o.a.s.c.SolrXmlConfig Loading container configuration from /Users/jenkins/workspace/Lucene-Solr-8.x-MacOSX/solr/build/solr-core/test/J0/temp/solr.update.TestInPlaceUpdatesDistrib_273338CDBB2FF314-001/shard-1-001/solr.xml
   [junit4]   2> 3249540 INFO  (closeThreadPool-21129-thread-1) [    ] o.a.s.c.SolrXmlConfig Configuration parameter autoReplicaFailoverWorkLoopDelay is ignored
   [junit4]   2> 3249540 INFO  (closeThreadPool-21129-thread-1) [    ] o.a.s.c.SolrXmlConfig Configuration parameter autoReplicaFailoverBadNodeExpiration is ignored
   [junit4]   2> 3249541 INFO  (closeThreadPool-21129-thread-1) [    ] o.a.s.c.SolrXmlConfig MBean server found: com.sun.jmx.mbeanserver.JmxMBeanServer@1dc4e626, but no JMX reporters were configured - adding default JMX reporter.
   [junit4]   2> 3249655 INFO  (closeThreadPool-21129-thread-1) [    ] o.a.s.h.c.HttpShardHandlerFactory Host whitelist initialized: WhitelistHostChecker [whitelistHosts=null, whitelistHostCheckingEnabled=false]
   [junit4]   2> 3249656 WARN  (closeThreadPool-21129-thread-1) [    ] o.e.j.u.s.S.config No Client EndPointIdentificationAlgorithm configured for SslContextFactory@2c297302[provider=null,keyStore=null,trustStore=null]
   [junit4]   2> 3249659 WARN  (closeThreadPool-21129-thread-1) [    ] o.e.j.u.s.S.config No Client EndPointIdentificationAlgorithm configured for SslContextFactory@50934fd8[provider=null,keyStore=null,trustStore=null]
   [junit4]   2> 3249660 INFO  (closeThreadPool-21129-thread-1) [    ] o.a.s.c.ZkContainer Zookeeper client=127.0.0.1:59546/solr
   [junit4]   2> 3249667 INFO  (zkConnectionManagerCallback-21138-thread-1) [    ] o.a.s.c.c.ConnectionManager zkClient has connected
   [junit4]   2> 3249680 INFO  (zkConnectionManagerCallback-21140-thread-1) [    ] o.a.s.c.c.ConnectionManager zkClient has connected
   [junit4]   2> 3249706 INFO  (closeThreadPool-21129-thread-1) [n:127.0.0.1:59569_    ] o.a.s.c.c.ZkStateReader Updated live nodes from ZooKeeper... (0) -> (1)
   [junit4]   2> 3249714 INFO  (closeThreadPool-21129-thread-1) [n:127.0.0.1:59569_    ] o.a.s.c.ZkController Publish node=127.0.0.1:59569_ as DOWN
   [junit4]   2> 3249715 INFO  (closeThreadPool-21129-thread-1) [n:127.0.0.1:59569_    ] o.a.s.c.TransientSolrCoreCacheDefault Allocating transient cache for 4 transient cores
   [junit4]   2> 3249715 INFO  (closeThreadPool-21129-thread-1) [n:127.0.0.1:59569_    ] o.a.s.c.ZkController Register node as live in ZooKeeper:/live_nodes/127.0.0.1:59569_
   [junit4]   2> 3249721 INFO  (zkCallback-21108-thread-3) [    ] o.a.s.c.c.ZkStateReader Updated live nodes from ZooKeeper... (1) -> (2)
   [junit4]   2> 3249721 INFO  (zkCallback-21115-thread-1) [    ] o.a.s.c.c.ZkStateReader Updated live nodes from ZooKeeper... (1) -> (2)
   [junit4]   2> 3249721 INFO  (zkCallback-21127-thread-1) [    ] o.a.s.c.c.ZkStateReader Updated live nodes from ZooKeeper... (1) -> (2)
   [junit4]   2> 3249722 INFO  (zkCallback-21139-thread-1) [    ] o.a.s.c.c.ZkStateReader Updated live nodes from ZooKeeper... (1) -> (2)
   [junit4]   2> 3249751 INFO  (zkConnectionManagerCallback-21147-thread-1) [    ] o.a.s.c.c.ConnectionManager zkClient has connected
   [junit4]   2> 3249761 INFO  (closeThreadPool-21129-thread-1) [n:127.0.0.1:59569_    ] o.a.s.c.c.ZkStateReader Updated live nodes from ZooKeeper... (0) -> (2)
   [junit4]   2> 3249785 INFO  (closeThreadPool-21129-thread-1) [n:127.0.0.1:59569_    ] o.a.s.c.s.i.ZkClientClusterStateProvider Cluster at 127.0.0.1:59546/solr ready
   [junit4]   2> 3249785 INFO  (closeThreadPool-21129-thread-1) [n:127.0.0.1:59569_    ] o.a.s.h.a.MetricsHistoryHandler No .system collection, keeping metrics history in memory.
   [junit4]   2> 3249803 INFO  (closeThreadPool-21129-thread-1) [n:127.0.0.1:59569_    ] o.a.s.m.r.SolrJmxReporter JMX monitoring for 'solr.node' (registry 'solr.node') enabled at server: com.sun.jmx.mbeanserver.JmxMBeanServer@1dc4e626
   [junit4]   2> 3249814 INFO  (closeThreadPool-21129-thread-1) [n:127.0.0.1:59569_    ] o.a.s.m.r.SolrJmxReporter JMX monitoring for 'solr.jvm' (registry 'solr.jvm') enabled at server: com.sun.jmx.mbeanserver.JmxMBeanServer@1dc4e626
   [junit4]   2> 3249814 INFO  (closeThreadPool-21129-thread-1) [n:127.0.0.1:59569_    ] o.a.s.m.r.SolrJmxReporter JMX monitoring for 'solr.jetty' (registry 'solr.jetty') enabled at server: com.sun.jmx.mbeanserver.JmxMBeanServer@1dc4e626
   [junit4]   2> 3249816 INFO  (closeThreadPool-21129-thread-1) [n:127.0.0.1:59569_    ] o.a.s.c.CorePropertiesLocator Found 0 core definitions underneath /Users/jenkins/workspace/Lucene-Solr-8.x-MacOSX/solr/build/solr-core/test/J0/../../../../../../../../../Users/jenkins/workspace/Lucene-Solr-8.x-MacOSX/solr/build/solr-core/test/J0/temp/solr.update.TestInPlaceUpdatesDistrib_273338CDBB2FF314-001/shard-1-001/cores
   [junit4]   2> 3249820 INFO  (TEST-TestInPlaceUpdatesDistrib.test-seed#[273338CDBB2FF314]) [    ] o.a.s.c.AbstractFullDistribZkTestBase create jetty 2 in directory /Users/jenkins/workspace/Lucene-Solr-8.x-MacOSX/solr/build/solr-core/test/J0/temp/solr.update.TestInPlaceUpdatesDistrib_273338CDBB2FF314-001/shard-2-001 of type NRT
   [junit4]   2> 3249820 WARN  (closeThreadPool-21129-thread-2) [    ] o.e.j.s.AbstractConnector Ignoring deprecated socket close linger time
   [junit4]   2> 3249821 INFO  (closeThreadPool-21129-thread-2) [    ] o.a.s.c.s.e.JettySolrRunner Start Jetty (original configured port=0)
   [junit4]   2> 3249821 INFO  (closeThreadPool-21129-thread-2) [    ] o.a.s.c.s.e.JettySolrRunner Trying to start Jetty on port 0 try number 1 ...
   [junit4]   2> 3249821 INFO  (closeThreadPool-21129-thread-2) [    ] o.e.j.s.Server jetty-9.4.14.v20181114; built: 2018-11-14T21:20:31.478Z; git: c4550056e785fb5665914545889f21dc136ad9e6; jvm 11.0.2+9
   [junit4]   2> 3249822 INFO  (closeThreadPool-21129-thread-2) [    ] o.e.j.s.session DefaultSessionIdManager workerName=node0
   [junit4]   2> 3249822 INFO  (closeThreadPool-21129-thread-2) [    ] o.e.j.s.session No SessionScavenger set, using defaults
   [junit4]   2> 3249822 INFO  (closeThreadPool-21129-thread-2) [    ] o.e.j.s.session node0 Scavenging every 660000ms
   [junit4]   2> 3249822 INFO  (closeThreadPool-21129-thread-2) [    ] o.e.j.s.h.ContextHandler Started o.e.j.s.ServletContextHandler@3ad8f2c5{/,null,AVAILABLE}
   [junit4]   2> 3249823 INFO  (closeThreadPool-21129-thread-2) [    ] o.e.j.s.AbstractConnector Started ServerConnector@4592ee4e{HTTP/1.1,[http/1.1, h2c]}{127.0.0.1:59574}
   [junit4]   2> 3249823 INFO  (closeThreadPool-21129-thread-2) [    ] o.e.j.s.Server Started @3249879ms
   [junit4]   2> 3249823 INFO  (closeThreadPool-21129-thread-2) [    ] o.a.s.c.s.e.JettySolrRunner Jetty properties: {hostContext=/, solrconfig=solrconfig.xml, solr.data.dir=/Users/jenkins/workspace/Lucene-Solr-8.x-MacOSX/solr/build/solr-core/test/J0/temp/solr.update.TestInPlaceUpdatesDistrib_273338CDBB2FF314-001/tempDir-001/jetty2, hostPort=59574, coreRootDirectory=/Users/jenkins/workspace/Lucene-Solr-8.x-MacOSX/solr/build/solr-core/test/J0/../../../../../../../../../Users/jenkins/workspace/Lucene-Solr-8.x-MacOSX/solr/build/solr-core/test/J0/temp/solr.update.TestInPlaceUpdatesDistrib_273338CDBB2FF314-001/shard-2-001/cores}
   [junit4]   2> 3249823 ERROR (closeThreadPool-21129-thread-2) [    ] o.a.s.u.StartupLoggingUtils Missing Java Option solr.log.dir. Logging may be missing or incomplete.
   [junit4]   2> 3249823 INFO  (closeThreadPool-21129-thread-2) [    ] o.a.s.s.SolrDispatchFilter Using logger factory org.apache.logging.slf4j.Log4jLoggerFactory
   [junit4]   2> 3249823 INFO  (closeThreadPool-21129-thread-2) [    ] o.a.s.s.SolrDispatchFilter  ___      _       Welcome to Apache Solr? version 8.2.0
   [junit4]   2> 3249823 INFO  (closeThreadPool-21129-thread-2) [    ] o.a.s.s.SolrDispatchFilter / __| ___| |_ _   Starting in cloud mode on port null
   [junit4]   2> 3249823 INFO  (closeThreadPool-21129-thread-2) [    ] o.a.s.s.SolrDispatchFilter \__ \/ _ \ | '_|  Install dir: null
   [junit4]   2> 3249823 INFO  (closeThreadPool-21129-thread-2) [    ] o.a.s.s.SolrDispatchFilter |___/\___/_|_|    Start time: 2019-05-02T09:29:11.117533Z
   [junit4]   2> 3249826 INFO  (zkConnectionManagerCallback-21150-thread-1) [    ] o.a.s.c.c.ConnectionManager zkClient has connected
   [junit4]   2> 3249827 INFO  (closeThreadPool-21129-thread-2) [    ] o.a.s.s.SolrDispatchFilter Loading solr.xml from SolrHome (not found in ZooKeeper)
   [junit4]   2> 3249827 INFO  (closeThreadPool-21129-thread-2) [    ] o.a.s.c.SolrXmlConfig Loading container configuration from /Users/jenkins/workspace/Lucene-Solr-8.x-MacOSX/solr/build/solr-core/test/J0/temp/solr.update.TestInPlaceUpdatesDistrib_273338CDBB2FF314-001/shard-2-001/solr.xml
   [junit4]   2> 3249829 INFO  (closeThreadPool-21129-thread-2) [    ] o.a.s.c.SolrXmlConfig Configuration parameter autoReplicaFailoverWorkLoopDelay is ignored
   [junit4]   2> 3249829 INFO  (closeThreadPool-21129-thread-2) [    ] o.a.s.c.SolrXmlConfig Configuration parameter autoReplicaFailoverBadNodeExpiration is ignored
   [junit4]   2> 3249830 INFO  (closeThreadPool-21129-thread-2) [    ] o.a.s.c.SolrXmlConfig MBean server found: com.sun.jmx.mbeanserver.JmxMBeanServer@1dc4e626, but no JMX reporters were configured - adding default JMX reporter.
   [junit4]   2> 3249916 INFO  (closeThreadPool-21129-thread-2) [    ] o.a.s.h.c.HttpShardHandlerFactory Host whitelist initialized: WhitelistHostChecker [whitelistHosts=null, whitelistHostCheckingEnabled=false]
   [junit4]   2> 3249917 WARN  (closeThreadPool-21129-thread-2) [    ] o.e.j.u.s.S.config No Client EndPointIdentificationAlgorithm configured for SslContextFactory@191a01c0[provider=null,keyStore=null,trustStore=null]
   [junit4]   2> 3249919 WARN  (closeThreadPool-21129-thread-2) [    ] o.e.j.u.s.S.config No Client EndPointIdentificationAlgorithm configured for SslContextFactory@4e5876a4[provider=null,keyStore=null,trustStore=null]
   [junit4]   2> 3249921 INFO  (closeThreadPool-21129-thread-2) [    ] o.a.s.c.ZkContainer Zookeeper client=127.0.0.1:59546/solr
   [junit4]   2> 3249923 INFO  (zkConnectionManagerCallback-21157-thread-1) [    ] o.a.s.c.c.ConnectionManager zkClient has connected
   [junit4]   2> 3249929 INFO  (zkConnectionManagerCallback-21159-thread-1) [    ] o.a.s.c.c.ConnectionManager zkClient has connected
   [junit4]   2> 3249938 INFO  (closeThreadPool-21129-thread-2) [n:127.0.0.1:59574_    ] o.a.s.c.c.ZkStateReader Updated live nodes from ZooKeeper... (0) -> (2)
   [junit4]   2> 3249945 INFO  (closeThreadPool-21129-thread-2) [n:127.0.0.1:59574_    ] o.a.s.c.ZkController Publish node=127.0.0.1:59574_ as DOWN
   [junit4]   2> 3249947 INFO  (closeThreadPool-21129-thread-2) [n:127.0.0.1:59574_    ] o.a.s.c.TransientSolrCoreCacheDefault Allocating transient cache for 4 transient cores
   [junit4]   2> 3249947 INFO  (closeThreadPool-21129-thread-2) [n:127.0.0.1:59574_    ] o.a.s.c.ZkController Register node as live in ZooKeeper:/live_nodes/127.0.0.1:59574_
   [junit4]   2> 3249949 INFO  (zkCallback-21127-thread-1) [    ] o.a.s.c.c.ZkStateReader Updated live nodes from ZooKeeper... (2) -> (3)
   [junit4]   2> 3249949 INFO  (zkCallback-21108-thread-3) [    ] o.a.s.c.c.ZkStateReader Updated live nodes from ZooKeeper... (2) -> (3)
   [junit4]   2> 3249949 INFO  (zkCallback-21139-thread-1) [    ] o.a.s.c.c.ZkStateReader Updated live nodes from ZooKeeper... (2) -> (3)
   [junit4]   2> 3249949 INFO  (zkCallback-21115-thread-1) [    ] o.a.s.c.c.ZkStateReader Updated live nodes from ZooKeeper... (2) -> (3)
   [junit4]   2> 3249949 INFO  (zkCallback-21158-thread-1) [    ] o.a.s.c.c.ZkStateReader Updated live nodes from ZooKeeper... (2) -> (3)
   [junit4]   2> 3249949 INFO  (zkCallback-21146-thread-1) [    ] o.a.s.c.c.ZkStateReader Updated live nodes from ZooKeeper... (2) -> (3)
   [junit4]   2> 3249969 INFO  (zkConnectionManagerCallback-21166-thread-1) [    ] o.a.s.c.c.ConnectionManager zkClient has connected
   [junit4]   2> 3249971 INFO  (closeThreadPool-21129-thread-2) [n:127.0.0.1:59574_    ] o.a.s.c.c.ZkStateReader Updated live nodes from ZooKeeper... (0) -> (3)
   [junit4]   2> 3249973 INFO  (closeThreadPool-21129-thread-2) [n:127.0.0.1:59574_    ] o.a.s.c.s.i.ZkClientClusterStateProvider Cluster at 127.0.0.1:59546/solr ready
   [junit4]   2> 3249973 INFO  (closeThreadPool-21129-thread-2) [n:127.0.0.1:59574_    ] o.a.s.h.a.MetricsHistoryHandler No .system collection, keeping metrics history in memory.
   [junit4]   2> 3249990 INFO  (closeThreadPool-21129-thread-2) [n:127.0.0.1:59574_    ] o.a.s.m.r.SolrJmxReporter JMX monitoring for 'solr.node' (registry 'solr.node') enabled at server: com.sun.jmx.mbeanserver.JmxMBeanServer@1dc4e626
   [junit4]   2> 3249999 INFO  (closeThreadPool-21129-thread-2) [n:127.0.0.1:59574_    ] o.a.s.m.r.SolrJmxReporter JMX monitoring for 'solr.jvm' (registry 'solr.jvm') enabled at server: com.sun.jmx.mbeanserver.JmxMBeanServer@1dc4e626
   [junit4]   2> 3249999 INFO  (closeThreadPool-21129-thread-2) [n:127.0.0.1:59574_    ] o.a.s.m.r.SolrJmxReporter JMX monitoring for 'solr.jetty' (registry 'solr.jetty') enabled at server: com.sun.jmx.mbeanserver.JmxMBeanServer@1dc4e626
   [junit4]   2> 3250001 INFO  (closeThreadPool-21129-thread-2) [n:127.0.0.1:59574_    ] o.a.s.c.CorePropertiesLocator Found 0 core definitions underneath /Users/jenkins/workspace/Lucene-Solr-8.x-MacOSX/solr/build/solr-core/test/J0/../../../../../../../../../Users/jenkins/workspace/Lucene-Solr-8.x-MacOSX/solr/build/solr-core/test/J0/temp/solr.update.TestInPlaceUpdatesDistrib_273338CDBB2FF314-001/shard-2-001/cores
   [junit4]   2> 3250133 INFO  (TEST-TestInPlaceUpdatesDistrib.test-seed#[273338CDBB2FF314]) [    ] o.a.s.c.AbstractFullDistribZkTestBase create jetty 3 in directory /Users/jenkins/workspace/Lucene-Solr-8.x-MacOSX/solr/build/solr-core/test/J0/temp/solr.update.TestInPlaceUpdatesDistrib_273338CDBB2FF314-001/shard-3-001 of type NRT
   [junit4]   2> 3250134 WARN  (closeThreadPool-21129-thread-2) [    ] o.e.j.s.AbstractConnector Ignoring deprecated socket close linger time
   [junit4]   2> 3250134 INFO  (closeThreadPool-21129-thread-2) [    ] o.a.s.c.s.e.JettySolrRunner Start Jetty (original configured port=0)
   [junit4]   2> 3250134 INFO  (closeThreadPool-21129-thread-2) [    ] o.a.s.c.s.e.JettySolrRunner Trying to start Jetty on port 0 try number 1 ...
   [junit4]   2> 3250134 INFO  (closeThreadPool-21129-thread-2) [    ] o.e.j.s.Server jetty-9.4.14.v20181114; built: 2018-11-14T21:20:31.478Z; git: c4550056e785fb5665914545889f21dc136ad9e6; jvm 11.0.2+9
   [junit4]   2> 3250135 INFO  (closeThreadPool-21129-thread-2) [    ] o.e.j.s.session DefaultSessionIdManager workerName=node0
   [junit4]   2> 3250135 INFO  (closeThreadPool-21129-thread-2) [    ] o.e.j.s.session No SessionScavenger set, using defaults
   [junit4]   2> 3250135 INFO  (closeThreadPool-21129-thread-2) [    ] o.e.j.s.session node0 Scavenging every 600000ms
   [junit4]   2> 3250135 INFO  (closeThreadPool-21129-thread-2) [    ] o.e.j.s.h.ContextHandler Started o.e.j.s.ServletContextHandler@3e4dd595{/,null,AVAILABLE}
   [junit4]   2> 3250136 INFO  (closeThreadPool-21129-thread-2) [    ] o.e.j.s.AbstractConnector Started ServerConnector@438c2312{HTTP/1.1,[http/1.1, h2c]}{127.0.0.1:59579}
   [junit4]   2> 3250136 INFO  (closeThreadPool-21129-thread-2) [    ] o.e.j.s.Server Started @3250192ms
   [junit4]   2> 3250136 INFO  (closeThreadPool-21129-thread-2) [    ] o.a.s.c.s.e.JettySolrRunner Jetty properties: {hostContext=/, solrconfig=solrconfig.xml, solr.data.dir=/Users/jenkins/workspace/Lucene-Solr-8.x-MacOSX/solr/build/solr-core/test/J0/temp/solr.update.TestInPlaceUpdatesDistrib_273338CDBB2FF314-001/tempDir-001/jetty3, hostPort=59579, coreRootDirectory=/Users/jenkins/workspace/Lucene-Solr-8.x-MacOSX/solr/build/solr-core/test/J0/../../../../../../../../../Users/jenkins/workspace/Lucene-Solr-8.x-MacOSX/solr/build/solr-core/test/J0/temp/solr.update.TestInPlaceUpdatesDistrib_273338CDBB2FF314-001/shard-3-001/cores}
   [junit4]   2> 3250136 ERROR (closeThreadPool-21129-thread-2) [    ] o.a.s.u.StartupLoggingUtils Missing Java Option solr.log.dir. Logging may be missing or incomplete.
   [junit4]   2> 3250136 INFO  (closeThreadPool-21129-thread-2) [    ] o.a.s.s.SolrDispatchFilter Using logger factory org.apache.logging.slf4j.Log4jLoggerFactory
   [junit4]   2> 3250136 INFO  (closeThreadPool-21129-thread-2) [    ] o.a.s.s.SolrDispatchFilter  ___      _       Welcome to Apache Solr? version 8.2.0
   [junit4]   2> 3250136 INFO  (closeThreadPool-21129-thread-2) [    ] o.a.s.s.SolrDispatchFilter / __| ___| |_ _   Starting in cloud mode on port null
   [junit4]   2> 3250136 INFO  (closeThreadPool-21129-thread-2) [    ] o.a.s.s.SolrDispatchFilter \__ \/ _ \ | '_|  Install dir: null
   [junit4]   2> 3250136 INFO  (closeThreadPool-21129-thread-2) [    ] o.a.s.s.SolrDispatchFilter |___/\___/_|_|    Start time: 2019-05-02T09:29:11.430523Z
   [junit4]   2> 3250138 INFO  (zkConnectionManagerCallback-21169-thread-1) [    ] o.a.s.c.c.ConnectionManager zkClient has connected
   [junit4]   2> 3250140 INFO  (closeThreadPool-21129-thread-2) [    ] o.a.s.s.SolrDispatchFilter Loading solr.xml from SolrHome (not found in ZooKeeper)
   [junit4]   2> 3250140 INFO  (closeThreadPool-21129-thread-2) [    ] o.a.s.c.SolrXmlConfig Loading container configuration from /Users/jenkins/workspace/Lucene-Solr-8.x-MacOSX/solr/build/solr-core/test/J0/temp/solr.update.TestInPlaceUpdatesDistrib_273338CDBB2FF314-001/shard-3-001/solr.xml
   [junit4]   2> 3250142 INFO  (closeThreadPool-21129-thread-2) [    ] o.a.s.c.SolrXmlConfig Configuration parameter autoReplicaFailoverWorkLoopDelay is ignored
   [junit4]   2> 3250142 INFO  (closeThreadPool-21129-thread-2) [    ] o.a.s.c.SolrXmlConfig Configuration parameter autoReplicaFailoverBadNodeExpiration is ignored
   [junit4]   2> 3250143 INFO  (closeThreadPool-21129-thread-2) [    ] o.a.s.c.SolrXmlConfig MBean server found: com.sun.jmx.mbeanserver.JmxMBeanServer@1dc4e626, but no JMX reporters were configured - adding default JMX reporter.
   [junit4]   2> 3250208 INFO  (closeThreadPool-21129-thread-2) [    ] o.a.s.h.c.HttpShardHandlerFactory Host whitelist initialized: WhitelistHostChecker [whitelistHosts=null, whitelistHostCheckingEnabled=false]
   [junit4]   2> 3250209 WARN  (closeThreadPool-21129-thread-2) [    ] o.e.j.u.s.S.config No Client EndPointIdentificationAlgorithm configured for SslContextFactory@2a026b0f[provider=null,keyStore=null,trustStore=null]
   [junit4]   2> 3250211 WARN  (closeThreadPool-21129-thread-2) [    ] o.e.j.u.s.S.config No Client EndPointIdentificationAlgorithm configured for SslContextFactory@2074923d[provider=null,keyStore=null,trustStore=null]
   [junit4]   2> 3250212 INFO  (closeThreadPool-21129-thread-2) [    ] o.a.s.c.ZkContainer Zookeeper client=127.0.0.1:59546/solr
   [junit4]   2> 3250215 INFO  (zkConnectionManagerCallback-21176-thread-1) [    ] o.a.s.c.c.ConnectionManager zkClient has connected
   [junit4]   2> 3250218 INFO  (zkConnectionManagerCallback-21178-thread-1) [    ] o.a.s.c.c.ConnectionManager zkClient has connected
   [junit4]   2> 3250226 INFO  (closeThreadPool-21129-thread-2) [    ] o.a.s.c.c.ZkStateReader Updated live nodes from ZooKeeper... (0) -> (3)
   [junit4]   2> 3250232 INFO  (closeThreadPool-21129-thread-2) [    ] o.a.s.c.ZkController Publish node=127.0.0.1:59579_ as DOWN
   [junit4]   2> 3250233 INFO  (closeThreadPool-21129-thread-2) [    ] o.a.s.c.TransientSolrCoreCacheDefault Allocating transient cache for 4 transient cores
   [junit4]   2> 3250233 INFO  (closeThreadPool-21129-thread-2) [    ] o.a.s.c.ZkController Register node as live in ZooKeeper:/live_nodes/127.0.0.1:59579_
   [junit4]   2> 3250235 INFO  (zkCallback-21108-thread-3) [    ] o.a.s.c.c.ZkStateReader Updated live nodes from ZooKeeper... (3) -> (4)
   [junit4]   2> 3250235 INFO  (zkCallback-21115-thread-1) [    ] o.a.s.c.c.ZkStateReader Updated live nodes from ZooKeeper... (3) -> (4)
   [junit4]   2> 3250235 INFO  (zkCallback-21146-thread-1) [    ] o.a.s.c.c.ZkStateReader Updated live nodes from ZooKeeper... (3) -> (4)
   [junit4]   2> 3250235 INFO  (zkCallback-21158-thread-1) [    ] o.a.s.c.c.ZkStateReader Updated live nodes from ZooKeeper... (3) -> (4)
   [junit4]   2> 3250235 INFO  (zkCallback-21139-thread-1) [    ] o.a.s.c.c.ZkStateReader Updated live nodes from ZooKeeper... (3) -> (4)
   [junit4]   2> 3250235 INFO  (zkCallback-21127-thread-1) [    ] o.a.s.c.c.ZkStateReader Updated live nodes from ZooKeeper... (3) -> (4)
   [junit4]   2> 3250236 INFO  (zkCallback-21165-thread-1) [    ] o.a.s.c.c.ZkStateReader Updated live nodes from ZooKeeper... (3) -> (4)
   [junit4]   2> 3250236 INFO  (zkCallback-21177-thread-1) [    ] o.a.s.c.c.ZkStateReader Updated live nodes from ZooKeeper... (3) -> (4)
   [junit4]   2> 3250253 INFO  (zkConnectionManagerCallback-21185-thread-1) [    ] o.a.s.c.c.ConnectionManager zkClient has connected
   [junit4]   2> 3250255 INFO  (closeThreadPool-21129-thread-2) [    ] o.a.s.c.c.ZkStateReader Updated live nodes from ZooKeeper... (0) -> (4)
   [junit4]   2> 3250257 INFO  (closeThreadPool-21129-thread-2) [    ] o.a.s.c.s.i.ZkClientClusterStateProvider Cluster at 127.0.0.1:59546/solr ready
   [junit4]   2> 3250257 INFO  (closeThreadPool-21129-thread-2) [    ] o.a.s.h.a.MetricsHistoryHandler No .system collection, keeping metrics history in memory.
   [junit4]   2> 3250281 INFO  (closeThreadPool-21129-thread-2) [    ] o.a.s.m.r.SolrJmxReporter JMX monitoring for 'solr.node' (registry 'solr.node') enabled at server: com.sun.jmx.mbeanserver.JmxMBeanServer@1dc4e626
   [junit4]   2> 3250290 INFO  (closeThreadPool-21129-thread-2) [    ] o.a.s.m.r.SolrJmxReporter JMX monitoring for 'solr.jvm' (registry 'solr.jvm') enabled at server: com.sun.jmx.mbeanserver.JmxMBeanServer@1dc4e626
   [junit4]   2> 3250290 INFO  (closeThreadPool-21129-thread-2) [    ] o.a.s.m.r.SolrJmxReporter JMX monitoring for 'solr.jetty' (registry 'solr.jetty') enabled at server: com.sun.jmx.mbeanserver.JmxMBeanServer@1dc4e626
   [junit4]   2> 3250291 INFO  (closeThreadPool-21129-thread-2) [    ] o.a.s.c.CorePropertiesLocator Found 0 core definitions underneath /Users/jenkins/workspace/Lucene-Solr-8.x-MacOSX/solr/build/solr-core/test/J0/../../../../../../../../../Users/jenkins/workspace/Lucene-Solr-8.x-MacOSX/solr/build/solr-core/test/J0/temp/solr.update.TestInPlaceUpdatesDistrib_273338CDBB2FF314-001/shard-3-001/cores
   [junit4]   2> 3250329 INFO  (qtp1996517632-53853) [n:127.0.0.1:59558_    ] o.a.s.h.a.CollectionsHandler Invoked Collection Action :addreplica with params node=127.0.0.1:59569_&action=ADDREPLICA&collection=collection1&shard=shard1&type=NRT&wt=javabin&version=2 and sendToOCPQueue=true
   [junit4]   2> 3250330 INFO  (qtp1996517632-53855) [n:127.0.0.1:59558_    ] o.a.s.h.a.CollectionsHandler Invoked Collection Action :addreplica with params node=127.0.0.1:59579_&action=ADDREPLICA&collection=collection1&shard=shard1&type=NRT&wt=javabin&version=2 and sendToOCPQueue=true
   [junit4]   2> 3250330 INFO  (qtp1996517632-53850) [n:127.0.0.1:59558_    ] o.a.s.h.a.CollectionsHandler Invoked Collection Action :addreplica with params node=127.0.0.1:59574_&action=ADDREPLICA&collection=collection1&shard=shard1&type=NRT&wt=javabin&version=2 and sendToOCPQueue=true
   [junit4]   2> 3250333 INFO  (OverseerThreadFactory-18488-thread-3) [ c:collection1 s:shard1  ] o.a.s.c.a.c.AddReplicaCmd Node Identified 127.0.0.1:59569_ for creating new replica of shard shard1 for collection collection1
   [junit4]   2> 3250333 INFO  (OverseerCollectionConfigSetProcessor-72069047430873092-127.0.0.1:59558_-n_0000000000) [    ] o.a.s.c.OverseerTaskQueue Response ZK path: /overseer/collection-queue-work/qnr-0000000002 doesn't exist.  Requestor may have disconnected from ZooKeeper
   [junit4]   2> 3250335 INFO  (OverseerThreadFactory-18488-thread-3) [ c:collection1 s:shard1  ] o.a.s.c.a.c.AddReplicaCmd Returning CreateReplica command.
   [junit4]   2> 3250339 INFO  (qtp399480306-53915) [n:127.0.0.1:59569_    x:collection1_shard1_replica_n1] o.a.s.h.a.CoreAdminOperation core create command qt=/admin/cores&collection.configName=conf1&name=collection1_shard1_replica_n1&action=CREATE&collection=collection1&shard=shard1&wt=javabin&version=2&replicaType=NRT
   [junit4]   2> 3251351 INFO  (qtp399480306-53915) [n:127.0.0.1:59569_ c:collection1 s:shard1  x:collection1_shard1_replica_n1] o.a.s.c.SolrConfig Using Lucene MatchVersion: 8.2.0
   [junit4]   2> 3251362 INFO  (qtp399480306-53915) [n:127.0.0.1:59569_ c:collection1 s:shard1  x:collection1_shard1_replica_n1] o.a.s.s.IndexSchema [collection1_shard1_replica_n1] Schema name=inplace-updates
   [junit4]   2> 3251364 INFO  (qtp399480306-53915) [n:127.0.0.1:59569_ c:collection1 s:shard1  x:collection1_shard1_replica_n1] o.a.s.s.IndexSchema Loaded schema inplace-updates/1.6 with uniqueid field id
   [junit4]   2> 3251364 INFO  (qtp399480306-53915) [n:127.0.0.1:59569_ c:collection1 s:shard1  x:collection1_shard1_replica_n1] o.a.s.c.CoreContainer Creating SolrCore 'collection1_shard1_replica_n1' using configuration from collection collection1, trusted=true
   [junit4]   2> 3251364 INFO  (qtp399480306-53915) [n:127.0.0.1:59569_ c:collection1 s:shard1  x:collection1_shard1_replica_n1] o.a.s.m.r.SolrJmxReporter JMX monitoring for 'solr.core.collection1.shard1.replica_n1' (registry 'solr.core.collection1.shard1.replica_n1') enabled at server: com.sun.jmx.mbeanserver.JmxMBeanServer@1dc4e626
   [junit4]   2> 3251364 INFO  (qtp399480306-53915) [n:127.0.0.1:59569_ c:collection1 s:shard1  x:collection1_shard1_replica_n1] o.a.s.c.SolrCore [[collection1_shard1_replica_n1] ] Opening new SolrCore at [/Users/jenkins/workspace/Lucene-Solr-8.x-MacOSX/solr/build/solr-core/test/J0/temp/solr.update.TestInPlaceUpdatesDistrib_273338CDBB2FF314-001/shard-1-001/cores/collection1_shard1_replica_n1], dataDir=[/Users/jenkins/workspace/Lucene-Solr-8.x-MacOSX/solr/build/solr-core/test/J0/../../../../../../../../../Users/jenkins/workspace/Lucene-Solr-8.x-MacOSX/solr/build/solr-core/test/J0/temp/solr.update.TestInPlaceUpdatesDistrib_273338CDBB2FF314-001/shard-1-001/cores/collection1_shard1_replica_n1/data/]
   [junit4]   2> 3251367 WARN  (qtp399480306-53915) [n:127.0.0.1:59569_ c:collection1 s:shard1  x:collection1_shard1_replica_n1] o.a.s.c.RequestHandlers INVALID paramSet a in requestHandler {type = requestHandler,name = /dump,class = DumpRequestHandler,attributes = {initParams=a, name=/dump, class=DumpRequestHandler},args = {defaults={a=A,b=B}}}
   [junit4]   2> 3251409 INFO  (qtp399480306-53915) [n:127.0.0.1:59569_ c:collection1 s:shard1  x:collection1_shard1_replica_n1] o.a.s.u.UpdateHandler Using UpdateLog implementation: org.apache.solr.update.UpdateLog
   [junit4]   2> 3251409 INFO  (qtp399480306-53915) [n:127.0.0.1:59569_ c:collection1 s:shard1  x:collection1_shard1_replica_n1] o.a.s.u.UpdateLog Initializing UpdateLog: dataDir= defaultSyncLevel=FLUSH numRecordsToKeep=100 maxNumLogsToKeep=10 numVersionBuckets=65536
   [junit4]   2> 3251421 INFO  (qtp399480306-53915) [n:127.0.0.1:59569_ c:collection1 s:shard1  x:collection1_shard1_replica_n1] o.a.s.u.CommitTracker Hard AutoCommit: disabled
   [junit4]   2> 3251421 INFO  (qtp399480306-53915) [n:127.0.0.1:59569_ c:collection1 s:shard1  x:collection1_shard1_replica_n1] o.a.s.u.CommitTracker Soft AutoCommit: disabled
   [junit4]   2> 3251421 INFO  (qtp399480306-53915) [n:127.0.0.1:59569_ c:collection1 s:shard1  x:collection1_shard1_replica_n1] o.a.s.s.SolrIndexSearcher Opening [Searcher@313fa97d[collection1_shard1_replica_n1] main]
   [junit4]   2> 3251423 INFO  (qtp399480306-53915) [n:127.0.0.1:59569_ c:collection1 s:shard1  x:collection1_shard1_replica_n1] o.a.s.r.ManagedResourceStorage Configured ZooKeeperStorageIO with znodeBase: /configs/conf1
   [junit4]   2> 3251424 INFO  (qtp399480306-53915) [n:127.0.0.1:59569_ c:collection1 s:shard1  x:collection1_shard1_replica_n1] o.a.s.r.ManagedResourceStorage Loaded null at path _rest_managed.json using ZooKeeperStorageIO:path=/configs/conf1
   [junit4]   2> 3251424 INFO  (qtp399480306-53915) [n:127.0.0.1:59569_ c:collection1 s:shard1  x:collection1_shard1_replica_n1] o.a.s.h.ReplicationHandler Commits will be reserved for 10000ms.
   [junit4]   2> 3251424 INFO  (qtp399480306-53915) [n:127.0.0.1:59569_ c:collection1 s:shard1  x:collection1_shard1_replica_n1] o.a.s.u.UpdateLog Could not find max version in index or recent updates, using new clock 1632411952315629568
   [junit4]   2> 3251426 INFO  (searcherExecutor-18525-thread-1-processing-n:127.0.0.1:59569_ x:collection1_shard1_replica_n1 c:collection1 s:shard1) [n:127.0.0.1:59569_ c:collection1 s:shard1  x:collection1_shard1_replica_n1] o.a.s.c.SolrCore [collection1_shard1_replica_n1] Registered new searcher Searcher@313fa97d[collection1_shard1_replica_n1] main{ExitableDirectoryReader(UninvertingDirectoryReader())}
   [junit4]   2> 3251431 INFO  (qtp399480306-53915) [n:127.0.0.1:59569_ c:collection1 s:shard1  x:collection1_shard1_replica_n1] o.a.s.c.ZkShardTerms Successful update of terms at /collections/collection1/terms/shard1 to Terms{values={core_node2=0}, version=0}
   [junit4]   2> 3251431 INFO  (qtp399480306-53915) [n:127.0.0.1:59569_ c:collection1 s:shard1  x:collection1_shard1_replica_n1] o.a.s.c.ShardLeaderElectionContextBase make sure parent is created /collections/collection1/leaders/shard1
   [junit4]   2> 3251438 INFO  (qtp399480306-53915) [n:127.0.0.1:59569_ c:collection1 s:shard1  x:collection1_shard1_replica_n1] o.a.s.c.ShardLeaderElectionContext Enough replicas found to continue.
   [junit4]   2> 3251438 INFO  (qtp399480306-53915) [n:127.0.0.1:59569_ c:collection1 s:shard1  x:collection1_shard1_replica_n1] o.a.s.c.ShardLeaderElectionContext I may be the new leader - try and sync
   [junit4]   2> 3251438 INFO  (qtp399480306-53915) [n:127.0.0.1:59569_ c:collection1 s:shard1  x:collection1_shard1_replica_n1] o.a.s.c.SyncStrategy Sync replicas to http://127.0.0.1:59569/collection1_shard1_replica_n1/
   [junit4]   2> 3251438 INFO  (qtp399480306-53915) [n:127.0.0.1:59569_ c:collection1 s:shard1  x:collection1_shard1_replica_n1] o.a.s.c.SyncStrategy Sync Success - now sync replicas to me
   [junit4]   2> 3251438 INFO  (qtp399480306-53915) [n:127.0.0.1:59569_ c:collection1 s:shard1  x:collection1_shard1_replica_n1] o.a.s.c.SyncStrategy http://127.0.0.1:59569/collection1_shard1_replica_n1/ has no replicas
   [junit4]   2> 3251438 INFO  (qtp399480306-53915) [n:127.0.0.1:59569_ c:collection1 s:shard1  x:collection1_shard1_replica_n1] o.a.s.c.ShardLeaderElectionContextBase Creating leader registration node /collections/collection1/leaders/shard1/leader after winning as /collections/collection1/leader_elect/shard1/election/72069047430873098-core_node2-n_0000000000
   [junit4]   2> 3251440 INFO  (qtp399480306-53915) [n:127.0.0.1:59569_ c:collection1 s:shard1  x:collection1_shard1_replica_n1] o.a.s.c.ShardLeaderElectionContext I am the new leader: http://127.0.0.1:59569/collection1_shard1_replica_n1/ shard1
   [junit4]   2> 3251594 INFO  (qtp399480306-53915) [n:127.0.0.1:59569_ c:collection1 s:shard1  x:collection1_shard1_replica_n1] o.a.s.c.ZkController I am the leader, no recovery necessary
   [junit4]   2> 3251597 INFO  (qtp399480306-53915) [n:127.0.0.1:59569_ c:collection1 s:shard1  x:collection1_shard1_replica_n1] o.a.s.s.HttpSolrCall [admin] webapp=null path=/admin/cores params={qt=/admin/cores&collection.configName=conf1&name=collection1_shard1_replica_n1&action=CREATE&collection=collection1&shard=shard1&wt=javabin&version=2&replicaType=NRT} status=0 QTime=1258
   [junit4]   2> 3251600 INFO  (qtp1996517632-53853) [n:127.0.0.1:59558_ c:collection1   ] o.a.s.s.HttpSolrCall [admin] webapp=null path=/admin/collections params={node=127.0.0.1:59569_&action=ADDREPLICA&collection=collection1&shard=shard1&type=NRT&wt=javabin&version=2} status=0 QTime=1271
   [junit4]   2> 3252343 INFO  (OverseerThreadFactory-18488-thread-4) [ c:collection1 s:shard1  ] o.a.s.c.a.c.AddReplicaCmd Node Identified 127.0.0.1:59579_ for creating new replica of shard shard1 for collection collection1
   [junit4]   2> 3252343 INFO  (OverseerCollectionConfigSetProcessor-72069047430873092-127.0.0.1:59558_-n_0000000000) [    ] o.a.s.c.OverseerTaskQueue Response ZK path: /overseer/collection-queue-work/qnr-0000000004 doesn't exist.  Requestor may have disconnected from ZooKeeper
   [junit4]   2> 3252344 INFO  (OverseerThreadFactory-18488-thread-4) [ c:collection1 s:shard1  ] o.a.s.c.a.c.AddReplicaCmd Returning CreateReplica command.
   [junit4]   2> 3252347 INFO  (qtp2111735764-53981) [n:127.0.0.1:59579_    x:collection1_shard1_replica_n3] o.a.s.h.a.CoreAdminOperation core create command qt=/admin/cores&collection.configName=conf1&name=collection1_shard1_replica_n3&action=CREATE&collection=collection1&shard=shard1&wt=javabin&version=2&replicaType=NRT
   [junit4]   2> 3253370 INFO  (qtp2111735764-53981) [n:127.0.0.1:59579_ c:collection1 s:shard1  x:collection1_shard1_replica_n3] o.a.s.c.SolrConfig Using Lucene MatchVersion: 8.2.0
   [junit4]   2> 3253380 INFO  (qtp2111735764-53981) [n:127.0.0.1:59579_ c:collection1 s:shard1  x:collection1_shard1_replica_n3] o.a.s.s.IndexSchema [collection1_shard1_replica_n3] Schema name=inplace-updates
   [junit4]   2> 3253382 INFO  (qtp2111735764-53981) [n:127.0.0.1:59579_ c:collection1 s:shard1  x:collection1_shard1_replica_n3] o.a.s.s.IndexSchema Loaded schema inplace-updates/1.6 with uniqueid field id
   [junit4]   2> 3253382 INFO  (qtp2111735764-53981) [n:127.0.0.1:59579_ c:collection1 s:shard1  x:collection1_shard1_replica_n3] o.a.s.c.CoreContainer Creating SolrCore 'collection1_shard1_replica_n3' using configuration from collection collection1, trusted=true
   [junit4]   2> 3253382 INFO  (qtp2111735764-53981) [n:127.0.0.1:59579_ c:collection1 s:shard1  x:collection1_shard1_replica_n3] o.a.s.m.r.SolrJmxReporter JMX monitoring for 'solr.core.collection1.shard1.replica_n3' (registry 'solr.core.collection1.shard1.replica_n3') enabled at server: com.sun.jmx.mbeanserver.JmxMBeanServer@1dc4e626
   [junit4]   2> 3253382 INFO  (qtp2111735764-53981) [n:127.0.0.1:59579_ c:collection1 s:shard1  x:collection1_shard1_replica_n3] o.a.s.c.SolrCore [[collection1_shard1_replica_n3] ] Opening new SolrCore at [/Users/jenkins/workspace/Lucene-Solr-8.x-MacOSX/solr/build/solr-core/test/J0/temp/solr.update.TestInPlaceUpdatesDistrib_273338CDBB2FF314-001/shard-3-001/cores/collection1_shard1_replica_n3], dataDir=[/Users/jenkins/workspace/Lucene-Solr-8.x-MacOSX/solr/build/solr-core/test/J0/../../../../../../../../../Users/jenkins/workspace/Lucene-Solr-8.x-MacOSX/solr/build/solr-core/test/J0/temp/solr.update.TestInPlaceUpdatesDistrib_273338CDBB2FF314-001/shard-3-001/cores/collection1_shard1_replica_n3/data/]
   [junit4]   2> 3253387 WARN  (qtp2111735764-53981) [n:127.0.0.1:59579_ c:collection1 s:shard1  x:collection1_shard1_replica_n3] o.a.s.c.RequestHandlers INVALID paramSet a in requestHandler {type = requestHandler,name = /dump,class = DumpRequestHandler,attributes = {initParams=a, name=/dump, class=DumpRequestHandler},args = {defaults={a=A,b=B}}}
   [junit4]   2> 3253425 INFO  (qtp2111735764-53981) [n:127.0.0.1:59579_ c:collection1 s:shard1  x:collection1_shard1_replica_n3] o.a.s.u.UpdateHandler Using UpdateLog implementation: org.apache.solr.update.UpdateLog
   [junit4]   2> 3253425 INFO  (qtp2111735764-53981) [n:127.0.0.1:59579_ c:collection1 s:shard1  x:collection1_shard1_replica_n3] o.a.s.u.UpdateLog Initializing UpdateLog: dataDir= defaultSyncLevel=FLUSH numRecordsToKeep=100 maxNumLogsToKeep=10 numVersionBuckets=65536
   [junit4]   2> 3253427 INFO  (qtp2111735764-53981) [n:127.0.0.1:59579_ c:collection1 s:shard1  x:collection1_shard1_replica_n3] o.a.s.u.CommitTracker Hard AutoCommit: disabled
   [junit4]   2> 3253427 INFO  (qtp2111735764-53981) [n:127.0.0.1:59579_ c:collection1 s:shard1  x:collection1_shard1_replica_n3] o.a.s.u.CommitTracker Soft AutoCommit: disabled
   [junit4]   2> 3253427 INFO  (qtp2111735764-53981) [n:127.0.0.1:59579_ c:collection1 s:shard1  x:collection1_shard1_replica_n3] o.a.s.s.SolrIndexSearcher Opening [Searcher@24b43cf5[collection1_shard1_replica_n3] main]
   [junit4]   2> 3253429 INFO  (qtp2111735764-53981) [n:127.0.0.1:59579_ c:collection1 s:shard1  x:collection1_shard1_replica_n3] o.a.s.r.ManagedResourceStorage Configured ZooKeeperStorageIO with znodeBase: /configs/conf1
   [junit4]   2> 3253430 INFO  (qtp2111735764-53981) [n:127.0.0.1:59579_ c:collection1 s:shard1  x:collection1_shard1_replica_n3] o.a.s.r.ManagedResourceStorage Loaded null at path _rest_managed.json using ZooKeeperStorageIO:path=/configs/conf1
   [junit4]   2> 3253430 INFO  (qtp2111735764-53981) [n:127.0.0.1:59579_ c:collection1 s:shard1  x:collection1_shard1_replica_n3] o.a.s.h.ReplicationHandler Commits will be reserved for 10000ms.
   [junit4]   2> 3253430 INFO  (qtp2111735764-53981) [n:127.0.0.1:59579_ c:collection1 s:shard1  x:collection1_shard1_replica_n3] o.a.s.u.UpdateLog Could not find max version in index or recent updates, using new clock 1632411954419073024
   [junit4]   2> 3253433 INFO  (searcherExecutor-18530-thread-1-processing-n:127.0.0.1:59579_ x:collection1_shard1_replica_n3 c:collection1 s:shard1) [n:127.0.0.1:59579_ c:collection1 s:shard1  x:collection1_shard1_replica_n3] o.a.s.c.SolrCore [collection1_shard1_replica_n3] Registered new searcher Searcher@24b43cf5[collection1_shard1_replica_n3] main{ExitableDirectoryReader(UninvertingDirectoryReader())}
   [junit4]   2> 3253437 INFO  (qtp2111735764-53981) [n:127.0.0.1:59579_ c:collection1 s:shard1  x:collection1_shard1_replica_n3] o.a.s.c.ZkShardTerms Successful update of terms at /collections/collection1/terms/shard1 to Terms{values={core_node2=0, core_node4=0}, version=1}
   [junit4]   2> 3253437 INFO  (qtp2111735764-53981) [n:127.0.0.1:59579_ c:collection1 s:shard1  x:collection1_shard1_replica_n3] o.a.s.c.ShardLeaderElectionContextBase make sure parent is created /collections/collection1/leaders/shard1
   [junit4]   2> 3253441 INFO  (qtp2111735764-53981) [n:127.0.0.1:59579_ c:collection1 s:shard1  x:collection1_shard1_replica_n3] o.a.s.c.ZkController Core needs to recover:collection1_shard1_replica_n3
   [junit4]   2> 3253442 INFO  (updateExecutor-21172-thread-1-processing-n:127.0.0.1:59579_ x:collection1_shard1_replica_n3 c:collection1 s:shard1) [n:127.0.0.1:59579_ c:collection1 s:shard1 r:core_node4 x:collection1_shard1_replica_n3] o.a.s.u.DefaultSolrCoreState Running recovery
   [junit4]   2> 3253443 INFO  (recoveryExecutor-21174-thread-1-processing-n:127.0.0.1:59579_ x:collection1_shard1_replica_n3 c:collection1 s:shard1 r:core_node4) [n:127.0.0.1:59579_ c:collection1 s:shard1 r:core_node4 x:collection1_shard1_replica_n3] o.a.s.c.RecoveryStrategy Starting recovery process. recoveringAfterStartup=true
   [junit4]   2> 3253443 INFO  (recoveryExecutor-21174-thread-1-processing-n:127.0.0.1:59579_ x:collection1_shard1_replica_n3 c:collection1 s:shard1 r:core_node4) [n:127.0.0.1:59579_ c:collection1 s:shard1 r:core_node4 x:collection1_shard1_replica_n3] o.a.s.c.RecoveryStrategy startupVersions is empty
   [junit4]   2> 3253444 INFO  (qtp2111735764-53981) [n:127.0.0.1:59579_ c:collection1 s:shard1  x:collection1_shard1_replica_n3] o.a.s.s.HttpSolrCall [admin] webapp=null path=/admin/cores params={qt=/admin/cores&collection.configName=conf1&name=collection1_shard1_replica_n3&action=CREATE&collection=collection1&shard=shard1&wt=javabin&version=2&replicaType=NRT} status=0 QTime=1096
   [junit4]   2> 3253445 INFO  (qtp399480306-53917) [n:127.0.0.1:59569_ c:collection1 s:shard1 r:core_node2 x:collection1_shard1_replica_n1] o.a.s.c.S.Request [collection1_shard1_replica_n1]  webapp= path=/admin/ping params={wt=javabin&version=2} hits=0 status=0 QTime=1
   [junit4]   2> 3253445 INFO  (qtp399480306-53917) [n:127.0.0.1:59569_ c:collection1 s:shard1 r:core_node2 x:collection1_shard1_replica_n1] o.a.s.c.S.Request [collection1_shard1_replica_n1]  webapp= path=/admin/ping params={wt=javabin&version=2} status=0 QTime=1
   [junit4]   2> 3253445 INFO  (recoveryExecutor-21174-thread-1-processing-n:127.0.0.1:59579_ x:collection1_shard1_replica_n3 c:collection1 s:shard1 r:core_node4) [n:127.0.0.1:59579_ c:collection1 s:shard1 r:core_node4 x:collection1_shard1_replica_n3] o.a.s.c.RecoveryStrategy Begin buffering updates. core=[collection1_shard1_replica_n3]
   [junit4]   2> 3253445 INFO  (recoveryExecutor-21174-thread-1-processing-n:127.0.0.1:59579_ x:collection1_shard1_replica_n3 c:collection1 s:shard1 r:core_node4) [n:127.0.0.1:59579_ c:collection1 s:shard1 r:core_node4 x:collection1_shard1_replica_n3] o.a.s.u.UpdateLog Starting to buffer updates. FSUpdateLog{state=ACTIVE, tlog=null}
   [junit4]   2> 3253445 INFO  (recoveryExecutor-21174-thread-1-processing-n:127.0.0.1:59579_ x:collection1_shard1_replica_n3 c:collection1 s:shard1 r:core_node4) [n:127.0.0.1:59579_ c:collection1 s:shard1 r:core_node4 x:collection1_shard1_replica_n3] o.a.s.c.RecoveryStrategy Publishing state of core [collection1_shard1_replica_n3] as recovering, leader is [http://127.0.0.1:59569/collection1_shard1_replica_n1/] and I am [http://127.0.0.1:59579/collection1_shard1_replica_n3/]
   [junit4]   2> 3253448 INFO  (recoveryExecutor-21174-thread-1-processing-n:127.0.0.1:59579_ x:collection1_shard1_replica_n3 c:collection1 s:shard1 r:core_node4) [n:127.0.0.1:59579_ c:collection1 s:shard1 r:core_node4 x:collection1_shard1_replica_n3] o.a.s.c.RecoveryStrategy Sending prep recovery command to [http://127.0.0.1:59569]; [WaitForState: action=PREPRECOVERY&core=collection1_shard1_replica_n1&nodeName=127.0.0.1:59579_&coreNodeName=core_node4&state=recovering&checkLive=true&onlyIfLeader=true&onlyIfLeaderActive=true]
   [junit4]   2> 3253449 INFO  (qtp399480306-53918) [n:127.0.0.1:59569_    x:collection1_shard1_replica_n1] o.a.s.h.a.PrepRecoveryOp Going to wait for coreNodeName: core_node4, state: recovering, checkLive: true, onlyIfLeader: true, onlyIfLeaderActive: true
   [junit4]   2> 3253449 INFO  (qtp399480306-53918) [n:127.0.0.1:59569_    x:collection1_shard1_replica_n1] o.a.s.h.a.PrepRecoveryOp In WaitForState(recovering): collection=collection1, shard=shard1, thisCore=collection1_shard1_replica_n1, leaderDoesNotNeedRecovery=false, isLeader? true, live=true, checkLive=true, currentState=down, localState=active, nodeName=127.0.0.1:59579_, coreNodeName=core_node4, onlyIfActiveCheckResult=false, nodeProps: core_node4:{"core":"collection1_shard1_replica_n3","base_url":"http://127.0.0.1:59579","node_name":"127.0.0.1:59579_","state":"down","type":"NRT"}
   [junit4]   2> 3253450 INFO  (qtp1996517632-53855) [n:127.0.0.1:59558_ c:collection1   ] o.a.s.s.HttpSolrCall [admin] webapp=null path=/admin/collections params={node=127.0.0.1:59579_&action=ADDREPLICA&collection=collection1&shard=shard1&type=NRT&wt=javabin&version=2} status=0 QTime=3120
   [junit4]   2> 3253561 INFO  (watches-21141-thread-1) [    ] o.a.s.h.a.PrepRecoveryOp In WaitForState(recovering): collection=collection1, shard=shard1, thisCore=collection1_shard1_replica_n1, leaderDoesNotNeedRecovery=false, isLeader? true, live=true, checkLive=true, currentState=recovering, localState=active, nodeName=127.0.0.1:59579_, coreNodeName=core_node4, onlyIfActiveCheckResult=false, nodeProps: core_node4:{"core":"collection1_shard1_replica_n3","base_url":"http://127.0.0.1:59579","node_name":"127.0.0.1:59579_","state":"recovering","type":"NRT"}
   [junit4]   2> 3253561 INFO  (qtp399480306-53918) [n:127.0.0.1:59569_    x:collection1_shard1_replica_n1] o.a.s.s.HttpSolrCall [admin] webapp=null path=/admin/cores params={nodeName=127.0.0.1:59579_&onlyIfLeaderActive=true&core=collection1_shard1_replica_n1&coreNodeName=core_node4&action=PREPRECOVERY&checkLive=true&state=recovering&onlyIfLeader=true&wt=javabin&version=2} status=0 QTime=112
   [junit4]   2> 3254071 INFO  (recoveryExecutor-21174-thread-1-processing-n:127.0.0.1:59579_ x:collection1_shard1_replica_n3 c:collection1 s:shard1 r:core_node4) [n:127.0.0.1:59579_ c:collection1 s:shard1 r:core_node4 x:collection1_shard1_replica_n3] o.a.s.c.RecoveryStrategy Attempting to PeerSync from [http://127.0.0.1:59569/collection1_shard1_replica_n1/] - recoveringAfterStartup=[true]
   [junit4]   2> 3254071 WARN  (recoveryExecutor-21174-thread-1-processing-n:127.0.0.1:59579_ x:collection1_shard1_replica_n3 c:collection1 s:shard1 r:core_node4) [n:127.0.0.1:59579_ c:collection1 s:shard1 r:core_node4 x:collection1_shard1_replica_n3] o.a.s.u.PeerSyncWithLeader no frame of reference to tell if we've missed updates
   [junit4]   2> 3254071 INFO  (recoveryExecutor-21174-thread-1-processing-n:127.0.0.1:59579_ x:collection1_shard1_replica_n3 c:collection1 s:shard1 r:core_node4) [n:127.0.0.1:59579_ c:collection1 s:shard1 r:core_node4 x:collection1_shard1_replica_n3] o.a.s.c.RecoveryStrategy PeerSync Recovery was not successful - trying replication.
   [junit4]   2> 3254071 INFO  (recoveryExecutor-21174-thread-1-processing-n:127.0.0.1:59579_ x:collection1_shard1_replica_n3 c:collection1 s:shard1 r:core_node4) [n:127.0.0.1:59579_ c:collection1 s:shard1 r:core_node4 x:collection1_shard1_replica_n3] o.a.s.c.RecoveryStrategy Starting Replication Recovery.
   [junit4]   2> 3254071 INFO  (recoveryExecutor-21174-thread-1-processing-n:127.0.0.1:59579_ x:collection1_shard1_replica_n3 c:collection1 s:shard1 r:core_node4) [n:127.0.0.1:59579_ c:collection1 s:shard1 r:core_node4 x:collection1_shard1_replica_n3] o.a.s.c.RecoveryStrategy Attempting to replicate from [http://127.0.0.1:59569/collection1_shard1_replica_n1/].
   [junit4]   2> 3254072 INFO  (qtp399480306-53913) [n:127.0.0.1:59569_ c:collection1 s:shard1 r:core_node2 x:collection1_shard1_replica_n1] o.a.s.u.DirectUpdateHandler2 start commit{_version_=1632411955092258816,optimize=false,openSearcher=false,waitSearcher=true,expungeDeletes=false,softCommit=false,prepareCommit=false}
   [junit4]   2> 3254072 INFO  (qtp399480306-53913) [n:127.0.0.1:59569_ c:collection1 s:shard1 r:core_node2 x:collection1_shard1_replica_n1] o.a.s.u.DirectUpdateHandler2 No uncommitted changes. Skipping IW.commit.
   [junit4]   2> 3254072 INFO  (qtp399480306-53913) [n:127.0.0.1:59569_ c:collection1 s:shard1 r:core_node2 x:collection1_shard1_replica_n1] o.a.s.u.DirectUpdateHandler2 end_commit_flush
   [junit4]   2> 3254075 INFO  (qtp2111735764-53984) [n:127.0.0.1:59579_ c:collection1 s:shard1 r:core_node4 x:collection1_shard1_replica_n3] o.a.s.u.p.DistributedUpdateProcessor Ignoring commit while not ACTIVE - state: BUFFERING replay: false
   [junit4]   2> 3254075 INFO  (qtp2111735764-53984) [n:127.0.0.1:59579_ c:collection1 s:shard1 r:core_node4 x:collection1_shard1_replica_n3] o.a.s.u.p.LogUpdateProcessorFactory [collection1_shard1_replica_n3]  webapp= path=/update params={update.distrib=FROMLEADER&waitSearcher=true&openSearcher=false&commit=true&softCommit=false&distrib.from=http://127.0.0.1:59569/collection1_shard1_replica_n1/&commit_end_point=replicas&wt=javabin&version=2&expungeDeletes=false}{commit=} 0 0
   [junit4]   2> 3254076 INFO  (qtp399480306-53913) [n:127.0.0.1:59569_ c:collection1 s:shard1 r:core_node2 x:collection1_shard1_replica_n1] o.a.s.u.p.LogUpdateProcessorFactory [collection1_shard1_replica_n1]  webapp= path=/update params={waitSearcher=true&openSearcher=false&commit=true&softCommit=false&wt=javabin&version=2}{commit=} 0 4
   [junit4]   2> 3254078 INFO  (qtp399480306-53914) [n:127.0.0.1:59569_ c:collection1 s:shard1 r:core_node2 x:collection1_shard1_replica_n1] o.a.s.c.S.Request [collection1_shard1_replica_n1]  webapp= path=/replication params={qt=/replication&wt=javabin&version=2&command=indexversion} status=0 QTime=0
   [junit4]   2> 3254078 INFO  (recoveryExecutor-21174-thread-1-processing-n:127.0.0.1:59579_ x:collection1_shard1_replica_n3 c:collection1 s:shard1 r:core_node4) [n:127.0.0.1:59579_ c:collection1 s:shard1 r:core_node4 x:collection1_shard1_replica_n3] o.a.s.h.IndexFetcher Master's generation: 1
   [junit4]   2> 3254078 INFO  (recoveryExecutor-21174-thread-1-processing-n:127.0.0.1:59579_ x:collection1_shard1_replica_n3 c:collection1 s:shard1 r:core

[...truncated too long message...]

TestFaceting, TestHdfsCloudBackupRestore, BadIndexSchemaTest, SuggesterFSTTest, SpellCheckComponentTest, TestUpdate, HdfsChaosMonkeyNothingIsSafeTest, PluginInfoTest, TestClassicSimilarityFactory, SecurityConfHandlerTest, TestObjectReleaseTracker, SimpleMLTQParserTest, CdcrBidirectionalTest, TestLegacyNumericUtils, TestSimExtremeIndexing, TaggingAttributeTest, TestOrdValues, TestConfigSetsAPI, MetricTriggerIntegrationTest, TestSubQueryTransformer, TestUtilizeNode, BufferStoreTest, CdcrWithNodesRestartsTest, TestJoin, TestEmbeddedSolrServerSchemaAPI, BlockJoinFacetDistribTest, TestSystemCollAutoCreate, TestSolrCloudSnapshots, ResourceLoaderTest, TestHighFrequencyDictionaryFactory, PreAnalyzedFieldTest, DeleteStatusTest, EmbeddedSolrNoSerializeTest, ZkControllerTest, SoftAutoCommitTest, TestDocBasedVersionConstraints, TestCloudConsistency, TestQueryUtils, RecoveryAfterSoftCommitTest, NodeAddedTriggerIntegrationTest, TestHashQParserPlugin, DistributedFacetSimpleRefinementLongTailTest, DistributedQueryComponentOptimizationTest, VersionInfoTest, TestStressCloudBlindAtomicUpdates, HdfsTlogReplayBufferedWhileIndexingTest, TokenizerChainTest, SuggesterTest, DistribDocExpirationUpdateProcessorTest, TestBinaryField, FastVectorHighlighterTest, VMParamsZkACLAndCredentialsProvidersTest, IndexSchemaRuntimeFieldTest, NodeMarkersRegistrationTest, TestReplicationHandlerBackup, MetricsHistoryIntegrationTest, TestRetrieveFieldsOptimizer, MigrateRouteKeyTest, FullHLLTest, TestOnReconnectListenerSupport, DocumentAnalysisRequestHandlerTest, TestLockTree, ChaosMonkeyNothingIsSafeTest, ZkNodePropsTest, XsltUpdateRequestHandlerTest, TestMaxScoreQueryParser, TestDeprecatedFilters, IgnoreCommitOptimizeUpdateProcessorFactoryTest, BasicAuthStandaloneTest, ReindexCollectionTest, ZkStateWriterTest, AnalysisAfterCoreReloadTest, TestManagedSchemaAPI, TestReplicaProperties, TestFieldCacheWithThreads, CreateRoutedAliasTest, TestUseDocValuesAsStored2, TestCloudRecovery, TestInfoStreamLogging, MoveReplicaHDFSFailoverTest, AutoscalingHistoryHandlerTest, TestRandomCollapseQParserPlugin, QueryEqualityTest, TestJmxIntegration, UpdateRequestProcessorFactoryTest, TestLegacyBM25SimilarityFactory, DocValuesMultiTest, SpatialRPTFieldTypeTest, DaemonStreamApiTest, TestReload, CdcrRequestHandlerTest, TestMissingGroups, TestExclusionRuleCollectionAccess, TestTrieFacet, BinaryUpdateRequestHandlerTest, PeerSyncTest, TestReversedWildcardFilterFactory, RequiredFieldsTest, LeaderFailureAfterFreshStartTest, TestSolrJ, TestJsonRequest, SolrMetricsIntegrationTest, ConnectionManagerTest, TestSuggestSpellingConverter, TestSolrCloudWithHadoopAuthPlugin, TestUnInvertedFieldException, TestSimpleQParserPlugin, UpdateLogTest, TestEmbeddedSolrServerAdminHandler, RuleEngineTest, TestPseudoReturnFields, TestSweetSpotSimilarityFactory, CollectionTooManyReplicasTest, BigEndianAscendingWordDeserializerTest, HdfsRecoveryZkTest, HdfsBasicDistributedZk2Test, TestFieldCollectionResource, DocValuesNotIndexedTest, PreAnalyzedUpdateProcessorTest, DateMathParserTest, TestCorePropertiesReload, TestManagedStopFilterFactory, HdfsWriteToMultipleCollectionsTest, QueryElevationComponentTest, AnalyticsMergeStrategyTest, TestZkChroot, Tagger2Test, TestCrossCoreJoin, SuggestComponentContextFilterQueryTest, BasicDistributedZkTest, RAMDirectoryFactoryTest, SolrIndexSplitterTest, TestPerFieldSimilarity, TestDistributedSearch, TriggerEventQueueTest, TestStressVersions, TestMacroExpander, TestComplexPhraseQParserPlugin, HealthCheckHandlerTest, MoveReplicaTest, TestNumericTerms32, OverseerModifyCollectionTest, PKIAuthenticationIntegrationTest, TestHdfsBackupRestoreCore, TestCloudPivotFacet, TestUtils, SolrIndexConfigTest, ShardRoutingTest, CloudExitableDirectoryReaderTest, TestCollapseQParserPlugin, ManagedSchemaRoundRobinCloudTest, CurrencyRangeFacetCloudTest, TestSerializedLuceneMatchVersion, CircularListTest, LoggingHandlerTest, TestDirectoryFactory, TestPayloadCheckQParserPlugin, TestDeleteCollectionOnDownNodes, TestSolrDeletionPolicy1, TestHalfAndHalfDocValues, SolrMetricManagerTest, TestSystemIdResolver, TestAuthorizationFramework, TestReqParamsAPI, AddReplicaTest, SystemCollectionCompatTest, DocumentBuilderTest, CachingDirectoryFactoryTest, TestSolrCoreProperties, DistanceFunctionTest, TestCodecSupport, TestLogWatcher, TestConfigSetProperties, TestBulkSchemaAPI, AtomicUpdatesTest, CoreSorterTest, HdfsLockFactoryTest, MetricUtilsTest, TestFunctionQuery, TestSimTriggerIntegration, TestReloadAndDeleteDocs, SolrJmxReporterCloudTest, TestRandomFlRTGCloud, TestPostingsSolrHighlighter, TestSubQueryTransformerDistrib, TestUninvertingReader, AsyncCallRequestStatusResponseTest, OutputWriterTest, HttpTriggerListenerTest, DistributedFacetPivotSmallTest, TestSortableTextField, TestPHPSerializedResponseWriter, TestInitQParser, StatelessScriptUpdateProcessorFactoryTest, DistributedQueueTest, TestCloudJSONFacetSKG, PingRequestHandlerTest, TestLRUStatsCache, SpatialFilterTest, TestCollectionAPI, ChaosMonkeySafeLeaderTest, CleanupOldIndexTest, ClusterStateTest, ClusterStateUpdateTest, CollectionStateFormat2Test, ConfigSetsAPITest, DeleteInactiveReplicaTest, DeleteShardTest, DistribCursorPagingTest, ForceLeaderWithTlogReplicasTest, FullSolrCloudDistribCmdsTest, HttpPartitionOnCommitTest, LeaderElectionContextKeyTest, LeaderElectionIntegrationTest, LeaderElectionTest, OutOfBoxZkACLAndCredentialsProvidersTest, OverseerRolesTest, OverseerStatusTest, OverseerTest, RecoveryZkTest, RollingRestartTest, SaslZkACLProviderTest, ShardRoutingCustomTest, SharedFSAutoReplicaFailoverTest, SolrCLIZkUtilsTest, SolrCloudExampleTest, SplitShardTest, TestCloudPseudoReturnFields, TestCloudRecovery2, TestConfigSetsAPIExclusivity, TestConfigSetsAPIZkFailure, TestCryptoKeys, TestDistributedMap, TestDownShardTolerantSearch, TestLeaderElectionWithEmptyReplica, TestRandomRequestDistribution, TestSegmentSorting, TestShortCircuitedRequests, TestSkipOverseerOperations, TestStressLiveNodes, TestTolerantUpdateProcessorCloud, TestTolerantUpdateProcessorRandomCloud, TriLevelCompositeIdRoutingTest, ZkCLITest, CollectionsAPIAsyncDistributedZkTest, ConcurrentDeleteAndCreateCollectionTest, CustomCollectionTest, SimpleCollectionCreateDeleteTest, TestCollectionsAPIViaSolrCloudCluster, AutoAddReplicasIntegrationTest, NodeLostTriggerIntegrationTest, ScheduledMaintenanceTriggerTest, SearchRateTriggerIntegrationTest, SearchRateTriggerTest, TestPolicyCloud, TriggerSetPropertiesIntegrationTest, TestSimComputePlanAction, TestSimDistributedQueue, TestSimGenericDistributedQueue, TestSimLargeCluster, TestMergePolicyConfig, TestQuerySenderListener, TestShardHandlerFactory, TestSimpleTextCodec, TestSolrConfigHandler, JsonLoaderTest, MoreLikeThisHandlerTest, RequestLoggingTest, ResponseBuilderTest, TestBlobHandler, TestReplicationHandler, V2StandaloneTest, XmlUpdateRequestHandlerTest, CoreAdminHandlerTest, MBeansHandlerTest, DistributedFacetPivotLargeTest, DistributedMLTComponentTest, DistributedSpellCheckComponentTest, PhrasesIdentificationComponentTest, ResponseLogComponentTest, SearchHandlerTest, TermVectorComponentDistributedTest, TestDistributedStatsComponentCardinality, TestExpandComponent, TestHttpShardHandlerFactory, TestPivotHelperCode, TestTrackingShardHandlerFactory, HighlighterMaxOffsetTest, TestSlowCompositeReaderWrapper, CheckHdfsIndexTest, TestLegacyField, TestLegacyTerms, TestNumericRangeQuery32, SolrSlf4jReporterTest, SolrShardReporterTest, TestRemoteStreaming, TestWriterPerf, SmileWriterTest, TestCSVResponseWriter, TestGraphMLResponseWriter, TestRawTransformer, TestChildDocTransformerHierarchy, TestCopyFieldCollectionResource, TestDynamicFieldCollectionResource, TestFieldResource, TestFieldTypeCollectionResource, TestManagedSynonymFilterFactory, ChangedSchemaMergeTest, CopyFieldTest, DateRangeFieldTest, DocValuesTest, TestCloudSchemaless, TestSchemaManager, TestSchemalessBufferedUpdates, AnalyticsQueryTest, CursorMarkTest, LargeFieldTest, SignificantTermsQParserPluginTest, TestAddFieldRealTimeGet, TestComplexPhraseLeadingWildcard, TestComponentsName, TestCustomSort, TestExtendedDismaxParser, TestFoldingMultitermQuery, TestIndexSearcher, TestNoOpRegenerator, TestPayloadScoreQParserPlugin, TestRecovery, TestJsonFacets, TestZkAclsWithHadoopAuth, NoCacheHeaderTest, ResponseHeaderTest, ConjunctionSolrSpellCheckerTest, DirectSolrSpellCheckerTest, SpellCheckCollatorTest, SuggesterWFSTTest, TestAnalyzedSuggestions, TestFreeTextSuggestions, TestPhraseSuggestions, TestDocTermOrdsUninvertLimit, TestFieldCacheReopen, TestNumericTerms64, PeerSyncWithBufferUpdatesTest, PeerSyncWithLeaderTest, TestInPlaceUpdatesDistrib]
   [junit4] Completed [848/855 (1!)] on J0 in 52.70s, 1 test, 1 failure <<< FAILURES!

[...truncated 8985 lines...]
BUILD FAILED
/Users/jenkins/workspace/Lucene-Solr-8.x-MacOSX/build.xml:634: The following error occurred while executing this line:
/Users/jenkins/workspace/Lucene-Solr-8.x-MacOSX/build.xml:128: Found 1 violations in source files (File uses Mockito but has no assumeWorkingMockito() call).

Total time: 107 minutes 7 seconds
Build step 'Invoke Ant' marked build as failure
Archiving artifacts
Setting ANT_1_8_2_HOME=/Users/jenkins/tools/hudson.tasks.Ant_AntInstallation/ANT_1.8.2
[WARNINGS] Skipping publisher since build result is FAILURE
Recording test results
Setting ANT_1_8_2_HOME=/Users/jenkins/tools/hudson.tasks.Ant_AntInstallation/ANT_1.8.2
Email was triggered for: Failure - Any
Sending email for trigger: Failure - Any
Setting ANT_1_8_2_HOME=/Users/jenkins/tools/hudson.tasks.Ant_AntInstallation/ANT_1.8.2
Setting ANT_1_8_2_HOME=/Users/jenkins/tools/hudson.tasks.Ant_AntInstallation/ANT_1.8.2
Setting ANT_1_8_2_HOME=/Users/jenkins/tools/hudson.tasks.Ant_AntInstallation/ANT_1.8.2
Setting ANT_1_8_2_HOME=/Users/jenkins/tools/hudson.tasks.Ant_AntInstallation/ANT_1.8.2
Setting ANT_1_8_2_HOME=/Users/jenkins/tools/hudson.tasks.Ant_AntInstallation/ANT_1.8.2
Setting ANT_1_8_2_HOME=/Users/jenkins/tools/hudson.tasks.Ant_AntInstallation/ANT_1.8.2

Mime
View raw message