lucene-dev mailing list archives

Site index · List index
Message view « Date » · « Thread »
Top « Date » · « Thread »
From Policeman Jenkins Server <jenk...@thetaphi.de>
Subject [JENKINS-EA] Lucene-Solr-8.x-Windows (64bit/jdk-13-ea+18) - Build # 237 - Still Failing!
Date Thu, 02 May 2019 05:53:26 GMT
Build: https://jenkins.thetaphi.de/job/Lucene-Solr-8.x-Windows/237/
Java: 64bit/jdk-13-ea+18 -XX:-UseCompressedOops -XX:+UseParallelGC

2 tests failed.
FAILED:  org.apache.solr.update.PeerSyncWithLeaderTest.test

Error Message:
Unexpected exception type, expected SolrException but got org.apache.solr.client.solrj.SolrServerException: Timeout occurred while waiting response from server at: http://127.0.0.1:52496/collection1

Stack Trace:
junit.framework.AssertionFailedError: Unexpected exception type, expected SolrException but got org.apache.solr.client.solrj.SolrServerException: Timeout occurred while waiting response from server at: http://127.0.0.1:52496/collection1
	at __randomizedtesting.SeedInfo.seed([BE1524C066D29295:36411B1AC82EFF6D]:0)
	at org.apache.lucene.util.LuceneTestCase.expectThrows(LuceneTestCase.java:2700)
	at org.apache.lucene.util.LuceneTestCase.expectThrows(LuceneTestCase.java:2689)
	at org.apache.solr.update.PeerSyncTest.test(PeerSyncTest.java:279)
	at java.base/jdk.internal.reflect.NativeMethodAccessorImpl.invoke0(Native Method)
	at java.base/jdk.internal.reflect.NativeMethodAccessorImpl.invoke(NativeMethodAccessorImpl.java:62)
	at java.base/jdk.internal.reflect.DelegatingMethodAccessorImpl.invoke(DelegatingMethodAccessorImpl.java:43)
	at java.base/java.lang.reflect.Method.invoke(Method.java:567)
	at com.carrotsearch.randomizedtesting.RandomizedRunner.invoke(RandomizedRunner.java:1750)
	at com.carrotsearch.randomizedtesting.RandomizedRunner$8.evaluate(RandomizedRunner.java:938)
	at com.carrotsearch.randomizedtesting.RandomizedRunner$9.evaluate(RandomizedRunner.java:974)
	at com.carrotsearch.randomizedtesting.RandomizedRunner$10.evaluate(RandomizedRunner.java:988)
	at org.apache.solr.BaseDistributedSearchTestCase$ShardsRepeatRule$ShardsFixedStatement.callStatement(BaseDistributedSearchTestCase.java:1082)
	at org.apache.solr.BaseDistributedSearchTestCase$ShardsRepeatRule$ShardsStatement.evaluate(BaseDistributedSearchTestCase.java:1054)
	at com.carrotsearch.randomizedtesting.rules.SystemPropertiesRestoreRule$1.evaluate(SystemPropertiesRestoreRule.java:57)
	at org.apache.lucene.util.TestRuleSetupTeardownChained$1.evaluate(TestRuleSetupTeardownChained.java:49)
	at org.apache.lucene.util.AbstractBeforeAfterRule$1.evaluate(AbstractBeforeAfterRule.java:45)
	at org.apache.lucene.util.TestRuleThreadAndTestName$1.evaluate(TestRuleThreadAndTestName.java:48)
	at org.apache.lucene.util.TestRuleIgnoreAfterMaxFailures$1.evaluate(TestRuleIgnoreAfterMaxFailures.java:64)
	at org.apache.lucene.util.TestRuleMarkFailure$1.evaluate(TestRuleMarkFailure.java:47)
	at com.carrotsearch.randomizedtesting.rules.StatementAdapter.evaluate(StatementAdapter.java:36)
	at com.carrotsearch.randomizedtesting.ThreadLeakControl$StatementRunner.run(ThreadLeakControl.java:368)
	at com.carrotsearch.randomizedtesting.ThreadLeakControl.forkTimeoutingTask(ThreadLeakControl.java:817)
	at com.carrotsearch.randomizedtesting.ThreadLeakControl$3.evaluate(ThreadLeakControl.java:468)
	at com.carrotsearch.randomizedtesting.RandomizedRunner.runSingleTest(RandomizedRunner.java:947)
	at com.carrotsearch.randomizedtesting.RandomizedRunner$5.evaluate(RandomizedRunner.java:832)
	at com.carrotsearch.randomizedtesting.RandomizedRunner$6.evaluate(RandomizedRunner.java:883)
	at com.carrotsearch.randomizedtesting.RandomizedRunner$7.evaluate(RandomizedRunner.java:894)
	at com.carrotsearch.randomizedtesting.rules.StatementAdapter.evaluate(StatementAdapter.java:36)
	at com.carrotsearch.randomizedtesting.rules.SystemPropertiesRestoreRule$1.evaluate(SystemPropertiesRestoreRule.java:57)
	at org.apache.lucene.util.AbstractBeforeAfterRule$1.evaluate(AbstractBeforeAfterRule.java:45)
	at com.carrotsearch.randomizedtesting.rules.StatementAdapter.evaluate(StatementAdapter.java:36)
	at org.apache.lucene.util.TestRuleStoreClassName$1.evaluate(TestRuleStoreClassName.java:41)
	at com.carrotsearch.randomizedtesting.rules.NoShadowingOrOverridesOnMethodsRule$1.evaluate(NoShadowingOrOverridesOnMethodsRule.java:40)
	at com.carrotsearch.randomizedtesting.rules.NoShadowingOrOverridesOnMethodsRule$1.evaluate(NoShadowingOrOverridesOnMethodsRule.java:40)
	at com.carrotsearch.randomizedtesting.rules.StatementAdapter.evaluate(StatementAdapter.java:36)
	at com.carrotsearch.randomizedtesting.rules.StatementAdapter.evaluate(StatementAdapter.java:36)
	at org.apache.lucene.util.TestRuleAssertionsRequired$1.evaluate(TestRuleAssertionsRequired.java:53)
	at org.apache.lucene.util.TestRuleMarkFailure$1.evaluate(TestRuleMarkFailure.java:47)
	at org.apache.lucene.util.TestRuleIgnoreAfterMaxFailures$1.evaluate(TestRuleIgnoreAfterMaxFailures.java:64)
	at org.apache.lucene.util.TestRuleIgnoreTestSuites$1.evaluate(TestRuleIgnoreTestSuites.java:54)
	at com.carrotsearch.randomizedtesting.rules.StatementAdapter.evaluate(StatementAdapter.java:36)
	at com.carrotsearch.randomizedtesting.ThreadLeakControl$StatementRunner.run(ThreadLeakControl.java:368)
	at java.base/java.lang.Thread.run(Thread.java:835)
Caused by: org.apache.solr.client.solrj.SolrServerException: Timeout occurred while waiting response from server at: http://127.0.0.1:52496/collection1
	at org.apache.solr.client.solrj.impl.HttpSolrClient.executeMethod(HttpSolrClient.java:660)
	at org.apache.solr.client.solrj.impl.HttpSolrClient.request(HttpSolrClient.java:255)
	at org.apache.solr.client.solrj.impl.HttpSolrClient.request(HttpSolrClient.java:244)
	at org.apache.solr.client.solrj.SolrRequest.process(SolrRequest.java:207)
	at org.apache.solr.client.solrj.SolrRequest.process(SolrRequest.java:224)
	at org.apache.solr.BaseDistributedSearchTestCase.add(BaseDistributedSearchTestCase.java:576)
	at org.apache.solr.update.PeerSyncTest.lambda$test$0(PeerSyncTest.java:281)
	at org.apache.lucene.util.LuceneTestCase.expectThrows(LuceneTestCase.java:2695)
	... 42 more
Caused by: java.net.SocketTimeoutException: Read timed out
	at java.base/java.net.SocketInputStream.socketRead0(Native Method)
	at java.base/java.net.SocketInputStream.socketRead(SocketInputStream.java:115)
	at java.base/java.net.SocketInputStream.read(SocketInputStream.java:168)
	at java.base/java.net.SocketInputStream.read(SocketInputStream.java:140)
	at java.base/java.net.Socket$SocketInputStream.read(Socket.java:972)
	at org.apache.http.impl.io.SessionInputBufferImpl.streamRead(SessionInputBufferImpl.java:137)
	at org.apache.http.impl.io.SessionInputBufferImpl.fillBuffer(SessionInputBufferImpl.java:153)
	at org.apache.http.impl.io.SessionInputBufferImpl.readLine(SessionInputBufferImpl.java:282)
	at org.apache.http.impl.conn.DefaultHttpResponseParser.parseHead(DefaultHttpResponseParser.java:138)
	at org.apache.http.impl.conn.DefaultHttpResponseParser.parseHead(DefaultHttpResponseParser.java:56)
	at org.apache.http.impl.io.AbstractMessageParser.parse(AbstractMessageParser.java:259)
	at org.apache.http.impl.DefaultBHttpClientConnection.receiveResponseHeader(DefaultBHttpClientConnection.java:163)
	at org.apache.http.impl.conn.CPoolProxy.receiveResponseHeader(CPoolProxy.java:165)
	at org.apache.http.protocol.HttpRequestExecutor.doReceiveResponse(HttpRequestExecutor.java:273)
	at org.apache.http.protocol.HttpRequestExecutor.execute(HttpRequestExecutor.java:125)
	at org.apache.http.impl.execchain.MainClientExec.execute(MainClientExec.java:272)
	at org.apache.http.impl.execchain.ProtocolExec.execute(ProtocolExec.java:185)
	at org.apache.http.impl.execchain.RetryExec.execute(RetryExec.java:89)
	at org.apache.http.impl.execchain.RedirectExec.execute(RedirectExec.java:110)
	at org.apache.http.impl.client.InternalHttpClient.doExecute(InternalHttpClient.java:185)
	at org.apache.http.impl.client.CloseableHttpClient.execute(CloseableHttpClient.java:83)
	at org.apache.http.impl.client.CloseableHttpClient.execute(CloseableHttpClient.java:56)
	at org.apache.solr.client.solrj.impl.HttpSolrClient.executeMethod(HttpSolrClient.java:548)
	... 49 more


FAILED:  org.apache.solr.update.PeerSyncTest.test

Error Message:
Unexpected exception type, expected SolrException but got org.apache.solr.client.solrj.SolrServerException: Timeout occurred while waiting response from server at: http://127.0.0.1:51084/collection1

Stack Trace:
junit.framework.AssertionFailedError: Unexpected exception type, expected SolrException but got org.apache.solr.client.solrj.SolrServerException: Timeout occurred while waiting response from server at: http://127.0.0.1:51084/collection1
	at __randomizedtesting.SeedInfo.seed([BE1524C066D29295:36411B1AC82EFF6D]:0)
	at org.apache.lucene.util.LuceneTestCase.expectThrows(LuceneTestCase.java:2700)
	at org.apache.lucene.util.LuceneTestCase.expectThrows(LuceneTestCase.java:2689)
	at org.apache.solr.update.PeerSyncTest.test(PeerSyncTest.java:279)
	at java.base/jdk.internal.reflect.NativeMethodAccessorImpl.invoke0(Native Method)
	at java.base/jdk.internal.reflect.NativeMethodAccessorImpl.invoke(NativeMethodAccessorImpl.java:62)
	at java.base/jdk.internal.reflect.DelegatingMethodAccessorImpl.invoke(DelegatingMethodAccessorImpl.java:43)
	at java.base/java.lang.reflect.Method.invoke(Method.java:567)
	at com.carrotsearch.randomizedtesting.RandomizedRunner.invoke(RandomizedRunner.java:1750)
	at com.carrotsearch.randomizedtesting.RandomizedRunner$8.evaluate(RandomizedRunner.java:938)
	at com.carrotsearch.randomizedtesting.RandomizedRunner$9.evaluate(RandomizedRunner.java:974)
	at com.carrotsearch.randomizedtesting.RandomizedRunner$10.evaluate(RandomizedRunner.java:988)
	at org.apache.solr.BaseDistributedSearchTestCase$ShardsRepeatRule$ShardsFixedStatement.callStatement(BaseDistributedSearchTestCase.java:1082)
	at org.apache.solr.BaseDistributedSearchTestCase$ShardsRepeatRule$ShardsStatement.evaluate(BaseDistributedSearchTestCase.java:1054)
	at com.carrotsearch.randomizedtesting.rules.SystemPropertiesRestoreRule$1.evaluate(SystemPropertiesRestoreRule.java:57)
	at org.apache.lucene.util.TestRuleSetupTeardownChained$1.evaluate(TestRuleSetupTeardownChained.java:49)
	at org.apache.lucene.util.AbstractBeforeAfterRule$1.evaluate(AbstractBeforeAfterRule.java:45)
	at org.apache.lucene.util.TestRuleThreadAndTestName$1.evaluate(TestRuleThreadAndTestName.java:48)
	at org.apache.lucene.util.TestRuleIgnoreAfterMaxFailures$1.evaluate(TestRuleIgnoreAfterMaxFailures.java:64)
	at org.apache.lucene.util.TestRuleMarkFailure$1.evaluate(TestRuleMarkFailure.java:47)
	at com.carrotsearch.randomizedtesting.rules.StatementAdapter.evaluate(StatementAdapter.java:36)
	at com.carrotsearch.randomizedtesting.ThreadLeakControl$StatementRunner.run(ThreadLeakControl.java:368)
	at com.carrotsearch.randomizedtesting.ThreadLeakControl.forkTimeoutingTask(ThreadLeakControl.java:817)
	at com.carrotsearch.randomizedtesting.ThreadLeakControl$3.evaluate(ThreadLeakControl.java:468)
	at com.carrotsearch.randomizedtesting.RandomizedRunner.runSingleTest(RandomizedRunner.java:947)
	at com.carrotsearch.randomizedtesting.RandomizedRunner$5.evaluate(RandomizedRunner.java:832)
	at com.carrotsearch.randomizedtesting.RandomizedRunner$6.evaluate(RandomizedRunner.java:883)
	at com.carrotsearch.randomizedtesting.RandomizedRunner$7.evaluate(RandomizedRunner.java:894)
	at com.carrotsearch.randomizedtesting.rules.StatementAdapter.evaluate(StatementAdapter.java:36)
	at com.carrotsearch.randomizedtesting.rules.SystemPropertiesRestoreRule$1.evaluate(SystemPropertiesRestoreRule.java:57)
	at org.apache.lucene.util.AbstractBeforeAfterRule$1.evaluate(AbstractBeforeAfterRule.java:45)
	at com.carrotsearch.randomizedtesting.rules.StatementAdapter.evaluate(StatementAdapter.java:36)
	at org.apache.lucene.util.TestRuleStoreClassName$1.evaluate(TestRuleStoreClassName.java:41)
	at com.carrotsearch.randomizedtesting.rules.NoShadowingOrOverridesOnMethodsRule$1.evaluate(NoShadowingOrOverridesOnMethodsRule.java:40)
	at com.carrotsearch.randomizedtesting.rules.NoShadowingOrOverridesOnMethodsRule$1.evaluate(NoShadowingOrOverridesOnMethodsRule.java:40)
	at com.carrotsearch.randomizedtesting.rules.StatementAdapter.evaluate(StatementAdapter.java:36)
	at com.carrotsearch.randomizedtesting.rules.StatementAdapter.evaluate(StatementAdapter.java:36)
	at org.apache.lucene.util.TestRuleAssertionsRequired$1.evaluate(TestRuleAssertionsRequired.java:53)
	at org.apache.lucene.util.TestRuleMarkFailure$1.evaluate(TestRuleMarkFailure.java:47)
	at org.apache.lucene.util.TestRuleIgnoreAfterMaxFailures$1.evaluate(TestRuleIgnoreAfterMaxFailures.java:64)
	at org.apache.lucene.util.TestRuleIgnoreTestSuites$1.evaluate(TestRuleIgnoreTestSuites.java:54)
	at com.carrotsearch.randomizedtesting.rules.StatementAdapter.evaluate(StatementAdapter.java:36)
	at com.carrotsearch.randomizedtesting.ThreadLeakControl$StatementRunner.run(ThreadLeakControl.java:368)
	at java.base/java.lang.Thread.run(Thread.java:835)
Caused by: org.apache.solr.client.solrj.SolrServerException: Timeout occurred while waiting response from server at: http://127.0.0.1:51084/collection1
	at org.apache.solr.client.solrj.impl.HttpSolrClient.executeMethod(HttpSolrClient.java:660)
	at org.apache.solr.client.solrj.impl.HttpSolrClient.request(HttpSolrClient.java:255)
	at org.apache.solr.client.solrj.impl.HttpSolrClient.request(HttpSolrClient.java:244)
	at org.apache.solr.client.solrj.SolrRequest.process(SolrRequest.java:207)
	at org.apache.solr.client.solrj.SolrRequest.process(SolrRequest.java:224)
	at org.apache.solr.BaseDistributedSearchTestCase.add(BaseDistributedSearchTestCase.java:576)
	at org.apache.solr.update.PeerSyncTest.lambda$test$0(PeerSyncTest.java:281)
	at org.apache.lucene.util.LuceneTestCase.expectThrows(LuceneTestCase.java:2695)
	... 42 more
Caused by: java.net.SocketTimeoutException: Read timed out
	at java.base/java.net.SocketInputStream.socketRead0(Native Method)
	at java.base/java.net.SocketInputStream.socketRead(SocketInputStream.java:115)
	at java.base/java.net.SocketInputStream.read(SocketInputStream.java:168)
	at java.base/java.net.SocketInputStream.read(SocketInputStream.java:140)
	at java.base/java.net.Socket$SocketInputStream.read(Socket.java:972)
	at org.apache.http.impl.io.SessionInputBufferImpl.streamRead(SessionInputBufferImpl.java:137)
	at org.apache.http.impl.io.SessionInputBufferImpl.fillBuffer(SessionInputBufferImpl.java:153)
	at org.apache.http.impl.io.SessionInputBufferImpl.readLine(SessionInputBufferImpl.java:282)
	at org.apache.http.impl.conn.DefaultHttpResponseParser.parseHead(DefaultHttpResponseParser.java:138)
	at org.apache.http.impl.conn.DefaultHttpResponseParser.parseHead(DefaultHttpResponseParser.java:56)
	at org.apache.http.impl.io.AbstractMessageParser.parse(AbstractMessageParser.java:259)
	at org.apache.http.impl.DefaultBHttpClientConnection.receiveResponseHeader(DefaultBHttpClientConnection.java:163)
	at org.apache.http.impl.conn.CPoolProxy.receiveResponseHeader(CPoolProxy.java:165)
	at org.apache.http.protocol.HttpRequestExecutor.doReceiveResponse(HttpRequestExecutor.java:273)
	at org.apache.http.protocol.HttpRequestExecutor.execute(HttpRequestExecutor.java:125)
	at org.apache.http.impl.execchain.MainClientExec.execute(MainClientExec.java:272)
	at org.apache.http.impl.execchain.ProtocolExec.execute(ProtocolExec.java:185)
	at org.apache.http.impl.execchain.RetryExec.execute(RetryExec.java:89)
	at org.apache.http.impl.execchain.RedirectExec.execute(RedirectExec.java:110)
	at org.apache.http.impl.client.InternalHttpClient.doExecute(InternalHttpClient.java:185)
	at org.apache.http.impl.client.CloseableHttpClient.execute(CloseableHttpClient.java:83)
	at org.apache.http.impl.client.CloseableHttpClient.execute(CloseableHttpClient.java:56)
	at org.apache.solr.client.solrj.impl.HttpSolrClient.executeMethod(HttpSolrClient.java:548)
	... 49 more




Build Log:
[...truncated 13949 lines...]
   [junit4] Suite: org.apache.solr.update.PeerSyncTest
   [junit4]   2> Creating dataDir: C:\Users\jenkins\workspace\Lucene-Solr-8.x-Windows\solr\build\solr-core\test\J0\temp\solr.update.PeerSyncTest_BE1524C066D29295-001\init-core-data-001
   [junit4]   2> 1073407 WARN  (SUITE-PeerSyncTest-seed#[BE1524C066D29295]-worker) [    ] o.a.s.SolrTestCaseJ4 startTrackingSearchers: numOpens=16 numCloses=16
   [junit4]   2> 1073407 INFO  (SUITE-PeerSyncTest-seed#[BE1524C066D29295]-worker) [    ] o.a.s.SolrTestCaseJ4 Using PointFields (NUMERIC_POINTS_SYSPROP=true) w/NUMERIC_DOCVALUES_SYSPROP=false
   [junit4]   2> 1073409 INFO  (SUITE-PeerSyncTest-seed#[BE1524C066D29295]-worker) [    ] o.a.s.SolrTestCaseJ4 Randomized ssl (false) and clientAuth (false) via: @org.apache.solr.SolrTestCaseJ4$SuppressSSL(bugUrl="https://issues.apache.org/jira/browse/SOLR-5776")
   [junit4]   2> 1073409 INFO  (SUITE-PeerSyncTest-seed#[BE1524C066D29295]-worker) [    ] o.a.s.SolrTestCaseJ4 SecureRandom sanity checks: test.solr.allowed.securerandom=null & java.security.egd=file:/dev/./urandom
   [junit4]   2> 1073409 INFO  (SUITE-PeerSyncTest-seed#[BE1524C066D29295]-worker) [    ] o.a.s.BaseDistributedSearchTestCase Setting hostContext system property: /
   [junit4]   2> 1073410 INFO  (TEST-PeerSyncTest.test-seed#[BE1524C066D29295]) [    ] o.a.s.SolrTestCaseJ4 ####initCore
   [junit4]   2> 1073410 INFO  (TEST-PeerSyncTest.test-seed#[BE1524C066D29295]) [    ] o.a.s.c.SolrResourceLoader [null] Added 2 libs to classloader, from paths: [/C:/Users/jenkins/workspace/Lucene-Solr-8.x-Windows/solr/core/src/test-files/solr/collection1/lib, /C:/Users/jenkins/workspace/Lucene-Solr-8.x-Windows/solr/core/src/test-files/solr/collection1/lib/classes]
   [junit4]   2> 1073428 INFO  (TEST-PeerSyncTest.test-seed#[BE1524C066D29295]) [    ] o.a.s.c.SolrConfig Using Lucene MatchVersion: 8.2.0
   [junit4]   2> 1073444 INFO  (TEST-PeerSyncTest.test-seed#[BE1524C066D29295]) [    ] o.a.s.s.IndexSchema [null] Schema name=test
   [junit4]   2> 1073521 INFO  (TEST-PeerSyncTest.test-seed#[BE1524C066D29295]) [    ] o.a.s.s.IndexSchema Loaded schema test/1.0 with uniqueid field id
   [junit4]   2> 1073585 INFO  (TEST-PeerSyncTest.test-seed#[BE1524C066D29295]) [    ] o.a.s.h.c.HttpShardHandlerFactory Host whitelist initialized: WhitelistHostChecker [whitelistHosts=null, whitelistHostCheckingEnabled=false]
   [junit4]   2> 1073589 WARN  (TEST-PeerSyncTest.test-seed#[BE1524C066D29295]) [    ] o.e.j.u.s.S.config No Client EndPointIdentificationAlgorithm configured for SslContextFactory@64afb738[provider=null,keyStore=null,trustStore=null]
   [junit4]   2> 1073593 WARN  (TEST-PeerSyncTest.test-seed#[BE1524C066D29295]) [    ] o.e.j.u.s.S.config No Client EndPointIdentificationAlgorithm configured for SslContextFactory@35abc38c[provider=null,keyStore=null,trustStore=null]
   [junit4]   2> 1073615 INFO  (TEST-PeerSyncTest.test-seed#[BE1524C066D29295]) [    ] o.a.s.c.TransientSolrCoreCacheDefault Allocating transient cache for 2147483647 transient cores
   [junit4]   2> 1073615 INFO  (TEST-PeerSyncTest.test-seed#[BE1524C066D29295]) [    ] o.a.s.h.a.MetricsHistoryHandler No .system collection, keeping metrics history in memory.
   [junit4]   2> 1073631 INFO  (TEST-PeerSyncTest.test-seed#[BE1524C066D29295]) [    ] o.a.s.m.r.SolrJmxReporter JMX monitoring for 'solr.node' (registry 'solr.node') enabled at server: com.sun.jmx.mbeanserver.JmxMBeanServer@23caba9f
   [junit4]   2> 1073637 INFO  (TEST-PeerSyncTest.test-seed#[BE1524C066D29295]) [    ] o.a.s.m.r.SolrJmxReporter JMX monitoring for 'solr.jvm' (registry 'solr.jvm') enabled at server: com.sun.jmx.mbeanserver.JmxMBeanServer@23caba9f
   [junit4]   2> 1073637 INFO  (TEST-PeerSyncTest.test-seed#[BE1524C066D29295]) [    ] o.a.s.m.r.SolrJmxReporter JMX monitoring for 'solr.jetty' (registry 'solr.jetty') enabled at server: com.sun.jmx.mbeanserver.JmxMBeanServer@23caba9f
   [junit4]   2> 1073640 INFO  (coreLoadExecutor-6185-thread-1) [    x:collection1] o.a.s.c.SolrResourceLoader [null] Added 2 libs to classloader, from paths: [/C:/Users/jenkins/workspace/Lucene-Solr-8.x-Windows/solr/core/src/test-files/solr/collection1/lib, /C:/Users/jenkins/workspace/Lucene-Solr-8.x-Windows/solr/core/src/test-files/solr/collection1/lib/classes]
   [junit4]   2> 1073661 INFO  (coreLoadExecutor-6185-thread-1) [    x:collection1] o.a.s.c.SolrConfig Using Lucene MatchVersion: 8.2.0
   [junit4]   2> 1073680 INFO  (coreLoadExecutor-6185-thread-1) [    x:collection1] o.a.s.s.IndexSchema [collection1] Schema name=test
   [junit4]   2> 1073757 INFO  (coreLoadExecutor-6185-thread-1) [    x:collection1] o.a.s.s.IndexSchema Loaded schema test/1.0 with uniqueid field id
   [junit4]   2> 1073770 INFO  (coreLoadExecutor-6185-thread-1) [    x:collection1] o.a.s.c.CoreContainer Creating SolrCore 'collection1' using configuration from instancedir C:\Users\jenkins\workspace\Lucene-Solr-8.x-Windows\solr\core\src\test-files\solr\collection1, trusted=true
   [junit4]   2> 1073770 INFO  (coreLoadExecutor-6185-thread-1) [    x:collection1] o.a.s.m.r.SolrJmxReporter JMX monitoring for 'solr.core.collection1' (registry 'solr.core.collection1') enabled at server: com.sun.jmx.mbeanserver.JmxMBeanServer@23caba9f
   [junit4]   2> 1073770 INFO  (coreLoadExecutor-6185-thread-1) [    x:collection1] o.a.s.c.SolrCore [[collection1] ] Opening new SolrCore at [C:\Users\jenkins\workspace\Lucene-Solr-8.x-Windows\solr\core\src\test-files\solr\collection1], dataDir=[C:\Users\jenkins\workspace\Lucene-Solr-8.x-Windows\solr\build\solr-core\test\J0\temp\solr.update.PeerSyncTest_BE1524C066D29295-001\init-core-data-001\]
   [junit4]   2> 1073770 INFO  (coreLoadExecutor-6185-thread-1) [    x:collection1] o.a.s.u.RandomMergePolicy RandomMergePolicy wrapping class org.apache.lucene.index.TieredMergePolicy: [TieredMergePolicy: maxMergeAtOnce=29, maxMergeAtOnceExplicit=28, maxMergedSegmentMB=96.74609375, floorSegmentMB=1.3818359375, forceMergeDeletesPctAllowed=26.2170774837334, segmentsPerTier=49.0, maxCFSSegmentSizeMB=8.796093022207999E12, noCFSRatio=0.2042441906187519, deletesPctAllowed=20.032875142576426
   [junit4]   2> 1073772 WARN  (coreLoadExecutor-6185-thread-1) [    x:collection1] o.a.s.c.RequestHandlers INVALID paramSet a in requestHandler {type = requestHandler,name = /dump,class = DumpRequestHandler,attributes = {initParams=a, name=/dump, class=DumpRequestHandler},args = {defaults={a=A,b=B}}}
   [junit4]   2> 1073827 INFO  (coreLoadExecutor-6185-thread-1) [    x:collection1] o.a.s.u.UpdateHandler Using UpdateLog implementation: org.apache.solr.update.UpdateLog
   [junit4]   2> 1073827 INFO  (coreLoadExecutor-6185-thread-1) [    x:collection1] o.a.s.u.UpdateLog Initializing UpdateLog: dataDir= defaultSyncLevel=FLUSH numRecordsToKeep=100 maxNumLogsToKeep=10 numVersionBuckets=65536
   [junit4]   2> 1073827 INFO  (coreLoadExecutor-6185-thread-1) [    x:collection1] o.a.s.u.CommitTracker Hard AutoCommit: disabled
   [junit4]   2> 1073827 INFO  (coreLoadExecutor-6185-thread-1) [    x:collection1] o.a.s.u.CommitTracker Soft AutoCommit: disabled
   [junit4]   2> 1073830 INFO  (coreLoadExecutor-6185-thread-1) [    x:collection1] o.a.s.u.RandomMergePolicy RandomMergePolicy wrapping class org.apache.lucene.index.TieredMergePolicy: [TieredMergePolicy: maxMergeAtOnce=31, maxMergeAtOnceExplicit=43, maxMergedSegmentMB=49.490234375, floorSegmentMB=0.8779296875, forceMergeDeletesPctAllowed=15.332129890048597, segmentsPerTier=42.0, maxCFSSegmentSizeMB=8.796093022207999E12, noCFSRatio=0.8800935484127915, deletesPctAllowed=39.285389382364116
   [junit4]   2> 1073830 INFO  (coreLoadExecutor-6185-thread-1) [    x:collection1] o.a.s.s.SolrIndexSearcher Opening [Searcher@59440d9d[collection1] main]
   [junit4]   2> 1073830 WARN  (coreLoadExecutor-6185-thread-1) [    x:collection1] o.a.s.r.ManagedResourceStorage Cannot write to config directory C:\Users\jenkins\workspace\Lucene-Solr-8.x-Windows\solr\core\src\test-files\solr\collection1\conf; switching to use InMemory storage instead.
   [junit4]   2> 1073831 INFO  (coreLoadExecutor-6185-thread-1) [    x:collection1] o.a.s.h.ReplicationHandler Commits will be reserved for 10000ms.
   [junit4]   2> 1073831 INFO  (coreLoadExecutor-6185-thread-1) [    x:collection1] o.a.s.u.UpdateLog Could not find max version in index or recent updates, using new clock 1632394601115418624
   [junit4]   2> 1073832 INFO  (searcherExecutor-6186-thread-1-processing-x:collection1) [    x:collection1] o.a.s.c.SolrCore [collection1] Registered new searcher Searcher@59440d9d[collection1] main{ExitableDirectoryReader(UninvertingDirectoryReader())}
   [junit4]   2> 1073834 INFO  (TEST-PeerSyncTest.test-seed#[BE1524C066D29295]) [    ] o.a.s.SolrTestCaseJ4 ####initCore end
   [junit4]   2> 1074199 INFO  (TEST-PeerSyncTest.test-seed#[BE1524C066D29295]) [    ] o.a.s.SolrTestCaseJ4 Writing core.properties file to C:\Users\jenkins\workspace\Lucene-Solr-8.x-Windows\solr\build\solr-core\test\J0\temp\solr.update.PeerSyncTest_BE1524C066D29295-001\tempDir-001\control\cores\collection1
   [junit4]   2> 1074200 WARN  (TEST-PeerSyncTest.test-seed#[BE1524C066D29295]) [    ] o.e.j.s.AbstractConnector Ignoring deprecated socket close linger time
   [junit4]   2> 1074201 INFO  (TEST-PeerSyncTest.test-seed#[BE1524C066D29295]) [    ] o.a.s.c.s.e.JettySolrRunner Start Jetty (original configured port=0)
   [junit4]   2> 1074201 INFO  (TEST-PeerSyncTest.test-seed#[BE1524C066D29295]) [    ] o.a.s.c.s.e.JettySolrRunner Trying to start Jetty on port 0 try number 1 ...
   [junit4]   2> 1074201 INFO  (TEST-PeerSyncTest.test-seed#[BE1524C066D29295]) [    ] o.e.j.s.Server jetty-9.4.14.v20181114; built: 2018-11-14T21:20:31.478Z; git: c4550056e785fb5665914545889f21dc136ad9e6; jvm 13-ea+18
   [junit4]   2> 1074201 INFO  (TEST-PeerSyncTest.test-seed#[BE1524C066D29295]) [    ] o.e.j.s.session DefaultSessionIdManager workerName=node0
   [junit4]   2> 1074201 INFO  (TEST-PeerSyncTest.test-seed#[BE1524C066D29295]) [    ] o.e.j.s.session No SessionScavenger set, using defaults
   [junit4]   2> 1074201 INFO  (TEST-PeerSyncTest.test-seed#[BE1524C066D29295]) [    ] o.e.j.s.session node0 Scavenging every 660000ms
   [junit4]   2> 1074202 INFO  (TEST-PeerSyncTest.test-seed#[BE1524C066D29295]) [    ] o.e.j.s.h.ContextHandler Started o.e.j.s.ServletContextHandler@3c9c96ab{/,null,AVAILABLE}
   [junit4]   2> 1074202 INFO  (TEST-PeerSyncTest.test-seed#[BE1524C066D29295]) [    ] o.e.j.s.AbstractConnector Started ServerConnector@4419e74c{HTTP/1.1,[http/1.1, h2c]}{127.0.0.1:51077}
   [junit4]   2> 1074202 INFO  (TEST-PeerSyncTest.test-seed#[BE1524C066D29295]) [    ] o.e.j.s.Server Started @1074235ms
   [junit4]   2> 1074202 INFO  (TEST-PeerSyncTest.test-seed#[BE1524C066D29295]) [    ] o.a.s.c.s.e.JettySolrRunner Jetty properties: {schema=schema.xml, hostContext=/, solrconfig=solrconfig-tlog.xml, hostPort=51077, coreRootDirectory=C:\Users\jenkins\workspace\Lucene-Solr-8.x-Windows\solr\build\solr-core\test\J0\temp\solr.update.PeerSyncTest_BE1524C066D29295-001\tempDir-001\control\cores}
   [junit4]   2> 1074203 ERROR (TEST-PeerSyncTest.test-seed#[BE1524C066D29295]) [    ] o.a.s.u.StartupLoggingUtils Missing Java Option solr.log.dir. Logging may be missing or incomplete.
   [junit4]   2> 1074203 INFO  (TEST-PeerSyncTest.test-seed#[BE1524C066D29295]) [    ] o.a.s.s.SolrDispatchFilter Using logger factory org.apache.logging.slf4j.Log4jLoggerFactory
   [junit4]   2> 1074203 INFO  (TEST-PeerSyncTest.test-seed#[BE1524C066D29295]) [    ] o.a.s.s.SolrDispatchFilter  ___      _       Welcome to Apache Solr? version 8.2.0
   [junit4]   2> 1074203 INFO  (TEST-PeerSyncTest.test-seed#[BE1524C066D29295]) [    ] o.a.s.s.SolrDispatchFilter / __| ___| |_ _   Starting in standalone mode on port null
   [junit4]   2> 1074203 INFO  (TEST-PeerSyncTest.test-seed#[BE1524C066D29295]) [    ] o.a.s.s.SolrDispatchFilter \__ \/ _ \ | '_|  Install dir: null
   [junit4]   2> 1074203 INFO  (TEST-PeerSyncTest.test-seed#[BE1524C066D29295]) [    ] o.a.s.s.SolrDispatchFilter |___/\___/_|_|    Start time: 2019-05-02T04:53:25.696811100Z
   [junit4]   2> 1074203 INFO  (TEST-PeerSyncTest.test-seed#[BE1524C066D29295]) [    ] o.a.s.c.SolrXmlConfig Loading container configuration from C:\Users\jenkins\workspace\Lucene-Solr-8.x-Windows\solr\build\solr-core\test\J0\temp\solr.update.PeerSyncTest_BE1524C066D29295-001\tempDir-001\control\solr.xml
   [junit4]   2> 1074206 INFO  (TEST-PeerSyncTest.test-seed#[BE1524C066D29295]) [    ] o.a.s.c.SolrXmlConfig Configuration parameter autoReplicaFailoverWorkLoopDelay is ignored
   [junit4]   2> 1074206 INFO  (TEST-PeerSyncTest.test-seed#[BE1524C066D29295]) [    ] o.a.s.c.SolrXmlConfig Configuration parameter autoReplicaFailoverBadNodeExpiration is ignored
   [junit4]   2> 1074208 INFO  (TEST-PeerSyncTest.test-seed#[BE1524C066D29295]) [    ] o.a.s.c.SolrXmlConfig MBean server found: com.sun.jmx.mbeanserver.JmxMBeanServer@23caba9f, but no JMX reporters were configured - adding default JMX reporter.
   [junit4]   2> 1074351 INFO  (TEST-PeerSyncTest.test-seed#[BE1524C066D29295]) [    ] o.a.s.h.c.HttpShardHandlerFactory Host whitelist initialized: WhitelistHostChecker [whitelistHosts=null, whitelistHostCheckingEnabled=false]
   [junit4]   2> 1074352 WARN  (TEST-PeerSyncTest.test-seed#[BE1524C066D29295]) [    ] o.e.j.u.s.S.config No Client EndPointIdentificationAlgorithm configured for SslContextFactory@4c50399e[provider=null,keyStore=null,trustStore=null]
   [junit4]   2> 1074356 WARN  (TEST-PeerSyncTest.test-seed#[BE1524C066D29295]) [    ] o.e.j.u.s.S.config No Client EndPointIdentificationAlgorithm configured for SslContextFactory@1d235901[provider=null,keyStore=null,trustStore=null]
   [junit4]   2> 1074380 INFO  (TEST-PeerSyncTest.test-seed#[BE1524C066D29295]) [    ] o.a.s.c.TransientSolrCoreCacheDefault Allocating transient cache for 4 transient cores
   [junit4]   2> 1074380 INFO  (TEST-PeerSyncTest.test-seed#[BE1524C066D29295]) [    ] o.a.s.h.a.MetricsHistoryHandler No .system collection, keeping metrics history in memory.
   [junit4]   2> 1074399 INFO  (TEST-PeerSyncTest.test-seed#[BE1524C066D29295]) [    ] o.a.s.m.r.SolrJmxReporter JMX monitoring for 'solr.node' (registry 'solr.node') enabled at server: com.sun.jmx.mbeanserver.JmxMBeanServer@23caba9f
   [junit4]   2> 1074403 INFO  (TEST-PeerSyncTest.test-seed#[BE1524C066D29295]) [    ] o.a.s.m.r.SolrJmxReporter JMX monitoring for 'solr.jvm' (registry 'solr.jvm') enabled at server: com.sun.jmx.mbeanserver.JmxMBeanServer@23caba9f
   [junit4]   2> 1074403 INFO  (TEST-PeerSyncTest.test-seed#[BE1524C066D29295]) [    ] o.a.s.m.r.SolrJmxReporter JMX monitoring for 'solr.jetty' (registry 'solr.jetty') enabled at server: com.sun.jmx.mbeanserver.JmxMBeanServer@23caba9f
   [junit4]   2> 1074408 INFO  (TEST-PeerSyncTest.test-seed#[BE1524C066D29295]) [    ] o.a.s.c.CorePropertiesLocator Found 1 core definitions underneath C:\Users\jenkins\workspace\Lucene-Solr-8.x-Windows\solr\build\solr-core\test\J0\temp\solr.update.PeerSyncTest_BE1524C066D29295-001\tempDir-001\control\cores
   [junit4]   2> 1074408 INFO  (TEST-PeerSyncTest.test-seed#[BE1524C066D29295]) [    ] o.a.s.c.CorePropertiesLocator Cores are: [collection1]
   [junit4]   2> 1074415 INFO  (coreLoadExecutor-6199-thread-1) [    x:collection1] o.a.s.c.SolrResourceLoader [null] Added 2 libs to classloader, from paths: [/C:/Users/jenkins/workspace/Lucene-Solr-8.x-Windows/solr/core/src/test-files/solr/collection1/lib, /C:/Users/jenkins/workspace/Lucene-Solr-8.x-Windows/solr/core/src/test-files/solr/collection1/lib/classes]
   [junit4]   2> 1074434 INFO  (coreLoadExecutor-6199-thread-1) [    x:collection1] o.a.s.c.SolrConfig Using Lucene MatchVersion: 8.2.0
   [junit4]   2> 1074446 INFO  (coreLoadExecutor-6199-thread-1) [    x:collection1] o.a.s.s.IndexSchema [collection1] Schema name=test
   [junit4]   2> 1074523 INFO  (coreLoadExecutor-6199-thread-1) [    x:collection1] o.a.s.s.IndexSchema Loaded schema test/1.0 with uniqueid field id
   [junit4]   2> 1074534 INFO  (coreLoadExecutor-6199-thread-1) [    x:collection1] o.a.s.c.CoreContainer Creating SolrCore 'collection1' using configuration from configset C:\Users\jenkins\workspace\Lucene-Solr-8.x-Windows\solr\core\src\test-files\solr\collection1, trusted=true
   [junit4]   2> 1074534 INFO  (coreLoadExecutor-6199-thread-1) [    x:collection1] o.a.s.m.r.SolrJmxReporter JMX monitoring for 'solr.core.collection1' (registry 'solr.core.collection1') enabled at server: com.sun.jmx.mbeanserver.JmxMBeanServer@23caba9f
   [junit4]   2> 1074534 INFO  (coreLoadExecutor-6199-thread-1) [    x:collection1] o.a.s.c.SolrCore [[collection1] ] Opening new SolrCore at [C:\Users\jenkins\workspace\Lucene-Solr-8.x-Windows\solr\core\src\test-files\solr\collection1], dataDir=[C:\Users\jenkins\workspace\Lucene-Solr-8.x-Windows\solr\build\solr-core\test\J0\temp\solr.update.PeerSyncTest_BE1524C066D29295-001\tempDir-001\control\cores\collection1\data\]
   [junit4]   2> 1074536 INFO  (coreLoadExecutor-6199-thread-1) [    x:collection1] o.a.s.u.RandomMergePolicy RandomMergePolicy wrapping class org.apache.lucene.index.TieredMergePolicy: [TieredMergePolicy: maxMergeAtOnce=29, maxMergeAtOnceExplicit=28, maxMergedSegmentMB=96.74609375, floorSegmentMB=1.3818359375, forceMergeDeletesPctAllowed=26.2170774837334, segmentsPerTier=49.0, maxCFSSegmentSizeMB=8.796093022207999E12, noCFSRatio=0.2042441906187519, deletesPctAllowed=20.032875142576426
   [junit4]   2> 1074536 WARN  (coreLoadExecutor-6199-thread-1) [    x:collection1] o.a.s.c.RequestHandlers INVALID paramSet a in requestHandler {type = requestHandler,name = /dump,class = DumpRequestHandler,attributes = {initParams=a, name=/dump, class=DumpRequestHandler},args = {defaults={a=A,b=B}}}
   [junit4]   2> 1074592 INFO  (coreLoadExecutor-6199-thread-1) [    x:collection1] o.a.s.u.UpdateHandler Using UpdateLog implementation: org.apache.solr.update.UpdateLog
   [junit4]   2> 1074592 INFO  (coreLoadExecutor-6199-thread-1) [    x:collection1] o.a.s.u.UpdateLog Initializing UpdateLog: dataDir= defaultSyncLevel=FLUSH numRecordsToKeep=100 maxNumLogsToKeep=10 numVersionBuckets=65536
   [junit4]   2> 1074593 INFO  (coreLoadExecutor-6199-thread-1) [    x:collection1] o.a.s.u.CommitTracker Hard AutoCommit: disabled
   [junit4]   2> 1074593 INFO  (coreLoadExecutor-6199-thread-1) [    x:collection1] o.a.s.u.CommitTracker Soft AutoCommit: disabled
   [junit4]   2> 1074594 INFO  (coreLoadExecutor-6199-thread-1) [    x:collection1] o.a.s.u.RandomMergePolicy RandomMergePolicy wrapping class org.apache.lucene.index.TieredMergePolicy: [TieredMergePolicy: maxMergeAtOnce=31, maxMergeAtOnceExplicit=43, maxMergedSegmentMB=49.490234375, floorSegmentMB=0.8779296875, forceMergeDeletesPctAllowed=15.332129890048597, segmentsPerTier=42.0, maxCFSSegmentSizeMB=8.796093022207999E12, noCFSRatio=0.8800935484127915, deletesPctAllowed=39.285389382364116
   [junit4]   2> 1074594 INFO  (coreLoadExecutor-6199-thread-1) [    x:collection1] o.a.s.s.SolrIndexSearcher Opening [Searcher@1d362d6b[collection1] main]
   [junit4]   2> 1074594 WARN  (coreLoadExecutor-6199-thread-1) [    x:collection1] o.a.s.r.ManagedResourceStorage Cannot write to config directory C:\Users\jenkins\workspace\Lucene-Solr-8.x-Windows\solr\core\src\test-files\solr\collection1\conf; switching to use InMemory storage instead.
   [junit4]   2> 1074594 INFO  (coreLoadExecutor-6199-thread-1) [    x:collection1] o.a.s.h.ReplicationHandler Commits will be reserved for 10000ms.
   [junit4]   2> 1074595 INFO  (coreLoadExecutor-6199-thread-1) [    x:collection1] o.a.s.u.UpdateLog Could not find max version in index or recent updates, using new clock 1632394601916530688
   [junit4]   2> 1074596 INFO  (searcherExecutor-6200-thread-1-processing-x:collection1) [    x:collection1] o.a.s.c.SolrCore [collection1] Registered new searcher Searcher@1d362d6b[collection1] main{ExitableDirectoryReader(UninvertingDirectoryReader())}
   [junit4]   2> 1074950 INFO  (TEST-PeerSyncTest.test-seed#[BE1524C066D29295]) [    ] o.a.s.SolrTestCaseJ4 Writing core.properties file to C:\Users\jenkins\workspace\Lucene-Solr-8.x-Windows\solr\build\solr-core\test\J0\temp\solr.update.PeerSyncTest_BE1524C066D29295-001\tempDir-001\shard0\cores\collection1
   [junit4]   2> 1074951 WARN  (TEST-PeerSyncTest.test-seed#[BE1524C066D29295]) [    ] o.e.j.s.AbstractConnector Ignoring deprecated socket close linger time
   [junit4]   2> 1074951 INFO  (TEST-PeerSyncTest.test-seed#[BE1524C066D29295]) [    ] o.a.s.c.s.e.JettySolrRunner Start Jetty (original configured port=0)
   [junit4]   2> 1074951 INFO  (TEST-PeerSyncTest.test-seed#[BE1524C066D29295]) [    ] o.a.s.c.s.e.JettySolrRunner Trying to start Jetty on port 0 try number 1 ...
   [junit4]   2> 1074951 INFO  (TEST-PeerSyncTest.test-seed#[BE1524C066D29295]) [    ] o.e.j.s.Server jetty-9.4.14.v20181114; built: 2018-11-14T21:20:31.478Z; git: c4550056e785fb5665914545889f21dc136ad9e6; jvm 13-ea+18
   [junit4]   2> 1074952 INFO  (TEST-PeerSyncTest.test-seed#[BE1524C066D29295]) [    ] o.e.j.s.session DefaultSessionIdManager workerName=node0
   [junit4]   2> 1074952 INFO  (TEST-PeerSyncTest.test-seed#[BE1524C066D29295]) [    ] o.e.j.s.session No SessionScavenger set, using defaults
   [junit4]   2> 1074952 INFO  (TEST-PeerSyncTest.test-seed#[BE1524C066D29295]) [    ] o.e.j.s.session node0 Scavenging every 600000ms
   [junit4]   2> 1074952 INFO  (TEST-PeerSyncTest.test-seed#[BE1524C066D29295]) [    ] o.e.j.s.h.ContextHandler Started o.e.j.s.ServletContextHandler@46880ccd{/,null,AVAILABLE}
   [junit4]   2> 1074953 INFO  (TEST-PeerSyncTest.test-seed#[BE1524C066D29295]) [    ] o.e.j.s.AbstractConnector Started ServerConnector@64d102fe{HTTP/1.1,[http/1.1, h2c]}{127.0.0.1:51084}
   [junit4]   2> 1074953 INFO  (TEST-PeerSyncTest.test-seed#[BE1524C066D29295]) [    ] o.e.j.s.Server Started @1074986ms
   [junit4]   2> 1074953 INFO  (TEST-PeerSyncTest.test-seed#[BE1524C066D29295]) [    ] o.a.s.c.s.e.JettySolrRunner Jetty properties: {schema=schema.xml, hostContext=/, solrconfig=solrconfig-tlog.xml, hostPort=51084, coreRootDirectory=C:\Users\jenkins\workspace\Lucene-Solr-8.x-Windows\solr\build\solr-core\test\J0\temp\solr.update.PeerSyncTest_BE1524C066D29295-001\tempDir-001\shard0\cores}
   [junit4]   2> 1074953 ERROR (TEST-PeerSyncTest.test-seed#[BE1524C066D29295]) [    ] o.a.s.u.StartupLoggingUtils Missing Java Option solr.log.dir. Logging may be missing or incomplete.
   [junit4]   2> 1074953 INFO  (TEST-PeerSyncTest.test-seed#[BE1524C066D29295]) [    ] o.a.s.s.SolrDispatchFilter Using logger factory org.apache.logging.slf4j.Log4jLoggerFactory
   [junit4]   2> 1074953 INFO  (TEST-PeerSyncTest.test-seed#[BE1524C066D29295]) [    ] o.a.s.s.SolrDispatchFilter  ___      _       Welcome to Apache Solr? version 8.2.0
   [junit4]   2> 1074953 INFO  (TEST-PeerSyncTest.test-seed#[BE1524C066D29295]) [    ] o.a.s.s.SolrDispatchFilter / __| ___| |_ _   Starting in standalone mode on port null
   [junit4]   2> 1074953 INFO  (TEST-PeerSyncTest.test-seed#[BE1524C066D29295]) [    ] o.a.s.s.SolrDispatchFilter \__ \/ _ \ | '_|  Install dir: null
   [junit4]   2> 1074953 INFO  (TEST-PeerSyncTest.test-seed#[BE1524C066D29295]) [    ] o.a.s.s.SolrDispatchFilter |___/\___/_|_|    Start time: 2019-05-02T04:53:26.446801400Z
   [junit4]   2> 1074953 INFO  (TEST-PeerSyncTest.test-seed#[BE1524C066D29295]) [    ] o.a.s.c.SolrXmlConfig Loading container configuration from C:\Users\jenkins\workspace\Lucene-Solr-8.x-Windows\solr\build\solr-core\test\J0\temp\solr.update.PeerSyncTest_BE1524C066D29295-001\tempDir-001\shard0\solr.xml
   [junit4]   2> 1074956 INFO  (TEST-PeerSyncTest.test-seed#[BE1524C066D29295]) [    ] o.a.s.c.SolrXmlConfig Configuration parameter autoReplicaFailoverWorkLoopDelay is ignored
   [junit4]   2> 1074956 INFO  (TEST-PeerSyncTest.test-seed#[BE1524C066D29295]) [    ] o.a.s.c.SolrXmlConfig Configuration parameter autoReplicaFailoverBadNodeExpiration is ignored
   [junit4]   2> 1074962 INFO  (TEST-PeerSyncTest.test-seed#[BE1524C066D29295]) [    ] o.a.s.c.SolrXmlConfig MBean server found: com.sun.jmx.mbeanserver.JmxMBeanServer@23caba9f, but no JMX reporters were configured - adding default JMX reporter.
   [junit4]   2> 1075018 INFO  (TEST-PeerSyncTest.test-seed#[BE1524C066D29295]) [    ] o.a.s.h.c.HttpShardHandlerFactory Host whitelist initialized: WhitelistHostChecker [whitelistHosts=null, whitelistHostCheckingEnabled=false]
   [junit4]   2> 1075020 WARN  (TEST-PeerSyncTest.test-seed#[BE1524C066D29295]) [    ] o.e.j.u.s.S.config No Client EndPointIdentificationAlgorithm configured for SslContextFactory@630829ac[provider=null,keyStore=null,trustStore=null]
   [junit4]   2> 1075024 WARN  (TEST-PeerSyncTest.test-seed#[BE1524C066D29295]) [    ] o.e.j.u.s.S.config No Client EndPointIdentificationAlgorithm configured for SslContextFactory@2b2bc86b[provider=null,keyStore=null,trustStore=null]
   [junit4]   2> 1075047 INFO  (TEST-PeerSyncTest.test-seed#[BE1524C066D29295]) [    ] o.a.s.c.TransientSolrCoreCacheDefault Allocating transient cache for 4 transient cores
   [junit4]   2> 1075047 INFO  (TEST-PeerSyncTest.test-seed#[BE1524C066D29295]) [    ] o.a.s.h.a.MetricsHistoryHandler No .system collection, keeping metrics history in memory.
   [junit4]   2> 1075065 INFO  (TEST-PeerSyncTest.test-seed#[BE1524C066D29295]) [    ] o.a.s.m.r.SolrJmxReporter JMX monitoring for 'solr.node' (registry 'solr.node') enabled at server: com.sun.jmx.mbeanserver.JmxMBeanServer@23caba9f
   [junit4]   2> 1075073 INFO  (TEST-PeerSyncTest.test-seed#[BE1524C066D29295]) [    ] o.a.s.m.r.SolrJmxReporter JMX monitoring for 'solr.jvm' (registry 'solr.jvm') enabled at server: com.sun.jmx.mbeanserver.JmxMBeanServer@23caba9f
   [junit4]   2> 1075074 INFO  (TEST-PeerSyncTest.test-seed#[BE1524C066D29295]) [    ] o.a.s.m.r.SolrJmxReporter JMX monitoring for 'solr.jetty' (registry 'solr.jetty') enabled at server: com.sun.jmx.mbeanserver.JmxMBeanServer@23caba9f
   [junit4]   2> 1075076 INFO  (TEST-PeerSyncTest.test-seed#[BE1524C066D29295]) [    ] o.a.s.c.CorePropertiesLocator Found 1 core definitions underneath C:\Users\jenkins\workspace\Lucene-Solr-8.x-Windows\solr\build\solr-core\test\J0\temp\solr.update.PeerSyncTest_BE1524C066D29295-001\tempDir-001\shard0\cores
   [junit4]   2> 1075076 INFO  (TEST-PeerSyncTest.test-seed#[BE1524C066D29295]) [    ] o.a.s.c.CorePropertiesLocator Cores are: [collection1]
   [junit4]   2> 1075077 INFO  (coreLoadExecutor-6213-thread-1) [    x:collection1] o.a.s.c.SolrResourceLoader [null] Added 2 libs to classloader, from paths: [/C:/Users/jenkins/workspace/Lucene-Solr-8.x-Windows/solr/core/src/test-files/solr/collection1/lib, /C:/Users/jenkins/workspace/Lucene-Solr-8.x-Windows/solr/core/src/test-files/solr/collection1/lib/classes]
   [junit4]   2> 1075105 INFO  (coreLoadExecutor-6213-thread-1) [    x:collection1] o.a.s.c.SolrConfig Using Lucene MatchVersion: 8.2.0
   [junit4]   2> 1075118 INFO  (coreLoadExecutor-6213-thread-1) [    x:collection1] o.a.s.s.IndexSchema [collection1] Schema name=test
   [junit4]   2> 1075208 INFO  (coreLoadExecutor-6213-thread-1) [    x:collection1] o.a.s.s.IndexSchema Loaded schema test/1.0 with uniqueid field id
   [junit4]   2> 1075219 INFO  (coreLoadExecutor-6213-thread-1) [    x:collection1] o.a.s.c.CoreContainer Creating SolrCore 'collection1' using configuration from configset C:\Users\jenkins\workspace\Lucene-Solr-8.x-Windows\solr\core\src\test-files\solr\collection1, trusted=true
   [junit4]   2> 1075220 INFO  (coreLoadExecutor-6213-thread-1) [    x:collection1] o.a.s.m.r.SolrJmxReporter JMX monitoring for 'solr.core.collection1' (registry 'solr.core.collection1') enabled at server: com.sun.jmx.mbeanserver.JmxMBeanServer@23caba9f
   [junit4]   2> 1075220 INFO  (coreLoadExecutor-6213-thread-1) [    x:collection1] o.a.s.c.SolrCore [[collection1] ] Opening new SolrCore at [C:\Users\jenkins\workspace\Lucene-Solr-8.x-Windows\solr\core\src\test-files\solr\collection1], dataDir=[C:\Users\jenkins\workspace\Lucene-Solr-8.x-Windows\solr\build\solr-core\test\J0\temp\solr.update.PeerSyncTest_BE1524C066D29295-001\tempDir-001\shard0\cores\collection1\data\]
   [junit4]   2> 1075220 INFO  (coreLoadExecutor-6213-thread-1) [    x:collection1] o.a.s.u.RandomMergePolicy RandomMergePolicy wrapping class org.apache.lucene.index.TieredMergePolicy: [TieredMergePolicy: maxMergeAtOnce=29, maxMergeAtOnceExplicit=28, maxMergedSegmentMB=96.74609375, floorSegmentMB=1.3818359375, forceMergeDeletesPctAllowed=26.2170774837334, segmentsPerTier=49.0, maxCFSSegmentSizeMB=8.796093022207999E12, noCFSRatio=0.2042441906187519, deletesPctAllowed=20.032875142576426
   [junit4]   2> 1075222 WARN  (coreLoadExecutor-6213-thread-1) [    x:collection1] o.a.s.c.RequestHandlers INVALID paramSet a in requestHandler {type = requestHandler,name = /dump,class = DumpRequestHandler,attributes = {initParams=a, name=/dump, class=DumpRequestHandler},args = {defaults={a=A,b=B}}}
   [junit4]   2> 1075272 INFO  (coreLoadExecutor-6213-thread-1) [    x:collection1] o.a.s.u.UpdateHandler Using UpdateLog implementation: org.apache.solr.update.UpdateLog
   [junit4]   2> 1075272 INFO  (coreLoadExecutor-6213-thread-1) [    x:collection1] o.a.s.u.UpdateLog Initializing UpdateLog: dataDir= defaultSyncLevel=FLUSH numRecordsToKeep=100 maxNumLogsToKeep=10 numVersionBuckets=65536
   [junit4]   2> 1075274 INFO  (coreLoadExecutor-6213-thread-1) [    x:collection1] o.a.s.u.CommitTracker Hard AutoCommit: disabled
   [junit4]   2> 1075274 INFO  (coreLoadExecutor-6213-thread-1) [    x:collection1] o.a.s.u.CommitTracker Soft AutoCommit: disabled
   [junit4]   2> 1075275 INFO  (coreLoadExecutor-6213-thread-1) [    x:collection1] o.a.s.u.RandomMergePolicy RandomMergePolicy wrapping class org.apache.lucene.index.TieredMergePolicy: [TieredMergePolicy: maxMergeAtOnce=31, maxMergeAtOnceExplicit=43, maxMergedSegmentMB=49.490234375, floorSegmentMB=0.8779296875, forceMergeDeletesPctAllowed=15.332129890048597, segmentsPerTier=42.0, maxCFSSegmentSizeMB=8.796093022207999E12, noCFSRatio=0.8800935484127915, deletesPctAllowed=39.285389382364116
   [junit4]   2> 1075275 INFO  (coreLoadExecutor-6213-thread-1) [    x:collection1] o.a.s.s.SolrIndexSearcher Opening [Searcher@406a5593[collection1] main]
   [junit4]   2> 1075275 WARN  (coreLoadExecutor-6213-thread-1) [    x:collection1] o.a.s.r.ManagedResourceStorage Cannot write to config directory C:\Users\jenkins\workspace\Lucene-Solr-8.x-Windows\solr\core\src\test-files\solr\collection1\conf; switching to use InMemory storage instead.
   [junit4]   2> 1075276 INFO  (coreLoadExecutor-6213-thread-1) [    x:collection1] o.a.s.h.ReplicationHandler Commits will be reserved for 10000ms.
   [junit4]   2> 1075276 INFO  (coreLoadExecutor-6213-thread-1) [    x:collection1] o.a.s.u.UpdateLog Could not find max version in index or recent updates, using new clock 1632394602630610944
   [junit4]   2> 1075278 INFO  (searcherExecutor-6214-thread-1-processing-x:collection1) [    x:collection1] o.a.s.c.SolrCore [collection1] Registered new searcher Searcher@406a5593[collection1] main{ExitableDirectoryReader(UninvertingDirectoryReader())}
   [junit4]   2> 1075642 INFO  (TEST-PeerSyncTest.test-seed#[BE1524C066D29295]) [    ] o.a.s.SolrTestCaseJ4 Writing core.properties file to C:\Users\jenkins\workspace\Lucene-Solr-8.x-Windows\solr\build\solr-core\test\J0\temp\solr.update.PeerSyncTest_BE1524C066D29295-001\tempDir-001\shard1\cores\collection1
   [junit4]   2> 1075643 WARN  (TEST-PeerSyncTest.test-seed#[BE1524C066D29295]) [    ] o.e.j.s.AbstractConnector Ignoring deprecated socket close linger time
   [junit4]   2> 1075643 INFO  (TEST-PeerSyncTest.test-seed#[BE1524C066D29295]) [    ] o.a.s.c.s.e.JettySolrRunner Start Jetty (original configured port=0)
   [junit4]   2> 1075643 INFO  (TEST-PeerSyncTest.test-seed#[BE1524C066D29295]) [    ] o.a.s.c.s.e.JettySolrRunner Trying to start Jetty on port 0 try number 1 ...
   [junit4]   2> 1075643 INFO  (TEST-PeerSyncTest.test-seed#[BE1524C066D29295]) [    ] o.e.j.s.Server jetty-9.4.14.v20181114; built: 2018-11-14T21:20:31.478Z; git: c4550056e785fb5665914545889f21dc136ad9e6; jvm 13-ea+18
   [junit4]   2> 1075644 INFO  (TEST-PeerSyncTest.test-seed#[BE1524C066D29295]) [    ] o.e.j.s.session DefaultSessionIdManager workerName=node0
   [junit4]   2> 1075644 INFO  (TEST-PeerSyncTest.test-seed#[BE1524C066D29295]) [    ] o.e.j.s.session No SessionScavenger set, using defaults
   [junit4]   2> 1075644 INFO  (TEST-PeerSyncTest.test-seed#[BE1524C066D29295]) [    ] o.e.j.s.session node0 Scavenging every 600000ms
   [junit4]   2> 1075644 INFO  (TEST-PeerSyncTest.test-seed#[BE1524C066D29295]) [    ] o.e.j.s.h.ContextHandler Started o.e.j.s.ServletContextHandler@3ca07b85{/,null,AVAILABLE}
   [junit4]   2> 1075645 INFO  (TEST-PeerSyncTest.test-seed#[BE1524C066D29295]) [    ] o.e.j.s.AbstractConnector Started ServerConnector@5bcb077b{HTTP/1.1,[http/1.1, h2c]}{127.0.0.1:51113}
   [junit4]   2> 1075645 INFO  (TEST-PeerSyncTest.test-seed#[BE1524C066D29295]) [    ] o.e.j.s.Server Started @1075678ms
   [junit4]   2> 1075645 INFO  (TEST-PeerSyncTest.test-seed#[BE1524C066D29295]) [    ] o.a.s.c.s.e.JettySolrRunner Jetty properties: {schema=schema.xml, hostContext=/, solrconfig=solrconfig-tlog.xml, hostPort=51113, coreRootDirectory=C:\Users\jenkins\workspace\Lucene-Solr-8.x-Windows\solr\build\solr-core\test\J0\temp\solr.update.PeerSyncTest_BE1524C066D29295-001\tempDir-001\shard1\cores}
   [junit4]   2> 1075645 ERROR (TEST-PeerSyncTest.test-seed#[BE1524C066D29295]) [    ] o.a.s.u.StartupLoggingUtils Missing Java Option solr.log.dir. Logging may be missing or incomplete.
   [junit4]   2> 1075645 INFO  (TEST-PeerSyncTest.test-seed#[BE1524C066D29295]) [    ] o.a.s.s.SolrDispatchFilter Using logger factory org.apache.logging.slf4j.Log4jLoggerFactory
   [junit4]   2> 1075645 INFO  (TEST-PeerSyncTest.test-seed#[BE1524C066D29295]) [    ] o.a.s.s.SolrDispatchFilter  ___      _       Welcome to Apache Solr? version 8.2.0
   [junit4]   2> 1075645 INFO  (TEST-PeerSyncTest.test-seed#[BE1524C066D29295]) [    ] o.a.s.s.SolrDispatchFilter / __| ___| |_ _   Starting in standalone mode on port null
   [junit4]   2> 1075645 INFO  (TEST-PeerSyncTest.test-seed#[BE1524C066D29295]) [    ] o.a.s.s.SolrDispatchFilter \__ \/ _ \ | '_|  Install dir: null
   [junit4]   2> 1075645 INFO  (TEST-PeerSyncTest.test-seed#[BE1524C066D29295]) [    ] o.a.s.s.SolrDispatchFilter |___/\___/_|_|    Start time: 2019-05-02T04:53:27.138831200Z
   [junit4]   2> 1075646 INFO  (TEST-PeerSyncTest.test-seed#[BE1524C066D29295]) [    ] o.a.s.c.SolrXmlConfig Loading container configuration from C:\Users\jenkins\workspace\Lucene-Solr-8.x-Windows\solr\build\solr-core\test\J0\temp\solr.update.PeerSyncTest_BE1524C066D29295-001\tempDir-001\shard1\solr.xml
   [junit4]   2> 1075648 INFO  (TEST-PeerSyncTest.test-seed#[BE1524C066D29295]) [    ] o.a.s.c.SolrXmlConfig Configuration parameter autoReplicaFailoverWorkLoopDelay is ignored
   [junit4]   2> 1075648 INFO  (TEST-PeerSyncTest.test-seed#[BE1524C066D29295]) [    ] o.a.s.c.SolrXmlConfig Configuration parameter autoReplicaFailoverBadNodeExpiration is ignored
   [junit4]   2> 1075649 INFO  (TEST-PeerSyncTest.test-seed#[BE1524C066D29295]) [    ] o.a.s.c.SolrXmlConfig MBean server found: com.sun.jmx.mbeanserver.JmxMBeanServer@23caba9f, but no JMX reporters were configured - adding default JMX reporter.
   [junit4]   2> 1075746 INFO  (TEST-PeerSyncTest.test-seed#[BE1524C066D29295]) [    ] o.a.s.h.c.HttpShardHandlerFactory Host whitelist initialized: WhitelistHostChecker [whitelistHosts=null, whitelistHostCheckingEnabled=false]
   [junit4]   2> 1075748 WARN  (TEST-PeerSyncTest.test-seed#[BE1524C066D29295]) [    ] o.e.j.u.s.S.config No Client EndPointIdentificationAlgorithm configured for SslContextFactory@3f6250c0[provider=null,keyStore=null,trustStore=null]
   [junit4]   2> 1075751 WARN  (TEST-PeerSyncTest.test-seed#[BE1524C066D29295]) [    ] o.e.j.u.s.S.config No Client EndPointIdentificationAlgorithm configured for SslContextFactory@205785b6[provider=null,keyStore=null,trustStore=null]
   [junit4]   2> 1075773 INFO  (TEST-PeerSyncTest.test-seed#[BE1524C066D29295]) [    ] o.a.s.c.TransientSolrCoreCacheDefault Allocating transient cache for 4 transient cores
   [junit4]   2> 1075773 INFO  (TEST-PeerSyncTest.test-seed#[BE1524C066D29295]) [    ] o.a.s.h.a.MetricsHistoryHandler No .system collection, keeping metrics history in memory.
   [junit4]   2> 1075790 INFO  (TEST-PeerSyncTest.test-seed#[BE1524C066D29295]) [    ] o.a.s.m.r.SolrJmxReporter JMX monitoring for 'solr.node' (registry 'solr.node') enabled at server: com.sun.jmx.mbeanserver.JmxMBeanServer@23caba9f
   [junit4]   2> 1075797 INFO  (TEST-PeerSyncTest.test-seed#[BE1524C066D29295]) [    ] o.a.s.m.r.SolrJmxReporter JMX monitoring for 'solr.jvm' (registry 'solr.jvm') enabled at server: com.sun.jmx.mbeanserver.JmxMBeanServer@23caba9f
   [junit4]   2> 1075797 INFO  (TEST-PeerSyncTest.test-seed#[BE1524C066D29295]) [    ] o.a.s.m.r.SolrJmxReporter JMX monitoring for 'solr.jetty' (registry 'solr.jetty') enabled at server: com.sun.jmx.mbeanserver.JmxMBeanServer@23caba9f
   [junit4]   2> 1075799 INFO  (TEST-PeerSyncTest.test-seed#[BE1524C066D29295]) [    ] o.a.s.c.CorePropertiesLocator Found 1 core definitions underneath C:\Users\jenkins\workspace\Lucene-Solr-8.x-Windows\solr\build\solr-core\test\J0\temp\solr.update.PeerSyncTest_BE1524C066D29295-001\tempDir-001\shard1\cores
   [junit4]   2> 1075799 INFO  (TEST-PeerSyncTest.test-seed#[BE1524C066D29295]) [    ] o.a.s.c.CorePropertiesLocator Cores are: [collection1]
   [junit4]   2> 1075800 INFO  (coreLoadExecutor-6227-thread-1) [    x:collection1] o.a.s.c.SolrResourceLoader [null] Added 2 libs to classloader, from paths: [/C:/Users/jenkins/workspace/Lucene-Solr-8.x-Windows/solr/core/src/test-files/solr/collection1/lib, /C:/Users/jenkins/workspace/Lucene-Solr-8.x-Windows/solr/core/src/test-files/solr/collection1/lib/classes]
   [junit4]   2> 1075819 INFO  (coreLoadExecutor-6227-thread-1) [    x:collection1] o.a.s.c.SolrConfig Using Lucene MatchVersion: 8.2.0
   [junit4]   2> 1075839 INFO  (coreLoadExecutor-6227-thread-1) [    x:collection1] o.a.s.s.IndexSchema [collection1] Schema name=test
   [junit4]   2> 1075916 INFO  (coreLoadExecutor-6227-thread-1) [    x:collection1] o.a.s.s.IndexSchema Loaded schema test/1.0 with uniqueid field id
   [junit4]   2> 1075926 INFO  (coreLoadExecutor-6227-thread-1) [    x:collection1] o.a.s.c.CoreContainer Creating SolrCore 'collection1' using configuration from configset C:\Users\jenkins\workspace\Lucene-Solr-8.x-Windows\solr\core\src\test-files\solr\collection1, trusted=true
   [junit4]   2> 1075926 INFO  (coreLoadExecutor-6227-thread-1) [    x:collection1] o.a.s.m.r.SolrJmxReporter JMX monitoring for 'solr.core.collection1' (registry 'solr.core.collection1') enabled at server: com.sun.jmx.mbeanserver.JmxMBeanServer@23caba9f
   [junit4]   2> 1075927 INFO  (coreLoadExecutor-6227-thread-1) [    x:collection1] o.a.s.c.SolrCore [[collection1] ] Opening new SolrCore at [C:\Users\jenkins\workspace\Lucene-Solr-8.x-Windows\solr\core\src\test-files\solr\collection1], dataDir=[C:\Users\jenkins\workspace\Lucene-Solr-8.x-Windows\solr\build\solr-core\test\J0\temp\solr.update.PeerSyncTest_BE1524C066D29295-001\tempDir-001\shard1\cores\collection1\data\]
   [junit4]   2> 1075927 INFO  (coreLoadExecutor-6227-thread-1) [    x:collection1] o.a.s.u.RandomMergePolicy RandomMergePolicy wrapping class org.apache.lucene.index.TieredMergePolicy: [TieredMergePolicy: maxMergeAtOnce=29, maxMergeAtOnceExplicit=28, maxMergedSegmentMB=96.74609375, floorSegmentMB=1.3818359375, forceMergeDeletesPctAllowed=26.2170774837334, segmentsPerTier=49.0, maxCFSSegmentSizeMB=8.796093022207999E12, noCFSRatio=0.2042441906187519, deletesPctAllowed=20.032875142576426
   [junit4]   2> 1075928 WARN  (coreLoadExecutor-6227-thread-1) [    x:collection1] o.a.s.c.RequestHandlers INVALID paramSet a in requestHandler {type = requestHandler,name = /dump,class = DumpRequestHandler,attributes = {initParams=a, name=/dump, class=DumpRequestHandler},args = {defaults={a=A,b=B}}}
   [junit4]   2> 1075978 INFO  (coreLoadExecutor-6227-thread-1) [    x:collection1] o.a.s.u.UpdateHandler Using UpdateLog implementation: org.apache.solr.update.UpdateLog
   [junit4]   2> 1075978 INFO  (coreLoadExecutor-6227-thread-1) [    x:collection1] o.a.s.u.UpdateLog Initializing UpdateLog: dataDir= defaultSyncLevel=FLUSH numRecordsToKeep=100 maxNumLogsToKeep=10 numVersionBuckets=65536
   [junit4]   2> 1075978 INFO  (coreLoadExecutor-6227-thread-1) [    x:collection1] o.a.s.u.CommitTracker Hard AutoCommit: disabled
   [junit4]   2> 1075978 INFO  (coreLoadExecutor-6227-thread-1) [    x:collection1] o.a.s.u.CommitTracker Soft AutoCommit: disabled
   [junit4]   2> 1075980 INFO  (coreLoadExecutor-6227-thread-1) [    x:collection1] o.a.s.u.RandomMergePolicy RandomMergePolicy wrapping class org.apache.lucene.index.TieredMergePolicy: [TieredMergePolicy: maxMergeAtOnce=31, maxMergeAtOnceExplicit=43, maxMergedSegmentMB=49.490234375, floorSegmentMB=0.8779296875, forceMergeDeletesPctAllowed=15.332129890048597, segmentsPerTier=42.0, maxCFSSegmentSizeMB=8.796093022207999E12, noCFSRatio=0.8800935484127915, deletesPctAllowed=39.285389382364116
   [junit4]   2> 1075981 INFO  (coreLoadExecutor-6227-thread-1) [    x:collection1] o.a.s.s.SolrIndexSearcher Opening [Searcher@44f103a3[collection1] main]
   [junit4]   2> 1075981 WARN  (coreLoadExecutor-6227-thread-1) [    x:collection1] o.a.s.r.ManagedResourceStorage Cannot write to config directory C:\Users\jenkins\workspace\Lucene-Solr-8.x-Windows\solr\core\src\test-files\solr\collection1\conf; switching to use InMemory storage instead.
   [junit4]   2> 1075981 INFO  (coreLoadExecutor-6227-thread-1) [    x:collection1] o.a.s.h.ReplicationHandler Commits will be reserved for 10000ms.
   [junit4]   2> 1075982 INFO  (coreLoadExecutor-6227-thread-1) [    x:collection1] o.a.s.u.UpdateLog Could not find max version in index or recent updates, using new clock 1632394603370905600
   [junit4]   2> 1075984 INFO  (searcherExecutor-6228-thread-1-processing-x:collection1) [    x:collection1] o.a.s.c.SolrCore [collection1] Registered new searcher Searcher@44f103a3[collection1] main{ExitableDirectoryReader(UninvertingDirectoryReader())}
   [junit4]   2> 1076483 INFO  (TEST-PeerSyncTest.test-seed#[BE1524C066D29295]) [    ] o.a.s.SolrTestCaseJ4 Writing core.properties file to C:\Users\jenkins\workspace\Lucene-Solr-8.x-Windows\solr\build\solr-core\test\J0\temp\solr.update.PeerSyncTest_BE1524C066D29295-001\tempDir-001\shard2\cores\collection1
   [junit4]   2> 1076484 WARN  (TEST-PeerSyncTest.test-seed#[BE1524C066D29295]) [    ] o.e.j.s.AbstractConnector Ignoring deprecated socket close linger time
   [junit4]   2> 1076485 INFO  (TEST-PeerSyncTest.test-seed#[BE1524C066D29295]) [    ] o.a.s.c.s.e.JettySolrRunner Start Jetty (original configured port=0)
   [junit4]   2> 1076485 INFO  (TEST-PeerSyncTest.test-seed#[BE1524C066D29295]) [    ] o.a.s.c.s.e.JettySolrRunner Trying to start Jetty on port 0 try number 1 ...
   [junit4]   2> 1076485 INFO  (TEST-PeerSyncTest.test-seed#[BE1524C066D29295]) [    ] o.e.j.s.Server jetty-9.4.14.v20181114; built: 2018-11-14T21:20:31.478Z; git: c4550056e785fb5665914545889f21dc136ad9e6; jvm 13-ea+18
   [junit4]   2> 1076485 INFO  (TEST-PeerSyncTest.test-seed#[BE1524C066D29295]) [    ] o.e.j.s.session DefaultSessionIdManager workerName=node0
   [junit4]   2> 1076485 INFO  (TEST-PeerSyncTest.test-seed#[BE1524C066D29295]) [    ] o.e.j.s.session No SessionScavenger set, using defaults
   [junit4]   2> 1076485 INFO  (TEST-PeerSyncTest.test-seed#[BE1524C066D29295]) [    ] o.e.j.s.session node0 Scavenging every 660000ms
   [junit4]   2> 1076486 INFO  (TEST-PeerSyncTest.test-seed#[BE1524C066D29295]) [    ] o.e.j.s.h.ContextHandler Started o.e.j.s.ServletContextHandler@6cb5025{/,null,AVAILABLE}
   [junit4]   2> 1076487 INFO  (TEST-PeerSyncTest.test-seed#[BE1524C066D29295]) [    ] o.e.j.s.AbstractConnector Started ServerConnector@536f0085{HTTP/1.1,[http/1.1, h2c]}{127.0.0.1:51120}
   [junit4]   2> 1076487 INFO  (TEST-PeerSyncTest.test-seed#[BE1524C066D29295]) [    ] o.e.j.s.Server Started @1076520ms
   [junit4]   2> 1076487 INFO  (TEST-PeerSyncTest.test-seed#[BE1524C066D29295]) [    ] o.a.s.c.s.e.JettySolrRunner Jetty properties: {schema=schema.xml, hostContext=/, solrconfig=solrconfig-tlog.xml, hostPort=51120, coreRootDirectory=C:\Users\jenkins\workspace\Lucene-Solr-8.x-Windows\solr\build\solr-core\test\J0\temp\solr.update.PeerSyncTest_BE1524C066D29295-001\tempDir-001\shard2\cores}
   [junit4]   2> 1076488 ERROR (TEST-PeerSyncTest.test-seed#[BE1524C066D29295]) [    ] o.a.s.u.StartupLoggingUtils Missing Java Option solr.log.dir. Logging may be missing or incomplete.
   [junit4]   2> 1076488 INFO  (TEST-PeerSyncTest.test-seed#[BE1524C066D29295]) [    ] o.a.s.s.SolrDispatchFilter Using logger factory org.apache.logging.slf4j.Log4jLoggerFactory
   [junit4]   2> 1076488 INFO  (TEST-PeerSyncTest.test-seed#[BE1524C066D29295]) [    ] o.a.s.s.SolrDispatchFilter  ___      _       Welcome to Apache Solr? version 8.2.0
   [junit4]   2> 1076488 INFO  (TEST-PeerSyncTest.test-seed#[BE1524C066D29295]) [    ] o.a.s.s.SolrDispatchFilter / __| ___| |_ _   Starting in standalone mode on port null
   [junit4]   2> 1076488 INFO  (TEST-PeerSyncTest.test-seed#[BE1524C066D29295]) [    ] o.a.s.s.SolrDispatchFilter \__ \/ _ \ | '_|  Install dir: null
   [junit4]   2> 1076488 INFO  (TEST-PeerSyncTest.test-seed#[BE1524C066D29295]) [    ] o.a.s.s.SolrDispatchFilter |___/\___/_|_|    Start time: 2019-05-02T04:53:27.981848Z
   [junit4]   2> 1076488 INFO  (TEST-PeerSyncTest.test-seed#[BE1524C066D29295]) [    ] o.a.s.c.SolrXmlConfig Loading container configuration from C:\Users\jenkins\workspace\Lucene-Solr-8.x-Windows\solr\build\solr-core\test\J0\temp\solr.update.PeerSyncTest_BE1524C066D29295-001\tempDir-001\shard2\solr.xml
   [junit4]   2> 1076492 INFO  (TEST-PeerSyncTest.test-seed#[BE1524C066D29295]) [    ] o.a.s.c.SolrXmlConfig Configuration parameter autoReplicaFailoverWorkLoopDelay is ignored
   [junit4]   2> 1076492 INFO  (TEST-PeerSyncTest.test-seed#[BE1524C066D29295]) [    ] o.a.s.c.SolrXmlConfig Configuration parameter autoReplicaFailoverBadNodeExpiration is ignored
   [junit4]   2> 1076492 INFO  (TEST-PeerSyncTest.test-seed#[BE1524C066D29295]) [    ] o.a.s.c.SolrXmlConfig MBean server found: com.sun.jmx.mbeanserver.JmxMBeanServer@23caba9f, but no JMX reporters were configured - adding default JMX reporter.
   [junit4]   2> 1076773 INFO  (TEST-PeerSyncTest.test-seed#[BE1524C066D29295]) [    ] o.a.s.h.c.HttpShardHandlerFactory Host whitelist initialized: WhitelistHostChecker [whitelistHosts=null, whitelistHostCheckingEnabled=false]
   [junit4]   2> 1076776 WARN  (TEST-PeerSyncTest.test-seed#[BE1524C066D29295]) [    ] o.e.j.u.s.S.config No Client EndPointIdentificationAlgorithm configured for SslContextFactory@7b3132ed[provider=null,keyStore=null,trustStore=null]
   [junit4]   2> 1076781 WARN  (TEST-PeerSyncTest.test-seed#[BE1524C066D29295]) [    ] o.e.j.u.s.S.config No Client EndPointIdentificationAlgorithm configured for SslContextFactory@1707ac37[provider=null,keyStore=null,trustStore=null]
   [junit4]   2> 1076810 INFO  (TEST-PeerSyncTest.test-seed#[BE1524C066D29295]) [    ] o.a.s.c.TransientSolrCoreCacheDefault Allocating transient cache for 4 transient cores
   [junit4]   2> 1076810 INFO  (TEST-PeerSyncTest.test-seed#[BE1524C066D29295]) [    ] o.a.s.h.a.MetricsHistoryHandler No .system collection, keeping metrics history in memory.
   [junit4]   2> 1076828 INFO  (TEST-PeerSyncTest.test-seed#[BE1524C066D29295]) [    ] o.a.s.m.r.SolrJmxReporter JMX monitoring for 'solr.node' (registry 'solr.node') enabled at server: com.sun.jmx.mbeanserver.JmxMBeanServer@23caba9f
   [junit4]   2> 1076836 INFO  (TEST-PeerSyncTest.test-seed#[BE1524C066D29295]) [    ] o.a.s.m.r.SolrJmxReporter JMX monitoring for 'solr.jvm' (registry 'solr.jvm') enabled at server: com.sun.jmx.mbeanserver.JmxMBeanServer@23caba9f
   [junit4]   2> 1076836 INFO  (TEST-PeerSyncTest.test-seed#[BE1524C066D29295]) [    ] o.a.s.m.r.SolrJmxReporter JMX monitoring for 'solr.jetty' (registry 'solr.jetty') enabled at server: com.sun.jmx.mbeanserver.JmxMBeanServer@23caba9f
   [junit4]   2> 1076838 INFO  (TEST-PeerSyncTest.test-seed#[BE1524C066D29295]) [    ] o.a.s.c.CorePropertiesLocator Found 1 core definitions underneath C:\Users\jenkins\workspace\Lucene-Solr-8.x-Windows\solr\build\solr-core\test\J0\temp\solr.update.PeerSyncTest_BE1524C066D29295-001\tempDir-001\shard2\cores
   [junit4]   2> 1076838 INFO  (TEST-PeerSyncTest.test-seed#[BE1524C066D29295]) [    ] o.a.s.c.CorePropertiesLocator Cores are: [collection1]
   [junit4]   2> 1076840 INFO  (coreLoadExecutor-6241-thread-1) [    x:collection1] o.a.s.c.SolrResourceLoader [null] Added 2 libs to classloader, from paths: [/C:/Users/jenkins/workspace/Lucene-Solr-8.x-Windows/solr/core/src/test-files/solr/collection1/lib, /C:/Users/jenkins/workspace/Lucene-Solr-8.x-Windows/solr/core/src/test-files/solr/collection1/lib/classes]
   [junit4]   2> 1076864 INFO  (coreLoadExecutor-6241-thread-1) [    x:collection1] o.a.s.c.SolrConfig Using Lucene MatchVersion: 8.2.0
   [junit4]   2> 1076876 INFO  (coreLoadExecutor-6241-thread-1) [    x:collection1] o.a.s.s.IndexSchema [collection1] Schema name=test
   [junit4]   2> 1076958 INFO  (coreLoadExecutor-6241-thread-1) [    x:collection1] o.a.s.s.IndexSchema Loaded schema test/1.0 with uniqueid field id
   [junit4]   2> 1076969 INFO  (coreLoadExecutor-6241-thread-1) [    x:collection1] o.a.s.c.CoreContainer Creating SolrCore 'collection1' using configuration from configset C:\Users\jenkins\workspace\Lucene-Solr-8.x-Windows\solr\core\src\test-files\solr\collection1, trusted=true
   [junit4]   2> 1076969 INFO  (coreLoadExecutor-6241-thread-1) [    x:collection1] o.a.s.m.r.SolrJmxReporter JMX monitoring for 'solr.core.collection1' (registry 'solr.core.collection1') enabled at server: com.sun.jmx.mbeanserver.JmxMBeanServer@23caba9f
   [junit4]   2> 1076969 INFO  (coreLoadExecutor-6241-thread-1) [    x:collection1] o.a.s.c.SolrCore [[collection1] ] Opening new SolrCore at [C:\Users\jenkins\workspace\Lucene-Solr-8.x-Windows\solr\core\src\test-files\solr\collection1], dataDir=[C:\Users\jenkins\workspace\Lucene-Solr-8.x-Windows\solr\build\solr-core\test\J0\temp\solr.update.PeerSyncTest_BE1524C066D29295-001\tempDir-001\shard2\cores\collection1\data\]
   [junit4]   2> 1076970 INFO  (coreLoadExecutor-6241-thread-1) [    x:collection1] o.a.s.u.RandomMergePolicy RandomMergePolicy wrapping class org.apache.lucene.index.TieredMergePolicy: [TieredMergePolicy: maxMergeAtOnce=29, maxMergeAtOnceExplicit=28, maxMergedSegmentMB=96.74609375, floorSegmentMB=1.3818359375, forceMergeDeletesPctAllowed=26.2170774837334, segmentsPerTier=49.0, maxCFSSegmentSizeMB=8.796093022207999E12, noCFSRatio=0.2042441906187519, deletesPctAllowed=20.032875142576426
   [junit4]   2> 1076972 WARN  (coreLoadExecutor-6241-thread-1) [    x:collection1] o.a.s.c.RequestHandlers INVALID paramSet a in requestHandler {type = requestHandler,name = /dump,class = DumpRequestHandler,attributes = {initParams=a, name=/dump, class=DumpRequestHandler},args = {defaults={a=A,b=B}}}
   [junit4]   2> 1077027 INFO  (coreLoadExecutor-6241-thread-1) [    x:collection1] o.a.s.u.UpdateHandler Using UpdateLog implementation: org.apache.solr.update.UpdateLog
   [junit4]   2> 1077027 INFO  (coreLoadExecutor-6241-thread-1) [    x:collection1] o.a.s.u.UpdateLog Initializing UpdateLog: dataDir= defaultSyncLevel=FLUSH numRecordsToKeep=100 maxNumLogsToKeep=10 numVersionBuckets=65536
   [junit4]   2> 1077029 INFO  (coreLoadExecutor-6241-thread-1) [    x:collection1] o.a.s.u.CommitTracker Hard AutoCommit: disabled
   [junit4]   2> 1077029 INFO  (coreLoadExecutor-6241-thread-1) [    x:collection1] o.a.s.u.CommitTracker Soft AutoCommit: disabled
   [junit4]   2> 1077030 INFO  (coreLoadExecutor-6241-thread-1) [    x:collection1] o.a.s.u.RandomMergePolicy RandomMergePolicy wrapping class org.apache.lucene.index.TieredMergePolicy: [TieredMergePolicy: maxMergeAtOnce=31, maxMergeAtOnceExplicit=43, maxMergedSegmentMB=49.490234375, floorSegmentMB=0.8779296875, forceMergeDeletesPctAllowed=15.332129890048597, segmentsPerTier=42.0, maxCFSSegmentSizeMB=8.796093022207999E12, noCFSRatio=0.8800935484127915, deletesPctAllowed=39.285389382364116
   [junit4]   2> 1077030 INFO  (coreLoadExecutor-6241-thread-1) [    x:collection1] o.a.s.s.SolrIndexSearcher Opening [Searcher@3d25e105[collection1] main]
   [junit4]   2> 1077030 WARN  (coreLoadExecutor-6241-thread-1) [    x:collection1] o.a.s.r.ManagedResourceStorage Cannot write to config directory C:\Users\jenkins\workspace\Lucene-Solr-8.x-Windows\solr\core\src\test-files\solr\collection1\conf; switching to use InMemory storage instead.
   [junit4]   2> 1077030 INFO  (coreLoadExecutor-6241-thread-1) [    x:collection1] o.a.s.h.ReplicationHandler Commits will be reserved for 10000ms.
   [junit4]   2> 1077030 INFO  (coreLoadExecutor-6241-thread-1) [    x:collection1] o.a.s.u.UpdateLog Could not find max version in index or recent updates, using new clock 1632394604469813248
   [junit4]   2> 1077032 INFO  (searcherExecutor-6242-thread-1-processing-x:collection1) [    x:collection1] o.a.s.c.SolrCore [collection1] Registered new searcher Searcher@3d25e105[collection1] main{ExitableDirectoryReader(UninvertingDirectoryReader())}
   [junit4]   2> 1077033 INFO  (TEST-PeerSyncTest.test-seed#[BE1524C066D29295]) [    ] o.a.s.SolrTestCaseJ4 ###Starting test
   [junit4]   2> 1077037 INFO  (qtp1106616738-19108) [    x:collection1] o.a.s.u.p.LogUpdateProcessorFactory [collection1]  webapp= path=/update params={update.distrib=FROMLEADER&wt=javabin&version=2}{add=[1 (1)]} 0 1
   [junit4]   2> 1077039 INFO  (qtp2127777786-19129) [    x:collection1] o.a.s.u.PeerSync PeerSync: core=collection1 url= START replicas=[http://127.0.0.1:51084/collection1] nUpdates=100
   [junit4]   2> 1077046 INFO  (qtp1106616738-19111) [    x:collection1] o.a.s.s.SolrIndexSearcher Opening [Searcher@f3dc88b[collection1] realtime]
   [junit4]   2> 1077046 INFO  (qtp1106616738-19111) [    x:collection1] o.a.s.u.IndexFingerprint IndexFingerprint millis:4.0 result:{maxVersionSpecified=9223372036854775807, maxVersionEncountered=1, maxInHash=1, versionsHash=-5451962507482445012, numVersions=1, numDocs=1, maxDoc=1}
   [junit4]   2> 1077046 INFO  (qtp1106616738-19111) [    x:collection1] o.a.s.c.S.Request [collection1]  webapp= path=/get params={distrib=false&qt=/get&getFingerprint=9223372036854775807&wt=javabin&version=2} status=0 QTime=5
   [junit4]   2> 1077046 INFO  (qtp2127777786-19129) [    x:collection1] o.a.s.u.IndexFingerprint IndexFingerprint millis:0.0 result:{maxVersionSpecified=9223372036854775807, maxVersionEncountered=0, maxInHash=0, versionsHash=0, numVersions=0, numDocs=0, maxDoc=0}
   [junit4]   2> 1077046 INFO  (qtp2127777786-19129) [    x:collection1] o.a.s.u.PeerSync PeerSync: core=collection1 url= DONE.  We have no versions.  sync failed.
   [junit4]   2> 1077047 INFO  (qtp1106616738-19110) [    x:collection1] o.a.s.u.IndexFingerprint IndexFingerprint millis:0.0 result:{maxVersionSpecified=9223372036854775807, maxVersionEncountered=1, maxInHash=1, versionsHash=-5451962507482445012, numVersions=1, numDocs=1, maxDoc=1}
   [junit4]   2> 1077047 INFO  (qtp1106616738-19110) [    x:collection1] o.a.s.c.S.Request [collection1]  webapp= path=/get params={distrib=false&qt=/get&fingerprint=true&getVersions=100&wt=javabin&version=2} status=0 QTime=0
   [junit4]   2> 1077047 INFO  (qtp2127777786-19129) [    x:collection1] o.a.s.c.S.Request [collection1]  webapp= path=/get params={qt=/get&getVersions=100&sync=http://127.0.0.1:51084/collection1&wt=javabin&version=2} status=0 QTime=8
   [junit4]   2> 1077048 INFO  (qtp2127777786-19130) [    x:collection1] o.a.s.u.p.LogUpdateProcessorFactory [collection1]  webapp= path=/update params={update.distrib=FROMLEADER&wt=javabin&version=2}{add=[1 (1)]} 0 1
   [junit4]   2> 1077049 INFO  (qtp2127777786-19131) [    x:collection1] o.a.s.u.PeerSync PeerSync: core=collection1 url= START replicas=[http://127.0.0.1:51084/collection1] nUpdates=100
   [junit4]   2> 1077050 INFO  (qtp1106616738-19112) [    x:collection1] o.a.s.u.IndexFingerprint IndexFingerprint millis:0.0 result:{maxVersionSpecified=9223372036854775807, maxVersionEncountered=1, maxInHash=1, versionsHash=-5451962507482445012, numVersions=1, numDocs=1, maxDoc=1}
   [junit4]   2> 1077050 INFO  (qtp1106616738-19112) [    x:collection1] o.a.s.c.S.Request [collection1]  webapp= path=/get params={distrib=false&qt=/get&getFingerprint=9223372036854775807&wt=javabin&version=2} status=0 QTime=0
   [junit4]   2> 1077052 INFO  (qtp2127777786-19131) [    x:collection1] o.a.s.s.SolrIndexSearcher Opening [Searcher@2ff634d0[collection1] realtime]
   [junit4]   2> 1077052 INFO  (qtp2127777786-19131) [    x:collection1] o.a.s.u.IndexFingerprint IndexFingerprint millis:2.0 result:{maxVersionSpecified=9223372036854775807, maxVersionEncountered=1, maxInHash=1, versionsHash=-5451962507482445012, numVersions=1, numDocs=1, maxDoc=1}
   [junit4]   2> 1077052 INFO  (qtp2127777786-19131) [    x:collection1] o.a.s.u.PeerSync We are already in sync. No need to do a PeerSync 
   [junit4]   2> 1077052 INFO  (qtp2127777786-19131) [    x:collection1] o.a.s.c.S.Request [collection1]  webapp= path=/get params={qt=/get&getVersions=100&sync=http://127.0.0.1:51084/collection1&wt=javabin&version=2} status=0 QTime=3
   [junit4]   2> 1077054 INFO  (qtp1106616738-19107) [    x:collection1] o.a.s.u.DirectUpdateHandler2 start commit{_version_=1632394604494979072,optimize=false,openSearcher=true,waitSearcher=true,expungeDeletes=false,softCommit=false,prepareCommit=false}
   [junit4]   2> 1077054 INFO  (qtp1106616738-19107) [    x:collection1] o.a.s.u.SolrIndexWriter Calling setCommitData with IW:org.apache.solr.update.SolrIndexWriter@4c04bf81 commitCommandVersion:1632394604494979072
   [junit4]   2> 1077055 INFO  (qtp1106616738-19107) [    x:collection1] o.a.s.s.SolrIndexSearcher Opening [Searcher@6d675aa2[collection1] main]
   [junit4]   2> 1077055 INFO  (qtp1106616738-19107) [    x:collection1] o.a.s.u.DirectUpdateHandler2 end_commit_flush
   [junit4]   2> 1077056 INFO  (searcherExecutor-6214-thread-1-processing-x:collection1) [    x:collection1] o.a.s.c.SolrCore [collection1] Registered new searcher Searcher@6d675aa2[collection1] main{ExitableDirectoryReader(UninvertingDirectoryReader(Uninverting(_0(8.2.0):C1:[diagnostics={os=Windows 10, java.vendor=Oracle Corporation, java.version=13-ea, java.vm.version=13-ea+18, lucene.version=8.2.0, os.arch=amd64, java.runtime.version=13-ea+18, source=flush, os.version=10.0, timestamp=1556772808535}]:[attributes={Lucene50StoredFieldsFormat.mode=BEST_SPEED}])))}
   [junit4]   2> 1077056 INFO  (qtp1106616738-19107) [    x:collection1] o.a.s.u.p.LogUpdateProcessorFactory [collection1]  webapp= path=/update params={waitSearcher=true&commit=true&softCommit=false&wt=javabin&version=2}{commit=} 0 3
   [junit4]   2> 1077057 INFO  (qtp2127777786-19132) [    x:collection1] o.a.s.u.DirectUpdateHandler2 start commit{_version_=1632394604498124800,optimize=false,openSearcher=true,waitSearcher=true,expungeDeletes=false,softCommit=false,prepareCommit=false}
   [junit4]   2> 1077057 INFO  (qtp2127777786-19132) [    x:collection1] o.a.s.u.SolrIndexWriter Calling setCommitData with IW:org.apache.solr.update.SolrIndexWriter@bfba200 commitCommandVersion:1632394604498124800
   [junit4]   2> 1077058 INFO  (qtp2127777786-19132) [    x:collection1] o.a.s.s.SolrIndexSearcher Opening [Searcher@58fa0552[collection1] main]
   [junit4]   2> 1077059 INFO  (qtp2127777786-19132) [    x:collection1] o.a.s.u.DirectUpdateHandler2 end_commit_flush
   [junit4]   2> 1077061 INFO  (searcherExecutor-6228-thread-1-processing-x:collection1) [    x:collection1] o.a.s.c.SolrCore [collection1] Registered new searcher Searcher@58fa0552[collection1] main{ExitableDirectoryReader(UninvertingDirectoryReader(Uninverting(_0(8.2.0):C1:[diagnostics={os=Windows 10, java.vendor=Oracle Corporation, java.version=13-ea, java.vm.version=13-ea+18, lucene.version=8.2.0, os.arch=amd64, java.runtime.version=13-ea+18, source=flush, os.version=10.0, timestamp=1556772808544}]:[attributes={Lucene50StoredFieldsFormat.mode=BEST_SPEED}])))}
   [junit4]   2> 1077061 INFO  (qtp2127777786-19132) [    x:collection1] o.a.s.u.p.LogUpdateProcessorFactory [collection1]  webapp= path=/update params={waitSearcher=true&commit=true&softCommit=false&wt=javabin&version=2}{commit=} 0 3
   [junit4]   2> 1077061 INFO  (qtp1106616738-19108) [    x:collection1] o.a.s.c.S.Request [collection1]  webapp= path=/select params={q=*:*&wt=javabin&version=2} hits=1 status=0 QTime=0
   [junit4]   2> 1077063 INFO  (qtp2127777786-19133) [    x:collection1] o.a.s.c.S.Request [collection1]  webapp= path=/select params={q=*:*&wt=javabin&version=2} hits=1 status=0 QTime=0
   [junit4]   2> 1077066 INFO  (qtp1106616738-19109) [    x:collection1] o.a.s.u.p.LogUpdateProcessorFactory [collection1]  webapp= path=/update params={update.distrib=FROMLEADER&wt=javabin&version=2}{add=[2 (2)]} 0 2
   [junit4]   2> 1077067 INFO  (qtp2127777786-19128) [    x:collection1] o.a.s.u.PeerSync PeerSync: core=collection1 url= START replicas=[http://127.0.0.1:51084/collection1] nUpdates=100
   [junit4]   2> 1077069 INFO  (qtp1106616738-19111) [    x:collection1] o.a.s.s.SolrIndexSearcher Opening [Searcher@1db0123e[collection1] realtime]
   [junit4]   2> 1077069 INFO  (qtp1106616738-19111) [    x:collection1] o.a.s.u.IndexFingerprint IndexFingerprint millis:3.0 result:{maxVersionSpecified=9223372036854775807, maxVersionEncountered=2, maxInHash=2, versionsHash=-1218814014108643565, numVersions=2, numDocs=2, maxDoc=1}
   [junit4]   2> 1077070 INFO  (qtp1106616738-19111) [    x:collection1] o.a.s.c.S.Request [collection1]  webapp= path=/get params={distrib=false&qt=/get&getFingerprint=9223372036854775807&wt=javabin&version=2} status=0 QTime=3
   [junit4]   2> 1077070 INFO  (qtp2127777786-19128) [    x:collection1] o.a.s.u.IndexFingerprint IndexFingerprint millis:0.0 result:{maxVersionSpecified=9223372036854775807, maxVersionEncountered=1, maxInHash=1, versionsHash=-5451962507482445012, numVersions=1, numDocs=1, maxDoc=1}
   [junit4]   2> 1077071 INFO  (qtp1106616738-19110) [    x:collection1] o.a.s.u.IndexFingerprint IndexFingerprint millis:0.0 result:{maxVersionSpecified=9223372036854775807, maxVersionEncountered=2, maxInHash=2, versionsHash=-1218814014108643565, numVersions=2, numDocs=2, maxDoc=1}
   [junit4]   2> 1077072 INFO  (qtp1106616738-19110) [    x:collection1] o.a.s.c.S.Request [collection1]  webapp= path=/get params={distrib=false&qt=/get&fingerprint=true&getVersions=100&wt=javabin&version=2} status=0 QTime=0
   [junit4]   2> 1077072 INFO  (qtp2127777786-19128) [    x:collection1] o.a.s.u.PeerSync PeerSync: core=collection1 url=  Received 2 versions from http://127.0.0.1:51084/collection1 fingerprint:{maxVersionSpecified=9223372036854775807, maxVersionEncountered=2, maxInHash=2, versionsHash=-1218814014108643565, numVersions=2, numDocs=2, maxDoc=1}
   [junit4]   2> 1077072 INFO  (qtp1106616738-19112) [    x:collection1] o.a.s.c.S.Request [collection1]  webapp= path=/get params={distrib=false&qt=/get&checkCanHandleVersionRanges=false&wt=javabin&version=2} status=0 QTime=0
   [junit4]   2> 1077073 INFO  (qtp2127777786-19128) [    x:collection1] o.a.s.u.PeerSync PeerSync: core=collection1 url= Requesting updates from http://127.0.0.1:51084/collection1n=1 versions=2...2
   [junit4]   2> 1077073 INFO  (qtp1106616738-19107) [    x:collection1] o.a.s.u.IndexFingerprint IndexFingerprint millis:0.0 result:{maxVersionSpecified=2, maxVersionEncountered=2, maxInHash=2, versionsHash=-1218814014108643565, numVersions=2, numDocs=2, maxDoc=1}
   [junit4]   2> 1077073 INFO  (qtp1106616738-19107) [    x:collection1] o.a.s.c.S.Request [collection1]  webapp= path=/get params={getUpdates=2...2&distrib=false&qt=/get&fingerprint=true&onlyIfActive=false&wt=javabin&version=2} status=0 QTime=0
   [junit4]   2> 1077075 INFO  (qtp2127777786-19128) [    x:collection1] o.a.s.u.p.LogUpdateProcessorFactory [collection1] {add=[2 (2)]} 0 2
   [junit4]   2> 1077078 INFO  (qtp2127777786-19128) [    x:collection1] o.a.s.s.SolrIndexSearcher Opening [Searcher@5c88348e[collection1] realtime]
   [junit4]   2> 1077078 INFO  (qtp2127777786-19128) [    x:collection1] o.a.s.u.IndexFingerprint IndexFingerprint millis:2.0 result:{maxVersionSpecified=2, maxVersionEncountered=2, maxInHash=2, versionsHash=-1218814014108643565, numVersions=2, numDocs=2, maxDoc=1}
   [junit4]   2> 1077078 INFO  (qtp2127777786-19128) [    x:collection1] o.a.s.u.PeerSync Fingerprint comparison: 0
   [junit4]   2> 1077078 INFO  (qtp2127777786-19128) [    x:collection1] o.a.s.u.PeerSync PeerSync: core=collection1 url= DONE. sync succeeded
   [junit4]   2> 1077078 INFO  (qtp2127777786-19128) [    x:collection1] o.a.s.c.S.Request [collection1]  webapp= path=/get params={qt=/get&getVersions=100&sync=http://127.0.0.1:51084/collection1&wt=javabin&version=2} status=0 QTime=12
   [junit4]   2> 1077078 INFO  (qtp1106616738-19108) [    x:collection1] o.a.s.u.DirectUpdateHandler2 start commit{_version_=1632394604520144896,optimize=false,openSearcher=true,waitSearcher=true,expungeDeletes=false,softCommit=false,prepareCommit=false}
   [junit4]   2> 1077078 INFO  (qtp1106616738-19108) [    x:collection1] o.a.s.u.SolrIndexWriter Calling setCommitData with IW:org.apache.solr.update.SolrIndexWriter@4c04bf81 commitCommandVersion:1632394604520144896
   [junit4]   2> 1077079 INFO  (qtp1106616738-19108) [    x:collection1] o.a.s.s.SolrIndexSearcher Opening [Searcher@65c638e4[collection1] main]
   [junit4]   2> 1077079 INFO  (qtp1106616738-19108) [    x:collection1] o.a.s.u.DirectUpdateHandler2 end_commit_flush
   [junit4]   2> 1077080 INFO  (searcherExecutor-6214-thread-1-processing-x:collection1) [    x:collection1] o.a.s.c.SolrCore [collection1] Registered new searcher Searcher@65c638e4[collection1] main{ExitableDirectoryReader(UninvertingDirectoryReader(Uninverting(_0(8.2.0):C1:[diagnostics={os=Windows 10, java.vendor=Oracle Corporation, java.version=13-ea, java.vm.version=13-ea+18, lucene.version=8.2.0, os.arch=amd64, java.runtime.version=13-ea+18, source=flush, os.version=10.0, timestamp=1556772808535}]:[attributes={Lucene50StoredFieldsFormat.mode=BEST_SPEED}]) Uninverting(_1(8.2.0):C1:[diagnostics={os=Windows 10, java.vendor=Oracle Corporation, java.version=13-ea, java.vm.version=13-ea+18, lucene.version=8.2.0, os.arch=amd64, java.runtime.version=13-ea+18, source=flush, os.version=10.0, timestamp=1556772808561}]:[attributes={Lucene50StoredFieldsFormat.mode=BEST_SPEED}])))}
   [junit4]   2> 1077080 INFO  (qtp1106616738-19108) [    x:collection1] o.a.s.u.p.LogUpdateProcessorFactory [collection1]  webapp= path=/update params={waitSearcher=true&commit=true&softCommit=false&wt=javabin&version=2}{commit=} 0 2
   [junit4]   2> 1077080 INFO  (qtp2127777786-19129) [    x:collection1] o.a.s.u.DirectUpdateHandler2 start commit{_version_=1632394604522242048,optimize=false,openSearcher=true,waitSearcher=true,expungeDeletes=false,softCommit=false,prepareCommit=false}
   [junit4]   2> 1077080 INFO  (qtp2127777786-19129) [    x:collection1] o.a.s.u.SolrIndexWriter Calling setCommitData with IW:org.apache.solr.update.SolrIndexWriter@bfba200 commitCommandVersion:1632394604522242048
   [junit4]   2> 1077080 INFO  (qtp2127777786-19129) [    x:collection1] o.a.s.s.SolrIndexSearcher Opening [Searcher@5afce152[collection1] main]
   [junit4]   2> 1077080 INFO  (qtp2127777786-19129) [    x:collection1] o.a.s.u.DirectUpdateHandler2 end_commit_flush
   [junit4]   2> 1077080 INFO  (searcherExecutor-6228-thread-1-processing-x:collection1) [    x:collection1] o.a.s.c.SolrCore [collection1] Registered new searcher Searcher@5afce152[collection1] main{ExitableDirectoryReader(UninvertingDirectoryReader(Uninverting(_0(8.2.0):C1:[diagnostics={os=Windows 10, java.vendor=Oracle Corporation, java.version=13-ea, java.vm.version=13-ea+18, lucene.version=8.2.0, os.arch=amd64, java.runtime.version=13-ea+18, source=flush, os.version=10.0, timestamp=1556772808544}]:[attributes={Lucene50StoredFieldsFormat.mode=BEST_SPEED}]) Uninverting(_1(8.2.0):C1:[diagnostics={os=Windows 10, java.vendor=Oracle Corporation, java.version=13-ea, java.vm.version=13-ea+18, lucene.version=8.2.0, os.arch=amd64, java.runtime.version=13-ea+18, source=flush, os.version=10.0, timestamp=1556772808570}]:[attributes={Lucene50StoredFieldsFormat.mode=BEST_SPEED}])))}
   [junit4]   2> 1077080 INFO  (qtp2127777786-19129) [    x:collection1] o.a.s.u.p.LogUpdateProcessorFactory [collection1]  webapp= path=/update params={waitSearcher=true&commit=true&softCommit=false&wt=javabin&version=2}{commit=} 0 1
   [junit4]   2> 1077084 INFO  (qtp1106616738-19109) [    x:collection1] o.a.s.c.S.Request [collection1]  webapp= path=/select params={q=*:*&wt=javabin&version=2} hits=2 status=0 QTime=0
   [junit4]   2> 1077087 INFO  (qtp2127777786-19130) [    x:collection1] o.a.s.c.S.Request [collection1]  webapp= path=/select params={q=*:*&wt=javabin&version=2} hits=2 status=0 QTime=0
   [junit4]   2> 1077092 INFO  (qtp1106616738-19111) [    x:collection1] o.a.s.u.p.LogUpdateProcessorFactory [collection1]  webapp= path=/update params={update.distrib=FROMLEADER&wt=javabin&version=2}{add=[3 (3)]} 0 2
   [junit4]   2> 1077094 INFO  (qtp1106616738-19111) [    x:collection1] o.a.s.u.p.LogUpdateProcessorFactory [collection1]  webapp= path=/update params={update.distrib=FROMLEADER&wt=javabin&version=2}{add=[4 (4)]} 0 1
   [junit4]   2> 1077095 INFO  (qtp1106616738-19112) [    x:collection1] o.a.s.u.p.LogUpdateProcessorFactory [collection1]  webapp= path=/update params={update.distrib=FROMLEADER&wt=javabin&version=2}{add=[5 (5)]} 0 0
   [junit4]   2> 1077095 INFO  (qtp1106616738-19107) [    x:collection1] o.a.s.u.p.LogUpdateProcessorFactory [collection1]  webapp= path=/update params={update.distrib=FROMLEADER&wt=javabin&version=2}{add=[6 (6)]} 0 0
   [junit4]   2> 1077096 INFO  (qtp1106616738-19108) [    x:collection1] o.a.s.u.p.LogUpdateProcessorFactory [collection1]  webapp= path=/update params={update.distrib=FROMLEADER&wt=javabin&version=2}{add=[7 (7)]} 0 0
   [junit4]   2> 1077096 INFO  (qtp1106616738-19109) [    x:collection1] o.a.s.u.p.LogUpdateProcessorFactory [collection1]  webapp= path=/update params={update.distrib=FROMLEADER&wt=javabin&version=2}{add=[8 (8)]} 0 0
   [junit4]   2> 1077098 INFO  (qtp1106616738-19110) [    x:collection1] o.a.s.u.p.LogUpdateProcessorFactory [collection1]  webapp= path=/update params={update.distrib=FROMLEADER&wt=javabin&version=2}{add=[9 (9)]} 0 0
   [junit4]   2> 1077098 INFO  (qtp1106616738-19111) [    x:collection1] o.a.s.u.p.LogUpdateProcessorFactory [collection1]  webapp= path=/update params={update.distrib=FROMLEADER&wt=javabin&version=2}{add=[10 (10)]} 0 0
   [junit4]   2> 1077098 INFO  (qtp2127777786-19131) [    x:collection1] o.a.s.u.PeerSync PeerSync: core=collection1 url= START replicas=[http://127.0.0.1:51084/collection1] nUpdates=100
   [junit4]   2> 1077100 INFO  (qtp1106616738-19112) [    x:collection1] o.a.s.s.SolrIndexSearcher Opening [Searcher@1dd1c2dc[collection1] realtime]
   [junit4]   2> 1077100 INFO  (qtp1106616738-19112) [    x:collection1] o.a.s.u.IndexFingerprint IndexFingerprint millis:3.0 result:{maxVersionSpecified=9223372036854775807, maxVersionEncountered=10, maxInHash=10, versionsHash=-5671163287542876028, numVersions=10, numDocs=10, maxDoc=8}
   [junit4]   2> 1077100 INFO  (qtp1106616738-19112) [    x:collection1] o.a.s.c.S.Request [collection1]  webapp= path=/get params={distrib=false&qt=/get&getFingerprint=9223372036854775807&wt=javabin&version=2} status=0 QTime=3
   [junit4]   2> 1077100 INFO  (qtp2127777786-19131) [    x:collection1] o.a.s.u.IndexFingerprint IndexFingerprint millis:0.0 result:{maxVersionSpecified=9223372036854775807, maxVersionEncountered=2, maxInHash=2, versionsHash=-1218814014108643565, numVersions=2, numDocs=2, maxDoc=1}
   [junit4]   2> 1077104 INFO  (qtp1106616738-19107) [    x:collection1] o.a.s.u.IndexFingerprint IndexFingerprint millis:0.0 result:{maxVersionSpecified=9223372036854775807, maxVersionEncountered=10, maxInHash=10, versionsHash=-5671163287542876028, numVersions=10, numDocs=10, maxDoc=8}
   [junit4]   2> 1077104 INFO  (qtp1106616738-19107) [    x:collection1] o.a.s.c.S.Request [collection1]  webapp= path=/get params={distrib=false&qt=/get&fingerprint=true&getVersions=100&wt=javabin&version=2} status=0 QTime=0
   [junit4]   2> 1077104 INFO  (qtp2127777786-19131) [    x:collection1] o.a.s.u.PeerSync PeerSync: core=collection1 url=  Received 10 versions from http://127.0.0.1:51084/collection1 fingerprint:{maxVersionSpecified=9223372036854775807, maxVersionEncountered=10, maxInHash=10, versionsHash=-5671163287542876028, numVersions=10, numDocs=10, maxDoc=8}
   [junit4]   2> 1077104 INFO  (qtp1106616738-19108) [    x:collection1] o.a.s.c.S.Request [collection1]  webapp= path=/get params={distrib=false&qt=/get&checkCanHandleVersionRanges=false&wt=javabin&version=2} status=0 QTime=0
   [junit4]   2> 1077104 INFO  (qtp2127777786-19131) [    x:collection1] o.a.s.u.PeerSync PeerSync: core=collection1 url= Requesting updates from http://127.0.0.1:51084/collection1n=8 versions=3...10
   [junit4]   2> 1077104 INFO  (qtp1106616738-19109) [    x:collection1] o.a.s.u.IndexFingerprint IndexFingerprint millis:0.0 result:{maxVersionSpecified=10, maxVersionEncountered=10, maxInHash=10, versionsHash=-5671163287542876028, numVersions=10, numDocs=10, maxDoc=8}
   [junit4]   2> 1077104 INFO  (qtp1106616738-19109) [    x:collection1] o.a.s.c.S.Request [collection1]  webapp= path=/get params={getUpdates=3...10&distrib=false&qt=/get&fingerprint=true&onlyIfActive=false&wt=javabin&ve

[...truncated too long message...]

QParserPlugin, TestImpersonationWithHadoopAuth, MissingSegmentRecoveryTest, TlogReplayBufferedWhileIndexingTest, CursorMarkTest, IndexBasedSpellCheckerTest, BJQParserTest, SolrMetricReporterTest, SmileWriterTest, TestSimGenericDistributedQueue, CdcrBootstrapTest, SOLR749Test, AutoAddReplicasPlanActionTest, TestDistribIDF, TestManagedSynonymFilterFactory, TestSolrCLIRunExample, SyncSliceTest, TestSizeLimitedDistributedMap, TestCoreBackup, TestUseDocValuesAsStored, ImplicitSnitchTest, RestartWhileUpdatingTest, TestSegmentSorting, IndexSizeTriggerTest, TestSha256AuthenticationProvider, CdcrUpdateLogTest, SolrGraphiteReporterTest, TestCloudJSONFacetJoinDomain, TestWordDelimiterFilterFactory, SSLMigrationTest, ShardRoutingCustomTest, DirectSolrConnectionTest, SparseHLLTest, TestSolr4Spatial2, SimpleCollectionCreateDeleteTest, TestMinMaxOnMultiValuedField, DistributedFacetPivotLargeTest, TestZkAclsWithHadoopAuth, UnloadDistributedZkTest, SuggesterTSTTest, NotRequiredUniqueKeyTest, PeerSyncWithBufferUpdatesTest, TestGraphTermsQParserPlugin, SolrCoreMetricManagerTest, AssignTest, SharedFSAutoReplicaFailoverTest, TriggerCooldownIntegrationTest, TestNumericRangeQuery32, TestMiniSolrCloudClusterSSL, SolrRrdBackendFactoryTest, CleanupOldIndexTest, RecoveryZkTest, ChaosMonkeySafeLeaderWithPullReplicasTest, TransactionLogTest, CustomHighlightComponentTest, ReturnFieldsTest, LegacyCloudClusterPropTest, AddSchemaFieldsUpdateProcessorFactoryTest, TestStressUserVersions, TestCoreDiscovery, SolrCloudReportersTest, RangeFacetCloudTest, SolrRequestParserTest, WordBreakSolrSpellCheckerTest, AddBlockUpdateTest, DistribCursorPagingTest, TestCursorMarkWithoutUniqueKey, TestPayloadScoreQParserPlugin, TestSolrXml, DistributedQueryElevationComponentTest, TestRandomRequestDistribution, TestHashPartitioner, RemoteQueryErrorTest, CollectionPropsTest, TestSolrCloudWithSecureImpersonation, TestClusterProperties, DistributedVersionInfoTest, TestSchemalessBufferedUpdates, OpenExchangeRatesOrgProviderTest, TestPhraseSuggestions, SolrXmlInZkTest, HdfsRecoverLeaseTest, TestSearcherReuse, SuggesterWFSTTest, TestSortByMinMaxFunction, XmlInterpolationTest, MoreLikeThisHandlerTest, TestCryptoKeys, CoreAdminOperationTest, TestCharFilters, TestFieldSortValues, TestExactStatsCache, TestExtendedDismaxParser, TestBulkSchemaConcurrent, CloneFieldUpdateProcessorFactoryTest, TestConfig, TestDFISimilarityFactory, PrimitiveFieldTypeTest, SolrCLIZkUtilsTest, DirectUpdateHandlerTest, ConfigureRecoveryStrategyTest, TestTestInjection, ZookeeperStatusHandlerTest, AuthToolTest, CloudMLTQParserTest, DateFieldTest, ConcurrentDeleteAndCreateCollectionTest, TestNestedDocsSort, TestSubQueryTransformerCrossCore, BasicDistributedZk2Test, ShufflingReplicaListTransformerTest, HdfsRestartWhileUpdatingTest, SearchRateTriggerIntegrationTest, BlobRepositoryCloudTest, PeerSyncWithLeaderAndIndexFingerprintCachingTest, TestHdfsUpdateLog, SolrPluginUtilsTest, FullSolrCloudDistribCmdsTest, TestWriterPerf, TestLegacyTerms, TestFieldResource, CSVRequestHandlerTest, DistributedIntervalFacetingTest, XmlUpdateRequestHandlerTest, TestFileDictionaryLookup, TestLFUCache, TestNonDefinedSimilarityFactory, TestPerFieldSimilarityWithDefaultOverride, TimeZoneUtilsTest, TestMinHashQParser, SortSpecParsingTest, SpellingQueryConverterTest, PeerSyncReplicationTest, TestDynamicFieldResource, AnalysisAfterCoreReloadTest, CursorPagingTest, DisMaxRequestHandlerTest, OutputWriterTest, SampleTest, SolrTestCaseJ4Test, TestDistributedGrouping, TestDistributedMissingSort, TestDistributedSearch, TestDocumentBuilder, TestHighlightDedupGrouping, TestRandomDVFaceting, TestRandomFaceting, TestSimpleTrackingShardHandler, TestSolrCoreProperties, TestTolerantSearch, TestTrie, PathHierarchyTokenizerFactoryTest, TestLuceneMatchVersion, TokenizerChainTest, TestLuceneIndexBackCompat, TestJettySolrRunner, ConnectionReuseTest, ActionThrottleTest, AssignBackwardCompatibilityTest, BasicDistributedZkTest, BasicZkTest, ChaosMonkeyNothingIsSafeWithPullReplicasTest, ChaosMonkeySafeLeaderTest, CloudExitableDirectoryReaderTest, ClusterStateTest, CollectionStateFormat2Test, CollectionsAPISolrJTest, ForceLeaderTest, ForceLeaderWithTlogReplicasTest, HttpPartitionOnCommitTest, HttpPartitionWithTlogReplicasTest, LeaderFailureAfterFreshStartTest, MultiSolrCloudTestCaseTest, OverseerCollectionConfigSetProcessorTest, OverseerModifyCollectionTest, OverseerRolesTest, OverseerTaskQueueTest, ReindexCollectionTest, TestCloudSearcherWarming, TestPullReplicaErrorHandling, TestSkipOverseerOperations, TestStressLiveNodes, TestTlogReplica, TestTolerantUpdateProcessorRandomCloud, ZkNodePropsTest, ZkShardTermsTest, ZkSolrClientTest, CollectionReloadTest, TestCollectionAPI, TestCollectionsAPIViaSolrCloudCluster, TestHdfsCloudBackupRestore, TestLocalFSCloudBackupRestore, TestReplicaProperties, AutoAddReplicasIntegrationTest, HdfsAutoAddReplicasIntegrationTest, MetricTriggerIntegrationTest, NodeAddedTriggerTest, RestoreTriggerStateTest, ScheduledTriggerIntegrationTest, ScheduledTriggerTest, SystemLogListenerTest, TestSimClusterStateProvider, TestSimDistribStateManager, TestSimNodeAddedTrigger, TestSimNodeLostTrigger, TestSimPolicyCloud, TestSimTriggerIntegration, BaseCdcrDistributedZkTest, CdcrBidirectionalTest, CdcrRequestHandlerTest, CdcrWithNodesRestartsTest, HDFSCollectionsAPITest, HdfsBasicDistributedZkTest, HdfsChaosMonkeyNothingIsSafeTest, HdfsChaosMonkeySafeLeaderTest, HdfsNNFailoverTest, HdfsThreadLeakTest, HdfsTlogReplayBufferedWhileIndexingTest, HdfsUnloadDistributedZkTest, TestClusterStateMutator, ZkStateReaderTest, ZkStateWriterTest, RulesTest, TestCodecSupport, TestConfigSetProperties, TestCustomStream, TestDynamicURP, TestInfoStreamLogging, TestInitParams, TestJmxIntegration, TestLazyCores, TestQuerySenderListener, TestShardHandlerFactory, TestSolrConfigHandler, BinaryUpdateRequestHandlerTest, DocumentAnalysisRequestHandlerTest, FieldAnalysisRequestHandlerTest, JsonLoaderTest, PingRequestHandlerTest, SearchHandlerTest, TestCSVLoader, TestReplicationHandler, TestSystemCollAutoCreate, InfoHandlerTest, MBeansHandlerTest, DistributedDebugComponentTest, DistributedExpandComponentTest, DistributedFacetPivotSmallAdvancedTest, DistributedFacetPivotWhiteBoxTest, DistributedQueryComponentOptimizationTest, DistributedSpellCheckComponentTest, SuggestComponentTest, TestDistributedStatsComponentCardinality, TestHttpShardHandlerFactory, TestPivotHelperCode, TestTrackingShardHandlerFactory, TestUnifiedSolrHighlighter, WrapperMergePolicyFactoryTest, TestLegacyFieldReuse, TestMultiValuedNumericRangeQuery, TestNumericTokenStream, JvmMetricsTest, SolrJmxReporterTest, TestIntervalFaceting, TestChildDocTransformerHierarchy, TestRestManager, TestCopyFieldCollectionResource, TestDynamicFieldCollectionResource, TestFieldCollectionResource, TestFieldTypeCollectionResource, TestSchemaSimilarityResource, TestSerializedLuceneMatchVersion, TestManagedStopFilterFactory, BooleanFieldTest, ChangedSchemaMergeTest, CurrencyFieldTypeTest, DocValuesMultiTest, ExternalFileFieldSortTest, IndexSchemaTest, ManagedSchemaRoundRobinCloudTest, NumericFieldsTest, PreAnalyzedFieldManagedSchemaCloudTest, SynonymTokenizerTest, TestCollationField, TestCollationFieldDocValues, TestHalfAndHalfDocValues, TestPointFields, QueryEqualityTest, TestCollapseQParserPlugin, TestDocSet, TestElisionMultitermQuery, TestFiltering, TestInitQParser, TestLRUCache, TestMultiWordSynonyms, TestPayloadCheckQParserPlugin, TestRTGBase, TestReRankQParserPlugin, TestRealTimeGet, TestRecoveryHdfs, TestReloadDeadlock, TestSimpleQParserPlugin, TestSmileRequest, TestSolrFieldCacheBean, TestSolrQueryParser, TestStandardQParsers, TestStressLucene, TestStressVersions, TestValueSourceCache, TestJsonFacetsStatsParsing, TestJsonFacetsWithNestedObjects, SortByFunctionTest, TestFunctionQuery, DistanceFunctionTest, BlockJoinFacetDistribTest, BlockJoinFacetRandomTest, BlockJoinFacetSimpleTest, GraphQueryTest, TestScoreJoinQPScore, TestJsonRequest, SimpleMLTQParserTest, TestBM25SimilarityFactory, TestClassicSimilarityFactory, TestIBSimilarityFactory, TestLMJelinekMercerSimilarityFactory, TestPerFieldSimilarity, TestExactSharedStatsCache, BasicAuthIntegrationTest, MultiDestinationAuditLoggerTest, SolrLogAuditLoggerPluginTest, TestAuthorizationFramework, ConjunctionSolrSpellCheckerTest, DirectSolrSpellCheckerTest, SpellCheckCollatorTest, TestAnalyzeInfixSuggestions, TestFuzzyAnalyzedSuggestions, BlockDirectoryTest, TestFieldCacheWithThreads, TestLegacyFieldCache, AnalysisErrorHandlingTest, DataDrivenBlockJoinTest, DocumentBuilderTest, PeerSyncWithLeaderTest]
   [junit4] Completed [831/855 (2!)] on J1 in 141.76s, 1 test, 1 failure <<< FAILURES!

[...truncated 9053 lines...]
BUILD FAILED
C:\Users\jenkins\workspace\Lucene-Solr-8.x-Windows\build.xml:634: The following error occurred while executing this line:
C:\Users\jenkins\workspace\Lucene-Solr-8.x-Windows\build.xml:128: Found 1 violations in source files (File uses Mockito but has no assumeWorkingMockito() call).

Total time: 108 minutes 54 seconds
Build step 'Invoke Ant' marked build as failure
Archiving artifacts
Setting ANT_1_8_2_HOME=C:\Users\jenkins\tools\hudson.tasks.Ant_AntInstallation\ANT_1.8.2
[WARNINGS] Skipping publisher since build result is FAILURE
Recording test results
Setting ANT_1_8_2_HOME=C:\Users\jenkins\tools\hudson.tasks.Ant_AntInstallation\ANT_1.8.2
Email was triggered for: Failure - Any
Sending email for trigger: Failure - Any
Setting ANT_1_8_2_HOME=C:\Users\jenkins\tools\hudson.tasks.Ant_AntInstallation\ANT_1.8.2
Setting ANT_1_8_2_HOME=C:\Users\jenkins\tools\hudson.tasks.Ant_AntInstallation\ANT_1.8.2
Setting ANT_1_8_2_HOME=C:\Users\jenkins\tools\hudson.tasks.Ant_AntInstallation\ANT_1.8.2
Setting ANT_1_8_2_HOME=C:\Users\jenkins\tools\hudson.tasks.Ant_AntInstallation\ANT_1.8.2
Setting ANT_1_8_2_HOME=C:\Users\jenkins\tools\hudson.tasks.Ant_AntInstallation\ANT_1.8.2
Setting ANT_1_8_2_HOME=C:\Users\jenkins\tools\hudson.tasks.Ant_AntInstallation\ANT_1.8.2

Mime
View raw message