lucene-dev mailing list archives

Site index · List index
Message view « Date » · « Thread »
Top « Date » · « Thread »
From Policeman Jenkins Server <jenk...@thetaphi.de>
Subject [JENKINS] Lucene-Solr-master-Windows (64bit/jdk-12) - Build # 7927 - Unstable!
Date Tue, 07 May 2019 11:02:19 GMT
Build: https://jenkins.thetaphi.de/job/Lucene-Solr-master-Windows/7927/
Java: 64bit/jdk-12 -XX:+UseCompressedOops -XX:+UseG1GC

5 tests failed.
FAILED:  org.apache.solr.security.JWTAuthPluginIntegrationTest.createCollectionUpdateAndQueryDistributed

Error Message:
Expected metric minimums for prefix SECURITY./authentication/pki.: {failMissingCredentials=0, authenticated=12, passThrough=0, failWrongCredentials=0, requests=12, errors=0}, but got: {failMissingCredentials=0, authenticated=4, passThrough=0, totalTime=14552300, failWrongCredentials=0, requestTimes=349, requests=4, errors=0}

Stack Trace:
java.lang.AssertionError: Expected metric minimums for prefix SECURITY./authentication/pki.: {failMissingCredentials=0, authenticated=12, passThrough=0, failWrongCredentials=0, requests=12, errors=0}, but got: {failMissingCredentials=0, authenticated=4, passThrough=0, totalTime=14552300, failWrongCredentials=0, requestTimes=349, requests=4, errors=0}
	at __randomizedtesting.SeedInfo.seed([22115CB07A9CDE29:24395EDE182B489A]:0)
	at org.junit.Assert.fail(Assert.java:88)
	at org.junit.Assert.assertTrue(Assert.java:41)
	at org.apache.solr.cloud.SolrCloudAuthTestCase.assertAuthMetricsMinimums(SolrCloudAuthTestCase.java:129)
	at org.apache.solr.cloud.SolrCloudAuthTestCase.assertPkiAuthMetricsMinimums(SolrCloudAuthTestCase.java:74)
	at org.apache.solr.security.JWTAuthPluginIntegrationTest.createCollectionUpdateAndQueryDistributed(JWTAuthPluginIntegrationTest.java:173)
	at java.base/jdk.internal.reflect.NativeMethodAccessorImpl.invoke0(Native Method)
	at java.base/jdk.internal.reflect.NativeMethodAccessorImpl.invoke(NativeMethodAccessorImpl.java:62)
	at java.base/jdk.internal.reflect.DelegatingMethodAccessorImpl.invoke(DelegatingMethodAccessorImpl.java:43)
	at java.base/java.lang.reflect.Method.invoke(Method.java:567)
	at com.carrotsearch.randomizedtesting.RandomizedRunner.invoke(RandomizedRunner.java:1750)
	at com.carrotsearch.randomizedtesting.RandomizedRunner$8.evaluate(RandomizedRunner.java:938)
	at com.carrotsearch.randomizedtesting.RandomizedRunner$9.evaluate(RandomizedRunner.java:974)
	at com.carrotsearch.randomizedtesting.RandomizedRunner$10.evaluate(RandomizedRunner.java:988)
	at com.carrotsearch.randomizedtesting.rules.SystemPropertiesRestoreRule$1.evaluate(SystemPropertiesRestoreRule.java:57)
	at org.apache.lucene.util.TestRuleSetupTeardownChained$1.evaluate(TestRuleSetupTeardownChained.java:49)
	at org.apache.lucene.util.AbstractBeforeAfterRule$1.evaluate(AbstractBeforeAfterRule.java:45)
	at org.apache.lucene.util.TestRuleThreadAndTestName$1.evaluate(TestRuleThreadAndTestName.java:48)
	at org.apache.lucene.util.TestRuleIgnoreAfterMaxFailures$1.evaluate(TestRuleIgnoreAfterMaxFailures.java:64)
	at org.apache.lucene.util.TestRuleMarkFailure$1.evaluate(TestRuleMarkFailure.java:47)
	at com.carrotsearch.randomizedtesting.rules.StatementAdapter.evaluate(StatementAdapter.java:36)
	at com.carrotsearch.randomizedtesting.ThreadLeakControl$StatementRunner.run(ThreadLeakControl.java:368)
	at com.carrotsearch.randomizedtesting.ThreadLeakControl.forkTimeoutingTask(ThreadLeakControl.java:817)
	at com.carrotsearch.randomizedtesting.ThreadLeakControl$3.evaluate(ThreadLeakControl.java:468)
	at com.carrotsearch.randomizedtesting.RandomizedRunner.runSingleTest(RandomizedRunner.java:947)
	at com.carrotsearch.randomizedtesting.RandomizedRunner$5.evaluate(RandomizedRunner.java:832)
	at com.carrotsearch.randomizedtesting.RandomizedRunner$6.evaluate(RandomizedRunner.java:883)
	at com.carrotsearch.randomizedtesting.RandomizedRunner$7.evaluate(RandomizedRunner.java:894)
	at com.carrotsearch.randomizedtesting.rules.StatementAdapter.evaluate(StatementAdapter.java:36)
	at com.carrotsearch.randomizedtesting.rules.SystemPropertiesRestoreRule$1.evaluate(SystemPropertiesRestoreRule.java:57)
	at org.apache.lucene.util.AbstractBeforeAfterRule$1.evaluate(AbstractBeforeAfterRule.java:45)
	at com.carrotsearch.randomizedtesting.rules.StatementAdapter.evaluate(StatementAdapter.java:36)
	at org.apache.lucene.util.TestRuleStoreClassName$1.evaluate(TestRuleStoreClassName.java:41)
	at com.carrotsearch.randomizedtesting.rules.NoShadowingOrOverridesOnMethodsRule$1.evaluate(NoShadowingOrOverridesOnMethodsRule.java:40)
	at com.carrotsearch.randomizedtesting.rules.NoShadowingOrOverridesOnMethodsRule$1.evaluate(NoShadowingOrOverridesOnMethodsRule.java:40)
	at com.carrotsearch.randomizedtesting.rules.StatementAdapter.evaluate(StatementAdapter.java:36)
	at com.carrotsearch.randomizedtesting.rules.StatementAdapter.evaluate(StatementAdapter.java:36)
	at org.apache.lucene.util.TestRuleAssertionsRequired$1.evaluate(TestRuleAssertionsRequired.java:53)
	at org.apache.lucene.util.TestRuleMarkFailure$1.evaluate(TestRuleMarkFailure.java:47)
	at org.apache.lucene.util.TestRuleIgnoreAfterMaxFailures$1.evaluate(TestRuleIgnoreAfterMaxFailures.java:64)
	at org.apache.lucene.util.TestRuleIgnoreTestSuites$1.evaluate(TestRuleIgnoreTestSuites.java:54)
	at com.carrotsearch.randomizedtesting.rules.StatementAdapter.evaluate(StatementAdapter.java:36)
	at com.carrotsearch.randomizedtesting.ThreadLeakControl$StatementRunner.run(ThreadLeakControl.java:368)
	at java.base/java.lang.Thread.run(Thread.java:835)


FAILED:  org.apache.solr.security.JWTAuthPluginIntegrationTest.createCollectionUpdateAndQueryDistributed

Error Message:
Expected metric minimums for prefix SECURITY./authentication/pki.: {failMissingCredentials=0, authenticated=12, passThrough=0, failWrongCredentials=0, requests=12, errors=0}, but got: {failMissingCredentials=0, authenticated=4, passThrough=0, totalTime=9532100, failWrongCredentials=0, requestTimes=369, requests=4, errors=0}

Stack Trace:
java.lang.AssertionError: Expected metric minimums for prefix SECURITY./authentication/pki.: {failMissingCredentials=0, authenticated=12, passThrough=0, failWrongCredentials=0, requests=12, errors=0}, but got: {failMissingCredentials=0, authenticated=4, passThrough=0, totalTime=9532100, failWrongCredentials=0, requestTimes=369, requests=4, errors=0}
	at __randomizedtesting.SeedInfo.seed([22115CB07A9CDE29:24395EDE182B489A]:0)
	at org.junit.Assert.fail(Assert.java:88)
	at org.junit.Assert.assertTrue(Assert.java:41)
	at org.apache.solr.cloud.SolrCloudAuthTestCase.assertAuthMetricsMinimums(SolrCloudAuthTestCase.java:129)
	at org.apache.solr.cloud.SolrCloudAuthTestCase.assertPkiAuthMetricsMinimums(SolrCloudAuthTestCase.java:74)
	at org.apache.solr.security.JWTAuthPluginIntegrationTest.createCollectionUpdateAndQueryDistributed(JWTAuthPluginIntegrationTest.java:173)
	at java.base/jdk.internal.reflect.NativeMethodAccessorImpl.invoke0(Native Method)
	at java.base/jdk.internal.reflect.NativeMethodAccessorImpl.invoke(NativeMethodAccessorImpl.java:62)
	at java.base/jdk.internal.reflect.DelegatingMethodAccessorImpl.invoke(DelegatingMethodAccessorImpl.java:43)
	at java.base/java.lang.reflect.Method.invoke(Method.java:567)
	at com.carrotsearch.randomizedtesting.RandomizedRunner.invoke(RandomizedRunner.java:1750)
	at com.carrotsearch.randomizedtesting.RandomizedRunner$8.evaluate(RandomizedRunner.java:938)
	at com.carrotsearch.randomizedtesting.RandomizedRunner$9.evaluate(RandomizedRunner.java:974)
	at com.carrotsearch.randomizedtesting.RandomizedRunner$10.evaluate(RandomizedRunner.java:988)
	at com.carrotsearch.randomizedtesting.rules.SystemPropertiesRestoreRule$1.evaluate(SystemPropertiesRestoreRule.java:57)
	at org.apache.lucene.util.TestRuleSetupTeardownChained$1.evaluate(TestRuleSetupTeardownChained.java:49)
	at org.apache.lucene.util.AbstractBeforeAfterRule$1.evaluate(AbstractBeforeAfterRule.java:45)
	at org.apache.lucene.util.TestRuleThreadAndTestName$1.evaluate(TestRuleThreadAndTestName.java:48)
	at org.apache.lucene.util.TestRuleIgnoreAfterMaxFailures$1.evaluate(TestRuleIgnoreAfterMaxFailures.java:64)
	at org.apache.lucene.util.TestRuleMarkFailure$1.evaluate(TestRuleMarkFailure.java:47)
	at com.carrotsearch.randomizedtesting.rules.StatementAdapter.evaluate(StatementAdapter.java:36)
	at com.carrotsearch.randomizedtesting.ThreadLeakControl$StatementRunner.run(ThreadLeakControl.java:368)
	at com.carrotsearch.randomizedtesting.ThreadLeakControl.forkTimeoutingTask(ThreadLeakControl.java:817)
	at com.carrotsearch.randomizedtesting.ThreadLeakControl$3.evaluate(ThreadLeakControl.java:468)
	at com.carrotsearch.randomizedtesting.RandomizedRunner.runSingleTest(RandomizedRunner.java:947)
	at com.carrotsearch.randomizedtesting.RandomizedRunner$5.evaluate(RandomizedRunner.java:832)
	at com.carrotsearch.randomizedtesting.RandomizedRunner$6.evaluate(RandomizedRunner.java:883)
	at com.carrotsearch.randomizedtesting.RandomizedRunner$7.evaluate(RandomizedRunner.java:894)
	at com.carrotsearch.randomizedtesting.rules.StatementAdapter.evaluate(StatementAdapter.java:36)
	at com.carrotsearch.randomizedtesting.rules.SystemPropertiesRestoreRule$1.evaluate(SystemPropertiesRestoreRule.java:57)
	at org.apache.lucene.util.AbstractBeforeAfterRule$1.evaluate(AbstractBeforeAfterRule.java:45)
	at com.carrotsearch.randomizedtesting.rules.StatementAdapter.evaluate(StatementAdapter.java:36)
	at org.apache.lucene.util.TestRuleStoreClassName$1.evaluate(TestRuleStoreClassName.java:41)
	at com.carrotsearch.randomizedtesting.rules.NoShadowingOrOverridesOnMethodsRule$1.evaluate(NoShadowingOrOverridesOnMethodsRule.java:40)
	at com.carrotsearch.randomizedtesting.rules.NoShadowingOrOverridesOnMethodsRule$1.evaluate(NoShadowingOrOverridesOnMethodsRule.java:40)
	at com.carrotsearch.randomizedtesting.rules.StatementAdapter.evaluate(StatementAdapter.java:36)
	at com.carrotsearch.randomizedtesting.rules.StatementAdapter.evaluate(StatementAdapter.java:36)
	at org.apache.lucene.util.TestRuleAssertionsRequired$1.evaluate(TestRuleAssertionsRequired.java:53)
	at org.apache.lucene.util.TestRuleMarkFailure$1.evaluate(TestRuleMarkFailure.java:47)
	at org.apache.lucene.util.TestRuleIgnoreAfterMaxFailures$1.evaluate(TestRuleIgnoreAfterMaxFailures.java:64)
	at org.apache.lucene.util.TestRuleIgnoreTestSuites$1.evaluate(TestRuleIgnoreTestSuites.java:54)
	at com.carrotsearch.randomizedtesting.rules.StatementAdapter.evaluate(StatementAdapter.java:36)
	at com.carrotsearch.randomizedtesting.ThreadLeakControl$StatementRunner.run(ThreadLeakControl.java:368)
	at java.base/java.lang.Thread.run(Thread.java:835)


FAILED:  org.apache.solr.security.JWTAuthPluginIntegrationTest.createCollectionUpdateAndQueryDistributed

Error Message:
Expected metric minimums for prefix SECURITY./authentication/pki.: {failMissingCredentials=0, authenticated=12, passThrough=0, failWrongCredentials=0, requests=12, errors=0}, but got: {failMissingCredentials=0, authenticated=4, passThrough=0, totalTime=6850300, failWrongCredentials=0, requestTimes=354, requests=4, errors=0}

Stack Trace:
java.lang.AssertionError: Expected metric minimums for prefix SECURITY./authentication/pki.: {failMissingCredentials=0, authenticated=12, passThrough=0, failWrongCredentials=0, requests=12, errors=0}, but got: {failMissingCredentials=0, authenticated=4, passThrough=0, totalTime=6850300, failWrongCredentials=0, requestTimes=354, requests=4, errors=0}
	at __randomizedtesting.SeedInfo.seed([22115CB07A9CDE29:24395EDE182B489A]:0)
	at org.junit.Assert.fail(Assert.java:88)
	at org.junit.Assert.assertTrue(Assert.java:41)
	at org.apache.solr.cloud.SolrCloudAuthTestCase.assertAuthMetricsMinimums(SolrCloudAuthTestCase.java:129)
	at org.apache.solr.cloud.SolrCloudAuthTestCase.assertPkiAuthMetricsMinimums(SolrCloudAuthTestCase.java:74)
	at org.apache.solr.security.JWTAuthPluginIntegrationTest.createCollectionUpdateAndQueryDistributed(JWTAuthPluginIntegrationTest.java:173)
	at java.base/jdk.internal.reflect.NativeMethodAccessorImpl.invoke0(Native Method)
	at java.base/jdk.internal.reflect.NativeMethodAccessorImpl.invoke(NativeMethodAccessorImpl.java:62)
	at java.base/jdk.internal.reflect.DelegatingMethodAccessorImpl.invoke(DelegatingMethodAccessorImpl.java:43)
	at java.base/java.lang.reflect.Method.invoke(Method.java:567)
	at com.carrotsearch.randomizedtesting.RandomizedRunner.invoke(RandomizedRunner.java:1750)
	at com.carrotsearch.randomizedtesting.RandomizedRunner$8.evaluate(RandomizedRunner.java:938)
	at com.carrotsearch.randomizedtesting.RandomizedRunner$9.evaluate(RandomizedRunner.java:974)
	at com.carrotsearch.randomizedtesting.RandomizedRunner$10.evaluate(RandomizedRunner.java:988)
	at com.carrotsearch.randomizedtesting.rules.SystemPropertiesRestoreRule$1.evaluate(SystemPropertiesRestoreRule.java:57)
	at org.apache.lucene.util.TestRuleSetupTeardownChained$1.evaluate(TestRuleSetupTeardownChained.java:49)
	at org.apache.lucene.util.AbstractBeforeAfterRule$1.evaluate(AbstractBeforeAfterRule.java:45)
	at org.apache.lucene.util.TestRuleThreadAndTestName$1.evaluate(TestRuleThreadAndTestName.java:48)
	at org.apache.lucene.util.TestRuleIgnoreAfterMaxFailures$1.evaluate(TestRuleIgnoreAfterMaxFailures.java:64)
	at org.apache.lucene.util.TestRuleMarkFailure$1.evaluate(TestRuleMarkFailure.java:47)
	at com.carrotsearch.randomizedtesting.rules.StatementAdapter.evaluate(StatementAdapter.java:36)
	at com.carrotsearch.randomizedtesting.ThreadLeakControl$StatementRunner.run(ThreadLeakControl.java:368)
	at com.carrotsearch.randomizedtesting.ThreadLeakControl.forkTimeoutingTask(ThreadLeakControl.java:817)
	at com.carrotsearch.randomizedtesting.ThreadLeakControl$3.evaluate(ThreadLeakControl.java:468)
	at com.carrotsearch.randomizedtesting.RandomizedRunner.runSingleTest(RandomizedRunner.java:947)
	at com.carrotsearch.randomizedtesting.RandomizedRunner$5.evaluate(RandomizedRunner.java:832)
	at com.carrotsearch.randomizedtesting.RandomizedRunner$6.evaluate(RandomizedRunner.java:883)
	at com.carrotsearch.randomizedtesting.RandomizedRunner$7.evaluate(RandomizedRunner.java:894)
	at com.carrotsearch.randomizedtesting.rules.StatementAdapter.evaluate(StatementAdapter.java:36)
	at com.carrotsearch.randomizedtesting.rules.SystemPropertiesRestoreRule$1.evaluate(SystemPropertiesRestoreRule.java:57)
	at org.apache.lucene.util.AbstractBeforeAfterRule$1.evaluate(AbstractBeforeAfterRule.java:45)
	at com.carrotsearch.randomizedtesting.rules.StatementAdapter.evaluate(StatementAdapter.java:36)
	at org.apache.lucene.util.TestRuleStoreClassName$1.evaluate(TestRuleStoreClassName.java:41)
	at com.carrotsearch.randomizedtesting.rules.NoShadowingOrOverridesOnMethodsRule$1.evaluate(NoShadowingOrOverridesOnMethodsRule.java:40)
	at com.carrotsearch.randomizedtesting.rules.NoShadowingOrOverridesOnMethodsRule$1.evaluate(NoShadowingOrOverridesOnMethodsRule.java:40)
	at com.carrotsearch.randomizedtesting.rules.StatementAdapter.evaluate(StatementAdapter.java:36)
	at com.carrotsearch.randomizedtesting.rules.StatementAdapter.evaluate(StatementAdapter.java:36)
	at org.apache.lucene.util.TestRuleAssertionsRequired$1.evaluate(TestRuleAssertionsRequired.java:53)
	at org.apache.lucene.util.TestRuleMarkFailure$1.evaluate(TestRuleMarkFailure.java:47)
	at org.apache.lucene.util.TestRuleIgnoreAfterMaxFailures$1.evaluate(TestRuleIgnoreAfterMaxFailures.java:64)
	at org.apache.lucene.util.TestRuleIgnoreTestSuites$1.evaluate(TestRuleIgnoreTestSuites.java:54)
	at com.carrotsearch.randomizedtesting.rules.StatementAdapter.evaluate(StatementAdapter.java:36)
	at com.carrotsearch.randomizedtesting.ThreadLeakControl$StatementRunner.run(ThreadLeakControl.java:368)
	at java.base/java.lang.Thread.run(Thread.java:835)


FAILED:  org.apache.solr.security.JWTAuthPluginIntegrationTest.createCollectionUpdateAndQueryDistributed

Error Message:
Expected metric minimums for prefix SECURITY./authentication/pki.: {failMissingCredentials=0, authenticated=12, passThrough=0, failWrongCredentials=0, requests=12, errors=0}, but got: {failMissingCredentials=0, authenticated=4, passThrough=0, totalTime=8965300, failWrongCredentials=0, requestTimes=403, requests=4, errors=0}

Stack Trace:
java.lang.AssertionError: Expected metric minimums for prefix SECURITY./authentication/pki.: {failMissingCredentials=0, authenticated=12, passThrough=0, failWrongCredentials=0, requests=12, errors=0}, but got: {failMissingCredentials=0, authenticated=4, passThrough=0, totalTime=8965300, failWrongCredentials=0, requestTimes=403, requests=4, errors=0}
	at __randomizedtesting.SeedInfo.seed([22115CB07A9CDE29:24395EDE182B489A]:0)
	at org.junit.Assert.fail(Assert.java:88)
	at org.junit.Assert.assertTrue(Assert.java:41)
	at org.apache.solr.cloud.SolrCloudAuthTestCase.assertAuthMetricsMinimums(SolrCloudAuthTestCase.java:129)
	at org.apache.solr.cloud.SolrCloudAuthTestCase.assertPkiAuthMetricsMinimums(SolrCloudAuthTestCase.java:74)
	at org.apache.solr.security.JWTAuthPluginIntegrationTest.createCollectionUpdateAndQueryDistributed(JWTAuthPluginIntegrationTest.java:173)
	at java.base/jdk.internal.reflect.NativeMethodAccessorImpl.invoke0(Native Method)
	at java.base/jdk.internal.reflect.NativeMethodAccessorImpl.invoke(NativeMethodAccessorImpl.java:62)
	at java.base/jdk.internal.reflect.DelegatingMethodAccessorImpl.invoke(DelegatingMethodAccessorImpl.java:43)
	at java.base/java.lang.reflect.Method.invoke(Method.java:567)
	at com.carrotsearch.randomizedtesting.RandomizedRunner.invoke(RandomizedRunner.java:1750)
	at com.carrotsearch.randomizedtesting.RandomizedRunner$8.evaluate(RandomizedRunner.java:938)
	at com.carrotsearch.randomizedtesting.RandomizedRunner$9.evaluate(RandomizedRunner.java:974)
	at com.carrotsearch.randomizedtesting.RandomizedRunner$10.evaluate(RandomizedRunner.java:988)
	at com.carrotsearch.randomizedtesting.rules.SystemPropertiesRestoreRule$1.evaluate(SystemPropertiesRestoreRule.java:57)
	at org.apache.lucene.util.TestRuleSetupTeardownChained$1.evaluate(TestRuleSetupTeardownChained.java:49)
	at org.apache.lucene.util.AbstractBeforeAfterRule$1.evaluate(AbstractBeforeAfterRule.java:45)
	at org.apache.lucene.util.TestRuleThreadAndTestName$1.evaluate(TestRuleThreadAndTestName.java:48)
	at org.apache.lucene.util.TestRuleIgnoreAfterMaxFailures$1.evaluate(TestRuleIgnoreAfterMaxFailures.java:64)
	at org.apache.lucene.util.TestRuleMarkFailure$1.evaluate(TestRuleMarkFailure.java:47)
	at com.carrotsearch.randomizedtesting.rules.StatementAdapter.evaluate(StatementAdapter.java:36)
	at com.carrotsearch.randomizedtesting.ThreadLeakControl$StatementRunner.run(ThreadLeakControl.java:368)
	at com.carrotsearch.randomizedtesting.ThreadLeakControl.forkTimeoutingTask(ThreadLeakControl.java:817)
	at com.carrotsearch.randomizedtesting.ThreadLeakControl$3.evaluate(ThreadLeakControl.java:468)
	at com.carrotsearch.randomizedtesting.RandomizedRunner.runSingleTest(RandomizedRunner.java:947)
	at com.carrotsearch.randomizedtesting.RandomizedRunner$5.evaluate(RandomizedRunner.java:832)
	at com.carrotsearch.randomizedtesting.RandomizedRunner$6.evaluate(RandomizedRunner.java:883)
	at com.carrotsearch.randomizedtesting.RandomizedRunner$7.evaluate(RandomizedRunner.java:894)
	at com.carrotsearch.randomizedtesting.rules.StatementAdapter.evaluate(StatementAdapter.java:36)
	at com.carrotsearch.randomizedtesting.rules.SystemPropertiesRestoreRule$1.evaluate(SystemPropertiesRestoreRule.java:57)
	at org.apache.lucene.util.AbstractBeforeAfterRule$1.evaluate(AbstractBeforeAfterRule.java:45)
	at com.carrotsearch.randomizedtesting.rules.StatementAdapter.evaluate(StatementAdapter.java:36)
	at org.apache.lucene.util.TestRuleStoreClassName$1.evaluate(TestRuleStoreClassName.java:41)
	at com.carrotsearch.randomizedtesting.rules.NoShadowingOrOverridesOnMethodsRule$1.evaluate(NoShadowingOrOverridesOnMethodsRule.java:40)
	at com.carrotsearch.randomizedtesting.rules.NoShadowingOrOverridesOnMethodsRule$1.evaluate(NoShadowingOrOverridesOnMethodsRule.java:40)
	at com.carrotsearch.randomizedtesting.rules.StatementAdapter.evaluate(StatementAdapter.java:36)
	at com.carrotsearch.randomizedtesting.rules.StatementAdapter.evaluate(StatementAdapter.java:36)
	at org.apache.lucene.util.TestRuleAssertionsRequired$1.evaluate(TestRuleAssertionsRequired.java:53)
	at org.apache.lucene.util.TestRuleMarkFailure$1.evaluate(TestRuleMarkFailure.java:47)
	at org.apache.lucene.util.TestRuleIgnoreAfterMaxFailures$1.evaluate(TestRuleIgnoreAfterMaxFailures.java:64)
	at org.apache.lucene.util.TestRuleIgnoreTestSuites$1.evaluate(TestRuleIgnoreTestSuites.java:54)
	at com.carrotsearch.randomizedtesting.rules.StatementAdapter.evaluate(StatementAdapter.java:36)
	at com.carrotsearch.randomizedtesting.ThreadLeakControl$StatementRunner.run(ThreadLeakControl.java:368)
	at java.base/java.lang.Thread.run(Thread.java:835)


FAILED:  org.apache.solr.security.JWTAuthPluginIntegrationTest.createCollectionUpdateAndQueryDistributed

Error Message:
Expected metric minimums for prefix SECURITY./authentication/pki.: {failMissingCredentials=0, authenticated=12, passThrough=0, failWrongCredentials=0, requests=12, errors=0}, but got: {failMissingCredentials=0, authenticated=4, passThrough=0, totalTime=3495300, failWrongCredentials=0, requestTimes=476, requests=4, errors=0}

Stack Trace:
java.lang.AssertionError: Expected metric minimums for prefix SECURITY./authentication/pki.: {failMissingCredentials=0, authenticated=12, passThrough=0, failWrongCredentials=0, requests=12, errors=0}, but got: {failMissingCredentials=0, authenticated=4, passThrough=0, totalTime=3495300, failWrongCredentials=0, requestTimes=476, requests=4, errors=0}
	at __randomizedtesting.SeedInfo.seed([22115CB07A9CDE29:24395EDE182B489A]:0)
	at org.junit.Assert.fail(Assert.java:88)
	at org.junit.Assert.assertTrue(Assert.java:41)
	at org.apache.solr.cloud.SolrCloudAuthTestCase.assertAuthMetricsMinimums(SolrCloudAuthTestCase.java:129)
	at org.apache.solr.cloud.SolrCloudAuthTestCase.assertPkiAuthMetricsMinimums(SolrCloudAuthTestCase.java:74)
	at org.apache.solr.security.JWTAuthPluginIntegrationTest.createCollectionUpdateAndQueryDistributed(JWTAuthPluginIntegrationTest.java:173)
	at java.base/jdk.internal.reflect.NativeMethodAccessorImpl.invoke0(Native Method)
	at java.base/jdk.internal.reflect.NativeMethodAccessorImpl.invoke(NativeMethodAccessorImpl.java:62)
	at java.base/jdk.internal.reflect.DelegatingMethodAccessorImpl.invoke(DelegatingMethodAccessorImpl.java:43)
	at java.base/java.lang.reflect.Method.invoke(Method.java:567)
	at com.carrotsearch.randomizedtesting.RandomizedRunner.invoke(RandomizedRunner.java:1750)
	at com.carrotsearch.randomizedtesting.RandomizedRunner$8.evaluate(RandomizedRunner.java:938)
	at com.carrotsearch.randomizedtesting.RandomizedRunner$9.evaluate(RandomizedRunner.java:974)
	at com.carrotsearch.randomizedtesting.RandomizedRunner$10.evaluate(RandomizedRunner.java:988)
	at com.carrotsearch.randomizedtesting.rules.SystemPropertiesRestoreRule$1.evaluate(SystemPropertiesRestoreRule.java:57)
	at org.apache.lucene.util.TestRuleSetupTeardownChained$1.evaluate(TestRuleSetupTeardownChained.java:49)
	at org.apache.lucene.util.AbstractBeforeAfterRule$1.evaluate(AbstractBeforeAfterRule.java:45)
	at org.apache.lucene.util.TestRuleThreadAndTestName$1.evaluate(TestRuleThreadAndTestName.java:48)
	at org.apache.lucene.util.TestRuleIgnoreAfterMaxFailures$1.evaluate(TestRuleIgnoreAfterMaxFailures.java:64)
	at org.apache.lucene.util.TestRuleMarkFailure$1.evaluate(TestRuleMarkFailure.java:47)
	at com.carrotsearch.randomizedtesting.rules.StatementAdapter.evaluate(StatementAdapter.java:36)
	at com.carrotsearch.randomizedtesting.ThreadLeakControl$StatementRunner.run(ThreadLeakControl.java:368)
	at com.carrotsearch.randomizedtesting.ThreadLeakControl.forkTimeoutingTask(ThreadLeakControl.java:817)
	at com.carrotsearch.randomizedtesting.ThreadLeakControl$3.evaluate(ThreadLeakControl.java:468)
	at com.carrotsearch.randomizedtesting.RandomizedRunner.runSingleTest(RandomizedRunner.java:947)
	at com.carrotsearch.randomizedtesting.RandomizedRunner$5.evaluate(RandomizedRunner.java:832)
	at com.carrotsearch.randomizedtesting.RandomizedRunner$6.evaluate(RandomizedRunner.java:883)
	at com.carrotsearch.randomizedtesting.RandomizedRunner$7.evaluate(RandomizedRunner.java:894)
	at com.carrotsearch.randomizedtesting.rules.StatementAdapter.evaluate(StatementAdapter.java:36)
	at com.carrotsearch.randomizedtesting.rules.SystemPropertiesRestoreRule$1.evaluate(SystemPropertiesRestoreRule.java:57)
	at org.apache.lucene.util.AbstractBeforeAfterRule$1.evaluate(AbstractBeforeAfterRule.java:45)
	at com.carrotsearch.randomizedtesting.rules.StatementAdapter.evaluate(StatementAdapter.java:36)
	at org.apache.lucene.util.TestRuleStoreClassName$1.evaluate(TestRuleStoreClassName.java:41)
	at com.carrotsearch.randomizedtesting.rules.NoShadowingOrOverridesOnMethodsRule$1.evaluate(NoShadowingOrOverridesOnMethodsRule.java:40)
	at com.carrotsearch.randomizedtesting.rules.NoShadowingOrOverridesOnMethodsRule$1.evaluate(NoShadowingOrOverridesOnMethodsRule.java:40)
	at com.carrotsearch.randomizedtesting.rules.StatementAdapter.evaluate(StatementAdapter.java:36)
	at com.carrotsearch.randomizedtesting.rules.StatementAdapter.evaluate(StatementAdapter.java:36)
	at org.apache.lucene.util.TestRuleAssertionsRequired$1.evaluate(TestRuleAssertionsRequired.java:53)
	at org.apache.lucene.util.TestRuleMarkFailure$1.evaluate(TestRuleMarkFailure.java:47)
	at org.apache.lucene.util.TestRuleIgnoreAfterMaxFailures$1.evaluate(TestRuleIgnoreAfterMaxFailures.java:64)
	at org.apache.lucene.util.TestRuleIgnoreTestSuites$1.evaluate(TestRuleIgnoreTestSuites.java:54)
	at com.carrotsearch.randomizedtesting.rules.StatementAdapter.evaluate(StatementAdapter.java:36)
	at com.carrotsearch.randomizedtesting.ThreadLeakControl$StatementRunner.run(ThreadLeakControl.java:368)
	at java.base/java.lang.Thread.run(Thread.java:835)




Build Log:
[...truncated 15210 lines...]
   [junit4] Suite: org.apache.solr.security.JWTAuthPluginIntegrationTest
   [junit4]   2> Creating dataDir: C:\Users\jenkins\workspace\Lucene-Solr-master-Windows\solr\build\solr-core\test\J1\temp\solr.security.JWTAuthPluginIntegrationTest_22115CB07A9CDE29-001\init-core-data-001
   [junit4]   2> 3031405 INFO  (SUITE-JWTAuthPluginIntegrationTest-seed#[22115CB07A9CDE29]-worker) [    ] o.a.s.SolrTestCaseJ4 Using PointFields (NUMERIC_POINTS_SYSPROP=true) w/NUMERIC_DOCVALUES_SYSPROP=false
   [junit4]   2> 3031406 INFO  (SUITE-JWTAuthPluginIntegrationTest-seed#[22115CB07A9CDE29]-worker) [    ] o.a.s.SolrTestCaseJ4 Randomized ssl (false) and clientAuth (false) via: @org.apache.solr.SolrTestCaseJ4$SuppressSSL(bugUrl="None")
   [junit4]   2> 3031406 INFO  (SUITE-JWTAuthPluginIntegrationTest-seed#[22115CB07A9CDE29]-worker) [    ] o.a.s.SolrTestCaseJ4 SecureRandom sanity checks: test.solr.allowed.securerandom=null & java.security.egd=file:/dev/./urandom
   [junit4]   2> 3031409 INFO  (TEST-JWTAuthPluginIntegrationTest.testMetrics-seed#[22115CB07A9CDE29]) [    ] o.a.s.SolrTestCaseJ4 ###Starting testMetrics
   [junit4]   2> 3031410 INFO  (TEST-JWTAuthPluginIntegrationTest.testMetrics-seed#[22115CB07A9CDE29]) [    ] o.a.s.c.MiniSolrCloudCluster Starting cluster of 2 servers in C:\Users\jenkins\workspace\Lucene-Solr-master-Windows\solr\build\solr-core\test\J1\temp\solr.security.JWTAuthPluginIntegrationTest_22115CB07A9CDE29-001\tempDir-001
   [junit4]   2> 3031410 INFO  (TEST-JWTAuthPluginIntegrationTest.testMetrics-seed#[22115CB07A9CDE29]) [    ] o.a.s.c.ZkTestServer STARTING ZK TEST SERVER
   [junit4]   2> 3031410 INFO  (ZkTestServer Run Thread) [    ] o.a.s.c.ZkTestServer client port:0.0.0.0/0.0.0.0:0
   [junit4]   2> 3031410 INFO  (ZkTestServer Run Thread) [    ] o.a.s.c.ZkTestServer Starting server
   [junit4]   2> 3031511 INFO  (TEST-JWTAuthPluginIntegrationTest.testMetrics-seed#[22115CB07A9CDE29]) [    ] o.a.s.c.ZkTestServer start zk server on port:65235
   [junit4]   2> 3031511 INFO  (TEST-JWTAuthPluginIntegrationTest.testMetrics-seed#[22115CB07A9CDE29]) [    ] o.a.s.c.ZkTestServer parse host and port list: 127.0.0.1:65235
   [junit4]   2> 3031511 INFO  (TEST-JWTAuthPluginIntegrationTest.testMetrics-seed#[22115CB07A9CDE29]) [    ] o.a.s.c.ZkTestServer connecting to 127.0.0.1 65235
   [junit4]   2> 3031516 INFO  (zkConnectionManagerCallback-21521-thread-1) [    ] o.a.s.c.c.ConnectionManager zkClient has connected
   [junit4]   2> 3031520 INFO  (zkConnectionManagerCallback-21523-thread-1) [    ] o.a.s.c.c.ConnectionManager zkClient has connected
   [junit4]   2> 3031522 INFO  (zkConnectionManagerCallback-21525-thread-1) [    ] o.a.s.c.c.ConnectionManager zkClient has connected
   [junit4]   2> 3031526 WARN  (jetty-launcher-21526-thread-2) [    ] o.e.j.s.AbstractConnector Ignoring deprecated socket close linger time
   [junit4]   2> 3031526 WARN  (jetty-launcher-21526-thread-1) [    ] o.e.j.s.AbstractConnector Ignoring deprecated socket close linger time
   [junit4]   2> 3031526 INFO  (jetty-launcher-21526-thread-2) [    ] o.a.s.c.s.e.JettySolrRunner Start Jetty (original configured port=0)
   [junit4]   2> 3031526 INFO  (jetty-launcher-21526-thread-1) [    ] o.a.s.c.s.e.JettySolrRunner Start Jetty (original configured port=0)
   [junit4]   2> 3031526 INFO  (jetty-launcher-21526-thread-1) [    ] o.a.s.c.s.e.JettySolrRunner Trying to start Jetty on port 0 try number 1 ...
   [junit4]   2> 3031526 INFO  (jetty-launcher-21526-thread-2) [    ] o.a.s.c.s.e.JettySolrRunner Trying to start Jetty on port 0 try number 1 ...
   [junit4]   2> 3031526 INFO  (jetty-launcher-21526-thread-1) [    ] o.e.j.s.Server jetty-9.4.14.v20181114; built: 2018-11-14T21:20:31.478Z; git: c4550056e785fb5665914545889f21dc136ad9e6; jvm 12+33
   [junit4]   2> 3031526 INFO  (jetty-launcher-21526-thread-2) [    ] o.e.j.s.Server jetty-9.4.14.v20181114; built: 2018-11-14T21:20:31.478Z; git: c4550056e785fb5665914545889f21dc136ad9e6; jvm 12+33
   [junit4]   2> 3031527 INFO  (jetty-launcher-21526-thread-1) [    ] o.e.j.s.session DefaultSessionIdManager workerName=node0
   [junit4]   2> 3031527 INFO  (jetty-launcher-21526-thread-1) [    ] o.e.j.s.session No SessionScavenger set, using defaults
   [junit4]   2> 3031527 INFO  (jetty-launcher-21526-thread-1) [    ] o.e.j.s.session node0 Scavenging every 600000ms
   [junit4]   2> 3031527 INFO  (jetty-launcher-21526-thread-2) [    ] o.e.j.s.session DefaultSessionIdManager workerName=node0
   [junit4]   2> 3031527 INFO  (jetty-launcher-21526-thread-2) [    ] o.e.j.s.session No SessionScavenger set, using defaults
   [junit4]   2> 3031527 INFO  (jetty-launcher-21526-thread-2) [    ] o.e.j.s.session node0 Scavenging every 600000ms
   [junit4]   2> 3031527 INFO  (jetty-launcher-21526-thread-1) [    ] o.e.j.s.h.ContextHandler Started o.e.j.s.ServletContextHandler@381b8172{/solr,null,AVAILABLE}
   [junit4]   2> 3031527 INFO  (jetty-launcher-21526-thread-2) [    ] o.e.j.s.h.ContextHandler Started o.e.j.s.ServletContextHandler@173ebc8{/solr,null,AVAILABLE}
   [junit4]   2> 3031528 INFO  (jetty-launcher-21526-thread-1) [    ] o.e.j.s.AbstractConnector Started ServerConnector@78d3613e{HTTP/1.1,[http/1.1, h2c]}{127.0.0.1:65246}
   [junit4]   2> 3031528 INFO  (jetty-launcher-21526-thread-1) [    ] o.e.j.s.Server Started @3031547ms
   [junit4]   2> 3031528 INFO  (jetty-launcher-21526-thread-1) [    ] o.a.s.c.s.e.JettySolrRunner Jetty properties: {hostContext=/solr, hostPort=65246}
   [junit4]   2> 3031528 INFO  (jetty-launcher-21526-thread-2) [    ] o.e.j.s.AbstractConnector Started ServerConnector@1c2101b1{HTTP/1.1,[http/1.1, h2c]}{127.0.0.1:65247}
   [junit4]   2> 3031528 INFO  (jetty-launcher-21526-thread-2) [    ] o.e.j.s.Server Started @3031547ms
   [junit4]   2> 3031528 INFO  (jetty-launcher-21526-thread-2) [    ] o.a.s.c.s.e.JettySolrRunner Jetty properties: {hostContext=/solr, hostPort=65247}
   [junit4]   2> 3031528 ERROR (jetty-launcher-21526-thread-1) [    ] o.a.s.u.StartupLoggingUtils Missing Java Option solr.log.dir. Logging may be missing or incomplete.
   [junit4]   2> 3031528 INFO  (jetty-launcher-21526-thread-1) [    ] o.a.s.s.SolrDispatchFilter Using logger factory org.apache.logging.slf4j.Log4jLoggerFactory
   [junit4]   2> 3031528 INFO  (jetty-launcher-21526-thread-1) [    ] o.a.s.s.SolrDispatchFilter  ___      _       Welcome to Apache Solr? version 9.0.0
   [junit4]   2> 3031528 ERROR (jetty-launcher-21526-thread-2) [    ] o.a.s.u.StartupLoggingUtils Missing Java Option solr.log.dir. Logging may be missing or incomplete.
   [junit4]   2> 3031528 INFO  (jetty-launcher-21526-thread-2) [    ] o.a.s.s.SolrDispatchFilter Using logger factory org.apache.logging.slf4j.Log4jLoggerFactory
   [junit4]   2> 3031528 INFO  (jetty-launcher-21526-thread-1) [    ] o.a.s.s.SolrDispatchFilter / __| ___| |_ _   Starting in cloud mode on port null
   [junit4]   2> 3031528 INFO  (jetty-launcher-21526-thread-1) [    ] o.a.s.s.SolrDispatchFilter \__ \/ _ \ | '_|  Install dir: null
   [junit4]   2> 3031528 INFO  (jetty-launcher-21526-thread-2) [    ] o.a.s.s.SolrDispatchFilter  ___      _       Welcome to Apache Solr? version 9.0.0
   [junit4]   2> 3031528 INFO  (jetty-launcher-21526-thread-1) [    ] o.a.s.s.SolrDispatchFilter |___/\___/_|_|    Start time: 2019-05-07T10:29:43.744101100Z
   [junit4]   2> 3031528 INFO  (jetty-launcher-21526-thread-2) [    ] o.a.s.s.SolrDispatchFilter / __| ___| |_ _   Starting in cloud mode on port null
   [junit4]   2> 3031528 INFO  (jetty-launcher-21526-thread-2) [    ] o.a.s.s.SolrDispatchFilter \__ \/ _ \ | '_|  Install dir: null
   [junit4]   2> 3031528 INFO  (jetty-launcher-21526-thread-2) [    ] o.a.s.s.SolrDispatchFilter |___/\___/_|_|    Start time: 2019-05-07T10:29:43.744101100Z
   [junit4]   2> 3031532 INFO  (zkConnectionManagerCallback-21530-thread-1) [    ] o.a.s.c.c.ConnectionManager zkClient has connected
   [junit4]   2> 3031532 INFO  (zkConnectionManagerCallback-21528-thread-1) [    ] o.a.s.c.c.ConnectionManager zkClient has connected
   [junit4]   2> 3031532 INFO  (jetty-launcher-21526-thread-2) [    ] o.a.s.s.SolrDispatchFilter solr.xml found in ZooKeeper. Loading...
   [junit4]   2> 3031532 INFO  (jetty-launcher-21526-thread-1) [    ] o.a.s.s.SolrDispatchFilter solr.xml found in ZooKeeper. Loading...
   [junit4]   2> 3031542 WARN  (NIOServerCxn.Factory:0.0.0.0/0.0.0.0:0) [    ] o.a.z.s.NIOServerCnxn Unable to read additional data from client sessionid 0x10011bc0fbe0004, likely client has closed socket
   [junit4]   2> 3031542 WARN  (NIOServerCxn.Factory:0.0.0.0/0.0.0.0:0) [    ] o.a.z.s.NIOServerCnxn Unable to read additional data from client sessionid 0x10011bc0fbe0003, likely client has closed socket
   [junit4]   2> 3031860 INFO  (jetty-launcher-21526-thread-2) [    ] o.a.s.h.c.HttpShardHandlerFactory Host whitelist initialized: WhitelistHostChecker [whitelistHosts=null, whitelistHostCheckingEnabled=true]
   [junit4]   2> 3031861 WARN  (jetty-launcher-21526-thread-2) [    ] o.e.j.u.s.S.config No Client EndPointIdentificationAlgorithm configured for SslContextFactory@72599981[provider=null,keyStore=null,trustStore=null]
   [junit4]   2> 3031865 WARN  (jetty-launcher-21526-thread-2) [    ] o.e.j.u.s.S.config No Client EndPointIdentificationAlgorithm configured for SslContextFactory@327775ef[provider=null,keyStore=null,trustStore=null]
   [junit4]   2> 3031866 INFO  (jetty-launcher-21526-thread-2) [    ] o.a.s.c.ZkContainer Zookeeper client=127.0.0.1:65235/solr
   [junit4]   2> 3031869 INFO  (zkConnectionManagerCallback-21538-thread-1) [    ] o.a.s.c.c.ConnectionManager zkClient has connected
   [junit4]   2> 3031870 WARN  (NIOServerCxn.Factory:0.0.0.0/0.0.0.0:0) [    ] o.a.z.s.NIOServerCnxn Unable to read additional data from client sessionid 0x10011bc0fbe0005, likely client has closed socket
   [junit4]   2> 3031870 INFO  (zkConnectionManagerCallback-21540-thread-1) [    ] o.a.s.c.c.ConnectionManager zkClient has connected
   [junit4]   2> 3031883 INFO  (jetty-launcher-21526-thread-1) [    ] o.a.s.h.c.HttpShardHandlerFactory Host whitelist initialized: WhitelistHostChecker [whitelistHosts=null, whitelistHostCheckingEnabled=true]
   [junit4]   2> 3031883 WARN  (jetty-launcher-21526-thread-1) [    ] o.e.j.u.s.S.config No Client EndPointIdentificationAlgorithm configured for SslContextFactory@61d4ddd1[provider=null,keyStore=null,trustStore=null]
   [junit4]   2> 3031887 WARN  (jetty-launcher-21526-thread-1) [    ] o.e.j.u.s.S.config No Client EndPointIdentificationAlgorithm configured for SslContextFactory@635060[provider=null,keyStore=null,trustStore=null]
   [junit4]   2> 3031889 INFO  (jetty-launcher-21526-thread-1) [    ] o.a.s.c.ZkContainer Zookeeper client=127.0.0.1:65235/solr
   [junit4]   2> 3031891 INFO  (zkConnectionManagerCallback-21548-thread-1) [    ] o.a.s.c.c.ConnectionManager zkClient has connected
   [junit4]   2> 3031896 INFO  (zkConnectionManagerCallback-21550-thread-1) [    ] o.a.s.c.c.ConnectionManager zkClient has connected
   [junit4]   2> 3031905 INFO  (jetty-launcher-21526-thread-1) [n:127.0.0.1:65246_solr    ] o.a.s.c.OverseerElectionContext I am going to be the leader 127.0.0.1:65246_solr
   [junit4]   2> 3031905 INFO  (jetty-launcher-21526-thread-1) [n:127.0.0.1:65246_solr    ] o.a.s.c.Overseer Overseer (id=72077093453561864-127.0.0.1:65246_solr-n_0000000000) starting
   [junit4]   2> 3031912 INFO  (zkConnectionManagerCallback-21557-thread-1) [    ] o.a.s.c.c.ConnectionManager zkClient has connected
   [junit4]   2> 3031914 INFO  (jetty-launcher-21526-thread-1) [n:127.0.0.1:65246_solr    ] o.a.s.c.s.i.ZkClientClusterStateProvider Cluster at 127.0.0.1:65235/solr ready
   [junit4]   2> 3031914 INFO  (jetty-launcher-21526-thread-1) [n:127.0.0.1:65246_solr    ] o.a.s.c.ZkController Register node as live in ZooKeeper:/live_nodes/127.0.0.1:65246_solr
   [junit4]   2> 3031915 INFO  (jetty-launcher-21526-thread-1) [n:127.0.0.1:65246_solr    ] o.a.s.c.CoreContainer Initializing authentication plugin: solr.JWTAuthPlugin
   [junit4]   2> 3031922 INFO  (OverseerStateUpdate-72077093453561864-127.0.0.1:65246_solr-n_0000000000) [n:127.0.0.1:65246_solr    ] o.a.s.c.Overseer Starting to work on the main queue : 127.0.0.1:65246_solr
   [junit4]   2> 3031922 INFO  (OverseerStateUpdate-72077093453561864-127.0.0.1:65246_solr-n_0000000000) [n:127.0.0.1:65246_solr    ] o.a.s.c.c.ZkStateReader Updated live nodes from ZooKeeper... (0) -> (1)
   [junit4]   2> 3031926 INFO  (zkCallback-21556-thread-1) [    ] o.a.s.c.c.ZkStateReader Updated live nodes from ZooKeeper... (0) -> (1)
   [junit4]   2> 3031934 WARN  (jetty-launcher-21526-thread-1) [n:127.0.0.1:65246_solr    ] o.a.s.s.JWTAuthPlugin Warning: No adminUiScope provided, fallback to 'solr' as required scope. If this is not correct, the Admin UI login may not work
   [junit4]   2> 3031948 INFO  (jetty-launcher-21526-thread-2) [n:127.0.0.1:65247_solr    ] o.a.s.c.c.ZkStateReader Updated live nodes from ZooKeeper... (0) -> (1)
   [junit4]   2> 3031950 INFO  (jetty-launcher-21526-thread-2) [n:127.0.0.1:65247_solr    ] o.a.s.c.ZkController Publish node=127.0.0.1:65247_solr as DOWN
   [junit4]   2> 3031951 INFO  (jetty-launcher-21526-thread-2) [n:127.0.0.1:65247_solr    ] o.a.s.c.TransientSolrCoreCacheDefault Allocating transient cache for 2147483647 transient cores
   [junit4]   2> 3031951 INFO  (jetty-launcher-21526-thread-2) [n:127.0.0.1:65247_solr    ] o.a.s.c.ZkController Register node as live in ZooKeeper:/live_nodes/127.0.0.1:65247_solr
   [junit4]   2> 3031951 INFO  (zkCallback-21549-thread-1) [    ] o.a.s.c.c.ZkStateReader Updated live nodes from ZooKeeper... (1) -> (2)
   [junit4]   2> 3031951 INFO  (zkCallback-21556-thread-1) [    ] o.a.s.c.c.ZkStateReader Updated live nodes from ZooKeeper... (1) -> (2)
   [junit4]   2> 3031952 INFO  (jetty-launcher-21526-thread-2) [n:127.0.0.1:65247_solr    ] o.a.s.c.CoreContainer Initializing authentication plugin: solr.JWTAuthPlugin
   [junit4]   2> 3031952 WARN  (jetty-launcher-21526-thread-2) [n:127.0.0.1:65247_solr    ] o.a.s.s.JWTAuthPlugin Warning: No adminUiScope provided, fallback to 'solr' as required scope. If this is not correct, the Admin UI login may not work
   [junit4]   2> 3031952 INFO  (zkCallback-21539-thread-1) [    ] o.a.s.c.c.ZkStateReader Updated live nodes from ZooKeeper... (1) -> (2)
   [junit4]   2> 3031980 INFO  (jetty-launcher-21526-thread-1) [n:127.0.0.1:65246_solr    ] o.a.s.h.a.MetricsHistoryHandler No .system collection, keeping metrics history in memory.
   [junit4]   2> 3031986 INFO  (zkConnectionManagerCallback-21563-thread-1) [    ] o.a.s.c.c.ConnectionManager zkClient has connected
   [junit4]   2> 3031989 INFO  (jetty-launcher-21526-thread-2) [n:127.0.0.1:65247_solr    ] o.a.s.c.c.ZkStateReader Updated live nodes from ZooKeeper... (0) -> (2)
   [junit4]   2> 3031990 INFO  (jetty-launcher-21526-thread-2) [n:127.0.0.1:65247_solr    ] o.a.s.c.s.i.ZkClientClusterStateProvider Cluster at 127.0.0.1:65235/solr ready
   [junit4]   2> 3031991 INFO  (jetty-launcher-21526-thread-2) [n:127.0.0.1:65247_solr    ] o.a.s.h.a.MetricsHistoryHandler No .system collection, keeping metrics history in memory.
   [junit4]   2> 3032016 INFO  (jetty-launcher-21526-thread-1) [n:127.0.0.1:65246_solr    ] o.a.s.m.r.SolrJmxReporter JMX monitoring for 'solr_65246.solr.node' (registry 'solr.node') enabled at server: com.sun.jmx.mbeanserver.JmxMBeanServer@35209456
   [junit4]   2> 3032023 INFO  (jetty-launcher-21526-thread-1) [n:127.0.0.1:65246_solr    ] o.a.s.m.r.SolrJmxReporter JMX monitoring for 'solr_65246.solr.jvm' (registry 'solr.jvm') enabled at server: com.sun.jmx.mbeanserver.JmxMBeanServer@35209456
   [junit4]   2> 3032023 INFO  (jetty-launcher-21526-thread-1) [n:127.0.0.1:65246_solr    ] o.a.s.m.r.SolrJmxReporter JMX monitoring for 'solr_65246.solr.jetty' (registry 'solr.jetty') enabled at server: com.sun.jmx.mbeanserver.JmxMBeanServer@35209456
   [junit4]   2> 3032024 INFO  (jetty-launcher-21526-thread-2) [n:127.0.0.1:65247_solr    ] o.a.s.m.r.SolrJmxReporter JMX monitoring for 'solr_65247.solr.node' (registry 'solr.node') enabled at server: com.sun.jmx.mbeanserver.JmxMBeanServer@35209456
   [junit4]   2> 3032024 INFO  (jetty-launcher-21526-thread-1) [n:127.0.0.1:65246_solr    ] o.a.s.c.CorePropertiesLocator Found 0 core definitions underneath C:\Users\jenkins\workspace\Lucene-Solr-master-Windows\solr\build\solr-core\test\J1\temp\solr.security.JWTAuthPluginIntegrationTest_22115CB07A9CDE29-001\tempDir-001\node1\.
   [junit4]   2> 3032030 INFO  (jetty-launcher-21526-thread-2) [n:127.0.0.1:65247_solr    ] o.a.s.m.r.SolrJmxReporter JMX monitoring for 'solr_65247.solr.jvm' (registry 'solr.jvm') enabled at server: com.sun.jmx.mbeanserver.JmxMBeanServer@35209456
   [junit4]   2> 3032030 INFO  (jetty-launcher-21526-thread-2) [n:127.0.0.1:65247_solr    ] o.a.s.m.r.SolrJmxReporter JMX monitoring for 'solr_65247.solr.jetty' (registry 'solr.jetty') enabled at server: com.sun.jmx.mbeanserver.JmxMBeanServer@35209456
   [junit4]   2> 3032030 INFO  (jetty-launcher-21526-thread-2) [n:127.0.0.1:65247_solr    ] o.a.s.c.CorePropertiesLocator Found 0 core definitions underneath C:\Users\jenkins\workspace\Lucene-Solr-master-Windows\solr\build\solr-core\test\J1\temp\solr.security.JWTAuthPluginIntegrationTest_22115CB07A9CDE29-001\tempDir-001\node2\.
   [junit4]   2> 3032070 INFO  (zkConnectionManagerCallback-21569-thread-1) [    ] o.a.s.c.c.ConnectionManager zkClient has connected
   [junit4]   2> 3032071 INFO  (TEST-JWTAuthPluginIntegrationTest.testMetrics-seed#[22115CB07A9CDE29]) [    ] o.a.s.c.c.ZkStateReader Updated live nodes from ZooKeeper... (0) -> (2)
   [junit4]   2> 3032072 INFO  (TEST-JWTAuthPluginIntegrationTest.testMetrics-seed#[22115CB07A9CDE29]) [    ] o.a.s.c.s.i.ZkClientClusterStateProvider Cluster at 127.0.0.1:65235/solr ready
   [junit4]   2> 3032467 INFO  (qtp1200997010-57482) [n:127.0.0.1:65247_solr    ] o.a.s.h.a.CollectionsHandler Invoked Collection Action :create with params name=jwtColl&action=CREATE&numShards=2 and sendToOCPQueue=true
   [junit4]   2> 3032471 INFO  (OverseerThreadFactory-18908-thread-1-processing-n:127.0.0.1:65246_solr) [n:127.0.0.1:65246_solr    ] o.a.s.c.a.c.CreateCollectionCmd Create collection jwtColl
   [junit4]   2> 3032472 INFO  (OverseerThreadFactory-18908-thread-1-processing-n:127.0.0.1:65246_solr) [n:127.0.0.1:65246_solr    ] o.a.s.c.c.ZkConfigManager Copying zk node /configs/_default/managed-schema to /configs/jwtColl.AUTOCREATED/managed-schema
   [junit4]   2> 3032473 INFO  (OverseerThreadFactory-18908-thread-1-processing-n:127.0.0.1:65246_solr) [n:127.0.0.1:65246_solr    ] o.a.s.c.c.ZkConfigManager Copying zk node /configs/_default/protwords.txt to /configs/jwtColl.AUTOCREATED/protwords.txt
   [junit4]   2> 3032476 INFO  (OverseerThreadFactory-18908-thread-1-processing-n:127.0.0.1:65246_solr) [n:127.0.0.1:65246_solr    ] o.a.s.c.c.ZkConfigManager Copying zk node /configs/_default/solrconfig.xml to /configs/jwtColl.AUTOCREATED/solrconfig.xml
   [junit4]   2> 3032480 INFO  (OverseerThreadFactory-18908-thread-1-processing-n:127.0.0.1:65246_solr) [n:127.0.0.1:65246_solr    ] o.a.s.c.c.ZkConfigManager Copying zk node /configs/_default/synonyms.txt to /configs/jwtColl.AUTOCREATED/synonyms.txt
   [junit4]   2> 3032480 INFO  (OverseerThreadFactory-18908-thread-1-processing-n:127.0.0.1:65246_solr) [n:127.0.0.1:65246_solr    ] o.a.s.c.c.ZkConfigManager Copying zk node /configs/_default/stopwords.txt to /configs/jwtColl.AUTOCREATED/stopwords.txt
   [junit4]   2> 3032481 INFO  (OverseerThreadFactory-18908-thread-1-processing-n:127.0.0.1:65246_solr) [n:127.0.0.1:65246_solr    ] o.a.s.c.c.ZkConfigManager Copying zk node /configs/_default/lang/contractions_it.txt to /configs/jwtColl.AUTOCREATED/lang/contractions_it.txt
   [junit4]   2> 3032482 INFO  (OverseerThreadFactory-18908-thread-1-processing-n:127.0.0.1:65246_solr) [n:127.0.0.1:65246_solr    ] o.a.s.c.c.ZkConfigManager Copying zk node /configs/_default/lang/contractions_ca.txt to /configs/jwtColl.AUTOCREATED/lang/contractions_ca.txt
   [junit4]   2> 3032484 INFO  (OverseerThreadFactory-18908-thread-1-processing-n:127.0.0.1:65246_solr) [n:127.0.0.1:65246_solr    ] o.a.s.c.c.ZkConfigManager Copying zk node /configs/_default/lang/stemdict_nl.txt to /configs/jwtColl.AUTOCREATED/lang/stemdict_nl.txt
   [junit4]   2> 3032485 INFO  (OverseerThreadFactory-18908-thread-1-processing-n:127.0.0.1:65246_solr) [n:127.0.0.1:65246_solr    ] o.a.s.c.c.ZkConfigManager Copying zk node /configs/_default/lang/stopwords_hy.txt to /configs/jwtColl.AUTOCREATED/lang/stopwords_hy.txt
   [junit4]   2> 3032487 INFO  (OverseerThreadFactory-18908-thread-1-processing-n:127.0.0.1:65246_solr) [n:127.0.0.1:65246_solr    ] o.a.s.c.c.ZkConfigManager Copying zk node /configs/_default/lang/stopwords_no.txt to /configs/jwtColl.AUTOCREATED/lang/stopwords_no.txt
   [junit4]   2> 3032488 INFO  (OverseerThreadFactory-18908-thread-1-processing-n:127.0.0.1:65246_solr) [n:127.0.0.1:65246_solr    ] o.a.s.c.c.ZkConfigManager Copying zk node /configs/_default/lang/stopwords_id.txt to /configs/jwtColl.AUTOCREATED/lang/stopwords_id.txt
   [junit4]   2> 3032490 INFO  (OverseerThreadFactory-18908-thread-1-processing-n:127.0.0.1:65246_solr) [n:127.0.0.1:65246_solr    ] o.a.s.c.c.ZkConfigManager Copying zk node /configs/_default/lang/stopwords_da.txt to /configs/jwtColl.AUTOCREATED/lang/stopwords_da.txt
   [junit4]   2> 3032491 INFO  (OverseerThreadFactory-18908-thread-1-processing-n:127.0.0.1:65246_solr) [n:127.0.0.1:65246_solr    ] o.a.s.c.c.ZkConfigManager Copying zk node /configs/_default/lang/stopwords_ga.txt to /configs/jwtColl.AUTOCREATED/lang/stopwords_ga.txt
   [junit4]   2> 3032492 INFO  (OverseerThreadFactory-18908-thread-1-processing-n:127.0.0.1:65246_solr) [n:127.0.0.1:65246_solr    ] o.a.s.c.c.ZkConfigManager Copying zk node /configs/_default/lang/stopwords_hi.txt to /configs/jwtColl.AUTOCREATED/lang/stopwords_hi.txt
   [junit4]   2> 3032493 INFO  (OverseerThreadFactory-18908-thread-1-processing-n:127.0.0.1:65246_solr) [n:127.0.0.1:65246_solr    ] o.a.s.c.c.ZkConfigManager Copying zk node /configs/_default/lang/stopwords_ja.txt to /configs/jwtColl.AUTOCREATED/lang/stopwords_ja.txt
   [junit4]   2> 3032495 INFO  (OverseerThreadFactory-18908-thread-1-processing-n:127.0.0.1:65246_solr) [n:127.0.0.1:65246_solr    ] o.a.s.c.c.ZkConfigManager Copying zk node /configs/_default/lang/stopwords_pt.txt to /configs/jwtColl.AUTOCREATED/lang/stopwords_pt.txt
   [junit4]   2> 3032497 INFO  (OverseerThreadFactory-18908-thread-1-processing-n:127.0.0.1:65246_solr) [n:127.0.0.1:65246_solr    ] o.a.s.c.c.ZkConfigManager Copying zk node /configs/_default/lang/stopwords_hu.txt to /configs/jwtColl.AUTOCREATED/lang/stopwords_hu.txt
   [junit4]   2> 3032497 INFO  (OverseerThreadFactory-18908-thread-1-processing-n:127.0.0.1:65246_solr) [n:127.0.0.1:65246_solr    ] o.a.s.c.c.ZkConfigManager Copying zk node /configs/_default/lang/stopwords_el.txt to /configs/jwtColl.AUTOCREATED/lang/stopwords_el.txt
   [junit4]   2> 3032499 INFO  (OverseerThreadFactory-18908-thread-1-processing-n:127.0.0.1:65246_solr) [n:127.0.0.1:65246_solr    ] o.a.s.c.c.ZkConfigManager Copying zk node /configs/_default/lang/stopwords_ru.txt to /configs/jwtColl.AUTOCREATED/lang/stopwords_ru.txt
   [junit4]   2> 3032500 INFO  (OverseerThreadFactory-18908-thread-1-processing-n:127.0.0.1:65246_solr) [n:127.0.0.1:65246_solr    ] o.a.s.c.c.ZkConfigManager Copying zk node /configs/_default/lang/stopwords_tr.txt to /configs/jwtColl.AUTOCREATED/lang/stopwords_tr.txt
   [junit4]   2> 3032502 INFO  (OverseerThreadFactory-18908-thread-1-processing-n:127.0.0.1:65246_solr) [n:127.0.0.1:65246_solr    ] o.a.s.c.c.ZkConfigManager Copying zk node /configs/_default/lang/stopwords_ar.txt to /configs/jwtColl.AUTOCREATED/lang/stopwords_ar.txt
   [junit4]   2> 3032503 INFO  (OverseerThreadFactory-18908-thread-1-processing-n:127.0.0.1:65246_solr) [n:127.0.0.1:65246_solr    ] o.a.s.c.c.ZkConfigManager Copying zk node /configs/_default/lang/userdict_ja.txt to /configs/jwtColl.AUTOCREATED/lang/userdict_ja.txt
   [junit4]   2> 3032504 INFO  (OverseerThreadFactory-18908-thread-1-processing-n:127.0.0.1:65246_solr) [n:127.0.0.1:65246_solr    ] o.a.s.c.c.ZkConfigManager Copying zk node /configs/_default/lang/stopwords_eu.txt to /configs/jwtColl.AUTOCREATED/lang/stopwords_eu.txt
   [junit4]   2> 3032505 INFO  (OverseerThreadFactory-18908-thread-1-processing-n:127.0.0.1:65246_solr) [n:127.0.0.1:65246_solr    ] o.a.s.c.c.ZkConfigManager Copying zk node /configs/_default/lang/stopwords_it.txt to /configs/jwtColl.AUTOCREATED/lang/stopwords_it.txt
   [junit4]   2> 3032507 INFO  (OverseerThreadFactory-18908-thread-1-processing-n:127.0.0.1:65246_solr) [n:127.0.0.1:65246_solr    ] o.a.s.c.c.ZkConfigManager Copying zk node /configs/_default/lang/stopwords_cz.txt to /configs/jwtColl.AUTOCREATED/lang/stopwords_cz.txt
   [junit4]   2> 3032508 INFO  (OverseerThreadFactory-18908-thread-1-processing-n:127.0.0.1:65246_solr) [n:127.0.0.1:65246_solr    ] o.a.s.c.c.ZkConfigManager Copying zk node /configs/_default/lang/stoptags_ja.txt to /configs/jwtColl.AUTOCREATED/lang/stoptags_ja.txt
   [junit4]   2> 3032509 INFO  (OverseerThreadFactory-18908-thread-1-processing-n:127.0.0.1:65246_solr) [n:127.0.0.1:65246_solr    ] o.a.s.c.c.ZkConfigManager Copying zk node /configs/_default/lang/contractions_fr.txt to /configs/jwtColl.AUTOCREATED/lang/contractions_fr.txt
   [junit4]   2> 3032511 INFO  (OverseerThreadFactory-18908-thread-1-processing-n:127.0.0.1:65246_solr) [n:127.0.0.1:65246_solr    ] o.a.s.c.c.ZkConfigManager Copying zk node /configs/_default/lang/stopwords_de.txt to /configs/jwtColl.AUTOCREATED/lang/stopwords_de.txt
   [junit4]   2> 3032512 INFO  (OverseerThreadFactory-18908-thread-1-processing-n:127.0.0.1:65246_solr) [n:127.0.0.1:65246_solr    ] o.a.s.c.c.ZkConfigManager Copying zk node /configs/_default/lang/stopwords_fa.txt to /configs/jwtColl.AUTOCREATED/lang/stopwords_fa.txt
   [junit4]   2> 3032514 INFO  (OverseerThreadFactory-18908-thread-1-processing-n:127.0.0.1:65246_solr) [n:127.0.0.1:65246_solr    ] o.a.s.c.c.ZkConfigManager Copying zk node /configs/_default/lang/contractions_ga.txt to /configs/jwtColl.AUTOCREATED/lang/contractions_ga.txt
   [junit4]   2> 3032515 INFO  (OverseerThreadFactory-18908-thread-1-processing-n:127.0.0.1:65246_solr) [n:127.0.0.1:65246_solr    ] o.a.s.c.c.ZkConfigManager Copying zk node /configs/_default/lang/stopwords_ca.txt to /configs/jwtColl.AUTOCREATED/lang/stopwords_ca.txt
   [junit4]   2> 3032516 INFO  (OverseerThreadFactory-18908-thread-1-processing-n:127.0.0.1:65246_solr) [n:127.0.0.1:65246_solr    ] o.a.s.c.c.ZkConfigManager Copying zk node /configs/_default/lang/stopwords_nl.txt to /configs/jwtColl.AUTOCREATED/lang/stopwords_nl.txt
   [junit4]   2> 3032517 INFO  (OverseerThreadFactory-18908-thread-1-processing-n:127.0.0.1:65246_solr) [n:127.0.0.1:65246_solr    ] o.a.s.c.c.ZkConfigManager Copying zk node /configs/_default/lang/stopwords_bg.txt to /configs/jwtColl.AUTOCREATED/lang/stopwords_bg.txt
   [junit4]   2> 3032519 INFO  (OverseerThreadFactory-18908-thread-1-processing-n:127.0.0.1:65246_solr) [n:127.0.0.1:65246_solr    ] o.a.s.c.c.ZkConfigManager Copying zk node /configs/_default/lang/stopwords_en.txt to /configs/jwtColl.AUTOCREATED/lang/stopwords_en.txt
   [junit4]   2> 3032521 INFO  (OverseerThreadFactory-18908-thread-1-processing-n:127.0.0.1:65246_solr) [n:127.0.0.1:65246_solr    ] o.a.s.c.c.ZkConfigManager Copying zk node /configs/_default/lang/stopwords_es.txt to /configs/jwtColl.AUTOCREATED/lang/stopwords_es.txt
   [junit4]   2> 3032521 INFO  (OverseerThreadFactory-18908-thread-1-processing-n:127.0.0.1:65246_solr) [n:127.0.0.1:65246_solr    ] o.a.s.c.c.ZkConfigManager Copying zk node /configs/_default/lang/stopwords_lv.txt to /configs/jwtColl.AUTOCREATED/lang/stopwords_lv.txt
   [junit4]   2> 3032523 INFO  (OverseerThreadFactory-18908-thread-1-processing-n:127.0.0.1:65246_solr) [n:127.0.0.1:65246_solr    ] o.a.s.c.c.ZkConfigManager Copying zk node /configs/_default/lang/stopwords_ro.txt to /configs/jwtColl.AUTOCREATED/lang/stopwords_ro.txt
   [junit4]   2> 3032525 INFO  (OverseerThreadFactory-18908-thread-1-processing-n:127.0.0.1:65246_solr) [n:127.0.0.1:65246_solr    ] o.a.s.c.c.ZkConfigManager Copying zk node /configs/_default/lang/stopwords_th.txt to /configs/jwtColl.AUTOCREATED/lang/stopwords_th.txt
   [junit4]   2> 3032525 INFO  (OverseerThreadFactory-18908-thread-1-processing-n:127.0.0.1:65246_solr) [n:127.0.0.1:65246_solr    ] o.a.s.c.c.ZkConfigManager Copying zk node /configs/_default/lang/stopwords_fr.txt to /configs/jwtColl.AUTOCREATED/lang/stopwords_fr.txt
   [junit4]   2> 3032527 INFO  (OverseerThreadFactory-18908-thread-1-processing-n:127.0.0.1:65246_solr) [n:127.0.0.1:65246_solr    ] o.a.s.c.c.ZkConfigManager Copying zk node /configs/_default/lang/stopwords_sv.txt to /configs/jwtColl.AUTOCREATED/lang/stopwords_sv.txt
   [junit4]   2> 3032528 INFO  (OverseerThreadFactory-18908-thread-1-processing-n:127.0.0.1:65246_solr) [n:127.0.0.1:65246_solr    ] o.a.s.c.c.ZkConfigManager Copying zk node /configs/_default/lang/stopwords_fi.txt to /configs/jwtColl.AUTOCREATED/lang/stopwords_fi.txt
   [junit4]   2> 3032529 INFO  (OverseerThreadFactory-18908-thread-1-processing-n:127.0.0.1:65246_solr) [n:127.0.0.1:65246_solr    ] o.a.s.c.c.ZkConfigManager Copying zk node /configs/_default/lang/hyphenations_ga.txt to /configs/jwtColl.AUTOCREATED/lang/hyphenations_ga.txt
   [junit4]   2> 3032531 INFO  (OverseerThreadFactory-18908-thread-1-processing-n:127.0.0.1:65246_solr) [n:127.0.0.1:65246_solr    ] o.a.s.c.c.ZkConfigManager Copying zk node /configs/_default/lang/stopwords_gl.txt to /configs/jwtColl.AUTOCREATED/lang/stopwords_gl.txt
   [junit4]   2> 3032532 INFO  (OverseerThreadFactory-18908-thread-1-processing-n:127.0.0.1:65246_solr) [n:127.0.0.1:65246_solr    ] o.a.s.c.c.ZkConfigManager Copying zk node /configs/_default/params.json to /configs/jwtColl.AUTOCREATED/params.json
   [junit4]   2> 3032647 INFO  (qtp306896103-57486) [n:127.0.0.1:65246_solr    ] o.a.s.s.HttpSolrCall [admin] webapp=null path=/admin/info/key params={omitHeader=true&wt=json} status=0 QTime=0
   [junit4]   2> 3032648 INFO  (qtp306896103-57483) [    ] o.a.s.s.PKIAuthenticationPlugin New Key obtained from  node: 127.0.0.1:65246_solr / MIIBIjANBgkqhkiG9w0BAQEFAAOCAQ8AMIIBCgKCAQEAtht3Cp/Meh9hL8P2377HIe/glq4g9fGbU+YORjTztIIENdtseiYq2ASD86PXxuUyvNqATiO3j9ILDcndHWcLQ3iKcbPCh1NNBygJ70BiyvLwKVBR27pK21gghRyvEFxj6P7B7o4fp8r8RgaYonfRofsx8BYpaCTbogl2vvAgMHZGJ125pPxAYyVa+8pEuTW7cjKrGcPwz4IFspU3NYKWAswIqV9DMyfRxJITx5/UB/vwgDY5guBwDzbLuQEH5xUK4GYEE9Pu2VbK4kwo1ybuCC1mf1VeeCyohi8SR4GmXnoRolorcyIJ9wzIl4kuDaAYTAmMKUXvwV9jv7skjjkvxQIDAQAB
   [junit4]   2> 3032652 INFO  (qtp306896103-57483) [n:127.0.0.1:65246_solr    ] o.a.s.s.HttpSolrCall [admin] webapp=null path=/admin/metrics params={prefix=CONTAINER.fs.usableSpace,CONTAINER.fs.totalSpace,CORE.coreName&wt=javabin&version=2&group=solr.node,solr.core} status=0 QTime=3
   [junit4]   2> 3032661 INFO  (qtp306896103-57489) [n:127.0.0.1:65246_solr    ] o.a.s.s.HttpSolrCall [admin] webapp=null path=/admin/info/key params={omitHeader=true&wt=json} status=0 QTime=0
   [junit4]   2> 3032662 INFO  (qtp1200997010-57488) [    ] o.a.s.s.PKIAuthenticationPlugin New Key obtained from  node: 127.0.0.1:65246_solr / MIIBIjANBgkqhkiG9w0BAQEFAAOCAQ8AMIIBCgKCAQEAtht3Cp/Meh9hL8P2377HIe/glq4g9fGbU+YORjTztIIENdtseiYq2ASD86PXxuUyvNqATiO3j9ILDcndHWcLQ3iKcbPCh1NNBygJ70BiyvLwKVBR27pK21gghRyvEFxj6P7B7o4fp8r8RgaYonfRofsx8BYpaCTbogl2vvAgMHZGJ125pPxAYyVa+8pEuTW7cjKrGcPwz4IFspU3NYKWAswIqV9DMyfRxJITx5/UB/vwgDY5guBwDzbLuQEH5xUK4GYEE9Pu2VbK4kwo1ybuCC1mf1VeeCyohi8SR4GmXnoRolorcyIJ9wzIl4kuDaAYTAmMKUXvwV9jv7skjjkvxQIDAQAB
   [junit4]   2> 3032665 INFO  (qtp1200997010-57488) [n:127.0.0.1:65247_solr    ] o.a.s.s.HttpSolrCall [admin] webapp=null path=/admin/metrics params={prefix=CONTAINER.fs.usableSpace,CONTAINER.fs.totalSpace,CORE.coreName&wt=javabin&version=2&group=solr.node,solr.core} status=0 QTime=3
   [junit4]   2> 3032670 INFO  (OverseerStateUpdate-72077093453561864-127.0.0.1:65246_solr-n_0000000000) [n:127.0.0.1:65246_solr    ] o.a.s.c.o.SliceMutator createReplica() {
   [junit4]   2>   "operation":"ADDREPLICA",
   [junit4]   2>   "collection":"jwtColl",
   [junit4]   2>   "shard":"shard1",
   [junit4]   2>   "core":"jwtColl_shard1_replica_n1",
   [junit4]   2>   "state":"down",
   [junit4]   2>   "base_url":"http://127.0.0.1:65247/solr",
   [junit4]   2>   "type":"NRT",
   [junit4]   2>   "waitForFinalState":"false"} 
   [junit4]   2> 3032672 INFO  (OverseerStateUpdate-72077093453561864-127.0.0.1:65246_solr-n_0000000000) [n:127.0.0.1:65246_solr    ] o.a.s.c.o.SliceMutator createReplica() {
   [junit4]   2>   "operation":"ADDREPLICA",
   [junit4]   2>   "collection":"jwtColl",
   [junit4]   2>   "shard":"shard2",
   [junit4]   2>   "core":"jwtColl_shard2_replica_n2",
   [junit4]   2>   "state":"down",
   [junit4]   2>   "base_url":"http://127.0.0.1:65246/solr",
   [junit4]   2>   "type":"NRT",
   [junit4]   2>   "waitForFinalState":"false"} 
   [junit4]   2> 3032889 INFO  (qtp306896103-57481) [n:127.0.0.1:65246_solr    x:jwtColl_shard2_replica_n2] o.a.s.h.a.CoreAdminOperation core create command qt=/admin/cores&coreNodeName=core_node4&collection.configName=jwtColl.AUTOCREATED&newCollection=true&name=jwtColl_shard2_replica_n2&action=CREATE&numShards=2&collection=jwtColl&shard=shard2&wt=javabin&version=2&replicaType=NRT
   [junit4]   2> 3032889 INFO  (qtp1200997010-57490) [n:127.0.0.1:65247_solr    x:jwtColl_shard1_replica_n1] o.a.s.h.a.CoreAdminOperation core create command qt=/admin/cores&coreNodeName=core_node3&collection.configName=jwtColl.AUTOCREATED&newCollection=true&name=jwtColl_shard1_replica_n1&action=CREATE&numShards=2&collection=jwtColl&shard=shard1&wt=javabin&version=2&replicaType=NRT
   [junit4]   2> 3032889 INFO  (qtp306896103-57481) [n:127.0.0.1:65246_solr    x:jwtColl_shard2_replica_n2] o.a.s.c.TransientSolrCoreCacheDefault Allocating transient cache for 2147483647 transient cores
   [junit4]   2> 3033898 INFO  (qtp306896103-57481) [n:127.0.0.1:65246_solr c:jwtColl s:shard2 r:core_node4 x:jwtColl_shard2_replica_n2] o.a.s.c.RequestParams conf resource params.json loaded . version : 0 
   [junit4]   2> 3033898 INFO  (qtp1200997010-57490) [n:127.0.0.1:65247_solr c:jwtColl s:shard1 r:core_node3 x:jwtColl_shard1_replica_n1] o.a.s.c.RequestParams conf resource params.json loaded . version : 0 
   [junit4]   2> 3033898 INFO  (qtp1200997010-57490) [n:127.0.0.1:65247_solr c:jwtColl s:shard1 r:core_node3 x:jwtColl_shard1_replica_n1] o.a.s.c.RequestParams request params refreshed to version 0
   [junit4]   2> 3033898 INFO  (qtp306896103-57481) [n:127.0.0.1:65246_solr c:jwtColl s:shard2 r:core_node4 x:jwtColl_shard2_replica_n2] o.a.s.c.RequestParams request params refreshed to version 0
   [junit4]   2> 3033899 WARN  (qtp306896103-57481) [n:127.0.0.1:65246_solr c:jwtColl s:shard2 r:core_node4 x:jwtColl_shard2_replica_n2] o.a.s.c.SolrConfig Couldn't add files from C:\Users\jenkins\workspace\Lucene-Solr-master-Windows\solr\build\solr-core\test\J1\temp\solr.security.JWTAuthPluginIntegrationTest_22115CB07A9CDE29-001\tempDir-001\node1\jwtColl_shard2_replica_n2\..\..\..\..\contrib\extraction\lib filtered by .*\.jar to classpath: C:\Users\jenkins\workspace\Lucene-Solr-master-Windows\solr\build\solr-core\test\J1\temp\solr.security.JWTAuthPluginIntegrationTest_22115CB07A9CDE29-001\tempDir-001\node1\jwtColl_shard2_replica_n2\..\..\..\..\contrib\extraction\lib
   [junit4]   2> 3033899 WARN  (qtp1200997010-57490) [n:127.0.0.1:65247_solr c:jwtColl s:shard1 r:core_node3 x:jwtColl_shard1_replica_n1] o.a.s.c.SolrConfig Couldn't add files from C:\Users\jenkins\workspace\Lucene-Solr-master-Windows\solr\build\solr-core\test\J1\temp\solr.security.JWTAuthPluginIntegrationTest_22115CB07A9CDE29-001\tempDir-001\node2\jwtColl_shard1_replica_n1\..\..\..\..\contrib\extraction\lib filtered by .*\.jar to classpath: C:\Users\jenkins\workspace\Lucene-Solr-master-Windows\solr\build\solr-core\test\J1\temp\solr.security.JWTAuthPluginIntegrationTest_22115CB07A9CDE29-001\tempDir-001\node2\jwtColl_shard1_replica_n1\..\..\..\..\contrib\extraction\lib
   [junit4]   2> 3033900 WARN  (qtp1200997010-57490) [n:127.0.0.1:65247_solr c:jwtColl s:shard1 r:core_node3 x:jwtColl_shard1_replica_n1] o.a.s.c.SolrConfig Couldn't add files from C:\Users\jenkins\workspace\Lucene-Solr-master-Windows\solr\build\solr-core\test\J1\temp\solr.security.JWTAuthPluginIntegrationTest_22115CB07A9CDE29-001\tempDir-001\node2\jwtColl_shard1_replica_n1\..\..\..\..\dist filtered by solr-cell-\d.*\.jar to classpath: C:\Users\jenkins\workspace\Lucene-Solr-master-Windows\solr\build\solr-core\test\J1\temp\solr.security.JWTAuthPluginIntegrationTest_22115CB07A9CDE29-001\tempDir-001\node2\jwtColl_shard1_replica_n1\..\..\..\..\dist
   [junit4]   2> 3033900 WARN  (qtp306896103-57481) [n:127.0.0.1:65246_solr c:jwtColl s:shard2 r:core_node4 x:jwtColl_shard2_replica_n2] o.a.s.c.SolrConfig Couldn't add files from C:\Users\jenkins\workspace\Lucene-Solr-master-Windows\solr\build\solr-core\test\J1\temp\solr.security.JWTAuthPluginIntegrationTest_22115CB07A9CDE29-001\tempDir-001\node1\jwtColl_shard2_replica_n2\..\..\..\..\dist filtered by solr-cell-\d.*\.jar to classpath: C:\Users\jenkins\workspace\Lucene-Solr-master-Windows\solr\build\solr-core\test\J1\temp\solr.security.JWTAuthPluginIntegrationTest_22115CB07A9CDE29-001\tempDir-001\node1\jwtColl_shard2_replica_n2\..\..\..\..\dist
   [junit4]   2> 3033900 WARN  (qtp1200997010-57490) [n:127.0.0.1:65247_solr c:jwtColl s:shard1 r:core_node3 x:jwtColl_shard1_replica_n1] o.a.s.c.SolrConfig Couldn't add files from C:\Users\jenkins\workspace\Lucene-Solr-master-Windows\solr\build\solr-core\test\J1\temp\solr.security.JWTAuthPluginIntegrationTest_22115CB07A9CDE29-001\tempDir-001\node2\jwtColl_shard1_replica_n1\..\..\..\..\contrib\clustering\lib filtered by .*\.jar to classpath: C:\Users\jenkins\workspace\Lucene-Solr-master-Windows\solr\build\solr-core\test\J1\temp\solr.security.JWTAuthPluginIntegrationTest_22115CB07A9CDE29-001\tempDir-001\node2\jwtColl_shard1_replica_n1\..\..\..\..\contrib\clustering\lib
   [junit4]   2> 3033900 WARN  (qtp306896103-57481) [n:127.0.0.1:65246_solr c:jwtColl s:shard2 r:core_node4 x:jwtColl_shard2_replica_n2] o.a.s.c.SolrConfig Couldn't add files from C:\Users\jenkins\workspace\Lucene-Solr-master-Windows\solr\build\solr-core\test\J1\temp\solr.security.JWTAuthPluginIntegrationTest_22115CB07A9CDE29-001\tempDir-001\node1\jwtColl_shard2_replica_n2\..\..\..\..\contrib\clustering\lib filtered by .*\.jar to classpath: C:\Users\jenkins\workspace\Lucene-Solr-master-Windows\solr\build\solr-core\test\J1\temp\solr.security.JWTAuthPluginIntegrationTest_22115CB07A9CDE29-001\tempDir-001\node1\jwtColl_shard2_replica_n2\..\..\..\..\contrib\clustering\lib
   [junit4]   2> 3033900 WARN  (qtp1200997010-57490) [n:127.0.0.1:65247_solr c:jwtColl s:shard1 r:core_node3 x:jwtColl_shard1_replica_n1] o.a.s.c.SolrConfig Couldn't add files from C:\Users\jenkins\workspace\Lucene-Solr-master-Windows\solr\build\solr-core\test\J1\temp\solr.security.JWTAuthPluginIntegrationTest_22115CB07A9CDE29-001\tempDir-001\node2\jwtColl_shard1_replica_n1\..\..\..\..\dist filtered by solr-clustering-\d.*\.jar to classpath: C:\Users\jenkins\workspace\Lucene-Solr-master-Windows\solr\build\solr-core\test\J1\temp\solr.security.JWTAuthPluginIntegrationTest_22115CB07A9CDE29-001\tempDir-001\node2\jwtColl_shard1_replica_n1\..\..\..\..\dist
   [junit4]   2> 3033900 WARN  (qtp306896103-57481) [n:127.0.0.1:65246_solr c:jwtColl s:shard2 r:core_node4 x:jwtColl_shard2_replica_n2] o.a.s.c.SolrConfig Couldn't add files from C:\Users\jenkins\workspace\Lucene-Solr-master-Windows\solr\build\solr-core\test\J1\temp\solr.security.JWTAuthPluginIntegrationTest_22115CB07A9CDE29-001\tempDir-001\node1\jwtColl_shard2_replica_n2\..\..\..\..\dist filtered by solr-clustering-\d.*\.jar to classpath: C:\Users\jenkins\workspace\Lucene-Solr-master-Windows\solr\build\solr-core\test\J1\temp\solr.security.JWTAuthPluginIntegrationTest_22115CB07A9CDE29-001\tempDir-001\node1\jwtColl_shard2_replica_n2\..\..\..\..\dist
   [junit4]   2> 3033900 WARN  (qtp1200997010-57490) [n:127.0.0.1:65247_solr c:jwtColl s:shard1 r:core_node3 x:jwtColl_shard1_replica_n1] o.a.s.c.SolrConfig Couldn't add files from C:\Users\jenkins\workspace\Lucene-Solr-master-Windows\solr\build\solr-core\test\J1\temp\solr.security.JWTAuthPluginIntegrationTest_22115CB07A9CDE29-001\tempDir-001\node2\jwtColl_shard1_replica_n1\..\..\..\..\contrib\langid\lib filtered by .*\.jar to classpath: C:\Users\jenkins\workspace\Lucene-Solr-master-Windows\solr\build\solr-core\test\J1\temp\solr.security.JWTAuthPluginIntegrationTest_22115CB07A9CDE29-001\tempDir-001\node2\jwtColl_shard1_replica_n1\..\..\..\..\contrib\langid\lib
   [junit4]   2> 3033900 WARN  (qtp306896103-57481) [n:127.0.0.1:65246_solr c:jwtColl s:shard2 r:core_node4 x:jwtColl_shard2_replica_n2] o.a.s.c.SolrConfig Couldn't add files from C:\Users\jenkins\workspace\Lucene-Solr-master-Windows\solr\build\solr-core\test\J1\temp\solr.security.JWTAuthPluginIntegrationTest_22115CB07A9CDE29-001\tempDir-001\node1\jwtColl_shard2_replica_n2\..\..\..\..\contrib\langid\lib filtered by .*\.jar to classpath: C:\Users\jenkins\workspace\Lucene-Solr-master-Windows\solr\build\solr-core\test\J1\temp\solr.security.JWTAuthPluginIntegrationTest_22115CB07A9CDE29-001\tempDir-001\node1\jwtColl_shard2_replica_n2\..\..\..\..\contrib\langid\lib
   [junit4]   2> 3033900 WARN  (qtp1200997010-57490) [n:127.0.0.1:65247_solr c:jwtColl s:shard1 r:core_node3 x:jwtColl_shard1_replica_n1] o.a.s.c.SolrConfig Couldn't add files from C:\Users\jenkins\workspace\Lucene-Solr-master-Windows\solr\build\solr-core\test\J1\temp\solr.security.JWTAuthPluginIntegrationTest_22115CB07A9CDE29-001\tempDir-001\node2\jwtColl_shard1_replica_n1\..\..\..\..\dist filtered by solr-langid-\d.*\.jar to classpath: C:\Users\jenkins\workspace\Lucene-Solr-master-Windows\solr\build\solr-core\test\J1\temp\solr.security.JWTAuthPluginIntegrationTest_22115CB07A9CDE29-001\tempDir-001\node2\jwtColl_shard1_replica_n1\..\..\..\..\dist
   [junit4]   2> 3033900 WARN  (qtp306896103-57481) [n:127.0.0.1:65246_solr c:jwtColl s:shard2 r:core_node4 x:jwtColl_shard2_replica_n2] o.a.s.c.SolrConfig Couldn't add files from C:\Users\jenkins\workspace\Lucene-Solr-master-Windows\solr\build\solr-core\test\J1\temp\solr.security.JWTAuthPluginIntegrationTest_22115CB07A9CDE29-001\tempDir-001\node1\jwtColl_shard2_replica_n2\..\..\..\..\dist filtered by solr-langid-\d.*\.jar to classpath: C:\Users\jenkins\workspace\Lucene-Solr-master-Windows\solr\build\solr-core\test\J1\temp\solr.security.JWTAuthPluginIntegrationTest_22115CB07A9CDE29-001\tempDir-001\node1\jwtColl_shard2_replica_n2\..\..\..\..\dist
   [junit4]   2> 3033900 WARN  (qtp306896103-57481) [n:127.0.0.1:65246_solr c:jwtColl s:shard2 r:core_node4 x:jwtColl_shard2_replica_n2] o.a.s.c.SolrConfig Couldn't add files from C:\Users\jenkins\workspace\Lucene-Solr-master-Windows\solr\build\solr-core\test\J1\temp\solr.security.JWTAuthPluginIntegrationTest_22115CB07A9CDE29-001\tempDir-001\node1\jwtColl_shard2_replica_n2\..\..\..\..\contrib\velocity\lib filtered by .*\.jar to classpath: C:\Users\jenkins\workspace\Lucene-Solr-master-Windows\solr\build\solr-core\test\J1\temp\solr.security.JWTAuthPluginIntegrationTest_22115CB07A9CDE29-001\tempDir-001\node1\jwtColl_shard2_replica_n2\..\..\..\..\contrib\velocity\lib
   [junit4]   2> 3033900 WARN  (qtp1200997010-57490) [n:127.0.0.1:65247_solr c:jwtColl s:shard1 r:core_node3 x:jwtColl_shard1_replica_n1] o.a.s.c.SolrConfig Couldn't add files from C:\Users\jenkins\workspace\Lucene-Solr-master-Windows\solr\build\solr-core\test\J1\temp\solr.security.JWTAuthPluginIntegrationTest_22115CB07A9CDE29-001\tempDir-001\node2\jwtColl_shard1_replica_n1\..\..\..\..\contrib\velocity\lib filtered by .*\.jar to classpath: C:\Users\jenkins\workspace\Lucene-Solr-master-Windows\solr\build\solr-core\test\J1\temp\solr.security.JWTAuthPluginIntegrationTest_22115CB07A9CDE29-001\tempDir-001\node2\jwtColl_shard1_replica_n1\..\..\..\..\contrib\velocity\lib
   [junit4]   2> 3033900 WARN  (qtp306896103-57481) [n:127.0.0.1:65246_solr c:jwtColl s:shard2 r:core_node4 x:jwtColl_shard2_replica_n2] o.a.s.c.SolrConfig Couldn't add files from C:\Users\jenkins\workspace\Lucene-Solr-master-Windows\solr\build\solr-core\test\J1\temp\solr.security.JWTAuthPluginIntegrationTest_22115CB07A9CDE29-001\tempDir-001\node1\jwtColl_shard2_replica_n2\..\..\..\..\dist filtered by solr-velocity-\d.*\.jar to classpath: C:\Users\jenkins\workspace\Lucene-Solr-master-Windows\solr\build\solr-core\test\J1\temp\solr.security.JWTAuthPluginIntegrationTest_22115CB07A9CDE29-001\tempDir-001\node1\jwtColl_shard2_replica_n2\..\..\..\..\dist
   [junit4]   2> 3033900 WARN  (qtp1200997010-57490) [n:127.0.0.1:65247_solr c:jwtColl s:shard1 r:core_node3 x:jwtColl_shard1_replica_n1] o.a.s.c.SolrConfig Couldn't add files from C:\Users\jenkins\workspace\Lucene-Solr-master-Windows\solr\build\solr-core\test\J1\temp\solr.security.JWTAuthPluginIntegrationTest_22115CB07A9CDE29-001\tempDir-001\node2\jwtColl_shard1_replica_n1\..\..\..\..\dist filtered by solr-velocity-\d.*\.jar to classpath: C:\Users\jenkins\workspace\Lucene-Solr-master-Windows\solr\build\solr-core\test\J1\temp\solr.security.JWTAuthPluginIntegrationTest_22115CB07A9CDE29-001\tempDir-001\node2\jwtColl_shard1_replica_n1\..\..\..\..\dist
   [junit4]   2> 3033900 WARN  (qtp306896103-57481) [n:127.0.0.1:65246_solr c:jwtColl s:shard2 r:core_node4 x:jwtColl_shard2_replica_n2] o.a.s.c.SolrConfig Couldn't add files from C:\Users\jenkins\workspace\Lucene-Solr-master-Windows\solr\build\solr-core\test\J1\temp\solr.security.JWTAuthPluginIntegrationTest_22115CB07A9CDE29-001\tempDir-001\node1\jwtColl_shard2_replica_n2\..\..\..\..\dist filtered by solr-ltr-\d.*\.jar to classpath: C:\Users\jenkins\workspace\Lucene-Solr-master-Windows\solr\build\solr-core\test\J1\temp\solr.security.JWTAuthPluginIntegrationTest_22115CB07A9CDE29-001\tempDir-001\node1\jwtColl_shard2_replica_n2\..\..\..\..\dist
   [junit4]   2> 3033900 WARN  (qtp1200997010-57490) [n:127.0.0.1:65247_solr c:jwtColl s:shard1 r:core_node3 x:jwtColl_shard1_replica_n1] o.a.s.c.SolrConfig Couldn't add files from C:\Users\jenkins\workspace\Lucene-Solr-master-Windows\solr\build\solr-core\test\J1\temp\solr.security.JWTAuthPluginIntegrationTest_22115CB07A9CDE29-001\tempDir-001\node2\jwtColl_shard1_replica_n1\..\..\..\..\dist filtered by solr-ltr-\d.*\.jar to classpath: C:\Users\jenkins\workspace\Lucene-Solr-master-Windows\solr\build\solr-core\test\J1\temp\solr.security.JWTAuthPluginIntegrationTest_22115CB07A9CDE29-001\tempDir-001\node2\jwtColl_shard1_replica_n1\..\..\..\..\dist
   [junit4]   2> 3033901 INFO  (qtp306896103-57481) [n:127.0.0.1:65246_solr c:jwtColl s:shard2 r:core_node4 x:jwtColl_shard2_replica_n2] o.a.s.c.SolrConfig Using Lucene MatchVersion: 9.0.0
   [junit4]   2> 3033901 INFO  (qtp1200997010-57490) [n:127.0.0.1:65247_solr c:jwtColl s:shard1 r:core_node3 x:jwtColl_shard1_replica_n1] o.a.s.c.SolrConfig Using Lucene MatchVersion: 9.0.0
   [junit4]   2> 3033929 INFO  (qtp1200997010-57490) [n:127.0.0.1:65247_solr c:jwtColl s:shard1 r:core_node3 x:jwtColl_shard1_replica_n1] o.a.s.s.IndexSchema [jwtColl_shard1_replica_n1] Schema name=default-config
   [junit4]   2> 3033929 INFO  (qtp306896103-57481) [n:127.0.0.1:65246_solr c:jwtColl s:shard2 r:core_node4 x:jwtColl_shard2_replica_n2] o.a.s.s.IndexSchema [jwtColl_shard2_replica_n2] Schema name=default-config
   [junit4]   2> 3034066 INFO  (qtp1200997010-57490) [n:127.0.0.1:65247_solr c:jwtColl s:shard1 r:core_node3 x:jwtColl_shard1_replica_n1] o.a.s.s.IndexSchema Loaded schema default-config/1.6 with uniqueid field id
   [junit4]   2> 3034066 INFO  (qtp306896103-57481) [n:127.0.0.1:65246_solr c:jwtColl s:shard2 r:core_node4 x:jwtColl_shard2_replica_n2] o.a.s.s.IndexSchema Loaded schema default-config/1.6 with uniqueid field id
   [junit4]   2> 3034094 INFO  (qtp1200997010-57490) [n:127.0.0.1:65247_solr c:jwtColl s:shard1 r:core_node3 x:jwtColl_shard1_replica_n1] o.a.s.c.CoreContainer Creating SolrCore 'jwtColl_shard1_replica_n1' using configuration from collection jwtColl, trusted=true
   [junit4]   2> 3034094 INFO  (qtp1200997010-57490) [n:127.0.0.1:65247_solr c:jwtColl s:shard1 r:core_node3 x:jwtColl_shard1_replica_n1] o.a.s.m.r.SolrJmxReporter JMX monitoring for 'solr_65247.solr.core.jwtColl.shard1.replica_n1' (registry 'solr.core.jwtColl.shard1.replica_n1') enabled at server: com.sun.jmx.mbeanserver.JmxMBeanServer@35209456
   [junit4]   2> 3034094 INFO  (qtp1200997010-57490) [n:127.0.0.1:65247_solr c:jwtColl s:shard1 r:core_node3 x:jwtColl_shard1_replica_n1] o.a.s.c.SolrCore [[jwtColl_shard1_replica_n1] ] Opening new SolrCore at [C:\Users\jenkins\workspace\Lucene-Solr-master-Windows\solr\build\solr-core\test\J1\temp\solr.security.JWTAuthPluginIntegrationTest_22115CB07A9CDE29-001\tempDir-001\node2\jwtColl_shard1_replica_n1], dataDir=[C:\Users\jenkins\workspace\Lucene-Solr-master-Windows\solr\build\solr-core\test\J1\temp\solr.security.JWTAuthPluginIntegrationTest_22115CB07A9CDE29-001\tempDir-001\node2\.\jwtColl_shard1_replica_n1\data\]
   [junit4]   2> 3034094 INFO  (qtp306896103-57481) [n:127.0.0.1:65246_solr c:jwtColl s:shard2 r:core_node4 x:jwtColl_shard2_replica_n2] o.a.s.c.CoreContainer Creating SolrCore 'jwtColl_shard2_replica_n2' using configuration from collection jwtColl, trusted=true
   [junit4]   2> 3034094 INFO  (qtp306896103-57481) [n:127.0.0.1:65246_solr c:jwtColl s:shard2 r:core_node4 x:jwtColl_shard2_replica_n2] o.a.s.m.r.SolrJmxReporter JMX monitoring for 'solr_65246.solr.core.jwtColl.shard2.replica_n2' (registry 'solr.core.jwtColl.shard2.replica_n2') enabled at server: com.sun.jmx.mbeanserver.JmxMBeanServer@35209456
   [junit4]   2> 3034094 INFO  (qtp306896103-57481) [n:127.0.0.1:65246_solr c:jwtColl s:shard2 r:core_node4 x:jwtColl_shard2_replica_n2] o.a.s.c.SolrCore [[jwtColl_shard2_replica_n2] ] Opening new SolrCore at [C:\Users\jenkins\workspace\Lucene-Solr-master-Windows\solr\build\solr-core\test\J1\temp\solr.security.JWTAuthPluginIntegrationTest_22115CB07A9CDE29-001\tempDir-001\node1\jwtColl_shard2_replica_n2], dataDir=[C:\Users\jenkins\workspace\Lucene-Solr-master-Windows\solr\build\solr-core\test\J1\temp\solr.security.JWTAuthPluginIntegrationTest_22115CB07A9CDE29-001\tempDir-001\node1\.\jwtColl_shard2_replica_n2\data\]
   [junit4]   2> 3034096 INFO  (qtp306896103-57481) [n:127.0.0.1:65246_solr c:jwtColl s:shard2 r:core_node4 x:jwtColl_shard2_replica_n2] o.a.s.r.XSLTResponseWriter xsltCacheLifetimeSeconds=5
   [junit4]   2> 3034096 INFO  (qtp1200997010-57490) [n:127.0.0.1:65247_solr c:jwtColl s:shard1 r:core_node3 x:jwtColl_shard1_replica_n1] o.a.s.r.XSLTResponseWriter xsltCacheLifetimeSeconds=5
   [junit4]   2> 3034170 INFO  (qtp1200997010-57490) [n:127.0.0.1:65247_solr c:jwtColl s:shard1 r:core_node3 x:jwtColl_shard1_replica_n1] o.a.s.u.UpdateHandler Using UpdateLog implementation: org.apache.solr.update.UpdateLog
   [junit4]   2> 3034170 INFO  (qtp1200997010-57490) [n:127.0.0.1:65247_solr c:jwtColl s:shard1 r:core_node3 x:jwtColl_shard1_replica_n1] o.a.s.u.UpdateLog Initializing UpdateLog: dataDir= defaultSyncLevel=FLUSH numRecordsToKeep=100 maxNumLogsToKeep=10 numVersionBuckets=65536
   [junit4]   2> 3034170 INFO  (qtp306896103-57481) [n:127.0.0.1:65246_solr c:jwtColl s:shard2 r:core_node4 x:jwtColl_shard2_replica_n2] o.a.s.u.UpdateHandler Using UpdateLog implementation: org.apache.solr.update.UpdateLog
   [junit4]   2> 3034170 INFO  (qtp306896103-57481) [n:127.0.0.1:65246_solr c:jwtColl s:shard2 r:core_node4 x:jwtColl_shard2_replica_n2] o.a.s.u.UpdateLog Initializing UpdateLog: dataDir= defaultSyncLevel=FLUSH numRecordsToKeep=100 maxNumLogsToKeep=10 numVersionBuckets=65536
   [junit4]   2> 3034171 INFO  (qtp1200997010-57490) [n:127.0.0.1:65247_solr c:jwtColl s:shard1 r:core_node3 x:jwtColl_shard1_replica_n1] o.a.s.u.CommitTracker Hard AutoCommit: if uncommitted for 15000ms; 
   [junit4]   2> 3034171 INFO  (qtp1200997010-57490) [n:127.0.0.1:65247_solr c:jwtColl s:shard1 r:core_node3 x:jwtColl_shard1_replica_n1] o.a.s.u.CommitTracker Soft AutoCommit: disabled
   [junit4]   2> 3034171 INFO  (qtp306896103-57481) [n:127.0.0.1:65246_solr c:jwtColl s:shard2 r:core_node4 x:jwtColl_shard2_replica_n2] o.a.s.u.CommitTracker Hard AutoCommit: if uncommitted for 15000ms; 
   [junit4]   2> 3034171 INFO  (qtp306896103-57481) [n:127.0.0.1:65246_solr c:jwtColl s:shard2 r:core_node4 x:jwtColl_shard2_replica_n2] o.a.s.u.CommitTracker Soft AutoCommit: disabled
   [junit4]   2> 3034173 INFO  (qtp1200997010-57490) [n:127.0.0.1:65247_solr c:jwtColl s:shard1 r:core_node3 x:jwtColl_shard1_replica_n1] o.a.s.s.SolrIndexSearcher Opening [Searcher@3e0cd0c9[jwtColl_shard1_replica_n1] main]
   [junit4]   2> 3034173 INFO  (qtp306896103-57481) [n:127.0.0.1:65246_solr c:jwtColl s:shard2 r:core_node4 x:jwtColl_shard2_replica_n2] o.a.s.s.SolrIndexSearcher Opening [Searcher@42f61112[jwtColl_shard2_replica_n2] main]
   [junit4]   2> 3034174 INFO  (qtp306896103-57481) [n:127.0.0.1:65246_solr c:jwtColl s:shard2 r:core_node4 x:jwtColl_shard2_replica_n2] o.a.s.r.ManagedResourceStorage Configured ZooKeeperStorageIO with znodeBase: /configs/jwtColl.AUTOCREATED
   [junit4]   2> 3034174 INFO  (qtp1200997010-57490) [n:127.0.0.1:65247_solr c:jwtColl s:shard1 r:core_node3 x:jwtColl_shard1_replica_n1] o.a.s.r.ManagedResourceStorage Configured ZooKeeperStorageIO with znodeBase: /configs/jwtColl.AUTOCREATED
   [junit4]   2> 3034174 INFO  (qtp1200997010-57490) [n:127.0.0.1:65247_solr c:jwtColl s:shard1 r:core_node3 x:jwtColl_shard1_replica_n1] o.a.s.r.ManagedResourceStorage Loaded null at path _rest_managed.json using ZooKeeperStorageIO:path=/configs/jwtColl.AUTOCREATED
   [junit4]   2> 3034174 INFO  (qtp306896103-57481) [n:127.0.0.1:65246_solr c:jwtColl s:shard2 r:core_node4 x:jwtColl_shard2_replica_n2] o.a.s.r.ManagedResourceStorage Loaded null at path _rest_managed.json using ZooKeeperStorageIO:path=/configs/jwtColl.AUTOCREATED
   [junit4]   2> 3034174 INFO  (qtp306896103-57481) [n:127.0.0.1:65246_solr c:jwtColl s:shard2 r:core_node4 x:jwtColl_shard2_replica_n2] o.a.s.s.ZkIndexSchemaReader Creating ZooKeeper watch for the managed schema at /configs/jwtColl.AUTOCREATED/managed-schema
   [junit4]   2> 3034174 INFO  (qtp1200997010-57490) [n:127.0.0.1:65247_solr c:jwtColl s:shard1 r:core_node3 x:jwtColl_shard1_replica_n1] o.a.s.s.ZkIndexSchemaReader Creating ZooKeeper watch for the managed schema at /configs/jwtColl.AUTOCREATED/managed-schema
   [junit4]   2> 3034175 INFO  (qtp306896103-57481) [n:127.0.0.1:65246_solr c:jwtColl s:shard2 r:core_node4 x:jwtColl_shard2_replica_n2] o.a.s.s.ZkIndexSchemaReader Current schema version 0 is already the latest
   [junit4]   2> 3034175 INFO  (qtp1200997010-57490) [n:127.0.0.1:65247_solr c:jwtColl s:shard1 r:core_node3 x:jwtColl_shard1_replica_n1] o.a.s.s.ZkIndexSchemaReader Current schema version 0 is already the latest
   [junit4]   2> 3034175 INFO  (qtp306896103-57481) [n:127.0.0.1:65246_solr c:jwtColl s:shard2 r:core_node4 x:jwtColl_shard2_replica_n2] o.a.s.h.c.SpellCheckComponent Initializing spell checkers
   [junit4]   2> 3034175 INFO  (qtp306896103-57481) [n:127.0.0.1:65246_solr c:jwtColl s:shard2 r:core_node4 x:jwtColl_shard2_replica_n2] o.a.s.s.DirectSolrSpellChecker init: {name=default,field=_text_,classname=solr.DirectSolrSpellChecker,distanceMeasure=internal,accuracy=0.5,maxEdits=2,minPrefix=1,maxInspections=5,minQueryLength=4,maxQueryFrequency=0.01}
   [junit4]   2> 3034175 INFO  (qtp1200997010-57490) [n:127.0.0.1:65247_solr c:jwtColl s:shard1 r:core_node3 x:jwtColl_shard1_replica_n1] o.a.s.h.c.SpellCheckComponent Initializing spell checkers
   [junit4]   2> 3034175 INFO  (qtp1200997010-57490) [n:127.0.0.1:65247_solr c:jwtColl s:shard1 r:core_node3 x:jwtColl_shard1_replica_n1] o.a.s.s.DirectSolrSpellChecker init: {name=default,field=_text_,classname=solr.DirectSolrSpellChecker,distanceMeasure=internal,accuracy=0.5,maxEdits=2,minPrefix=1,maxInspections=5,minQueryLength=4,maxQueryFrequency=0.01}
   [junit4]   2> 3034176 INFO  (qtp1200997010-57490) [n:127.0.0.1:65247_solr c:jwtColl s:shard1 r:core_node3 x:jwtColl_shard1_replica_n1] o.a.s.h.ReplicationHandler Commits will be reserved for 10000ms.
   [junit4]   2> 3034176 INFO  (qtp306896103-57481) [n:127.0.0.1:65246_solr c:jwtColl s:shard2 r:core_node4 x:jwtColl_shard2_replica_n2] o.a.s.h.ReplicationHandler Commits will be reserved for 10000ms.
   [junit4]   2> 3034176 INFO  (qtp1200997010-57490) [n:127.0.0.1:65247_solr c:jwtColl s:shard1 r:core_node3 x:jwtColl_shard1_replica_n1] o.a.s.u.UpdateLog Could not find max version in index or recent updates, using new clock 1632868747330977792
   [junit4]   2> 3034176 INFO  (qtp306896103-57481) [n:127.0.0.1:65246_solr c:jwtColl s:shard2 r:core_node4 x:jwtColl_shard2_replica_n2] o.a.s.u.UpdateLog Could not find max version in index or recent updates, using new clock 1632868747330977792
   [junit4]   2> 3034178 INFO  (searcherExecutor-18917-thread-1-processing-n:127.0.0.1:65247_solr x:jwtColl_shard1_replica_n1 c:jwtColl s:shard1 r:core_node3) [n:127.0.0.1:65247_solr c:jwtColl s:shard1 r:core_node3 x:jwtColl_shard1_replica_n1] o.a.s.c.QuerySenderListener QuerySenderListener sending requests to Searcher@3e0cd0c9[jwtColl_shard1_replica_n1] main{ExitableDirectoryReader(UninvertingDirectoryReader())}
   [junit4]   2> 3034178 INFO  (searcherExecutor-18917-thread-1-processing-n:127.0.0.1:65247_solr x:jwtColl_shard1_replica_n1 c:jwtColl s:shard1 r:core_node3) [n:127.0.0.1:65247_solr c:jwtColl s:shard1 r:core_node3 x:jwtColl_shard1_replica_n1] o.a.s.c.QuerySenderListener QuerySenderListener done.
   [junit4]   2> 3034178 INFO  (searcherExecutor-18917-thread-1-processing-n:127.0.0.1:65247_solr x:jwtColl_shard1_replica_n1 c:jwtColl s:shard1 r:core_node3) [n:127.0.0.1:65247_solr c:jwtColl s:shard1 r:core_node3 x:jwtColl_shard1_replica_n1] o.a.s.h.c.SpellCheckComponent Loading spell index for spellchecker: default
   [junit4]   2> 3034179 INFO  (searcherExecutor-18918-thread-1-processing-n:127.0.0.1:65246_solr x:jwtColl_shard2_replica_n2 c:jwtColl s:shard2 r:core_node4) [n:127.0.0.1:65246_solr c:jwtColl s:shard2 r:core_node4 x:jwtColl_shard2_replica_n2] o.a.s.c.QuerySenderListener QuerySenderListener sending requests to Searcher@42f61112[jwtColl_shard2_replica_n2] main{ExitableDirectoryReader(UninvertingDirectoryReader())}
   [junit4]   2> 3034179 INFO  (searcherExecutor-18918-thread-1-processing-n:127.0.0.1:65246_solr x:jwtColl_shard2_replica_n2 c:jwtColl s:shard2 r:core_node4) [n:127.0.0.1:65246_solr c:jwtColl s:shard2 r:core_node4 x:jwtColl_shard2_replica_n2] o.a.s.c.QuerySenderListener QuerySenderListener done.
   [junit4]   2> 3034179 INFO  (searcherExecutor-18918-thread-1-processing-n:127.0.0.1:65246_solr x:jwtColl_shard2_replica_n2 c:jwtColl s:shard2 r:core_node4) [n:127.0.0.1:65246_solr c:jwtColl s:shard2 r:core_node4 x:jwtColl_shard2_replica_n2] o.a.s.h.c.SpellCheckComponent Loading spell index for spellchecker: default
   [junit4]   2> 3034179 INFO  (searcherExecutor-18917-thread-1-processing-n:127.0.0.1:65247_solr x:jwtColl_shard1_replica_n1 c:jwtColl s:shard1 r:core_node3) [n:127.0.0.1:65247_solr c:jwtColl s:shard1 r:core_node3 x:jwtColl_shard1_replica_n1] o.a.s.c.SolrCore [jwtColl_shard1_replica_n1] Registered new searcher Searcher@3e0cd0c9[jwtColl_shard1_replica_n1] main{ExitableDirectoryReader(UninvertingDirectoryReader())}
   [junit4]   2> 3034179 INFO  (searcherExecutor-18918-thread-1-processing-n:127.0.0.1:65246_solr x:jwtColl_shard2_replica_n2 c:jwtColl s:shard2 r:core_node4) [n:127.0.0.1:65246_solr c:jwtColl s:shard2 r:core_node4 x:jwtColl_shard2_replica_n2] o.a.s.c.SolrCore [jwtColl_shard2_replica_n2] Registered new searcher Searcher@42f61112[jwtColl_shard2_replica_n2] main{ExitableDirectoryReader(UninvertingDirectoryReader())}
   [junit4]   2> 3034192 INFO  (qtp306896103-57481) [n:127.0.0.1:65246_solr c:jwtColl s:shard2 r:core_node4 x:jwtColl_shard2_replica_n2] o.a.s.c.ZkShardTerms Successful update of terms at /collections/jwtColl/terms/shard2 to Terms{values={core_node4=0}, version=0}
   [junit4]   2> 3034192 INFO  (qtp306896103-57481) [n:127.0.0.1:65246_solr c:jwtColl s:shard2 r:core_node4 x:jwtColl_shard2_replica_n2] o.a.s.c.ShardLeaderElectionContextBase make sure parent is created /collections/jwtColl/leaders/shard2
   [junit4]   2> 3034192 INFO  (qtp1200997010-57490) [n:127.0.0.1:65247_solr c:jwtColl s:shard1 r:core_node3 x:jwtColl_shard1_replica_n1] o.a.s.c.ZkShardTerms Successful update of terms at /collections/jwtColl/terms/shard1 to Terms{values={core_node3=0}, version=0}
   [junit4]   2> 3034192 INFO  (qtp1200997010-57490) [n:127.0.0.1:65247_solr c:jwtColl s:shard1 r:core_node3 x:jwtColl_shard1_replica_n1] o.a.s.c.ShardLeaderElectionContextBase make sure parent is created /collections/jwtColl/leaders/shard1
   [junit4]   2> 3034195 INFO  (qtp1200997010-57490) [n:127.0.0.1:65247_solr c:jwtColl s:shard1 r:core_node3 x:jwtColl_shard1_replica_n1] o.a.s.c.ShardLeaderElectionContext Enough replicas found to continue.
   [junit4]   2> 3034195 INFO  (qtp306896103-57481) [n:127.0.0.1:65246_solr c:jwtColl s:shard2 r:core_node4 x:jwtColl_shard2_replica_n2] o.a.s.c.ShardLeaderElectionContext Enough replicas found to continue.
   [junit4]   2> 3034195 INFO  (qtp1200997010-57490) [n:127.0.0.1:65247_solr c:jwtColl s:shard1 r:core_node3 x:jwtColl_shard1_replica_n1] o.a.s.c.ShardLeaderElectionContext I may be the new leader - try and sync
   [junit4]   2> 3034195 INFO  (qtp306896103-57481) [n:127.0.0.1:65246_solr c:jwtColl s:shard2 r:core_node4 x:jwtColl_shard2_replica_n2] o.a.s.c.ShardLeaderElectionContext I may be the new leader - try and sync
   [junit4]   2> 3034195 INFO  (qtp1200997010-57490) [n:127.0.0.1:65247_solr c:jwtColl s:shard1 r:core_node3 x:jwtColl_shard1_replica_n1] o.a.s.c.SyncStrategy Sync replicas to http://127.0.0.1:65247/solr/jwtColl_shard1_replica_n1/
   [junit4]   2> 3034195 INFO  (qtp306896103-57481) [n:127.0.0.1:65246_solr c:jwtColl s:shard2 r:core_node4 x:jwtColl_shard2_replica_n2] o.a.s.c.SyncStrategy Sync replicas to http://127.0.0.1:65246/solr/jwtColl_shard2_replica_n2/
   [junit4]   2> 3034196 INFO  (qtp1200997010-57490) [n:127.0.0.1:65247_solr c:jwtColl s:shard1 r:core_node3 x:jwtColl_shard1_replica_n1] o.a.s.c.SyncStrategy Sync Success - now sync replicas to me
   [junit4]   2> 3034196 INFO  (qtp306896103-57481) [n:127.0.0.1:65246_solr c:jwtColl s:shard2 r:core_node4 x:jwtColl_shard2_replica_n2] o.a.s.c.SyncStrategy Sync Success - now sync replicas to me
   [junit4]   2> 3034196 INFO  (qtp1200997010-57490) [n:127.0.0.1:65247_solr c:jwtColl s:shard1 r:core_node3 x:jwtColl_shard1_replica_n1] o.a.s.c.SyncStrategy http://127.0.0.1:65247/solr/jwtColl_shard1_replica_n1/ has no replicas
   [junit4]   2> 3034196 INFO  (qtp1200997010-57490) [n:127.0.0.1:65247_solr c:jwtColl s:shard1 r:core_node3 x:jwtColl_shard1_replica_n1] o.a.s.c.ShardLeaderElectionContextBase Creating leader registration node /collections/jwtColl/leaders/shard1/leader after winning as /collections/jwtColl/leader_elect/shard1/election/72077093453561862-core_node3-n_0000000000
   [junit4]   2> 3034196 INFO  (qtp306896103-57481) [n:127.0.0.1:65246_solr c:jwtColl s:shard2 r:core_node4 x:jwtColl_shard2_replica_n2] o.a.s.c.SyncStrategy http://127.0.0.1:65246/solr/jwtColl_shard2_replica_n2/ has no replicas
   [junit4]   2> 3034196 INFO  (qtp306896103-57481) [n:127.0.0.1:65246_solr c:jwtColl s:shard2 r:core_node4 x:jwtColl_shard2_replica_n2] o.a.s.c.ShardLeaderElectionContextBase Creating leader registration node /collections/jwtColl/leaders/shard2/leader after winning as /collections/jwtColl/leader_elect/shard2/election/72077093453561864-core_node4-n_0000000000
   [junit4]   2> 3034197 INFO  (qtp1200997010-57490) [n:127.0.0.1:65247_solr c:jwtColl s:shard1 r:core_node3 x:jwtColl_shard1_replica_n1] o.a.s.c.ShardLeaderElectionContext I am the new leader: http://127.0.0.1:65247/solr/jwtColl_shard1_replica_n1/ shard1
   [juni

[...truncated too long message...]

    ] o.a.s.m.SolrMetricManager Closing metric reporters for registry=solr.jetty, tag=null
   [junit4]   2> 87547 INFO  (jetty-closer-538-thread-2) [    ] o.a.s.m.r.SolrJmxReporter Closing reporter [org.apache.solr.metrics.reporters.SolrJmxReporter@7af61998: rootName = solr_50833, domain = solr.jetty, service url = null, agent id = null] for registry solr.jetty / com.codahale.metrics.MetricRegistry@922457a
   [junit4]   2> 87547 INFO  (jetty-closer-538-thread-2) [    ] o.a.s.m.SolrMetricManager Closing metric reporters for registry=solr.cluster, tag=null
   [junit4]   2> 87551 INFO  (jetty-closer-538-thread-1) [    ] o.a.s.c.TransientSolrCoreCacheDefault Allocating transient cache for 2147483647 transient cores
   [junit4]   2> 87552 INFO  (zkCallback-524-thread-1) [    ] o.a.s.c.c.ZkStateReader Updated live nodes from ZooKeeper... (2) -> (1)
   [junit4]   2> 87552 INFO  (zkCallback-530-thread-1) [    ] o.a.s.c.c.ZkStateReader Updated live nodes from ZooKeeper... (2) -> (1)
   [junit4]   2> 87552 INFO  (zkCallback-517-thread-1) [    ] o.a.s.c.c.ZkStateReader Updated live nodes from ZooKeeper... (2) -> (1)
   [junit4]   2> 87552 INFO  (jetty-closer-538-thread-1) [    ] o.a.s.m.SolrMetricManager Closing metric reporters for registry=solr.node, tag=null
   [junit4]   2> 87608 INFO  (jetty-closer-538-thread-1) [    ] o.a.s.m.r.SolrJmxReporter Closing reporter [org.apache.solr.metrics.reporters.SolrJmxReporter@1b7e1338: rootName = solr_50834, domain = solr.node, service url = null, agent id = null] for registry solr.node / com.codahale.metrics.MetricRegistry@6216fb57
   [junit4]   2> 87608 INFO  (jetty-closer-538-thread-1) [    ] o.a.s.m.SolrMetricManager Closing metric reporters for registry=solr.jvm, tag=null
   [junit4]   2> 87608 INFO  (jetty-closer-538-thread-1) [    ] o.a.s.m.r.SolrJmxReporter Closing reporter [org.apache.solr.metrics.reporters.SolrJmxReporter@2fec896c: rootName = solr_50834, domain = solr.jvm, service url = null, agent id = null] for registry solr.jvm / com.codahale.metrics.MetricRegistry@2ee09d7c
   [junit4]   2> 87608 INFO  (jetty-closer-538-thread-1) [    ] o.a.s.m.SolrMetricManager Closing metric reporters for registry=solr.jetty, tag=null
   [junit4]   2> 87608 INFO  (jetty-closer-538-thread-1) [    ] o.a.s.m.r.SolrJmxReporter Closing reporter [org.apache.solr.metrics.reporters.SolrJmxReporter@4fdad125: rootName = solr_50834, domain = solr.jetty, service url = null, agent id = null] for registry solr.jetty / com.codahale.metrics.MetricRegistry@922457a
   [junit4]   2> 87608 INFO  (jetty-closer-538-thread-1) [    ] o.a.s.m.SolrMetricManager Closing metric reporters for registry=solr.cluster, tag=null
   [junit4]   2> 87641 INFO  (closeThreadPool-546-thread-1) [    ] o.a.s.c.Overseer Overseer (id=72077215554994184-127.0.0.1:50834_solr-n_0000000000) closing
   [junit4]   2> 87641 INFO  (OverseerStateUpdate-72077215554994184-127.0.0.1:50834_solr-n_0000000000) [n:127.0.0.1:50834_solr    ] o.a.s.c.Overseer Overseer Loop exiting : 127.0.0.1:50834_solr
   [junit4]   2> 87641 INFO  (OverseerAutoScalingTriggerThread-72077215554994184-127.0.0.1:50834_solr-n_0000000000) [    ] o.a.s.c.a.OverseerTriggerThread OverseerTriggerThread woken up but we are closed, exiting.
   [junit4]   2> 87650 INFO  (jetty-closer-538-thread-2) [    ] o.e.j.s.AbstractConnector Stopped ServerConnector@7febd0d2{HTTP/1.1,[http/1.1, h2c]}{127.0.0.1:0}
   [junit4]   2> 87652 WARN  (NIOServerCxn.Factory:0.0.0.0/0.0.0.0:0) [    ] o.a.z.s.NIOServerCnxn Unable to read additional data from client sessionid 0x10011d87d8e0008, likely client has closed socket
   [junit4]   2> 87652 INFO  (zkCallback-524-thread-1) [    ] o.a.s.c.c.ZkStateReader Updated live nodes from ZooKeeper... (1) -> (0)
   [junit4]   2> 87658 INFO  (jetty-closer-538-thread-1) [    ] o.a.s.c.Overseer Overseer (id=72077215554994184-127.0.0.1:50834_solr-n_0000000000) closing
   [junit4]   2> 87658 INFO  (closeThreadPool-546-thread-2) [    ] o.a.s.c.Overseer Overseer (id=72077215554994184-127.0.0.1:50834_solr-n_0000000000) closing
   [junit4]   2> 87661 INFO  (jetty-closer-538-thread-2) [    ] o.e.j.s.h.ContextHandler Stopped o.e.j.s.ServletContextHandler@7285bd95{/solr,null,UNAVAILABLE}
   [junit4]   2> 87682 INFO  (jetty-closer-538-thread-2) [    ] o.e.j.s.session node0 Stopped scavenging
   [junit4]   2> 87682 WARN  (NIOServerCxn.Factory:0.0.0.0/0.0.0.0:0) [    ] o.a.z.s.NIOServerCnxn Unable to read additional data from client sessionid 0x10011d87d8e0009, likely client has closed socket
   [junit4]   2> 87690 INFO  (jetty-closer-538-thread-1) [    ] o.e.j.s.AbstractConnector Stopped ServerConnector@344f7976{HTTP/1.1,[http/1.1, h2c]}{127.0.0.1:0}
   [junit4]   2> 87694 INFO  (jetty-closer-538-thread-1) [    ] o.e.j.s.h.ContextHandler Stopped o.e.j.s.ServletContextHandler@32831b28{/solr,null,UNAVAILABLE}
   [junit4]   2> 87698 INFO  (jetty-closer-538-thread-1) [    ] o.e.j.s.session node0 Stopped scavenging
   [junit4]   2> 87698 INFO  (TEST-JWTAuthPluginIntegrationTest.infoRequestWithoutToken-seed#[22115CB07A9CDE29]) [    ] o.a.s.c.ZkTestServer Shutting down ZkTestServer.
   [junit4]   2> 87707 WARN  (ZkTestServer Run Thread) [    ] o.a.s.c.ZkTestServer Watch limit violations: 
   [junit4]   2> Maximum concurrent create/delete watches above limit:
   [junit4]   2> 
   [junit4]   2> 	5	/solr/aliases.json
   [junit4]   2> 	5	/solr/clusterprops.json
   [junit4]   2> 	2	/solr/security.json
   [junit4]   2> 
   [junit4]   2> Maximum concurrent data watches above limit:
   [junit4]   2> 
   [junit4]   2> 	5	/solr/clusterstate.json
   [junit4]   2> 	5	/solr/clusterprops.json
   [junit4]   2> 
   [junit4]   2> Maximum concurrent children watches above limit:
   [junit4]   2> 
   [junit4]   2> 	5	/solr/live_nodes
   [junit4]   2> 	5	/solr/collections
   [junit4]   2> 
   [junit4]   2> 87711 INFO  (TEST-JWTAuthPluginIntegrationTest.infoRequestWithoutToken-seed#[22115CB07A9CDE29]) [    ] o.a.s.c.ZkTestServer parse host and port list: 127.0.0.1:50822
   [junit4]   2> 87711 INFO  (TEST-JWTAuthPluginIntegrationTest.infoRequestWithoutToken-seed#[22115CB07A9CDE29]) [    ] o.a.s.c.ZkTestServer connecting to 127.0.0.1 50822
   [junit4]   2> 88713 INFO  (TEST-JWTAuthPluginIntegrationTest.infoRequestWithoutToken-seed#[22115CB07A9CDE29]) [    ] o.a.s.SolrTestCaseJ4 ###Ending infoRequestWithoutToken
   [junit4] OK      2.48s J0 | JWTAuthPluginIntegrationTest.infoRequestWithoutToken
   [junit4]   2> NOTE: leaving temporary files on disk at: C:\Users\jenkins\workspace\Lucene-Solr-master-Windows\solr\build\solr-core\test\J0\temp\solr.security.JWTAuthPluginIntegrationTest_22115CB07A9CDE29-003
   [junit4]   2> NOTE: test params are: codec=Asserting(Lucene80): {}, docValues:{}, maxPointsInLeafNode=1046, maxMBSortInHeap=7.20565346770322, sim=Asserting(org.apache.lucene.search.similarities.AssertingSimilarity@6eb7ba49), locale=en-FJ, timezone=Asia/Kathmandu
   [junit4]   2> NOTE: Windows 10 10.0 amd64/Oracle Corporation 12 (64-bit)/cpus=3,threads=1,free=71365448,total=220200960
   [junit4]   2> NOTE: All tests run in this JVM: [JWTAuthPluginIntegrationTest, JWTAuthPluginIntegrationTest, JWTAuthPluginIntegrationTest]
   [junit4] Completed [5/5 (5!)] on J0 in 17.62s, 3 tests, 1 failure <<< FAILURES!

[...truncated 14 lines...]
BUILD FAILED
C:\Users\jenkins\workspace\Lucene-Solr-master-Windows\lucene\common-build.xml:1493: The following error occurred while executing this line:
C:\Users\jenkins\workspace\Lucene-Solr-master-Windows\lucene\common-build.xml:1020: There were test failures: 5 suites, 15 tests, 5 failures [seed: 22115CB07A9CDE29]

Total time: 1 minute 32 seconds

[repro] Setting last failure code to 1

[repro] Failures:
[repro]   5/5 failed: org.apache.solr.security.JWTAuthPluginIntegrationTest
[repro] Exiting with code 1

C:\Users\jenkins\workspace\Lucene-Solr-master-Windows>IF EXIST lucene\build move /y lucene\build lucene\build.repro 
        1 dir(s) moved.

C:\Users\jenkins\workspace\Lucene-Solr-master-Windows>IF EXIST solr\build move /y solr\build solr\build.repro 
        1 dir(s) moved.

C:\Users\jenkins\workspace\Lucene-Solr-master-Windows>IF EXIST lucene\build.orig move /y lucene\build.orig lucene\build 
        1 dir(s) moved.

C:\Users\jenkins\workspace\Lucene-Solr-master-Windows>IF EXIST solr\build.orig move /y solr\build.orig solr\build 
        1 dir(s) moved.

C:\Users\jenkins\workspace\Lucene-Solr-master-Windows>exit 0 
Archiving artifacts
Setting ANT_1_8_2_HOME=C:\Users\jenkins\tools\hudson.tasks.Ant_AntInstallation\ANT_1.8.2
[WARNINGS] Parsing warnings in console log with parser Java Compiler (javac)
Setting ANT_1_8_2_HOME=C:\Users\jenkins\tools\hudson.tasks.Ant_AntInstallation\ANT_1.8.2
No credentials specified
Setting ANT_1_8_2_HOME=C:\Users\jenkins\tools\hudson.tasks.Ant_AntInstallation\ANT_1.8.2
<Git Blamer> Using GitBlamer to create author and commit information for all warnings.
<Git Blamer> GIT_COMMIT=560b5e779d469dd5219a633fbeb09fd064174b74, workspace=C:\Users\jenkins\workspace\Lucene-Solr-master-Windows
[WARNINGS] Computing warning deltas based on reference build #7926
Recording test results
Setting ANT_1_8_2_HOME=C:\Users\jenkins\tools\hudson.tasks.Ant_AntInstallation\ANT_1.8.2
Build step 'Publish JUnit test result report' changed build result to UNSTABLE
Email was triggered for: Unstable (Test Failures)
Sending email for trigger: Unstable (Test Failures)
Setting ANT_1_8_2_HOME=C:\Users\jenkins\tools\hudson.tasks.Ant_AntInstallation\ANT_1.8.2
Setting ANT_1_8_2_HOME=C:\Users\jenkins\tools\hudson.tasks.Ant_AntInstallation\ANT_1.8.2
Setting ANT_1_8_2_HOME=C:\Users\jenkins\tools\hudson.tasks.Ant_AntInstallation\ANT_1.8.2
Setting ANT_1_8_2_HOME=C:\Users\jenkins\tools\hudson.tasks.Ant_AntInstallation\ANT_1.8.2
Setting ANT_1_8_2_HOME=C:\Users\jenkins\tools\hudson.tasks.Ant_AntInstallation\ANT_1.8.2
Setting ANT_1_8_2_HOME=C:\Users\jenkins\tools\hudson.tasks.Ant_AntInstallation\ANT_1.8.2

Mime
View raw message