lucene-dev mailing list archives

Site index · List index
Message view « Date » · « Thread »
Top « Date » · « Thread »
From Apache Jenkins Server <jenk...@builds.apache.org>
Subject [JENKINS] Lucene-Solr-Tests-8.x - Build # 183 - Still Failing
Date Thu, 02 May 2019 09:56:54 GMT
Build: https://builds.apache.org/job/Lucene-Solr-Tests-8.x/183/

3 tests failed.
FAILED:  org.apache.solr.security.AuditLoggerIntegrationTest.testAsyncQueueDrain

Error Message:
Failed waiting for 3 callbacks after 30 seconds

Stack Trace:
java.lang.AssertionError: Failed waiting for 3 callbacks after 30 seconds
	at __randomizedtesting.SeedInfo.seed([FBA19694FDE8D223:4ABE69B04D2B41FC]:0)
	at org.junit.Assert.fail(Assert.java:88)
	at org.apache.solr.security.AuditLoggerIntegrationTest.waitForAuditEventCallbacks(AuditLoggerIntegrationTest.java:229)
	at org.apache.solr.security.AuditLoggerIntegrationTest.waitForAuditEventCallbacks(AuditLoggerIntegrationTest.java:221)
	at org.apache.solr.security.AuditLoggerIntegrationTest.assertThreeAdminEvents(AuditLoggerIntegrationTest.java:252)
	at org.apache.solr.security.AuditLoggerIntegrationTest.testAsyncQueueDrain(AuditLoggerIntegrationTest.java:132)
	at sun.reflect.NativeMethodAccessorImpl.invoke0(Native Method)
	at sun.reflect.NativeMethodAccessorImpl.invoke(NativeMethodAccessorImpl.java:62)
	at sun.reflect.DelegatingMethodAccessorImpl.invoke(DelegatingMethodAccessorImpl.java:43)
	at java.lang.reflect.Method.invoke(Method.java:498)
	at com.carrotsearch.randomizedtesting.RandomizedRunner.invoke(RandomizedRunner.java:1750)
	at com.carrotsearch.randomizedtesting.RandomizedRunner$8.evaluate(RandomizedRunner.java:938)
	at com.carrotsearch.randomizedtesting.RandomizedRunner$9.evaluate(RandomizedRunner.java:974)
	at com.carrotsearch.randomizedtesting.RandomizedRunner$10.evaluate(RandomizedRunner.java:988)
	at com.carrotsearch.randomizedtesting.rules.SystemPropertiesRestoreRule$1.evaluate(SystemPropertiesRestoreRule.java:57)
	at org.apache.lucene.util.TestRuleSetupTeardownChained$1.evaluate(TestRuleSetupTeardownChained.java:49)
	at org.apache.lucene.util.AbstractBeforeAfterRule$1.evaluate(AbstractBeforeAfterRule.java:45)
	at org.apache.lucene.util.TestRuleThreadAndTestName$1.evaluate(TestRuleThreadAndTestName.java:48)
	at org.apache.lucene.util.TestRuleIgnoreAfterMaxFailures$1.evaluate(TestRuleIgnoreAfterMaxFailures.java:64)
	at org.apache.lucene.util.TestRuleMarkFailure$1.evaluate(TestRuleMarkFailure.java:47)
	at com.carrotsearch.randomizedtesting.rules.StatementAdapter.evaluate(StatementAdapter.java:36)
	at com.carrotsearch.randomizedtesting.ThreadLeakControl$StatementRunner.run(ThreadLeakControl.java:368)
	at com.carrotsearch.randomizedtesting.ThreadLeakControl.forkTimeoutingTask(ThreadLeakControl.java:817)
	at com.carrotsearch.randomizedtesting.ThreadLeakControl$3.evaluate(ThreadLeakControl.java:468)
	at com.carrotsearch.randomizedtesting.RandomizedRunner.runSingleTest(RandomizedRunner.java:947)
	at com.carrotsearch.randomizedtesting.RandomizedRunner$5.evaluate(RandomizedRunner.java:832)
	at com.carrotsearch.randomizedtesting.RandomizedRunner$6.evaluate(RandomizedRunner.java:883)
	at com.carrotsearch.randomizedtesting.RandomizedRunner$7.evaluate(RandomizedRunner.java:894)
	at com.carrotsearch.randomizedtesting.rules.StatementAdapter.evaluate(StatementAdapter.java:36)
	at com.carrotsearch.randomizedtesting.rules.SystemPropertiesRestoreRule$1.evaluate(SystemPropertiesRestoreRule.java:57)
	at org.apache.lucene.util.AbstractBeforeAfterRule$1.evaluate(AbstractBeforeAfterRule.java:45)
	at com.carrotsearch.randomizedtesting.rules.StatementAdapter.evaluate(StatementAdapter.java:36)
	at org.apache.lucene.util.TestRuleStoreClassName$1.evaluate(TestRuleStoreClassName.java:41)
	at com.carrotsearch.randomizedtesting.rules.NoShadowingOrOverridesOnMethodsRule$1.evaluate(NoShadowingOrOverridesOnMethodsRule.java:40)
	at com.carrotsearch.randomizedtesting.rules.NoShadowingOrOverridesOnMethodsRule$1.evaluate(NoShadowingOrOverridesOnMethodsRule.java:40)
	at com.carrotsearch.randomizedtesting.rules.StatementAdapter.evaluate(StatementAdapter.java:36)
	at com.carrotsearch.randomizedtesting.rules.StatementAdapter.evaluate(StatementAdapter.java:36)
	at com.carrotsearch.randomizedtesting.rules.StatementAdapter.evaluate(StatementAdapter.java:36)
	at org.apache.lucene.util.TestRuleAssertionsRequired$1.evaluate(TestRuleAssertionsRequired.java:53)
	at org.apache.lucene.util.TestRuleMarkFailure$1.evaluate(TestRuleMarkFailure.java:47)
	at org.apache.lucene.util.TestRuleIgnoreAfterMaxFailures$1.evaluate(TestRuleIgnoreAfterMaxFailures.java:64)
	at org.apache.lucene.util.TestRuleIgnoreTestSuites$1.evaluate(TestRuleIgnoreTestSuites.java:54)
	at com.carrotsearch.randomizedtesting.rules.StatementAdapter.evaluate(StatementAdapter.java:36)
	at com.carrotsearch.randomizedtesting.ThreadLeakControl$StatementRunner.run(ThreadLeakControl.java:368)
	at java.lang.Thread.run(Thread.java:748)


FAILED:  org.apache.solr.update.PeerSyncTest.test

Error Message:
Unexpected exception type, expected SolrException but got org.apache.solr.client.solrj.SolrServerException: Timeout occurred while waiting response from server at: http://127.0.0.1:34991/_x/m/collection1

Stack Trace:
junit.framework.AssertionFailedError: Unexpected exception type, expected SolrException but got org.apache.solr.client.solrj.SolrServerException: Timeout occurred while waiting response from server at: http://127.0.0.1:34991/_x/m/collection1
	at __randomizedtesting.SeedInfo.seed([FBA19694FDE8D223:73F5A94E5314BFDB]:0)
	at org.apache.lucene.util.LuceneTestCase.expectThrows(LuceneTestCase.java:2700)
	at org.apache.lucene.util.LuceneTestCase.expectThrows(LuceneTestCase.java:2689)
	at org.apache.solr.update.PeerSyncTest.test(PeerSyncTest.java:279)
	at sun.reflect.NativeMethodAccessorImpl.invoke0(Native Method)
	at sun.reflect.NativeMethodAccessorImpl.invoke(NativeMethodAccessorImpl.java:62)
	at sun.reflect.DelegatingMethodAccessorImpl.invoke(DelegatingMethodAccessorImpl.java:43)
	at java.lang.reflect.Method.invoke(Method.java:498)
	at com.carrotsearch.randomizedtesting.RandomizedRunner.invoke(RandomizedRunner.java:1750)
	at com.carrotsearch.randomizedtesting.RandomizedRunner$8.evaluate(RandomizedRunner.java:938)
	at com.carrotsearch.randomizedtesting.RandomizedRunner$9.evaluate(RandomizedRunner.java:974)
	at com.carrotsearch.randomizedtesting.RandomizedRunner$10.evaluate(RandomizedRunner.java:988)
	at org.apache.solr.BaseDistributedSearchTestCase$ShardsRepeatRule$ShardsFixedStatement.callStatement(BaseDistributedSearchTestCase.java:1082)
	at org.apache.solr.BaseDistributedSearchTestCase$ShardsRepeatRule$ShardsStatement.evaluate(BaseDistributedSearchTestCase.java:1054)
	at com.carrotsearch.randomizedtesting.rules.SystemPropertiesRestoreRule$1.evaluate(SystemPropertiesRestoreRule.java:57)
	at org.apache.lucene.util.TestRuleSetupTeardownChained$1.evaluate(TestRuleSetupTeardownChained.java:49)
	at org.apache.lucene.util.AbstractBeforeAfterRule$1.evaluate(AbstractBeforeAfterRule.java:45)
	at org.apache.lucene.util.TestRuleThreadAndTestName$1.evaluate(TestRuleThreadAndTestName.java:48)
	at org.apache.lucene.util.TestRuleIgnoreAfterMaxFailures$1.evaluate(TestRuleIgnoreAfterMaxFailures.java:64)
	at org.apache.lucene.util.TestRuleMarkFailure$1.evaluate(TestRuleMarkFailure.java:47)
	at com.carrotsearch.randomizedtesting.rules.StatementAdapter.evaluate(StatementAdapter.java:36)
	at com.carrotsearch.randomizedtesting.ThreadLeakControl$StatementRunner.run(ThreadLeakControl.java:368)
	at com.carrotsearch.randomizedtesting.ThreadLeakControl.forkTimeoutingTask(ThreadLeakControl.java:817)
	at com.carrotsearch.randomizedtesting.ThreadLeakControl$3.evaluate(ThreadLeakControl.java:468)
	at com.carrotsearch.randomizedtesting.RandomizedRunner.runSingleTest(RandomizedRunner.java:947)
	at com.carrotsearch.randomizedtesting.RandomizedRunner$5.evaluate(RandomizedRunner.java:832)
	at com.carrotsearch.randomizedtesting.RandomizedRunner$6.evaluate(RandomizedRunner.java:883)
	at com.carrotsearch.randomizedtesting.RandomizedRunner$7.evaluate(RandomizedRunner.java:894)
	at com.carrotsearch.randomizedtesting.rules.StatementAdapter.evaluate(StatementAdapter.java:36)
	at com.carrotsearch.randomizedtesting.rules.SystemPropertiesRestoreRule$1.evaluate(SystemPropertiesRestoreRule.java:57)
	at org.apache.lucene.util.AbstractBeforeAfterRule$1.evaluate(AbstractBeforeAfterRule.java:45)
	at com.carrotsearch.randomizedtesting.rules.StatementAdapter.evaluate(StatementAdapter.java:36)
	at org.apache.lucene.util.TestRuleStoreClassName$1.evaluate(TestRuleStoreClassName.java:41)
	at com.carrotsearch.randomizedtesting.rules.NoShadowingOrOverridesOnMethodsRule$1.evaluate(NoShadowingOrOverridesOnMethodsRule.java:40)
	at com.carrotsearch.randomizedtesting.rules.NoShadowingOrOverridesOnMethodsRule$1.evaluate(NoShadowingOrOverridesOnMethodsRule.java:40)
	at com.carrotsearch.randomizedtesting.rules.StatementAdapter.evaluate(StatementAdapter.java:36)
	at com.carrotsearch.randomizedtesting.rules.StatementAdapter.evaluate(StatementAdapter.java:36)
	at com.carrotsearch.randomizedtesting.rules.StatementAdapter.evaluate(StatementAdapter.java:36)
	at org.apache.lucene.util.TestRuleAssertionsRequired$1.evaluate(TestRuleAssertionsRequired.java:53)
	at org.apache.lucene.util.TestRuleMarkFailure$1.evaluate(TestRuleMarkFailure.java:47)
	at org.apache.lucene.util.TestRuleIgnoreAfterMaxFailures$1.evaluate(TestRuleIgnoreAfterMaxFailures.java:64)
	at org.apache.lucene.util.TestRuleIgnoreTestSuites$1.evaluate(TestRuleIgnoreTestSuites.java:54)
	at com.carrotsearch.randomizedtesting.rules.StatementAdapter.evaluate(StatementAdapter.java:36)
	at com.carrotsearch.randomizedtesting.ThreadLeakControl$StatementRunner.run(ThreadLeakControl.java:368)
	at java.lang.Thread.run(Thread.java:748)
Caused by: org.apache.solr.client.solrj.SolrServerException: Timeout occurred while waiting response from server at: http://127.0.0.1:34991/_x/m/collection1
	at org.apache.solr.client.solrj.impl.HttpSolrClient.executeMethod(HttpSolrClient.java:660)
	at org.apache.solr.client.solrj.impl.HttpSolrClient.request(HttpSolrClient.java:255)
	at org.apache.solr.client.solrj.impl.HttpSolrClient.request(HttpSolrClient.java:244)
	at org.apache.solr.client.solrj.SolrRequest.process(SolrRequest.java:207)
	at org.apache.solr.client.solrj.SolrRequest.process(SolrRequest.java:224)
	at org.apache.solr.BaseDistributedSearchTestCase.add(BaseDistributedSearchTestCase.java:576)
	at org.apache.solr.update.PeerSyncTest.lambda$test$0(PeerSyncTest.java:281)
	at org.apache.lucene.util.LuceneTestCase.expectThrows(LuceneTestCase.java:2695)
	... 43 more
Caused by: java.net.SocketTimeoutException: Read timed out
	at java.net.SocketInputStream.socketRead0(Native Method)
	at java.net.SocketInputStream.socketRead(SocketInputStream.java:116)
	at java.net.SocketInputStream.read(SocketInputStream.java:171)
	at java.net.SocketInputStream.read(SocketInputStream.java:141)
	at org.apache.http.impl.io.SessionInputBufferImpl.streamRead(SessionInputBufferImpl.java:137)
	at org.apache.http.impl.io.SessionInputBufferImpl.fillBuffer(SessionInputBufferImpl.java:153)
	at org.apache.http.impl.io.SessionInputBufferImpl.readLine(SessionInputBufferImpl.java:282)
	at org.apache.http.impl.conn.DefaultHttpResponseParser.parseHead(DefaultHttpResponseParser.java:138)
	at org.apache.http.impl.conn.DefaultHttpResponseParser.parseHead(DefaultHttpResponseParser.java:56)
	at org.apache.http.impl.io.AbstractMessageParser.parse(AbstractMessageParser.java:259)
	at org.apache.http.impl.DefaultBHttpClientConnection.receiveResponseHeader(DefaultBHttpClientConnection.java:163)
	at org.apache.http.impl.conn.CPoolProxy.receiveResponseHeader(CPoolProxy.java:165)
	at org.apache.http.protocol.HttpRequestExecutor.doReceiveResponse(HttpRequestExecutor.java:273)
	at org.apache.http.protocol.HttpRequestExecutor.execute(HttpRequestExecutor.java:125)
	at org.apache.http.impl.execchain.MainClientExec.execute(MainClientExec.java:272)
	at org.apache.http.impl.execchain.ProtocolExec.execute(ProtocolExec.java:185)
	at org.apache.http.impl.execchain.RetryExec.execute(RetryExec.java:89)
	at org.apache.http.impl.execchain.RedirectExec.execute(RedirectExec.java:110)
	at org.apache.http.impl.client.InternalHttpClient.doExecute(InternalHttpClient.java:185)
	at org.apache.http.impl.client.CloseableHttpClient.execute(CloseableHttpClient.java:83)
	at org.apache.http.impl.client.CloseableHttpClient.execute(CloseableHttpClient.java:56)
	at org.apache.solr.client.solrj.impl.HttpSolrClient.executeMethod(HttpSolrClient.java:548)
	... 50 more


FAILED:  org.apache.solr.update.PeerSyncWithLeaderTest.test

Error Message:
Unexpected exception type, expected SolrException but got org.apache.solr.client.solrj.SolrServerException: Timeout occurred while waiting response from server at: http://127.0.0.1:37179/collection1

Stack Trace:
junit.framework.AssertionFailedError: Unexpected exception type, expected SolrException but got org.apache.solr.client.solrj.SolrServerException: Timeout occurred while waiting response from server at: http://127.0.0.1:37179/collection1
	at __randomizedtesting.SeedInfo.seed([FBA19694FDE8D223:73F5A94E5314BFDB]:0)
	at org.apache.lucene.util.LuceneTestCase.expectThrows(LuceneTestCase.java:2700)
	at org.apache.lucene.util.LuceneTestCase.expectThrows(LuceneTestCase.java:2689)
	at org.apache.solr.update.PeerSyncTest.test(PeerSyncTest.java:279)
	at sun.reflect.NativeMethodAccessorImpl.invoke0(Native Method)
	at sun.reflect.NativeMethodAccessorImpl.invoke(NativeMethodAccessorImpl.java:62)
	at sun.reflect.DelegatingMethodAccessorImpl.invoke(DelegatingMethodAccessorImpl.java:43)
	at java.lang.reflect.Method.invoke(Method.java:498)
	at com.carrotsearch.randomizedtesting.RandomizedRunner.invoke(RandomizedRunner.java:1750)
	at com.carrotsearch.randomizedtesting.RandomizedRunner$8.evaluate(RandomizedRunner.java:938)
	at com.carrotsearch.randomizedtesting.RandomizedRunner$9.evaluate(RandomizedRunner.java:974)
	at com.carrotsearch.randomizedtesting.RandomizedRunner$10.evaluate(RandomizedRunner.java:988)
	at org.apache.solr.BaseDistributedSearchTestCase$ShardsRepeatRule$ShardsFixedStatement.callStatement(BaseDistributedSearchTestCase.java:1082)
	at org.apache.solr.BaseDistributedSearchTestCase$ShardsRepeatRule$ShardsStatement.evaluate(BaseDistributedSearchTestCase.java:1054)
	at com.carrotsearch.randomizedtesting.rules.SystemPropertiesRestoreRule$1.evaluate(SystemPropertiesRestoreRule.java:57)
	at org.apache.lucene.util.TestRuleSetupTeardownChained$1.evaluate(TestRuleSetupTeardownChained.java:49)
	at org.apache.lucene.util.AbstractBeforeAfterRule$1.evaluate(AbstractBeforeAfterRule.java:45)
	at org.apache.lucene.util.TestRuleThreadAndTestName$1.evaluate(TestRuleThreadAndTestName.java:48)
	at org.apache.lucene.util.TestRuleIgnoreAfterMaxFailures$1.evaluate(TestRuleIgnoreAfterMaxFailures.java:64)
	at org.apache.lucene.util.TestRuleMarkFailure$1.evaluate(TestRuleMarkFailure.java:47)
	at com.carrotsearch.randomizedtesting.rules.StatementAdapter.evaluate(StatementAdapter.java:36)
	at com.carrotsearch.randomizedtesting.ThreadLeakControl$StatementRunner.run(ThreadLeakControl.java:368)
	at com.carrotsearch.randomizedtesting.ThreadLeakControl.forkTimeoutingTask(ThreadLeakControl.java:817)
	at com.carrotsearch.randomizedtesting.ThreadLeakControl$3.evaluate(ThreadLeakControl.java:468)
	at com.carrotsearch.randomizedtesting.RandomizedRunner.runSingleTest(RandomizedRunner.java:947)
	at com.carrotsearch.randomizedtesting.RandomizedRunner$5.evaluate(RandomizedRunner.java:832)
	at com.carrotsearch.randomizedtesting.RandomizedRunner$6.evaluate(RandomizedRunner.java:883)
	at com.carrotsearch.randomizedtesting.RandomizedRunner$7.evaluate(RandomizedRunner.java:894)
	at com.carrotsearch.randomizedtesting.rules.StatementAdapter.evaluate(StatementAdapter.java:36)
	at com.carrotsearch.randomizedtesting.rules.SystemPropertiesRestoreRule$1.evaluate(SystemPropertiesRestoreRule.java:57)
	at org.apache.lucene.util.AbstractBeforeAfterRule$1.evaluate(AbstractBeforeAfterRule.java:45)
	at com.carrotsearch.randomizedtesting.rules.StatementAdapter.evaluate(StatementAdapter.java:36)
	at org.apache.lucene.util.TestRuleStoreClassName$1.evaluate(TestRuleStoreClassName.java:41)
	at com.carrotsearch.randomizedtesting.rules.NoShadowingOrOverridesOnMethodsRule$1.evaluate(NoShadowingOrOverridesOnMethodsRule.java:40)
	at com.carrotsearch.randomizedtesting.rules.NoShadowingOrOverridesOnMethodsRule$1.evaluate(NoShadowingOrOverridesOnMethodsRule.java:40)
	at com.carrotsearch.randomizedtesting.rules.StatementAdapter.evaluate(StatementAdapter.java:36)
	at com.carrotsearch.randomizedtesting.rules.StatementAdapter.evaluate(StatementAdapter.java:36)
	at com.carrotsearch.randomizedtesting.rules.StatementAdapter.evaluate(StatementAdapter.java:36)
	at org.apache.lucene.util.TestRuleAssertionsRequired$1.evaluate(TestRuleAssertionsRequired.java:53)
	at org.apache.lucene.util.TestRuleMarkFailure$1.evaluate(TestRuleMarkFailure.java:47)
	at org.apache.lucene.util.TestRuleIgnoreAfterMaxFailures$1.evaluate(TestRuleIgnoreAfterMaxFailures.java:64)
	at org.apache.lucene.util.TestRuleIgnoreTestSuites$1.evaluate(TestRuleIgnoreTestSuites.java:54)
	at com.carrotsearch.randomizedtesting.rules.StatementAdapter.evaluate(StatementAdapter.java:36)
	at com.carrotsearch.randomizedtesting.ThreadLeakControl$StatementRunner.run(ThreadLeakControl.java:368)
	at java.lang.Thread.run(Thread.java:748)
Caused by: org.apache.solr.client.solrj.SolrServerException: Timeout occurred while waiting response from server at: http://127.0.0.1:37179/collection1
	at org.apache.solr.client.solrj.impl.HttpSolrClient.executeMethod(HttpSolrClient.java:660)
	at org.apache.solr.client.solrj.impl.HttpSolrClient.request(HttpSolrClient.java:255)
	at org.apache.solr.client.solrj.impl.HttpSolrClient.request(HttpSolrClient.java:244)
	at org.apache.solr.client.solrj.SolrRequest.process(SolrRequest.java:207)
	at org.apache.solr.client.solrj.SolrRequest.process(SolrRequest.java:224)
	at org.apache.solr.BaseDistributedSearchTestCase.add(BaseDistributedSearchTestCase.java:576)
	at org.apache.solr.update.PeerSyncTest.lambda$test$0(PeerSyncTest.java:281)
	at org.apache.lucene.util.LuceneTestCase.expectThrows(LuceneTestCase.java:2695)
	... 43 more
Caused by: java.net.SocketTimeoutException: Read timed out
	at java.net.SocketInputStream.socketRead0(Native Method)
	at java.net.SocketInputStream.socketRead(SocketInputStream.java:116)
	at java.net.SocketInputStream.read(SocketInputStream.java:171)
	at java.net.SocketInputStream.read(SocketInputStream.java:141)
	at org.apache.http.impl.io.SessionInputBufferImpl.streamRead(SessionInputBufferImpl.java:137)
	at org.apache.http.impl.io.SessionInputBufferImpl.fillBuffer(SessionInputBufferImpl.java:153)
	at org.apache.http.impl.io.SessionInputBufferImpl.readLine(SessionInputBufferImpl.java:282)
	at org.apache.http.impl.conn.DefaultHttpResponseParser.parseHead(DefaultHttpResponseParser.java:138)
	at org.apache.http.impl.conn.DefaultHttpResponseParser.parseHead(DefaultHttpResponseParser.java:56)
	at org.apache.http.impl.io.AbstractMessageParser.parse(AbstractMessageParser.java:259)
	at org.apache.http.impl.DefaultBHttpClientConnection.receiveResponseHeader(DefaultBHttpClientConnection.java:163)
	at org.apache.http.impl.conn.CPoolProxy.receiveResponseHeader(CPoolProxy.java:165)
	at org.apache.http.protocol.HttpRequestExecutor.doReceiveResponse(HttpRequestExecutor.java:273)
	at org.apache.http.protocol.HttpRequestExecutor.execute(HttpRequestExecutor.java:125)
	at org.apache.http.impl.execchain.MainClientExec.execute(MainClientExec.java:272)
	at org.apache.http.impl.execchain.ProtocolExec.execute(ProtocolExec.java:185)
	at org.apache.http.impl.execchain.RetryExec.execute(RetryExec.java:89)
	at org.apache.http.impl.execchain.RedirectExec.execute(RedirectExec.java:110)
	at org.apache.http.impl.client.InternalHttpClient.doExecute(InternalHttpClient.java:185)
	at org.apache.http.impl.client.CloseableHttpClient.execute(CloseableHttpClient.java:83)
	at org.apache.http.impl.client.CloseableHttpClient.execute(CloseableHttpClient.java:56)
	at org.apache.solr.client.solrj.impl.HttpSolrClient.executeMethod(HttpSolrClient.java:548)
	... 50 more




Build Log:
[...truncated 13926 lines...]
   [junit4] Suite: org.apache.solr.update.PeerSyncTest
   [junit4]   2> Creating dataDir: /home/jenkins/jenkins-slave/workspace/Lucene-Solr-Tests-8.x/solr/build/solr-core/test/J1/temp/solr.update.PeerSyncTest_FBA19694FDE8D223-001/init-core-data-001
   [junit4]   2> 1764497 WARN  (SUITE-PeerSyncTest-seed#[FBA19694FDE8D223]-worker) [    ] o.a.s.SolrTestCaseJ4 startTrackingSearchers: numOpens=556 numCloses=556
   [junit4]   2> 1764497 INFO  (SUITE-PeerSyncTest-seed#[FBA19694FDE8D223]-worker) [    ] o.a.s.SolrTestCaseJ4 Using PointFields (NUMERIC_POINTS_SYSPROP=true) w/NUMERIC_DOCVALUES_SYSPROP=true
   [junit4]   2> 1764499 INFO  (SUITE-PeerSyncTest-seed#[FBA19694FDE8D223]-worker) [    ] o.a.s.SolrTestCaseJ4 Randomized ssl (false) and clientAuth (false) via: @org.apache.solr.SolrTestCaseJ4$SuppressSSL(bugUrl=https://issues.apache.org/jira/browse/SOLR-5776)
   [junit4]   2> 1764499 INFO  (SUITE-PeerSyncTest-seed#[FBA19694FDE8D223]-worker) [    ] o.a.s.SolrTestCaseJ4 SecureRandom sanity checks: test.solr.allowed.securerandom=null & java.security.egd=file:/dev/./urandom
   [junit4]   2> 1764499 INFO  (SUITE-PeerSyncTest-seed#[FBA19694FDE8D223]-worker) [    ] o.a.s.BaseDistributedSearchTestCase Setting hostContext system property: /_x/m
   [junit4]   2> 1764500 INFO  (TEST-PeerSyncTest.test-seed#[FBA19694FDE8D223]) [    ] o.a.s.SolrTestCaseJ4 ####initCore
   [junit4]   2> 1764500 INFO  (TEST-PeerSyncTest.test-seed#[FBA19694FDE8D223]) [    ] o.a.s.c.SolrResourceLoader [null] Added 2 libs to classloader, from paths: [/home/jenkins/jenkins-slave/workspace/Lucene-Solr-Tests-8.x/solr/core/src/test-files/solr/collection1/lib, /home/jenkins/jenkins-slave/workspace/Lucene-Solr-Tests-8.x/solr/core/src/test-files/solr/collection1/lib/classes]
   [junit4]   2> 1764518 INFO  (TEST-PeerSyncTest.test-seed#[FBA19694FDE8D223]) [    ] o.a.s.c.SolrConfig Using Lucene MatchVersion: 8.2.0
   [junit4]   2> 1764532 INFO  (TEST-PeerSyncTest.test-seed#[FBA19694FDE8D223]) [    ] o.a.s.s.IndexSchema [null] Schema name=test
   [junit4]   2> 1764621 INFO  (TEST-PeerSyncTest.test-seed#[FBA19694FDE8D223]) [    ] o.a.s.s.IndexSchema Loaded schema test/1.0 with uniqueid field id
   [junit4]   2> 1764690 INFO  (TEST-PeerSyncTest.test-seed#[FBA19694FDE8D223]) [    ] o.a.s.h.c.HttpShardHandlerFactory Host whitelist initialized: WhitelistHostChecker [whitelistHosts=null, whitelistHostCheckingEnabled=false]
   [junit4]   2> 1764695 WARN  (TEST-PeerSyncTest.test-seed#[FBA19694FDE8D223]) [    ] o.e.j.u.s.S.config No Client EndPointIdentificationAlgorithm configured for SslContextFactory@36d3444f[provider=null,keyStore=null,trustStore=null]
   [junit4]   2> 1764698 WARN  (TEST-PeerSyncTest.test-seed#[FBA19694FDE8D223]) [    ] o.e.j.u.s.S.config No Client EndPointIdentificationAlgorithm configured for SslContextFactory@a022591[provider=null,keyStore=null,trustStore=null]
   [junit4]   2> 1764713 INFO  (TEST-PeerSyncTest.test-seed#[FBA19694FDE8D223]) [    ] o.a.s.c.TransientSolrCoreCacheDefault Allocating transient cache for 2147483647 transient cores
   [junit4]   2> 1764713 INFO  (TEST-PeerSyncTest.test-seed#[FBA19694FDE8D223]) [    ] o.a.s.h.a.MetricsHistoryHandler No .system collection, keeping metrics history in memory.
   [junit4]   2> 1764725 INFO  (TEST-PeerSyncTest.test-seed#[FBA19694FDE8D223]) [    ] o.a.s.m.r.SolrJmxReporter JMX monitoring for 'solr.node' (registry 'solr.node') enabled at server: com.sun.jmx.mbeanserver.JmxMBeanServer@75749aeb
   [junit4]   2> 1764731 INFO  (TEST-PeerSyncTest.test-seed#[FBA19694FDE8D223]) [    ] o.a.s.m.r.SolrJmxReporter JMX monitoring for 'solr.jvm' (registry 'solr.jvm') enabled at server: com.sun.jmx.mbeanserver.JmxMBeanServer@75749aeb
   [junit4]   2> 1764731 INFO  (TEST-PeerSyncTest.test-seed#[FBA19694FDE8D223]) [    ] o.a.s.m.r.SolrJmxReporter JMX monitoring for 'solr.jetty' (registry 'solr.jetty') enabled at server: com.sun.jmx.mbeanserver.JmxMBeanServer@75749aeb
   [junit4]   2> 1764733 INFO  (coreLoadExecutor-3163-thread-1) [    x:collection1] o.a.s.c.SolrResourceLoader [null] Added 2 libs to classloader, from paths: [/home/jenkins/jenkins-slave/workspace/Lucene-Solr-Tests-8.x/solr/core/src/test-files/solr/collection1/lib, /home/jenkins/jenkins-slave/workspace/Lucene-Solr-Tests-8.x/solr/core/src/test-files/solr/collection1/lib/classes]
   [junit4]   2> 1764765 INFO  (coreLoadExecutor-3163-thread-1) [    x:collection1] o.a.s.c.SolrConfig Using Lucene MatchVersion: 8.2.0
   [junit4]   2> 1764778 INFO  (coreLoadExecutor-3163-thread-1) [    x:collection1] o.a.s.s.IndexSchema [collection1] Schema name=test
   [junit4]   2> 1764863 INFO  (coreLoadExecutor-3163-thread-1) [    x:collection1] o.a.s.s.IndexSchema Loaded schema test/1.0 with uniqueid field id
   [junit4]   2> 1764869 INFO  (coreLoadExecutor-3163-thread-1) [    x:collection1] o.a.s.c.CoreContainer Creating SolrCore 'collection1' using configuration from instancedir /home/jenkins/jenkins-slave/workspace/Lucene-Solr-Tests-8.x/solr/core/src/test-files/solr/collection1, trusted=true
   [junit4]   2> 1764869 INFO  (coreLoadExecutor-3163-thread-1) [    x:collection1] o.a.s.m.r.SolrJmxReporter JMX monitoring for 'solr.core.collection1' (registry 'solr.core.collection1') enabled at server: com.sun.jmx.mbeanserver.JmxMBeanServer@75749aeb
   [junit4]   2> 1764870 INFO  (coreLoadExecutor-3163-thread-1) [    x:collection1] o.a.s.c.SolrCore [[collection1] ] Opening new SolrCore at [/home/jenkins/jenkins-slave/workspace/Lucene-Solr-Tests-8.x/solr/core/src/test-files/solr/collection1], dataDir=[/home/jenkins/jenkins-slave/workspace/Lucene-Solr-Tests-8.x/solr/build/solr-core/test/J1/temp/solr.update.PeerSyncTest_FBA19694FDE8D223-001/init-core-data-001/]
   [junit4]   2> 1764871 INFO  (coreLoadExecutor-3163-thread-1) [    x:collection1] o.a.s.u.RandomMergePolicy RandomMergePolicy wrapping class org.apache.lucene.index.LogByteSizeMergePolicy: [LogByteSizeMergePolicy: minMergeSize=1677721, mergeFactor=21, maxMergeSize=2147483648, maxMergeSizeForForcedMerge=9223372036854775807, calibrateSizeByDeletes=false, maxMergeDocs=2147483647, maxCFSSegmentSizeMB=8.796093022207999E12, noCFSRatio=1.0]
   [junit4]   2> 1764872 WARN  (coreLoadExecutor-3163-thread-1) [    x:collection1] o.a.s.c.RequestHandlers INVALID paramSet a in requestHandler {type = requestHandler,name = /dump,class = DumpRequestHandler,attributes = {initParams=a, name=/dump, class=DumpRequestHandler},args = {defaults={a=A,b=B}}}
   [junit4]   2> 1764903 INFO  (coreLoadExecutor-3163-thread-1) [    x:collection1] o.a.s.u.UpdateHandler Using UpdateLog implementation: org.apache.solr.update.UpdateLog
   [junit4]   2> 1764903 INFO  (coreLoadExecutor-3163-thread-1) [    x:collection1] o.a.s.u.UpdateLog Initializing UpdateLog: dataDir= defaultSyncLevel=FLUSH numRecordsToKeep=100 maxNumLogsToKeep=10 numVersionBuckets=65536
   [junit4]   2> 1764904 INFO  (coreLoadExecutor-3163-thread-1) [    x:collection1] o.a.s.u.CommitTracker Hard AutoCommit: disabled
   [junit4]   2> 1764905 INFO  (coreLoadExecutor-3163-thread-1) [    x:collection1] o.a.s.u.CommitTracker Soft AutoCommit: disabled
   [junit4]   2> 1764905 INFO  (coreLoadExecutor-3163-thread-1) [    x:collection1] o.a.s.u.RandomMergePolicy RandomMergePolicy wrapping class org.apache.lucene.index.LogDocMergePolicy: [LogDocMergePolicy: minMergeSize=1000, mergeFactor=22, maxMergeSize=9223372036854775807, maxMergeSizeForForcedMerge=9223372036854775807, calibrateSizeByDeletes=true, maxMergeDocs=2147483647, maxCFSSegmentSizeMB=8.796093022207999E12, noCFSRatio=0.7439940275079165]
   [junit4]   2> 1764905 INFO  (coreLoadExecutor-3163-thread-1) [    x:collection1] o.a.s.s.SolrIndexSearcher Opening [Searcher@2ff8eb6e[collection1] main]
   [junit4]   2> 1764906 WARN  (coreLoadExecutor-3163-thread-1) [    x:collection1] o.a.s.r.ManagedResourceStorage Cannot write to config directory /home/jenkins/jenkins-slave/workspace/Lucene-Solr-Tests-8.x/solr/core/src/test-files/solr/collection1/conf; switching to use InMemory storage instead.
   [junit4]   2> 1764906 INFO  (coreLoadExecutor-3163-thread-1) [    x:collection1] o.a.s.h.ReplicationHandler Commits will be reserved for 10000ms.
   [junit4]   2> 1764906 INFO  (coreLoadExecutor-3163-thread-1) [    x:collection1] o.a.s.u.UpdateLog Could not find max version in index or recent updates, using new clock 1632408571694022656
   [junit4]   2> 1764908 INFO  (searcherExecutor-3164-thread-1-processing-x:collection1) [    x:collection1] o.a.s.c.SolrCore [collection1] Registered new searcher Searcher@2ff8eb6e[collection1] main{ExitableDirectoryReader(UninvertingDirectoryReader())}
   [junit4]   2> 1764909 INFO  (TEST-PeerSyncTest.test-seed#[FBA19694FDE8D223]) [    ] o.a.s.SolrTestCaseJ4 ####initCore end
   [junit4]   2> 1765016 INFO  (TEST-PeerSyncTest.test-seed#[FBA19694FDE8D223]) [    ] o.a.s.SolrTestCaseJ4 Writing core.properties file to /home/jenkins/jenkins-slave/workspace/Lucene-Solr-Tests-8.x/solr/build/solr-core/test/J1/temp/solr.update.PeerSyncTest_FBA19694FDE8D223-001/tempDir-001/control/cores/collection1
   [junit4]   2> 1765016 WARN  (TEST-PeerSyncTest.test-seed#[FBA19694FDE8D223]) [    ] o.e.j.s.AbstractConnector Ignoring deprecated socket close linger time
   [junit4]   2> 1765017 INFO  (TEST-PeerSyncTest.test-seed#[FBA19694FDE8D223]) [    ] o.a.s.c.s.e.JettySolrRunner Start Jetty (original configured port=0)
   [junit4]   2> 1765017 INFO  (TEST-PeerSyncTest.test-seed#[FBA19694FDE8D223]) [    ] o.a.s.c.s.e.JettySolrRunner Trying to start Jetty on port 0 try number 1 ...
   [junit4]   2> 1765017 INFO  (TEST-PeerSyncTest.test-seed#[FBA19694FDE8D223]) [    ] o.e.j.s.Server jetty-9.4.14.v20181114; built: 2018-11-14T21:20:31.478Z; git: c4550056e785fb5665914545889f21dc136ad9e6; jvm 1.8.0_191-b12
   [junit4]   2> 1765018 INFO  (TEST-PeerSyncTest.test-seed#[FBA19694FDE8D223]) [    ] o.e.j.s.session DefaultSessionIdManager workerName=node0
   [junit4]   2> 1765018 INFO  (TEST-PeerSyncTest.test-seed#[FBA19694FDE8D223]) [    ] o.e.j.s.session No SessionScavenger set, using defaults
   [junit4]   2> 1765018 INFO  (TEST-PeerSyncTest.test-seed#[FBA19694FDE8D223]) [    ] o.e.j.s.session node0 Scavenging every 660000ms
   [junit4]   2> 1765019 INFO  (TEST-PeerSyncTest.test-seed#[FBA19694FDE8D223]) [    ] o.e.j.s.h.ContextHandler Started o.e.j.s.ServletContextHandler@73d0c667{/_x/m,null,AVAILABLE}
   [junit4]   2> 1765020 INFO  (TEST-PeerSyncTest.test-seed#[FBA19694FDE8D223]) [    ] o.e.j.s.AbstractConnector Started ServerConnector@295c808a{HTTP/1.1,[http/1.1, h2c]}{127.0.0.1:37652}
   [junit4]   2> 1765020 INFO  (TEST-PeerSyncTest.test-seed#[FBA19694FDE8D223]) [    ] o.e.j.s.Server Started @1765214ms
   [junit4]   2> 1765020 INFO  (TEST-PeerSyncTest.test-seed#[FBA19694FDE8D223]) [    ] o.a.s.c.s.e.JettySolrRunner Jetty properties: {schema=schema.xml, solrconfig=solrconfig-tlog.xml, hostContext=/_x/m, hostPort=37652, coreRootDirectory=/home/jenkins/jenkins-slave/workspace/Lucene-Solr-Tests-8.x/solr/build/solr-core/test/J1/temp/solr.update.PeerSyncTest_FBA19694FDE8D223-001/tempDir-001/control/cores}
   [junit4]   2> 1765020 ERROR (TEST-PeerSyncTest.test-seed#[FBA19694FDE8D223]) [    ] o.a.s.u.StartupLoggingUtils Missing Java Option solr.log.dir. Logging may be missing or incomplete.
   [junit4]   2> 1765020 INFO  (TEST-PeerSyncTest.test-seed#[FBA19694FDE8D223]) [    ] o.a.s.s.SolrDispatchFilter Using logger factory org.apache.logging.slf4j.Log4jLoggerFactory
   [junit4]   2> 1765020 INFO  (TEST-PeerSyncTest.test-seed#[FBA19694FDE8D223]) [    ] o.a.s.s.SolrDispatchFilter  ___      _       Welcome to Apache Solr? version 8.2.0
   [junit4]   2> 1765020 INFO  (TEST-PeerSyncTest.test-seed#[FBA19694FDE8D223]) [    ] o.a.s.s.SolrDispatchFilter / __| ___| |_ _   Starting in standalone mode on port null
   [junit4]   2> 1765020 INFO  (TEST-PeerSyncTest.test-seed#[FBA19694FDE8D223]) [    ] o.a.s.s.SolrDispatchFilter \__ \/ _ \ | '_|  Install dir: null
   [junit4]   2> 1765020 INFO  (TEST-PeerSyncTest.test-seed#[FBA19694FDE8D223]) [    ] o.a.s.s.SolrDispatchFilter |___/\___/_|_|    Start time: 2019-05-02T08:35:28.820Z
   [junit4]   2> 1765021 INFO  (TEST-PeerSyncTest.test-seed#[FBA19694FDE8D223]) [    ] o.a.s.c.SolrXmlConfig Loading container configuration from /home/jenkins/jenkins-slave/workspace/Lucene-Solr-Tests-8.x/solr/build/solr-core/test/J1/temp/solr.update.PeerSyncTest_FBA19694FDE8D223-001/tempDir-001/control/solr.xml
   [junit4]   2> 1765024 INFO  (TEST-PeerSyncTest.test-seed#[FBA19694FDE8D223]) [    ] o.a.s.c.SolrXmlConfig Configuration parameter autoReplicaFailoverWorkLoopDelay is ignored
   [junit4]   2> 1765024 INFO  (TEST-PeerSyncTest.test-seed#[FBA19694FDE8D223]) [    ] o.a.s.c.SolrXmlConfig Configuration parameter autoReplicaFailoverBadNodeExpiration is ignored
   [junit4]   2> 1765025 INFO  (TEST-PeerSyncTest.test-seed#[FBA19694FDE8D223]) [    ] o.a.s.c.SolrXmlConfig MBean server found: com.sun.jmx.mbeanserver.JmxMBeanServer@75749aeb, but no JMX reporters were configured - adding default JMX reporter.
   [junit4]   2> 1765086 INFO  (TEST-PeerSyncTest.test-seed#[FBA19694FDE8D223]) [    ] o.a.s.h.c.HttpShardHandlerFactory Host whitelist initialized: WhitelistHostChecker [whitelistHosts=null, whitelistHostCheckingEnabled=false]
   [junit4]   2> 1765087 WARN  (TEST-PeerSyncTest.test-seed#[FBA19694FDE8D223]) [    ] o.e.j.u.s.S.config No Client EndPointIdentificationAlgorithm configured for SslContextFactory@71500561[provider=null,keyStore=null,trustStore=null]
   [junit4]   2> 1765090 WARN  (TEST-PeerSyncTest.test-seed#[FBA19694FDE8D223]) [    ] o.e.j.u.s.S.config No Client EndPointIdentificationAlgorithm configured for SslContextFactory@546a25b4[provider=null,keyStore=null,trustStore=null]
   [junit4]   2> 1765106 INFO  (TEST-PeerSyncTest.test-seed#[FBA19694FDE8D223]) [    ] o.a.s.c.TransientSolrCoreCacheDefault Allocating transient cache for 4 transient cores
   [junit4]   2> 1765106 INFO  (TEST-PeerSyncTest.test-seed#[FBA19694FDE8D223]) [    ] o.a.s.h.a.MetricsHistoryHandler No .system collection, keeping metrics history in memory.
   [junit4]   2> 1765121 INFO  (TEST-PeerSyncTest.test-seed#[FBA19694FDE8D223]) [    ] o.a.s.m.r.SolrJmxReporter JMX monitoring for 'solr.node' (registry 'solr.node') enabled at server: com.sun.jmx.mbeanserver.JmxMBeanServer@75749aeb
   [junit4]   2> 1765130 INFO  (TEST-PeerSyncTest.test-seed#[FBA19694FDE8D223]) [    ] o.a.s.m.r.SolrJmxReporter JMX monitoring for 'solr.jvm' (registry 'solr.jvm') enabled at server: com.sun.jmx.mbeanserver.JmxMBeanServer@75749aeb
   [junit4]   2> 1765130 INFO  (TEST-PeerSyncTest.test-seed#[FBA19694FDE8D223]) [    ] o.a.s.m.r.SolrJmxReporter JMX monitoring for 'solr.jetty' (registry 'solr.jetty') enabled at server: com.sun.jmx.mbeanserver.JmxMBeanServer@75749aeb
   [junit4]   2> 1765132 INFO  (TEST-PeerSyncTest.test-seed#[FBA19694FDE8D223]) [    ] o.a.s.c.CorePropertiesLocator Found 1 core definitions underneath /home/jenkins/jenkins-slave/workspace/Lucene-Solr-Tests-8.x/solr/build/solr-core/test/J1/temp/solr.update.PeerSyncTest_FBA19694FDE8D223-001/tempDir-001/control/cores
   [junit4]   2> 1765132 INFO  (TEST-PeerSyncTest.test-seed#[FBA19694FDE8D223]) [    ] o.a.s.c.CorePropertiesLocator Cores are: [collection1]
   [junit4]   2> 1765133 INFO  (coreLoadExecutor-3177-thread-1) [    x:collection1] o.a.s.c.SolrResourceLoader [null] Added 2 libs to classloader, from paths: [/home/jenkins/jenkins-slave/workspace/Lucene-Solr-Tests-8.x/solr/core/src/test-files/solr/collection1/lib, /home/jenkins/jenkins-slave/workspace/Lucene-Solr-Tests-8.x/solr/core/src/test-files/solr/collection1/lib/classes]
   [junit4]   2> 1765154 INFO  (coreLoadExecutor-3177-thread-1) [    x:collection1] o.a.s.c.SolrConfig Using Lucene MatchVersion: 8.2.0
   [junit4]   2> 1765168 INFO  (coreLoadExecutor-3177-thread-1) [    x:collection1] o.a.s.s.IndexSchema [collection1] Schema name=test
   [junit4]   2> 1765250 INFO  (coreLoadExecutor-3177-thread-1) [    x:collection1] o.a.s.s.IndexSchema Loaded schema test/1.0 with uniqueid field id
   [junit4]   2> 1765256 INFO  (coreLoadExecutor-3177-thread-1) [    x:collection1] o.a.s.c.CoreContainer Creating SolrCore 'collection1' using configuration from configset /home/jenkins/jenkins-slave/workspace/Lucene-Solr-Tests-8.x/solr/core/src/test-files/solr/collection1, trusted=true
   [junit4]   2> 1765257 INFO  (coreLoadExecutor-3177-thread-1) [    x:collection1] o.a.s.m.r.SolrJmxReporter JMX monitoring for 'solr.core.collection1' (registry 'solr.core.collection1') enabled at server: com.sun.jmx.mbeanserver.JmxMBeanServer@75749aeb
   [junit4]   2> 1765257 INFO  (coreLoadExecutor-3177-thread-1) [    x:collection1] o.a.s.c.SolrCore [[collection1] ] Opening new SolrCore at [/home/jenkins/jenkins-slave/workspace/Lucene-Solr-Tests-8.x/solr/core/src/test-files/solr/collection1], dataDir=[/home/jenkins/jenkins-slave/workspace/Lucene-Solr-Tests-8.x/solr/build/solr-core/test/J1/temp/solr.update.PeerSyncTest_FBA19694FDE8D223-001/tempDir-001/control/cores/collection1/data/]
   [junit4]   2> 1765258 INFO  (coreLoadExecutor-3177-thread-1) [    x:collection1] o.a.s.u.RandomMergePolicy RandomMergePolicy wrapping class org.apache.lucene.index.LogByteSizeMergePolicy: [LogByteSizeMergePolicy: minMergeSize=1677721, mergeFactor=21, maxMergeSize=2147483648, maxMergeSizeForForcedMerge=9223372036854775807, calibrateSizeByDeletes=false, maxMergeDocs=2147483647, maxCFSSegmentSizeMB=8.796093022207999E12, noCFSRatio=1.0]
   [junit4]   2> 1765260 WARN  (coreLoadExecutor-3177-thread-1) [    x:collection1] o.a.s.c.RequestHandlers INVALID paramSet a in requestHandler {type = requestHandler,name = /dump,class = DumpRequestHandler,attributes = {initParams=a, name=/dump, class=DumpRequestHandler},args = {defaults={a=A,b=B}}}
   [junit4]   2> 1765293 INFO  (coreLoadExecutor-3177-thread-1) [    x:collection1] o.a.s.u.UpdateHandler Using UpdateLog implementation: org.apache.solr.update.UpdateLog
   [junit4]   2> 1765293 INFO  (coreLoadExecutor-3177-thread-1) [    x:collection1] o.a.s.u.UpdateLog Initializing UpdateLog: dataDir= defaultSyncLevel=FLUSH numRecordsToKeep=100 maxNumLogsToKeep=10 numVersionBuckets=65536
   [junit4]   2> 1765294 INFO  (coreLoadExecutor-3177-thread-1) [    x:collection1] o.a.s.u.CommitTracker Hard AutoCommit: disabled
   [junit4]   2> 1765294 INFO  (coreLoadExecutor-3177-thread-1) [    x:collection1] o.a.s.u.CommitTracker Soft AutoCommit: disabled
   [junit4]   2> 1765295 INFO  (coreLoadExecutor-3177-thread-1) [    x:collection1] o.a.s.u.RandomMergePolicy RandomMergePolicy wrapping class org.apache.lucene.index.LogDocMergePolicy: [LogDocMergePolicy: minMergeSize=1000, mergeFactor=22, maxMergeSize=9223372036854775807, maxMergeSizeForForcedMerge=9223372036854775807, calibrateSizeByDeletes=true, maxMergeDocs=2147483647, maxCFSSegmentSizeMB=8.796093022207999E12, noCFSRatio=0.7439940275079165]
   [junit4]   2> 1765295 INFO  (coreLoadExecutor-3177-thread-1) [    x:collection1] o.a.s.s.SolrIndexSearcher Opening [Searcher@6867d5f[collection1] main]
   [junit4]   2> 1765295 WARN  (coreLoadExecutor-3177-thread-1) [    x:collection1] o.a.s.r.ManagedResourceStorage Cannot write to config directory /home/jenkins/jenkins-slave/workspace/Lucene-Solr-Tests-8.x/solr/core/src/test-files/solr/collection1/conf; switching to use InMemory storage instead.
   [junit4]   2> 1765296 INFO  (coreLoadExecutor-3177-thread-1) [    x:collection1] o.a.s.h.ReplicationHandler Commits will be reserved for 10000ms.
   [junit4]   2> 1765296 INFO  (coreLoadExecutor-3177-thread-1) [    x:collection1] o.a.s.u.UpdateLog Could not find max version in index or recent updates, using new clock 1632408572102967296
   [junit4]   2> 1765298 INFO  (searcherExecutor-3178-thread-1-processing-x:collection1) [    x:collection1] o.a.s.c.SolrCore [collection1] Registered new searcher Searcher@6867d5f[collection1] main{ExitableDirectoryReader(UninvertingDirectoryReader())}
   [junit4]   2> 1765402 INFO  (TEST-PeerSyncTest.test-seed#[FBA19694FDE8D223]) [    ] o.a.s.SolrTestCaseJ4 Writing core.properties file to /home/jenkins/jenkins-slave/workspace/Lucene-Solr-Tests-8.x/solr/build/solr-core/test/J1/temp/solr.update.PeerSyncTest_FBA19694FDE8D223-001/tempDir-001/shard0/cores/collection1
   [junit4]   2> 1765402 WARN  (TEST-PeerSyncTest.test-seed#[FBA19694FDE8D223]) [    ] o.e.j.s.AbstractConnector Ignoring deprecated socket close linger time
   [junit4]   2> 1765403 INFO  (TEST-PeerSyncTest.test-seed#[FBA19694FDE8D223]) [    ] o.a.s.c.s.e.JettySolrRunner Start Jetty (original configured port=0)
   [junit4]   2> 1765403 INFO  (TEST-PeerSyncTest.test-seed#[FBA19694FDE8D223]) [    ] o.a.s.c.s.e.JettySolrRunner Trying to start Jetty on port 0 try number 1 ...
   [junit4]   2> 1765403 INFO  (TEST-PeerSyncTest.test-seed#[FBA19694FDE8D223]) [    ] o.e.j.s.Server jetty-9.4.14.v20181114; built: 2018-11-14T21:20:31.478Z; git: c4550056e785fb5665914545889f21dc136ad9e6; jvm 1.8.0_191-b12
   [junit4]   2> 1765403 INFO  (TEST-PeerSyncTest.test-seed#[FBA19694FDE8D223]) [    ] o.e.j.s.session DefaultSessionIdManager workerName=node0
   [junit4]   2> 1765403 INFO  (TEST-PeerSyncTest.test-seed#[FBA19694FDE8D223]) [    ] o.e.j.s.session No SessionScavenger set, using defaults
   [junit4]   2> 1765403 INFO  (TEST-PeerSyncTest.test-seed#[FBA19694FDE8D223]) [    ] o.e.j.s.session node0 Scavenging every 600000ms
   [junit4]   2> 1765404 INFO  (TEST-PeerSyncTest.test-seed#[FBA19694FDE8D223]) [    ] o.e.j.s.h.ContextHandler Started o.e.j.s.ServletContextHandler@29476a2d{/_x/m,null,AVAILABLE}
   [junit4]   2> 1765404 INFO  (TEST-PeerSyncTest.test-seed#[FBA19694FDE8D223]) [    ] o.e.j.s.AbstractConnector Started ServerConnector@207a2e15{HTTP/1.1,[http/1.1, h2c]}{127.0.0.1:34991}
   [junit4]   2> 1765404 INFO  (TEST-PeerSyncTest.test-seed#[FBA19694FDE8D223]) [    ] o.e.j.s.Server Started @1765599ms
   [junit4]   2> 1765404 INFO  (TEST-PeerSyncTest.test-seed#[FBA19694FDE8D223]) [    ] o.a.s.c.s.e.JettySolrRunner Jetty properties: {schema=schema.xml, solrconfig=solrconfig-tlog.xml, hostContext=/_x/m, hostPort=34991, coreRootDirectory=/home/jenkins/jenkins-slave/workspace/Lucene-Solr-Tests-8.x/solr/build/solr-core/test/J1/temp/solr.update.PeerSyncTest_FBA19694FDE8D223-001/tempDir-001/shard0/cores}
   [junit4]   2> 1765404 ERROR (TEST-PeerSyncTest.test-seed#[FBA19694FDE8D223]) [    ] o.a.s.u.StartupLoggingUtils Missing Java Option solr.log.dir. Logging may be missing or incomplete.
   [junit4]   2> 1765405 INFO  (TEST-PeerSyncTest.test-seed#[FBA19694FDE8D223]) [    ] o.a.s.s.SolrDispatchFilter Using logger factory org.apache.logging.slf4j.Log4jLoggerFactory
   [junit4]   2> 1765405 INFO  (TEST-PeerSyncTest.test-seed#[FBA19694FDE8D223]) [    ] o.a.s.s.SolrDispatchFilter  ___      _       Welcome to Apache Solr? version 8.2.0
   [junit4]   2> 1765405 INFO  (TEST-PeerSyncTest.test-seed#[FBA19694FDE8D223]) [    ] o.a.s.s.SolrDispatchFilter / __| ___| |_ _   Starting in standalone mode on port null
   [junit4]   2> 1765405 INFO  (TEST-PeerSyncTest.test-seed#[FBA19694FDE8D223]) [    ] o.a.s.s.SolrDispatchFilter \__ \/ _ \ | '_|  Install dir: null
   [junit4]   2> 1765405 INFO  (TEST-PeerSyncTest.test-seed#[FBA19694FDE8D223]) [    ] o.a.s.s.SolrDispatchFilter |___/\___/_|_|    Start time: 2019-05-02T08:35:29.205Z
   [junit4]   2> 1765405 INFO  (TEST-PeerSyncTest.test-seed#[FBA19694FDE8D223]) [    ] o.a.s.c.SolrXmlConfig Loading container configuration from /home/jenkins/jenkins-slave/workspace/Lucene-Solr-Tests-8.x/solr/build/solr-core/test/J1/temp/solr.update.PeerSyncTest_FBA19694FDE8D223-001/tempDir-001/shard0/solr.xml
   [junit4]   2> 1765408 INFO  (TEST-PeerSyncTest.test-seed#[FBA19694FDE8D223]) [    ] o.a.s.c.SolrXmlConfig Configuration parameter autoReplicaFailoverWorkLoopDelay is ignored
   [junit4]   2> 1765408 INFO  (TEST-PeerSyncTest.test-seed#[FBA19694FDE8D223]) [    ] o.a.s.c.SolrXmlConfig Configuration parameter autoReplicaFailoverBadNodeExpiration is ignored
   [junit4]   2> 1765409 INFO  (TEST-PeerSyncTest.test-seed#[FBA19694FDE8D223]) [    ] o.a.s.c.SolrXmlConfig MBean server found: com.sun.jmx.mbeanserver.JmxMBeanServer@75749aeb, but no JMX reporters were configured - adding default JMX reporter.
   [junit4]   2> 1765525 INFO  (TEST-PeerSyncTest.test-seed#[FBA19694FDE8D223]) [    ] o.a.s.h.c.HttpShardHandlerFactory Host whitelist initialized: WhitelistHostChecker [whitelistHosts=null, whitelistHostCheckingEnabled=false]
   [junit4]   2> 1765526 WARN  (TEST-PeerSyncTest.test-seed#[FBA19694FDE8D223]) [    ] o.e.j.u.s.S.config No Client EndPointIdentificationAlgorithm configured for SslContextFactory@42d6bc63[provider=null,keyStore=null,trustStore=null]
   [junit4]   2> 1765530 WARN  (TEST-PeerSyncTest.test-seed#[FBA19694FDE8D223]) [    ] o.e.j.u.s.S.config No Client EndPointIdentificationAlgorithm configured for SslContextFactory@15fa197e[provider=null,keyStore=null,trustStore=null]
   [junit4]   2> 1765545 INFO  (TEST-PeerSyncTest.test-seed#[FBA19694FDE8D223]) [    ] o.a.s.c.TransientSolrCoreCacheDefault Allocating transient cache for 4 transient cores
   [junit4]   2> 1765545 INFO  (TEST-PeerSyncTest.test-seed#[FBA19694FDE8D223]) [    ] o.a.s.h.a.MetricsHistoryHandler No .system collection, keeping metrics history in memory.
   [junit4]   2> 1765561 INFO  (TEST-PeerSyncTest.test-seed#[FBA19694FDE8D223]) [    ] o.a.s.m.r.SolrJmxReporter JMX monitoring for 'solr.node' (registry 'solr.node') enabled at server: com.sun.jmx.mbeanserver.JmxMBeanServer@75749aeb
   [junit4]   2> 1765571 INFO  (TEST-PeerSyncTest.test-seed#[FBA19694FDE8D223]) [    ] o.a.s.m.r.SolrJmxReporter JMX monitoring for 'solr.jvm' (registry 'solr.jvm') enabled at server: com.sun.jmx.mbeanserver.JmxMBeanServer@75749aeb
   [junit4]   2> 1765571 INFO  (TEST-PeerSyncTest.test-seed#[FBA19694FDE8D223]) [    ] o.a.s.m.r.SolrJmxReporter JMX monitoring for 'solr.jetty' (registry 'solr.jetty') enabled at server: com.sun.jmx.mbeanserver.JmxMBeanServer@75749aeb
   [junit4]   2> 1765573 INFO  (TEST-PeerSyncTest.test-seed#[FBA19694FDE8D223]) [    ] o.a.s.c.CorePropertiesLocator Found 1 core definitions underneath /home/jenkins/jenkins-slave/workspace/Lucene-Solr-Tests-8.x/solr/build/solr-core/test/J1/temp/solr.update.PeerSyncTest_FBA19694FDE8D223-001/tempDir-001/shard0/cores
   [junit4]   2> 1765573 INFO  (TEST-PeerSyncTest.test-seed#[FBA19694FDE8D223]) [    ] o.a.s.c.CorePropertiesLocator Cores are: [collection1]
   [junit4]   2> 1765573 INFO  (coreLoadExecutor-3191-thread-1) [    x:collection1] o.a.s.c.SolrResourceLoader [null] Added 2 libs to classloader, from paths: [/home/jenkins/jenkins-slave/workspace/Lucene-Solr-Tests-8.x/solr/core/src/test-files/solr/collection1/lib, /home/jenkins/jenkins-slave/workspace/Lucene-Solr-Tests-8.x/solr/core/src/test-files/solr/collection1/lib/classes]
   [junit4]   2> 1765594 INFO  (coreLoadExecutor-3191-thread-1) [    x:collection1] o.a.s.c.SolrConfig Using Lucene MatchVersion: 8.2.0
   [junit4]   2> 1765607 INFO  (coreLoadExecutor-3191-thread-1) [    x:collection1] o.a.s.s.IndexSchema [collection1] Schema name=test
   [junit4]   2> 1765690 INFO  (coreLoadExecutor-3191-thread-1) [    x:collection1] o.a.s.s.IndexSchema Loaded schema test/1.0 with uniqueid field id
   [junit4]   2> 1765697 INFO  (coreLoadExecutor-3191-thread-1) [    x:collection1] o.a.s.c.CoreContainer Creating SolrCore 'collection1' using configuration from configset /home/jenkins/jenkins-slave/workspace/Lucene-Solr-Tests-8.x/solr/core/src/test-files/solr/collection1, trusted=true
   [junit4]   2> 1765697 INFO  (coreLoadExecutor-3191-thread-1) [    x:collection1] o.a.s.m.r.SolrJmxReporter JMX monitoring for 'solr.core.collection1' (registry 'solr.core.collection1') enabled at server: com.sun.jmx.mbeanserver.JmxMBeanServer@75749aeb
   [junit4]   2> 1765697 INFO  (coreLoadExecutor-3191-thread-1) [    x:collection1] o.a.s.c.SolrCore [[collection1] ] Opening new SolrCore at [/home/jenkins/jenkins-slave/workspace/Lucene-Solr-Tests-8.x/solr/core/src/test-files/solr/collection1], dataDir=[/home/jenkins/jenkins-slave/workspace/Lucene-Solr-Tests-8.x/solr/build/solr-core/test/J1/temp/solr.update.PeerSyncTest_FBA19694FDE8D223-001/tempDir-001/shard0/cores/collection1/data/]
   [junit4]   2> 1765698 INFO  (coreLoadExecutor-3191-thread-1) [    x:collection1] o.a.s.u.RandomMergePolicy RandomMergePolicy wrapping class org.apache.lucene.index.LogByteSizeMergePolicy: [LogByteSizeMergePolicy: minMergeSize=1677721, mergeFactor=21, maxMergeSize=2147483648, maxMergeSizeForForcedMerge=9223372036854775807, calibrateSizeByDeletes=false, maxMergeDocs=2147483647, maxCFSSegmentSizeMB=8.796093022207999E12, noCFSRatio=1.0]
   [junit4]   2> 1765700 WARN  (coreLoadExecutor-3191-thread-1) [    x:collection1] o.a.s.c.RequestHandlers INVALID paramSet a in requestHandler {type = requestHandler,name = /dump,class = DumpRequestHandler,attributes = {initParams=a, name=/dump, class=DumpRequestHandler},args = {defaults={a=A,b=B}}}
   [junit4]   2> 1765734 INFO  (coreLoadExecutor-3191-thread-1) [    x:collection1] o.a.s.u.UpdateHandler Using UpdateLog implementation: org.apache.solr.update.UpdateLog
   [junit4]   2> 1765734 INFO  (coreLoadExecutor-3191-thread-1) [    x:collection1] o.a.s.u.UpdateLog Initializing UpdateLog: dataDir= defaultSyncLevel=FLUSH numRecordsToKeep=100 maxNumLogsToKeep=10 numVersionBuckets=65536
   [junit4]   2> 1765735 INFO  (coreLoadExecutor-3191-thread-1) [    x:collection1] o.a.s.u.CommitTracker Hard AutoCommit: disabled
   [junit4]   2> 1765735 INFO  (coreLoadExecutor-3191-thread-1) [    x:collection1] o.a.s.u.CommitTracker Soft AutoCommit: disabled
   [junit4]   2> 1765736 INFO  (coreLoadExecutor-3191-thread-1) [    x:collection1] o.a.s.u.RandomMergePolicy RandomMergePolicy wrapping class org.apache.lucene.index.LogDocMergePolicy: [LogDocMergePolicy: minMergeSize=1000, mergeFactor=22, maxMergeSize=9223372036854775807, maxMergeSizeForForcedMerge=9223372036854775807, calibrateSizeByDeletes=true, maxMergeDocs=2147483647, maxCFSSegmentSizeMB=8.796093022207999E12, noCFSRatio=0.7439940275079165]
   [junit4]   2> 1765736 INFO  (coreLoadExecutor-3191-thread-1) [    x:collection1] o.a.s.s.SolrIndexSearcher Opening [Searcher@25174a91[collection1] main]
   [junit4]   2> 1765736 WARN  (coreLoadExecutor-3191-thread-1) [    x:collection1] o.a.s.r.ManagedResourceStorage Cannot write to config directory /home/jenkins/jenkins-slave/workspace/Lucene-Solr-Tests-8.x/solr/core/src/test-files/solr/collection1/conf; switching to use InMemory storage instead.
   [junit4]   2> 1765737 INFO  (coreLoadExecutor-3191-thread-1) [    x:collection1] o.a.s.h.ReplicationHandler Commits will be reserved for 10000ms.
   [junit4]   2> 1765737 INFO  (coreLoadExecutor-3191-thread-1) [    x:collection1] o.a.s.u.UpdateLog Could not find max version in index or recent updates, using new clock 1632408572565389312
   [junit4]   2> 1765751 INFO  (searcherExecutor-3192-thread-1-processing-x:collection1) [    x:collection1] o.a.s.c.SolrCore [collection1] Registered new searcher Searcher@25174a91[collection1] main{ExitableDirectoryReader(UninvertingDirectoryReader())}
   [junit4]   2> 1765844 INFO  (TEST-PeerSyncTest.test-seed#[FBA19694FDE8D223]) [    ] o.a.s.SolrTestCaseJ4 Writing core.properties file to /home/jenkins/jenkins-slave/workspace/Lucene-Solr-Tests-8.x/solr/build/solr-core/test/J1/temp/solr.update.PeerSyncTest_FBA19694FDE8D223-001/tempDir-001/shard1/cores/collection1
   [junit4]   2> 1765844 WARN  (TEST-PeerSyncTest.test-seed#[FBA19694FDE8D223]) [    ] o.e.j.s.AbstractConnector Ignoring deprecated socket close linger time
   [junit4]   2> 1765845 INFO  (TEST-PeerSyncTest.test-seed#[FBA19694FDE8D223]) [    ] o.a.s.c.s.e.JettySolrRunner Start Jetty (original configured port=0)
   [junit4]   2> 1765845 INFO  (TEST-PeerSyncTest.test-seed#[FBA19694FDE8D223]) [    ] o.a.s.c.s.e.JettySolrRunner Trying to start Jetty on port 0 try number 1 ...
   [junit4]   2> 1765845 INFO  (TEST-PeerSyncTest.test-seed#[FBA19694FDE8D223]) [    ] o.e.j.s.Server jetty-9.4.14.v20181114; built: 2018-11-14T21:20:31.478Z; git: c4550056e785fb5665914545889f21dc136ad9e6; jvm 1.8.0_191-b12
   [junit4]   2> 1765845 INFO  (TEST-PeerSyncTest.test-seed#[FBA19694FDE8D223]) [    ] o.e.j.s.session DefaultSessionIdManager workerName=node0
   [junit4]   2> 1765845 INFO  (TEST-PeerSyncTest.test-seed#[FBA19694FDE8D223]) [    ] o.e.j.s.session No SessionScavenger set, using defaults
   [junit4]   2> 1765846 INFO  (TEST-PeerSyncTest.test-seed#[FBA19694FDE8D223]) [    ] o.e.j.s.session node0 Scavenging every 600000ms
   [junit4]   2> 1765846 INFO  (TEST-PeerSyncTest.test-seed#[FBA19694FDE8D223]) [    ] o.e.j.s.h.ContextHandler Started o.e.j.s.ServletContextHandler@55c8a259{/_x/m,null,AVAILABLE}
   [junit4]   2> 1765846 INFO  (TEST-PeerSyncTest.test-seed#[FBA19694FDE8D223]) [    ] o.e.j.s.AbstractConnector Started ServerConnector@6f3c1f8e{HTTP/1.1,[http/1.1, h2c]}{127.0.0.1:35936}
   [junit4]   2> 1765846 INFO  (TEST-PeerSyncTest.test-seed#[FBA19694FDE8D223]) [    ] o.e.j.s.Server Started @1766041ms
   [junit4]   2> 1765846 INFO  (TEST-PeerSyncTest.test-seed#[FBA19694FDE8D223]) [    ] o.a.s.c.s.e.JettySolrRunner Jetty properties: {schema=schema.xml, solrconfig=solrconfig-tlog.xml, hostContext=/_x/m, hostPort=35936, coreRootDirectory=/home/jenkins/jenkins-slave/workspace/Lucene-Solr-Tests-8.x/solr/build/solr-core/test/J1/temp/solr.update.PeerSyncTest_FBA19694FDE8D223-001/tempDir-001/shard1/cores}
   [junit4]   2> 1765846 ERROR (TEST-PeerSyncTest.test-seed#[FBA19694FDE8D223]) [    ] o.a.s.u.StartupLoggingUtils Missing Java Option solr.log.dir. Logging may be missing or incomplete.
   [junit4]   2> 1765847 INFO  (TEST-PeerSyncTest.test-seed#[FBA19694FDE8D223]) [    ] o.a.s.s.SolrDispatchFilter Using logger factory org.apache.logging.slf4j.Log4jLoggerFactory
   [junit4]   2> 1765847 INFO  (TEST-PeerSyncTest.test-seed#[FBA19694FDE8D223]) [    ] o.a.s.s.SolrDispatchFilter  ___      _       Welcome to Apache Solr? version 8.2.0
   [junit4]   2> 1765847 INFO  (TEST-PeerSyncTest.test-seed#[FBA19694FDE8D223]) [    ] o.a.s.s.SolrDispatchFilter / __| ___| |_ _   Starting in standalone mode on port null
   [junit4]   2> 1765847 INFO  (TEST-PeerSyncTest.test-seed#[FBA19694FDE8D223]) [    ] o.a.s.s.SolrDispatchFilter \__ \/ _ \ | '_|  Install dir: null
   [junit4]   2> 1765847 INFO  (TEST-PeerSyncTest.test-seed#[FBA19694FDE8D223]) [    ] o.a.s.s.SolrDispatchFilter |___/\___/_|_|    Start time: 2019-05-02T08:35:29.647Z
   [junit4]   2> 1765847 INFO  (TEST-PeerSyncTest.test-seed#[FBA19694FDE8D223]) [    ] o.a.s.c.SolrXmlConfig Loading container configuration from /home/jenkins/jenkins-slave/workspace/Lucene-Solr-Tests-8.x/solr/build/solr-core/test/J1/temp/solr.update.PeerSyncTest_FBA19694FDE8D223-001/tempDir-001/shard1/solr.xml
   [junit4]   2> 1765850 INFO  (TEST-PeerSyncTest.test-seed#[FBA19694FDE8D223]) [    ] o.a.s.c.SolrXmlConfig Configuration parameter autoReplicaFailoverWorkLoopDelay is ignored
   [junit4]   2> 1765850 INFO  (TEST-PeerSyncTest.test-seed#[FBA19694FDE8D223]) [    ] o.a.s.c.SolrXmlConfig Configuration parameter autoReplicaFailoverBadNodeExpiration is ignored
   [junit4]   2> 1765851 INFO  (TEST-PeerSyncTest.test-seed#[FBA19694FDE8D223]) [    ] o.a.s.c.SolrXmlConfig MBean server found: com.sun.jmx.mbeanserver.JmxMBeanServer@75749aeb, but no JMX reporters were configured - adding default JMX reporter.
   [junit4]   2> 1765967 INFO  (TEST-PeerSyncTest.test-seed#[FBA19694FDE8D223]) [    ] o.a.s.h.c.HttpShardHandlerFactory Host whitelist initialized: WhitelistHostChecker [whitelistHosts=null, whitelistHostCheckingEnabled=false]
   [junit4]   2> 1765968 WARN  (TEST-PeerSyncTest.test-seed#[FBA19694FDE8D223]) [    ] o.e.j.u.s.S.config No Client EndPointIdentificationAlgorithm configured for SslContextFactory@423db2e9[provider=null,keyStore=null,trustStore=null]
   [junit4]   2> 1765972 WARN  (TEST-PeerSyncTest.test-seed#[FBA19694FDE8D223]) [    ] o.e.j.u.s.S.config No Client EndPointIdentificationAlgorithm configured for SslContextFactory@40d1b4aa[provider=null,keyStore=null,trustStore=null]
   [junit4]   2> 1765987 INFO  (TEST-PeerSyncTest.test-seed#[FBA19694FDE8D223]) [    ] o.a.s.c.TransientSolrCoreCacheDefault Allocating transient cache for 4 transient cores
   [junit4]   2> 1765987 INFO  (TEST-PeerSyncTest.test-seed#[FBA19694FDE8D223]) [    ] o.a.s.h.a.MetricsHistoryHandler No .system collection, keeping metrics history in memory.
   [junit4]   2> 1766003 INFO  (TEST-PeerSyncTest.test-seed#[FBA19694FDE8D223]) [    ] o.a.s.m.r.SolrJmxReporter JMX monitoring for 'solr.node' (registry 'solr.node') enabled at server: com.sun.jmx.mbeanserver.JmxMBeanServer@75749aeb
   [junit4]   2> 1766012 INFO  (TEST-PeerSyncTest.test-seed#[FBA19694FDE8D223]) [    ] o.a.s.m.r.SolrJmxReporter JMX monitoring for 'solr.jvm' (registry 'solr.jvm') enabled at server: com.sun.jmx.mbeanserver.JmxMBeanServer@75749aeb
   [junit4]   2> 1766012 INFO  (TEST-PeerSyncTest.test-seed#[FBA19694FDE8D223]) [    ] o.a.s.m.r.SolrJmxReporter JMX monitoring for 'solr.jetty' (registry 'solr.jetty') enabled at server: com.sun.jmx.mbeanserver.JmxMBeanServer@75749aeb
   [junit4]   2> 1766014 INFO  (TEST-PeerSyncTest.test-seed#[FBA19694FDE8D223]) [    ] o.a.s.c.CorePropertiesLocator Found 1 core definitions underneath /home/jenkins/jenkins-slave/workspace/Lucene-Solr-Tests-8.x/solr/build/solr-core/test/J1/temp/solr.update.PeerSyncTest_FBA19694FDE8D223-001/tempDir-001/shard1/cores
   [junit4]   2> 1766014 INFO  (TEST-PeerSyncTest.test-seed#[FBA19694FDE8D223]) [    ] o.a.s.c.CorePropertiesLocator Cores are: [collection1]
   [junit4]   2> 1766015 INFO  (coreLoadExecutor-3205-thread-1) [    x:collection1] o.a.s.c.SolrResourceLoader [null] Added 2 libs to classloader, from paths: [/home/jenkins/jenkins-slave/workspace/Lucene-Solr-Tests-8.x/solr/core/src/test-files/solr/collection1/lib, /home/jenkins/jenkins-slave/workspace/Lucene-Solr-Tests-8.x/solr/core/src/test-files/solr/collection1/lib/classes]
   [junit4]   2> 1766035 INFO  (coreLoadExecutor-3205-thread-1) [    x:collection1] o.a.s.c.SolrConfig Using Lucene MatchVersion: 8.2.0
   [junit4]   2> 1766058 INFO  (coreLoadExecutor-3205-thread-1) [    x:collection1] o.a.s.s.IndexSchema [collection1] Schema name=test
   [junit4]   2> 1766141 INFO  (coreLoadExecutor-3205-thread-1) [    x:collection1] o.a.s.s.IndexSchema Loaded schema test/1.0 with uniqueid field id
   [junit4]   2> 1766148 INFO  (coreLoadExecutor-3205-thread-1) [    x:collection1] o.a.s.c.CoreContainer Creating SolrCore 'collection1' using configuration from configset /home/jenkins/jenkins-slave/workspace/Lucene-Solr-Tests-8.x/solr/core/src/test-files/solr/collection1, trusted=true
   [junit4]   2> 1766148 INFO  (coreLoadExecutor-3205-thread-1) [    x:collection1] o.a.s.m.r.SolrJmxReporter JMX monitoring for 'solr.core.collection1' (registry 'solr.core.collection1') enabled at server: com.sun.jmx.mbeanserver.JmxMBeanServer@75749aeb
   [junit4]   2> 1766148 INFO  (coreLoadExecutor-3205-thread-1) [    x:collection1] o.a.s.c.SolrCore [[collection1] ] Opening new SolrCore at [/home/jenkins/jenkins-slave/workspace/Lucene-Solr-Tests-8.x/solr/core/src/test-files/solr/collection1], dataDir=[/home/jenkins/jenkins-slave/workspace/Lucene-Solr-Tests-8.x/solr/build/solr-core/test/J1/temp/solr.update.PeerSyncTest_FBA19694FDE8D223-001/tempDir-001/shard1/cores/collection1/data/]
   [junit4]   2> 1766150 INFO  (coreLoadExecutor-3205-thread-1) [    x:collection1] o.a.s.u.RandomMergePolicy RandomMergePolicy wrapping class org.apache.lucene.index.LogByteSizeMergePolicy: [LogByteSizeMergePolicy: minMergeSize=1677721, mergeFactor=21, maxMergeSize=2147483648, maxMergeSizeForForcedMerge=9223372036854775807, calibrateSizeByDeletes=false, maxMergeDocs=2147483647, maxCFSSegmentSizeMB=8.796093022207999E12, noCFSRatio=1.0]
   [junit4]   2> 1766172 WARN  (coreLoadExecutor-3205-thread-1) [    x:collection1] o.a.s.c.RequestHandlers INVALID paramSet a in requestHandler {type = requestHandler,name = /dump,class = DumpRequestHandler,attributes = {initParams=a, name=/dump, class=DumpRequestHandler},args = {defaults={a=A,b=B}}}
   [junit4]   2> 1766207 INFO  (coreLoadExecutor-3205-thread-1) [    x:collection1] o.a.s.u.UpdateHandler Using UpdateLog implementation: org.apache.solr.update.UpdateLog
   [junit4]   2> 1766207 INFO  (coreLoadExecutor-3205-thread-1) [    x:collection1] o.a.s.u.UpdateLog Initializing UpdateLog: dataDir= defaultSyncLevel=FLUSH numRecordsToKeep=100 maxNumLogsToKeep=10 numVersionBuckets=65536
   [junit4]   2> 1766208 INFO  (coreLoadExecutor-3205-thread-1) [    x:collection1] o.a.s.u.CommitTracker Hard AutoCommit: disabled
   [junit4]   2> 1766208 INFO  (coreLoadExecutor-3205-thread-1) [    x:collection1] o.a.s.u.CommitTracker Soft AutoCommit: disabled
   [junit4]   2> 1766209 INFO  (coreLoadExecutor-3205-thread-1) [    x:collection1] o.a.s.u.RandomMergePolicy RandomMergePolicy wrapping class org.apache.lucene.index.LogDocMergePolicy: [LogDocMergePolicy: minMergeSize=1000, mergeFactor=22, maxMergeSize=9223372036854775807, maxMergeSizeForForcedMerge=9223372036854775807, calibrateSizeByDeletes=true, maxMergeDocs=2147483647, maxCFSSegmentSizeMB=8.796093022207999E12, noCFSRatio=0.7439940275079165]
   [junit4]   2> 1766209 INFO  (coreLoadExecutor-3205-thread-1) [    x:collection1] o.a.s.s.SolrIndexSearcher Opening [Searcher@7bcb511d[collection1] main]
   [junit4]   2> 1766209 WARN  (coreLoadExecutor-3205-thread-1) [    x:collection1] o.a.s.r.ManagedResourceStorage Cannot write to config directory /home/jenkins/jenkins-slave/workspace/Lucene-Solr-Tests-8.x/solr/core/src/test-files/solr/collection1/conf; switching to use InMemory storage instead.
   [junit4]   2> 1766210 INFO  (coreLoadExecutor-3205-thread-1) [    x:collection1] o.a.s.h.ReplicationHandler Commits will be reserved for 10000ms.
   [junit4]   2> 1766210 INFO  (coreLoadExecutor-3205-thread-1) [    x:collection1] o.a.s.u.UpdateLog Could not find max version in index or recent updates, using new clock 1632408573061365760
   [junit4]   2> 1766213 INFO  (searcherExecutor-3206-thread-1-processing-x:collection1) [    x:collection1] o.a.s.c.SolrCore [collection1] Registered new searcher Searcher@7bcb511d[collection1] main{ExitableDirectoryReader(UninvertingDirectoryReader())}
   [junit4]   2> 1766336 INFO  (TEST-PeerSyncTest.test-seed#[FBA19694FDE8D223]) [    ] o.a.s.SolrTestCaseJ4 Writing core.properties file to /home/jenkins/jenkins-slave/workspace/Lucene-Solr-Tests-8.x/solr/build/solr-core/test/J1/temp/solr.update.PeerSyncTest_FBA19694FDE8D223-001/tempDir-001/shard2/cores/collection1
   [junit4]   2> 1766337 WARN  (TEST-PeerSyncTest.test-seed#[FBA19694FDE8D223]) [    ] o.e.j.s.AbstractConnector Ignoring deprecated socket close linger time
   [junit4]   2> 1766337 INFO  (TEST-PeerSyncTest.test-seed#[FBA19694FDE8D223]) [    ] o.a.s.c.s.e.JettySolrRunner Start Jetty (original configured port=0)
   [junit4]   2> 1766337 INFO  (TEST-PeerSyncTest.test-seed#[FBA19694FDE8D223]) [    ] o.a.s.c.s.e.JettySolrRunner Trying to start Jetty on port 0 try number 1 ...
   [junit4]   2> 1766337 INFO  (TEST-PeerSyncTest.test-seed#[FBA19694FDE8D223]) [    ] o.e.j.s.Server jetty-9.4.14.v20181114; built: 2018-11-14T21:20:31.478Z; git: c4550056e785fb5665914545889f21dc136ad9e6; jvm 1.8.0_191-b12
   [junit4]   2> 1766338 INFO  (TEST-PeerSyncTest.test-seed#[FBA19694FDE8D223]) [    ] o.e.j.s.session DefaultSessionIdManager workerName=node0
   [junit4]   2> 1766338 INFO  (TEST-PeerSyncTest.test-seed#[FBA19694FDE8D223]) [    ] o.e.j.s.session No SessionScavenger set, using defaults
   [junit4]   2> 1766338 INFO  (TEST-PeerSyncTest.test-seed#[FBA19694FDE8D223]) [    ] o.e.j.s.session node0 Scavenging every 660000ms
   [junit4]   2> 1766338 INFO  (TEST-PeerSyncTest.test-seed#[FBA19694FDE8D223]) [    ] o.e.j.s.h.ContextHandler Started o.e.j.s.ServletContextHandler@78613d24{/_x/m,null,AVAILABLE}
   [junit4]   2> 1766338 INFO  (TEST-PeerSyncTest.test-seed#[FBA19694FDE8D223]) [    ] o.e.j.s.AbstractConnector Started ServerConnector@1657265b{HTTP/1.1,[http/1.1, h2c]}{127.0.0.1:42848}
   [junit4]   2> 1766338 INFO  (TEST-PeerSyncTest.test-seed#[FBA19694FDE8D223]) [    ] o.e.j.s.Server Started @1766533ms
   [junit4]   2> 1766338 INFO  (TEST-PeerSyncTest.test-seed#[FBA19694FDE8D223]) [    ] o.a.s.c.s.e.JettySolrRunner Jetty properties: {schema=schema.xml, solrconfig=solrconfig-tlog.xml, hostContext=/_x/m, hostPort=42848, coreRootDirectory=/home/jenkins/jenkins-slave/workspace/Lucene-Solr-Tests-8.x/solr/build/solr-core/test/J1/temp/solr.update.PeerSyncTest_FBA19694FDE8D223-001/tempDir-001/shard2/cores}
   [junit4]   2> 1766339 ERROR (TEST-PeerSyncTest.test-seed#[FBA19694FDE8D223]) [    ] o.a.s.u.StartupLoggingUtils Missing Java Option solr.log.dir. Logging may be missing or incomplete.
   [junit4]   2> 1766339 INFO  (TEST-PeerSyncTest.test-seed#[FBA19694FDE8D223]) [    ] o.a.s.s.SolrDispatchFilter Using logger factory org.apache.logging.slf4j.Log4jLoggerFactory
   [junit4]   2> 1766339 INFO  (TEST-PeerSyncTest.test-seed#[FBA19694FDE8D223]) [    ] o.a.s.s.SolrDispatchFilter  ___      _       Welcome to Apache Solr? version 8.2.0
   [junit4]   2> 1766339 INFO  (TEST-PeerSyncTest.test-seed#[FBA19694FDE8D223]) [    ] o.a.s.s.SolrDispatchFilter / __| ___| |_ _   Starting in standalone mode on port null
   [junit4]   2> 1766339 INFO  (TEST-PeerSyncTest.test-seed#[FBA19694FDE8D223]) [    ] o.a.s.s.SolrDispatchFilter \__ \/ _ \ | '_|  Install dir: null
   [junit4]   2> 1766339 INFO  (TEST-PeerSyncTest.test-seed#[FBA19694FDE8D223]) [    ] o.a.s.s.SolrDispatchFilter |___/\___/_|_|    Start time: 2019-05-02T08:35:30.139Z
   [junit4]   2> 1766339 INFO  (TEST-PeerSyncTest.test-seed#[FBA19694FDE8D223]) [    ] o.a.s.c.SolrXmlConfig Loading container configuration from /home/jenkins/jenkins-slave/workspace/Lucene-Solr-Tests-8.x/solr/build/solr-core/test/J1/temp/solr.update.PeerSyncTest_FBA19694FDE8D223-001/tempDir-001/shard2/solr.xml
   [junit4]   2> 1766343 INFO  (TEST-PeerSyncTest.test-seed#[FBA19694FDE8D223]) [    ] o.a.s.c.SolrXmlConfig Configuration parameter autoReplicaFailoverWorkLoopDelay is ignored
   [junit4]   2> 1766343 INFO  (TEST-PeerSyncTest.test-seed#[FBA19694FDE8D223]) [    ] o.a.s.c.SolrXmlConfig Configuration parameter autoReplicaFailoverBadNodeExpiration is ignored
   [junit4]   2> 1766344 INFO  (TEST-PeerSyncTest.test-seed#[FBA19694FDE8D223]) [    ] o.a.s.c.SolrXmlConfig MBean server found: com.sun.jmx.mbeanserver.JmxMBeanServer@75749aeb, but no JMX reporters were configured - adding default JMX reporter.
   [junit4]   2> 1766445 INFO  (TEST-PeerSyncTest.test-seed#[FBA19694FDE8D223]) [    ] o.a.s.h.c.HttpShardHandlerFactory Host whitelist initialized: WhitelistHostChecker [whitelistHosts=null, whitelistHostCheckingEnabled=false]
   [junit4]   2> 1766446 WARN  (TEST-PeerSyncTest.test-seed#[FBA19694FDE8D223]) [    ] o.e.j.u.s.S.config No Client EndPointIdentificationAlgorithm configured for SslContextFactory@21622e40[provider=null,keyStore=null,trustStore=null]
   [junit4]   2> 1766449 WARN  (TEST-PeerSyncTest.test-seed#[FBA19694FDE8D223]) [    ] o.e.j.u.s.S.config No Client EndPointIdentificationAlgorithm configured for SslContextFactory@3a9e9fcd[provider=null,keyStore=null,trustStore=null]
   [junit4]   2> 1766465 INFO  (TEST-PeerSyncTest.test-seed#[FBA19694FDE8D223]) [    ] o.a.s.c.TransientSolrCoreCacheDefault Allocating transient cache for 4 transient cores
   [junit4]   2> 1766465 INFO  (TEST-PeerSyncTest.test-seed#[FBA19694FDE8D223]) [    ] o.a.s.h.a.MetricsHistoryHandler No .system collection, keeping metrics history in memory.
   [junit4]   2> 1766480 INFO  (TEST-PeerSyncTest.test-seed#[FBA19694FDE8D223]) [    ] o.a.s.m.r.SolrJmxReporter JMX monitoring for 'solr.node' (registry 'solr.node') enabled at server: com.sun.jmx.mbeanserver.JmxMBeanServer@75749aeb
   [junit4]   2> 1766490 INFO  (TEST-PeerSyncTest.test-seed#[FBA19694FDE8D223]) [    ] o.a.s.m.r.SolrJmxReporter JMX monitoring for 'solr.jvm' (registry 'solr.jvm') enabled at server: com.sun.jmx.mbeanserver.JmxMBeanServer@75749aeb
   [junit4]   2> 1766490 INFO  (TEST-PeerSyncTest.test-seed#[FBA19694FDE8D223]) [    ] o.a.s.m.r.SolrJmxReporter JMX monitoring for 'solr.jetty' (registry 'solr.jetty') enabled at server: com.sun.jmx.mbeanserver.JmxMBeanServer@75749aeb
   [junit4]   2> 1766492 INFO  (TEST-PeerSyncTest.test-seed#[FBA19694FDE8D223]) [    ] o.a.s.c.CorePropertiesLocator Found 1 core definitions underneath /home/jenkins/jenkins-slave/workspace/Lucene-Solr-Tests-8.x/solr/build/solr-core/test/J1/temp/solr.update.PeerSyncTest_FBA19694FDE8D223-001/tempDir-001/shard2/cores
   [junit4]   2> 1766492 INFO  (TEST-PeerSyncTest.test-seed#[FBA19694FDE8D223]) [    ] o.a.s.c.CorePropertiesLocator Cores are: [collection1]
   [junit4]   2> 1766493 INFO  (coreLoadExecutor-3219-thread-1) [    x:collection1] o.a.s.c.SolrResourceLoader [null] Added 2 libs to classloader, from paths: [/home/jenkins/jenkins-slave/workspace/Lucene-Solr-Tests-8.x/solr/core/src/test-files/solr/collection1/lib, /home/jenkins/jenkins-slave/workspace/Lucene-Solr-Tests-8.x/solr/core/src/test-files/solr/collection1/lib/classes]
   [junit4]   2> 1766516 INFO  (coreLoadExecutor-3219-thread-1) [    x:collection1] o.a.s.c.SolrConfig Using Lucene MatchVersion: 8.2.0
   [junit4]   2> 1766531 INFO  (coreLoadExecutor-3219-thread-1) [    x:collection1] o.a.s.s.IndexSchema [collection1] Schema name=test
   [junit4]   2> 1766628 INFO  (coreLoadExecutor-3219-thread-1) [    x:collection1] o.a.s.s.IndexSchema Loaded schema test/1.0 with uniqueid field id
   [junit4]   2> 1766661 INFO  (coreLoadExecutor-3219-thread-1) [    x:collection1] o.a.s.c.CoreContainer Creating SolrCore 'collection1' using configuration from configset /home/jenkins/jenkins-slave/workspace/Lucene-Solr-Tests-8.x/solr/core/src/test-files/solr/collection1, trusted=true
   [junit4]   2> 1766661 INFO  (coreLoadExecutor-3219-thread-1) [    x:collection1] o.a.s.m.r.SolrJmxReporter JMX monitoring for 'solr.core.collection1' (registry 'solr.core.collection1') enabled at server: com.sun.jmx.mbeanserver.JmxMBeanServer@75749aeb
   [junit4]   2> 1766661 INFO  (coreLoadExecutor-3219-thread-1) [    x:collection1] o.a.s.c.SolrCore [[collection1] ] Opening new SolrCore at [/home/jenkins/jenkins-slave/workspace/Lucene-Solr-Tests-8.x/solr/core/src/test-files/solr/collection1], dataDir=[/home/jenkins/jenkins-slave/workspace/Lucene-Solr-Tests-8.x/solr/build/solr-core/test/J1/temp/solr.update.PeerSyncTest_FBA19694FDE8D223-001/tempDir-001/shard2/cores/collection1/data/]
   [junit4]   2> 1766663 INFO  (coreLoadExecutor-3219-thread-1) [    x:collection1] o.a.s.u.RandomMergePolicy RandomMergePolicy wrapping class org.apache.lucene.index.LogByteSizeMergePolicy: [LogByteSizeMergePolicy: minMergeSize=1677721, mergeFactor=21, maxMergeSize=2147483648, maxMergeSizeForForcedMerge=9223372036854775807, calibrateSizeByDeletes=false, maxMergeDocs=2147483647, maxCFSSegmentSizeMB=8.796093022207999E12, noCFSRatio=1.0]
   [junit4]   2> 1766665 WARN  (coreLoadExecutor-3219-thread-1) [    x:collection1] o.a.s.c.RequestHandlers INVALID paramSet a in requestHandler {type = requestHandler,name = /dump,class = DumpRequestHandler,attributes = {initParams=a, name=/dump, class=DumpRequestHandler},args = {defaults={a=A,b=B}}}
   [junit4]   2> 1766703 INFO  (coreLoadExecutor-3219-thread-1) [    x:collection1] o.a.s.u.UpdateHandler Using UpdateLog implementation: org.apache.solr.update.UpdateLog
   [junit4]   2> 1766703 INFO  (coreLoadExecutor-3219-thread-1) [    x:collection1] o.a.s.u.UpdateLog Initializing UpdateLog: dataDir= defaultSyncLevel=FLUSH numRecordsToKeep=100 maxNumLogsToKeep=10 numVersionBuckets=65536
   [junit4]   2> 1766704 INFO  (coreLoadExecutor-3219-thread-1) [    x:collection1] o.a.s.u.CommitTracker Hard AutoCommit: disabled
   [junit4]   2> 1766704 INFO  (coreLoadExecutor-3219-thread-1) [    x:collection1] o.a.s.u.CommitTracker Soft AutoCommit: disabled
   [junit4]   2> 1766705 INFO  (coreLoadExecutor-3219-thread-1) [    x:collection1] o.a.s.u.RandomMergePolicy RandomMergePolicy wrapping class org.apache.lucene.index.LogDocMergePolicy: [LogDocMergePolicy: minMergeSize=1000, mergeFactor=22, maxMergeSize=9223372036854775807, maxMergeSizeForForcedMerge=9223372036854775807, calibrateSizeByDeletes=true, maxMergeDocs=2147483647, maxCFSSegmentSizeMB=8.796093022207999E12, noCFSRatio=0.7439940275079165]
   [junit4]   2> 1766705 INFO  (coreLoadExecutor-3219-thread-1) [    x:collection1] o.a.s.s.SolrIndexSearcher Opening [Searcher@5d600e9f[collection1] main]
   [junit4]   2> 1766705 WARN  (coreLoadExecutor-3219-thread-1) [    x:collection1] o.a.s.r.ManagedResourceStorage Cannot write to config directory /home/jenkins/jenkins-slave/workspace/Lucene-Solr-Tests-8.x/solr/core/src/test-files/solr/collection1/conf; switching to use InMemory storage instead.
   [junit4]   2> 1766706 INFO  (coreLoadExecutor-3219-thread-1) [    x:collection1] o.a.s.h.ReplicationHandler Commits will be reserved for 10000ms.
   [junit4]   2> 1766706 INFO  (coreLoadExecutor-3219-thread-1) [    x:collection1] o.a.s.u.UpdateLog Could not find max version in index or recent updates, using new clock 1632408573581459456
   [junit4]   2> 1766709 INFO  (searcherExecutor-3220-thread-1-processing-x:collection1) [    x:collection1] o.a.s.c.SolrCore [collection1] Registered new searcher Searcher@5d600e9f[collection1] main{ExitableDirectoryReader(UninvertingDirectoryReader())}
   [junit4]   2> 1767209 INFO  (TEST-PeerSyncTest.test-seed#[FBA19694FDE8D223]) [    ] o.a.s.SolrTestCaseJ4 ###Starting test
   [junit4]   2> 1767213 INFO  (qtp1906885318-11284) [    x:collection1] o.a.s.u.p.LogUpdateProcessorFactory [collection1]  webapp=/_x/m path=/update params={update.distrib=FROMLEADER&wt=javabin&version=2}{add=[1 (1)]} 0 2
   [junit4]   2> 1767219 INFO  (qtp1721665394-11305) [    x:collection1] o.a.s.u.PeerSync PeerSync: core=collection1 url= START replicas=[http://127.0.0.1:34991/_x/m/collection1] nUpdates=100
   [junit4]   2> 1767225 INFO  (qtp1906885318-11286) [    x:collection1] o.a.s.s.SolrIndexSearcher Opening [Searcher@4c9eaf59[collection1] realtime]
   [junit4]   2> 1767225 INFO  (qtp1906885318-11286) [    x:collection1] o.a.s.u.IndexFingerprint IndexFingerprint millis:4.0 result:{maxVersionSpecified=9223372036854775807, maxVersionEncountered=1, maxInHash=1, versionsHash=-5451962507482445012, numVersions=1, numDocs=1, maxDoc=1}
   [junit4]   2> 1767225 INFO  (qtp1906885318-11286) [    x:collection1] o.a.s.c.S.Request [collection1]  webapp=/_x/m path=/get params={distrib=false&qt=/get&getFingerprint=9223372036854775807&wt=javabin&version=2} status=0 QTime=4
   [junit4]   2> 1767227 INFO  (qtp1721665394-11305) [    x:collection1] o.a.s.u.IndexFingerprint IndexFingerprint millis:1.0 result:{maxVersionSpecified=9223372036854775807, maxVersionEncountered=0, maxInHash=0, versionsHash=0, numVersions=0, numDocs=0, maxDoc=0}
   [junit4]   2> 1767227 INFO  (qtp1721665394-11305) [    x:collection1] o.a.s.u.PeerSync PeerSync: core=collection1 url= DONE.  We have no versions.  sync failed.
   [junit4]   2> 1767228 INFO  (qtp1906885318-11287) [    x:collection1] o.a.s.u.IndexFingerprint IndexFingerprint millis:0.0 result:{maxVersionSpecified=9223372036854775807, maxVersionEncountered=1, maxInHash=1, versionsHash=-5451962507482445012, numVersions=1, numDocs=1, maxDoc=1}
   [junit4]   2> 1767228 INFO  (qtp1906885318-11287) [    x:collection1] o.a.s.c.S.Request [collection1]  webapp=/_x/m path=/get params={distrib=false&qt=/get&fingerprint=true&getVersions=100&wt=javabin&version=2} status=0 QTime=0
   [junit4]   2> 1767228 INFO  (qtp1721665394-11305) [    x:collection1] o.a.s.c.S.Request [collection1]  webapp=/_x/m path=/get params={qt=/get&getVersions=100&sync=http://127.0.0.1:34991/_x/m/collection1&wt=javabin&version=2} status=0 QTime=9
   [junit4]   2> 1767229 INFO  (qtp1721665394-11306) [    x:collection1] o.a.s.u.p.LogUpdateProcessorFactory [collection1]  webapp=/_x/m path=/update params={update.distrib=FROMLEADER&wt=javabin&version=2}{add=[1 (1)]} 0 0
   [junit4]   2> 1767230 INFO  (qtp1721665394-11307) [    x:collection1] o.a.s.u.PeerSync PeerSync: core=collection1 url= START replicas=[http://127.0.0.1:34991/_x/m/collection1] nUpdates=100
   [junit4]   2> 1767231 INFO  (qtp1906885318-11283) [    x:collection1] o.a.s.u.IndexFingerprint IndexFingerprint millis:0.0 result:{maxVersionSpecified=9223372036854775807, maxVersionEncountered=1, maxInHash=1, versionsHash=-5451962507482445012, numVersions=1, numDocs=1, maxDoc=1}
   [junit4]   2> 1767231 INFO  (qtp1906885318-11283) [    x:collection1] o.a.s.c.S.Request [collection1]  webapp=/_x/m path=/get params={distrib=false&qt=/get&getFingerprint=9223372036854775807&wt=javabin&version=2} status=0 QTime=0
   [junit4]   2> 1767234 INFO  (qtp1721665394-11307) [    x:collection1] o.a.s.s.SolrIndexSearcher Opening [Searcher@1b6ad9ff[collection1] realtime]
   [junit4]   2> 1767234 INFO  (qtp1721665394-11307) [    x:collection1] o.a.s.u.IndexFingerprint IndexFingerprint millis:2.0 result:{maxVersionSpecified=9223372036854775807, maxVersionEncountered=1, maxInHash=1, versionsHash=-5451962507482445012, numVersions=1, numDocs=1, maxDoc=1}
   [junit4]   2> 1767234 INFO  (qtp1721665394-11307) [    x:collection1] o.a.s.u.PeerSync We are already in sync. No need to do a PeerSync 
   [junit4]   2> 1767234 INFO  (qtp1721665394-11307) [    x:collection1] o.a.s.c.S.Request [collection1]  webapp=/_x/m path=/get params={qt=/get&getVersions=100&sync=http://127.0.0.1:34991/_x/m/collection1&wt=javabin&version=2} status=0 QTime=4
   [junit4]   2> 1767235 INFO  (qtp1906885318-11284) [    x:collection1] o.a.s.u.DirectUpdateHandler2 start commit{_version_=1632408574135107584,optimize=false,openSearcher=true,waitSearcher=true,expungeDeletes=false,softCommit=false,prepareCommit=false}
   [junit4]   2> 1767235 INFO  (qtp1906885318-11284) [    x:collection1] o.a.s.u.SolrIndexWriter Calling setCommitData with IW:org.apache.solr.update.SolrIndexWriter@ec64d23 commitCommandVersion:1632408574135107584
   [junit4]   2> 1767236 INFO  (qtp1906885318-11284) [    x:collection1] o.a.s.s.SolrIndexSearcher Opening [Searcher@c52fee2[collection1] main]
   [junit4]   2> 1767236 INFO  (qtp1906885318-11284) [    x:collection1] o.a.s.u.DirectUpdateHandler2 end_commit_flush
   [junit4]   2> 1767238 INFO  (searcherExecutor-3192-thread-1-processing-x:collection1) [    x:collection1] o.a.s.c.SolrCore [collection1] Registered new searcher Searcher@c52fee2[collection1] main{ExitableDirectoryReader(UninvertingDirectoryReader(Uninverting(_0(8.2.0):c1:[diagnostics={os=Linux, java.vendor=Oracle Corporation, java.version=1.8.0_191, java.vm.version=25.191-b12, lucene.version=8.2.0, os.arch=amd64, java.runtime.version=1.8.0_191-b12, source=flush, os.version=4.4.0-112-generic, timestamp=1556786131023}]:[attributes={Lucene50StoredFieldsFormat.mode=BEST_SPEED}])))}
   [junit4]   2> 1767238 INFO  (qtp1906885318-11284) [    x:collection1] o.a.s.u.p.LogUpdateProcessorFactory [collection1]  webapp=/_x/m path=/update params={waitSearcher=true&commit=true&softCommit=false&wt=javabin&version=2}{commit=} 0 3
   [junit4]   2> 1767238 INFO  (qtp1721665394-11308) [    x:collection1] o.a.s.u.DirectUpdateHandler2 start commit{_version_=1632408574139301888,optimize=false,openSearcher=true,waitSearcher=true,expungeDeletes=false,softCommit=false,prepareCommit=false}
   [junit4]   2> 1767239 INFO  (qtp1721665394-11308) [    x:collection1] o.a.s.u.SolrIndexWriter Calling setCommitData with IW:org.apache.solr.update.SolrIndexWriter@103cfaa5 commitCommandVersion:1632408574139301888
   [junit4]   2> 1767239 INFO  (qtp1721665394-11308) [    x:collection1] o.a.s.s.SolrIndexSearcher Opening [Searcher@238c3175[collection1] main]
   [junit4]   2> 1767240 INFO  (qtp1721665394-11308) [    x:collection1] o.a.s.u.DirectUpdateHandler2 end_commit_flush
   [junit4]   2> 1767241 INFO  (searcherExecutor-3206-thread-1-processing-x:collection1) [    x:collection1] o.a.s.c.SolrCore [collection1] Registered new searcher Searcher@238c3175[collection1] main{ExitableDirectoryReader(UninvertingDirectoryReader(Uninverting(_0(8.2.0):c1:[diagnostics={os=Linux, java.vendor=Oracle Corporation, java.version=1.8.0_191, java.vm.version=25.191-b12, lucene.version=8.2.0, os.arch=amd64, java.runtime.version=1.8.0_191-b12, source=flush, os.version=4.4.0-112-generic, timestamp=1556786131032}]:[attributes={Lucene50StoredFieldsFormat.mode=BEST_SPEED}])))}
   [junit4]   2> 1767241 INFO  (qtp1721665394-11308) [    x:collection1] o.a.s.u.p.LogUpdateProcessorFactory [collection1]  webapp=/_x/m path=/update params={waitSearcher=true&commit=true&softCommit=false&wt=javabin&version=2}{commit=} 0 2
   [junit4]   2> 1767242 INFO  (qtp1906885318-11285) [    x:collection1] o.a.s.c.S.Request [collection1]  webapp=/_x/m path=/select params={q=*:*&wt=javabin&version=2} hits=1 status=0 QTime=0
   [junit4]   2> 1767243 INFO  (qtp1721665394-11304) [    x:collection1] o.a.s.c.S.Request [collection1]  webapp=/_x/m path=/select params={q=*:*&wt=javabin&version=2} hits=1 status=0 QTime=0
   [junit4]   2> 1767246 INFO  (qtp1906885318-11286) [    x:collection1] o.a.s.u.p.LogUpdateProcessorFactory [collection1]  webapp=/_x/m path=/update params={update.distrib=FROMLEADER&wt=javabin&version=2}{add=[2 (2)]} 0 2
   [junit4]   2> 1767246 INFO  (qtp1721665394-11305) [    x:collection1] o.a.s.u.PeerSync PeerSync: core=collection1 url= START replicas=[http://127.0.0.1:34991/_x/m/collection1] nUpdates=100
   [junit4]   2> 1767250 INFO  (qtp1906885318-11287) [    x:collection1] o.a.s.s.SolrIndexSearcher Opening [Searcher@586f58e[collection1] realtime]
   [junit4]   2> 1767250 INFO  (qtp1906885318-11287) [    x:collection1] o.a.s.u.IndexFingerprint IndexFingerprint millis:3.0 result:{maxVersionSpecified=9223372036854775807, maxVersionEncountered=2, maxInHash=2, versionsHash=-1218814014108643565, numVersions=2, numDocs=2, maxDoc=1}
   [junit4]   2> 1767250 INFO  (qtp1906885318-11287) [    x:collection1] o.a.s.c.S.Request [collection1]  webapp=/_x/m path=/get params={distrib=false&qt=/get&getFingerprint=9223372036854775807&wt=javabin&version=2} status=0 QTime=3
   [junit4]   2> 1767250 INFO  (qtp1721665394-11305) [    x:collection1] o.a.s.u.IndexFingerprint IndexFingerprint millis:0.0 result:{maxVersionSpecified=9223372036854775807, maxVersionEncountered=1, maxInHash=1, versionsHash=-5451962507482445012, numVersions=1, numDocs=1, maxDoc=1}
   [junit4]   2> 1767251 INFO  (qtp1906885318-11283) [    x:collection1] o.a.s.u.IndexFingerprint IndexFingerprint millis:0.0 result:{maxVersionSpecified=9223372036854775807, maxVersionEncountered=2, maxInHash=2, versionsHash=-1218814014108643565, numVersions=2, numDocs=2, maxDoc=1}
   [junit4]   2> 1767251 INFO  (qtp1906885318-11283) [    x:collection1] o.a.s.c.S.Request [collection1]  webapp=/_x/m path=/get params={distrib=false&qt=/get&fingerprint=true&getVersions=100&wt=javabin&version=2} status=0 QTime=0
   [junit4]   2> 1767251 INFO  (qtp1721665394-11305) [    x:collection1] o.a.s.u.PeerSync PeerSync: core=collection1 url=  Received 2 versions from http://127.0.0.1:34991/_x/m/collection1 fingerprint:{maxVersionSpecified=9223372036854775807, maxVersionEncountered=2, maxInHash=2, versionsHash=-1218814014108643565, numVersions=2, numDocs=2, maxDoc=1}
   [junit4]   2> 1767252 INFO  (qtp1721665394-11305) [    x:collection1] o.a.s.u.PeerSync PeerSync: core=collection1 url= Requesting updates from http://127.0.0.1:34991/_x/m/collection1n=1 versions=2
   [junit4]   2> 1767253 INFO  (qtp1906885318-11284) [    x:collection1] o.a.s.u.IndexFingerprint IndexFingerprint millis:0.0 result:{maxVersionSpecified=2, maxVersionEncountered=2, maxInHash=2, versionsHash=-1218814014108643565, numVersions=2, numDocs=2, maxDoc=1}
   [junit4]   2> 1767253 INFO  (qtp1906885318-11284) [    x:collection1] o.a.s.c.S.Request [collection1]  webapp=/_x/m path=/get params={getUpdates=2&distrib=false&qt=/get&fingerprint=true&onlyIfActive=false&wt=javabin&version=2} status=0 QTime=0
   [junit4]   2> 1767254 INFO  (qtp1721665394-11305) [    x:collection1] o.a.s.u.p.LogUpdateProcessorFactory [collection1] {add=[2 (2)]} 0 1
   [junit4]   2> 1767258 INFO  (qtp1721665394-11305) [    x:collection1] o.a.s.s.SolrIndexSearcher Opening [Searcher@2a3d5b3c[collection1] realtime]
   [junit4]   2> 1767258 INFO  (qtp1721665394-11305) [    x:collection1] o.a.s.u.IndexFingerprint IndexFingerprint millis:3.0 result:{maxVersionSpecified=2, maxVersionEncountered=2, maxInHash=2, versionsHash=-1218814014108643565, numVersions=2, numDocs=2, maxDoc=1}
   [junit4]   2> 1767258 INFO  (qtp1721665394-11305) [    x:collection1] o.a.s.u.PeerSync Fingerprint comparison: 0
   [junit4]   2> 1767258 INFO  (qtp1721665394-11305) [    x:collection1] o.a.s.u.PeerSync PeerSync: core=collection1 url= DONE. sync succeeded
   [junit4]   2> 1767258 INFO  (qtp1721665394-11305) [    x:collection1] o.a.s.c.S.Request [collection1]  webapp=/_x/m path=/get params={qt=/get&getVersions=100&sync=http://127.0.0.1:34991/_x/m/collection1&wt=javabin&version=2} status=0 QTime=11
   [junit4]   2> 1767259 INFO  (qtp1906885318-11285) [    x:collection1] o.a.s.u.DirectUpdateHandler2 start commit{_version_=1632408574161321984,optimize=false,openSearcher=true,waitSearcher=true,expungeDeletes=false,softCommit=false,prepareCommit=false}
   [junit4]   2> 1767259 INFO  (qtp1906885318-11285) [    x:collection1] o.a.s.u.SolrIndexWriter Calling setCommitData with IW:org.apache.solr.update.SolrIndexWriter@ec64d23 commitCommandVersion:1632408574161321984
   [junit4]   2> 1767260 INFO  (qtp1906885318-11285) [    x:collection1] o.a.s.s.SolrIndexSearcher Opening [Searcher@5b722de5[collection1] main]
   [junit4]   2> 1767260 INFO  (qtp1906885318-11285) [    x:collection1] o.a.s.u.DirectUpdateHandler2 end_commit_flush
   [junit4]   2> 1767261 INFO  (searcherExecutor-3192-thread-1-processing-x:collection1) [    x:collection1] o.a.s.c.SolrCore [collection1] Registered new searcher Searcher@5b722de5[collection1] main{ExitableDirectoryReader(UninvertingDirectoryReader(Uninverting(_0(8.2.0):c1:[diagnostics={os=Linux, java.vendor=Oracle Corporation, java.version=1.8.0_191, java.vm.version=25.191-b12, lucene.version=8.2.0, os.arch=amd64, java.runtime.version=1.8.0_191-b12, source=flush, os.version=4.4.0-112-generic, timestamp=1556786131023}]:[attributes={Lucene50StoredFieldsFormat.mode=BEST_SPEED}]) Uninverting(_1(8.2.0):c1:[diagnostics={os=Linux, java.vendor=Oracle Corporation, java.version=1.8.0_191, java.vm.version=25.191-b12, lucene.version=8.2.0, os.arch=amd64, java.runtime.version=1.8.0_191-b12, source=flush, os.version=4.4.0-112-generic, timestamp=1556786131048}]:[attributes={Lucene50StoredFieldsFormat.mode=BEST_SPEED}])))}
   [junit4]   2> 1767261 INFO  (qtp1906885318-11285) [    x:collection1] o.a.s.u.p.LogUpdateProcessorFactory [collection1]  webapp=/_x/m path=/update params={waitSearcher=true&commit=true&softCommit=false&wt=javabin&version=2}{commit=} 0 2
   [junit4]   2> 1767262 INFO  (qtp1721665394-11306) [    x:collection1] o.a.s.u.DirectUpdateHandler2 start commit{_version_=1632408574164467712,optimize=false,openSearcher=true,waitSearcher=true,expungeDeletes=false,softCommit=false,prepareCommit=false}
   [junit4]   2> 1767263 INFO  (qtp1721665394-11306) [    x:collection1] o.a.s.u.SolrIndexWriter Calling setCommitData with IW:org.apache.solr.update.SolrIndexWriter@103cfaa5 commitCommandVersion:1632408574164467712
   [junit4]   2> 1767263 INFO  (qtp1721665394-11306) [    x:collection1] o.a.s.s.SolrIndexSearcher Opening [Searcher@4619f6c5[collection1] main]
   [junit4]   2> 1767263 INFO  (qtp1721665394-11306) [    x:collection1] o.a.s.u.DirectUpdateHandler2 end_commit_flush
   [junit4]   2> 1767264 INFO  (searcherExecutor-3206-thread-1-processing-x:collection1) [    x:collection1] o.a.s.c.SolrCore [collection1] Registered new searcher Searcher@4619f6c5[collection1] main{ExitableDirectoryReader(UninvertingDirectoryReader(Uninverting(_0(8.2.0):c1:[diagnostics={os=Linux, java.vendor=Oracle Corporation, java.version=1.8.0_191, java.vm.version=25.191-b12, lucene.version=8.2.0, os.arch=amd64, java.runtime.version=1.8.0_191-b12, source=flush, os.version=4.4.0-112-generic, timestamp=1556786131032}]:[attributes={Lucene50StoredFieldsFormat.mode=BEST_SPEED}]) Uninverting(_1(8.2.0):c1:[diagnostics={os=Linux, java.vendor=Oracle Corporation, java.version=1.8.0_191, java.vm.version=25.191-b12, lucene.version=8.2.0, os.arch=amd64, java.runtime.version=1.8.0_191-b12, source=flush, os.version=4.4.0-112-generic, timestamp=1556786131056}]:[attributes={Lucene50StoredFieldsFormat.mode=BEST_SPEED}])))}
   [junit4]   2> 1767264 INFO  (qtp1721665394-11306) [    x:collection1] o.a.s.u.p.LogUpdateProcessorFactory [collection1]  webapp=/_x/m path=/update params={waitSearcher=true&commit=true&softCommit=false&wt=javabin&version=2}{commit=} 0 2
   [junit4]   2> 1767265 INFO  (qtp1906885318-11286) [    x:collection1] o.a.s.c.S.Request [collection1]  webapp=/_x/m path=/select params={q=*:*&wt=javabin&version=2} hits=2 status=0 QTime=0
   [junit4]   2> 1767266 INFO  (qtp1721665394-11307) [    x:collection1] o.a.s.c.S.Request [collection1]  webapp=/_x/m path=/select params={q=*:*&wt=javabin&version=2} hits=2 status=0 QTime=0
   [junit4]   2> 1767268 INFO  (qtp1906885318-11287) [    x:collection1] o.a.s.u.p.LogUpdateProcessorFactory [collection1]  webapp=/_x/m path=/update params={update.distrib=FROMLEADER&wt=javabin&version=2}{add=[3 (3)]} 0 1
   [junit4]   2> 1767269 INFO  (qtp1906885318-11283) [    x:collection1] o.a.s.u.p.LogUpdateProcessorFactory [collection1]  webapp=/_x/m path=/update params={update.distrib=FROMLEADER&wt=javabin&version=2}{add=[4 (4)]} 0 0
   [junit4]   2> 1767270 INFO  (qtp1906885318-11284) [    x:collection1] o.a.s.u.p.LogUpdateProcessorFactory [collection1]  webapp=/_x/m path=/update params={update.distrib=FROMLEADER&wt=javabin&vers

[...truncated too long message...]

ontextHandler@62164be6{/solr,null,UNAVAILABLE}
   [junit4]   2> 4677740 INFO  (jetty-closer-17398-thread-1) [    ] o.e.j.s.session node0 Stopped scavenging
   [junit4]   2> 4677817 INFO  (TEST-AuditLoggerIntegrationTest.auth-seed#[FBA19694FDE8D223]) [    ] o.a.s.c.ZkTestServer Shutting down ZkTestServer.
   [junit4]   2> 4677818 WARN  (ZkTestServer Run Thread) [    ] o.a.s.c.ZkTestServer Watch limit violations: 
   [junit4]   2> Maximum concurrent create/delete watches above limit:
   [junit4]   2> 
   [junit4]   2> 	3	/solr/aliases.json
   [junit4]   2> 	3	/solr/clusterprops.json
   [junit4]   2> 
   [junit4]   2> Maximum concurrent data watches above limit:
   [junit4]   2> 
   [junit4]   2> 	3	/solr/clusterstate.json
   [junit4]   2> 
   [junit4]   2> Maximum concurrent children watches above limit:
   [junit4]   2> 
   [junit4]   2> 	3	/solr/live_nodes
   [junit4]   2> 	3	/solr/collections
   [junit4]   2> 
   [junit4]   2> 4677993 INFO  (TEST-AuditLoggerIntegrationTest.auth-seed#[FBA19694FDE8D223]) [    ] o.a.s.c.ZkTestServer parse host and port list: 127.0.0.1:43849
   [junit4]   2> 4677993 INFO  (TEST-AuditLoggerIntegrationTest.auth-seed#[FBA19694FDE8D223]) [    ] o.a.s.c.ZkTestServer connecting to 127.0.0.1 43849
   [junit4]   2> 4677993 INFO  (TEST-AuditLoggerIntegrationTest.auth-seed#[FBA19694FDE8D223]) [    ] o.a.s.SolrTestCaseJ4 ###Ending auth
   [junit4]   2> NOTE: leaving temporary files on disk at: /home/jenkins/jenkins-slave/workspace/Lucene-Solr-Tests-8.x/solr/build/solr-core/test/J2/temp/solr.security.AuditLoggerIntegrationTest_FBA19694FDE8D223-001
   [junit4]   2> May 02, 2019 9:24:01 AM com.carrotsearch.randomizedtesting.ThreadLeakControl checkThreadLeaks
   [junit4]   2> WARNING: Will linger awaiting termination of 1 leaked thread(s).
   [junit4]   2> NOTE: test params are: codec=Asserting(Lucene80), sim=Asserting(org.apache.lucene.search.similarities.AssertingSimilarity@69b55232), locale=en-MT, timezone=Asia/Tehran
   [junit4]   2> NOTE: Linux 4.4.0-112-generic amd64/Oracle Corporation 1.8.0_191 (64-bit)/cpus=4,threads=1,free=171671280,total=524812288
   [junit4]   2> NOTE: All tests run in this JVM: [TestPointFields, OutputWriterTest, RAMDirectoryFactoryTest, SolrMetricsIntegrationTest, TestReqParamsAPI, TestCloudConsistency, TestLRUCache, PhrasesIdentificationComponentTest, CustomCollectionTest, SignatureUpdateProcessorFactoryTest, TestTolerantUpdateProcessorRandomCloud, NotRequiredUniqueKeyTest, HdfsAutoAddReplicasIntegrationTest, TestConfigSetsAPIZkFailure, OverseerTest, TestSolrCloudWithSecureImpersonation, SolrCloudExampleTest, TestDirectoryFactory, FileUtilsTest, SynonymTokenizerTest, OverseerRolesTest, TestSimpleQParserPlugin, TestSubQueryTransformer, JWTAuthPluginIntegrationTest, CollectionsAPISolrJTest, CheckHdfsIndexTest, SolrJmxReporterTest, TestSimNodeAddedTrigger, TestRTimerTree, DistributedFacetExistsSmallTest, UUIDFieldTest, SyncSliceTest, CollectionsAPIAsyncDistributedZkTest, TestSkipOverseerOperations, TestHdfsUpdateLog, TestMacroExpander, TestCollapseQParserPlugin, BlockJoinFacetDistribTest, TestIndexSearcher, ImplicitSnitchTest, SortSpecParsingTest, SolrShardReporterTest, URLClassifyProcessorTest, BadComponentTest, TestJavabinTupleStreamParser, RestartWhileUpdatingTest, PKIAuthenticationIntegrationTest, TestJoin, MetricsHistoryIntegrationTest, SchemaVersionSpecificBehaviorTest, DistribCursorPagingTest, TestZkChroot, CoreAdminOperationTest, TestFunctionQuery, TestConfigReload, FieldMutatingUpdateProcessorTest, TestSuggestSpellingConverter, TestCloudRecovery, LeaderTragicEventTest, TestHighFrequencyDictionaryFactory, TestRecovery, HttpPartitionWithTlogReplicasTest, DaemonStreamApiTest, TestConfigSetProperties, TestSolrIndexConfig, TestSystemIdResolver, HttpSolrCallGetCoreTest, TestPerFieldSimilarityWithDefaultOverride, ActionThrottleTest, HighlighterTest, TestSimpleTrackingShardHandler, PeerSyncWithBufferUpdatesTest, DateRangeFieldTest, CdcrRequestHandlerTest, TestUninvertingReader, DebugComponentTest, CdcrBootstrapTest, TestClusterStateMutator, ResponseLogComponentTest, TestLeaderElectionZkExpiry, SolrIndexSplitterTest, SolrTestCaseJ4Test, HdfsLockFactoryTest, TestSimExtremeIndexing, SmileWriterTest, EmbeddedSolrNoSerializeTest, TestNestedUpdateProcessor, TestManagedSynonymFilterFactory, CopyFieldTest, TestInPlaceUpdatesRequiredField, TestCharFilters, IndexSchemaRuntimeFieldTest, TestDocumentBuilder, TestFieldTypeCollectionResource, DistributedQueueTest, HdfsUnloadDistributedZkTest, TestExpandComponent, TestOnReconnectListenerSupport, TestFoldingMultitermQuery, CloudMLTQParserTest, TestSimDistribStateManager, PrimitiveFieldTypeTest, TestExactStatsCache, TestNumericRangeQuery32, MergeStrategyTest, TestPartialUpdateDeduplication, BinaryUpdateRequestHandlerTest, TestSegmentSorting, SearchHandlerTest, FastVectorHighlighterTest, DistributedMLTComponentTest, SolrCmdDistributorTest, TestCloudManagedSchema, TestNoOpRegenerator, MetricUtilsTest, SimpleCollectionCreateDeleteTest, FileBasedSpellCheckerTest, SegmentsInfoRequestHandlerTest, TestCollationFieldDocValues, SOLR749Test, TestDistributedGrouping, UpdateRequestProcessorFactoryTest, ReplaceNodeNoTargetTest, SearchRateTriggerTest, BadIndexSchemaTest, TestTrie, TestSurroundQueryParser, TestManagedSchemaAPI, TestCoreDiscovery, TestCloudJSONFacetSKG, TestSystemCollAutoCreate, NestedShardedAtomicUpdateTest, ScheduledTriggerIntegrationTest, PeerSyncWithLeaderTest, ConvertedLegacyTest, HLLSerializationTest, TestMinHashQParser, TestSerializedLuceneMatchVersion, TestSortByMinMaxFunction, AtomicUpdatesTest, CleanupOldIndexTest, ClusterStateTest, ClusterStateUpdateTest, ConcurrentCreateRoutedAliasTest, ConfigSetsAPITest, ConnectionManagerTest, CreateCollectionCleanupTest, CreateRoutedAliasTest, DeleteLastCustomShardedReplicaTest, DeleteReplicaTest, LeaderElectionTest, MetricsHistoryWithAuthIntegrationTest, MigrateRouteKeyTest, NodeMutatorTest, OutOfBoxZkACLAndCredentialsProvidersTest, OverriddenZkACLAndCredentialsProvidersTest, PeerSyncReplicationTest, SSLMigrationTest, SaslZkACLProviderTest, ShardRoutingCustomTest, SharedFSAutoReplicaFailoverTest, TestCloudDeleteByQuery, TestCloudInspectUtil, TestCloudPhrasesIdentificationComponent, TestCloudRecovery2, TestClusterProperties, TestCryptoKeys, TestDeleteCollectionOnDownNodes, TestDistribDocBasedVersion, TestDownShardTolerantSearch, TestPrepRecovery, TestRandomRequestDistribution, TestStressCloudBlindAtomicUpdates, ZkCLITest, AssignTest, AsyncCallRequestStatusResponseTest, TestCollectionsAPIViaSolrCloudCluster, AutoAddReplicasIntegrationTest, NodeLostTriggerTest, TriggerCooldownIntegrationTest, TriggerSetPropertiesIntegrationTest, CdcrVersionReplicationTest, HdfsBasicDistributedZk2Test, HdfsBasicDistributedZkTest, HdfsChaosMonkeyNothingIsSafeTest, HdfsChaosMonkeySafeLeaderTest, HdfsNNFailoverTest, HdfsRecoverLeaseTest, HdfsRecoveryZkTest, HdfsRestartWhileUpdatingTest, RuleEngineTest, AlternateDirectoryTest, ByteBuffersDirectoryFactoryTest, CachingDirectoryFactoryTest, SolrCoreCheckLockOnStartupTest, SolrCoreTest, TestImplicitCoreProperties, TestInfoStreamLogging, TestInitParams, TestJmxIntegration, TestMergePolicyConfig, TestNRTOpen, TestQuerySenderListener, TestQuerySenderNoQuery, TestReloadAndDeleteDocs, TestShardHandlerFactory, TestSimpleTextCodec, TestSolrConfigHandler, TestReplicationHandler, SystemInfoHandlerTest, TestApiFramework, TestCollectionAPIs, TestConfigsApi, DistributedFacetPivotLargeTest, DistributedQueryElevationComponentTest, DistributedSuggestComponentTest, ShardsWhitelistTest, StatsComponentTest, TestHttpShardHandlerFactory, TestPivotHelperCode, RandomizedTaggerTest, Tagger2Test, TaggerTest, TestUnifiedSolrHighlighter, TestLegacyField, TestLegacyNumericUtils, TestNumericTokenStream, TestLogWatcher, JvmMetricsTest, SolrRrdBackendFactoryTest, RegexBytesRefFilterTest, SimpleFacetsTest, TestRemoteStreaming, TestBinaryResponseWriter, TestCSVResponseWriter, TestPHPSerializedResponseWriter, TestRawTransformer, TestSolrQueryResponse, TestSubQueryTransformerCrossCore, TestManagedResource, TestManagedResourceStorage, TestRestManager, TestBulkSchemaAPI, DocValuesMultiTest, NumericFieldsTest, OpenExchangeRatesOrgProviderTest, PolyFieldTest, TestSchemaManager, TestSchemalessBufferedUpdates, TestSortableTextField, AnalyticsMergeStrategyTest, AnalyticsQueryTest, CurrencyRangeFacetCloudTest, QueryEqualityTest, RankQueryTest, TestComplexPhraseQParserPlugin, TestCustomSort, TestExtendedDismaxParser, TestPayloadScoreQParserPlugin, TestQueryTypes, TestRTGBase, TestRandomCollapseQParserPlugin, TestReload, TestReloadDeadlock, TestSmileRequest, TestSolr4Spatial, TestSolr4Spatial2, TestSolrCoreParser, TestSolrFieldCacheBean, TestSolrJ, TestSolrQueryParser, TestSort, TestStandardQParsers, TestStressLucene, TestStressRecovery, TestStressReorder, TestValueSourceCache, DistributedFacetSimpleRefinementLongTailTest, TestJsonFacetsStatsParsing, BlockJoinFacetRandomTest, BlockJoinFacetSimpleTest, GraphQueryTest, TestCloudNestedDocsSort, SimpleMLTQParserTest, TestBM25SimilarityFactory, TestClassicSimilarityFactory, TestDFISimilarityFactory, TestDFRSimilarityFactory, TestIBSimilarityFactory, TestLMDirichletSimilarityFactory, TestLMJelinekMercerSimilarityFactory, TestLegacyBM25SimilarityFactory, TestSweetSpotSimilarityFactory, TestDefaultStatsCache, AuditLoggerIntegrationTest]
   [junit4] Completed [780/855 (3!)] on J2 in 67.54s, 7 tests, 1 failure <<< FAILURES!

[...truncated 9239 lines...]
BUILD FAILED
/home/jenkins/jenkins-slave/workspace/Lucene-Solr-Tests-8.x/build.xml:634: The following error occurred while executing this line:
/home/jenkins/jenkins-slave/workspace/Lucene-Solr-Tests-8.x/build.xml:128: Found 1 violations in source files (File uses Mockito but has no assumeWorkingMockito() call).

Total time: 200 minutes 49 seconds
Build step 'Invoke Ant' marked build as failure
Archiving artifacts
Recording test results
Email was triggered for: Failure - Any
Sending email for trigger: Failure - Any

Mime
View raw message