lucene-dev mailing list archives

Site index · List index
Message view « Date » · « Thread »
Top « Date » · « Thread »
From Policeman Jenkins Server <jenk...@thetaphi.de>
Subject [JENKINS] Lucene-Solr-8.x-Windows (32bit/jdk1.8.0_201) - Build # 235 - Still Failing!
Date Wed, 01 May 2019 10:43:17 GMT
Build: https://jenkins.thetaphi.de/job/Lucene-Solr-8.x-Windows/235/
Java: 32bit/jdk1.8.0_201 -client -XX:+UseG1GC

3 tests failed.
FAILED:  org.apache.solr.cloud.DistributedQueueTest.testPeekElements

Error Message:


Stack Trace:
java.lang.AssertionError
	at __randomizedtesting.SeedInfo.seed([A4E4F05D7D7D4780:59CA4A7CAD44139D]:0)
	at org.junit.Assert.fail(Assert.java:86)
	at org.junit.Assert.assertTrue(Assert.java:41)
	at org.junit.Assert.assertTrue(Assert.java:52)
	at org.apache.solr.cloud.DistributedQueueTest.testPeekElements(DistributedQueueTest.java:277)
	at sun.reflect.NativeMethodAccessorImpl.invoke0(Native Method)
	at sun.reflect.NativeMethodAccessorImpl.invoke(NativeMethodAccessorImpl.java:62)
	at sun.reflect.DelegatingMethodAccessorImpl.invoke(DelegatingMethodAccessorImpl.java:43)
	at java.lang.reflect.Method.invoke(Method.java:498)
	at com.carrotsearch.randomizedtesting.RandomizedRunner.invoke(RandomizedRunner.java:1750)
	at com.carrotsearch.randomizedtesting.RandomizedRunner$8.evaluate(RandomizedRunner.java:938)
	at com.carrotsearch.randomizedtesting.RandomizedRunner$9.evaluate(RandomizedRunner.java:974)
	at com.carrotsearch.randomizedtesting.RandomizedRunner$10.evaluate(RandomizedRunner.java:988)
	at com.carrotsearch.randomizedtesting.rules.SystemPropertiesRestoreRule$1.evaluate(SystemPropertiesRestoreRule.java:57)
	at org.apache.lucene.util.TestRuleSetupTeardownChained$1.evaluate(TestRuleSetupTeardownChained.java:49)
	at org.apache.lucene.util.AbstractBeforeAfterRule$1.evaluate(AbstractBeforeAfterRule.java:45)
	at org.apache.lucene.util.TestRuleThreadAndTestName$1.evaluate(TestRuleThreadAndTestName.java:48)
	at org.apache.lucene.util.TestRuleIgnoreAfterMaxFailures$1.evaluate(TestRuleIgnoreAfterMaxFailures.java:64)
	at org.apache.lucene.util.TestRuleMarkFailure$1.evaluate(TestRuleMarkFailure.java:47)
	at com.carrotsearch.randomizedtesting.rules.StatementAdapter.evaluate(StatementAdapter.java:36)
	at com.carrotsearch.randomizedtesting.ThreadLeakControl$StatementRunner.run(ThreadLeakControl.java:368)
	at com.carrotsearch.randomizedtesting.ThreadLeakControl.forkTimeoutingTask(ThreadLeakControl.java:817)
	at com.carrotsearch.randomizedtesting.ThreadLeakControl$3.evaluate(ThreadLeakControl.java:468)
	at com.carrotsearch.randomizedtesting.RandomizedRunner.runSingleTest(RandomizedRunner.java:947)
	at com.carrotsearch.randomizedtesting.RandomizedRunner$5.evaluate(RandomizedRunner.java:832)
	at com.carrotsearch.randomizedtesting.RandomizedRunner$6.evaluate(RandomizedRunner.java:883)
	at com.carrotsearch.randomizedtesting.RandomizedRunner$7.evaluate(RandomizedRunner.java:894)
	at com.carrotsearch.randomizedtesting.rules.StatementAdapter.evaluate(StatementAdapter.java:36)
	at com.carrotsearch.randomizedtesting.rules.SystemPropertiesRestoreRule$1.evaluate(SystemPropertiesRestoreRule.java:57)
	at org.apache.lucene.util.AbstractBeforeAfterRule$1.evaluate(AbstractBeforeAfterRule.java:45)
	at com.carrotsearch.randomizedtesting.rules.StatementAdapter.evaluate(StatementAdapter.java:36)
	at org.apache.lucene.util.TestRuleStoreClassName$1.evaluate(TestRuleStoreClassName.java:41)
	at com.carrotsearch.randomizedtesting.rules.NoShadowingOrOverridesOnMethodsRule$1.evaluate(NoShadowingOrOverridesOnMethodsRule.java:40)
	at com.carrotsearch.randomizedtesting.rules.NoShadowingOrOverridesOnMethodsRule$1.evaluate(NoShadowingOrOverridesOnMethodsRule.java:40)
	at com.carrotsearch.randomizedtesting.rules.StatementAdapter.evaluate(StatementAdapter.java:36)
	at com.carrotsearch.randomizedtesting.rules.StatementAdapter.evaluate(StatementAdapter.java:36)
	at com.carrotsearch.randomizedtesting.rules.StatementAdapter.evaluate(StatementAdapter.java:36)
	at org.apache.lucene.util.TestRuleAssertionsRequired$1.evaluate(TestRuleAssertionsRequired.java:53)
	at org.apache.lucene.util.TestRuleMarkFailure$1.evaluate(TestRuleMarkFailure.java:47)
	at org.apache.lucene.util.TestRuleIgnoreAfterMaxFailures$1.evaluate(TestRuleIgnoreAfterMaxFailures.java:64)
	at org.apache.lucene.util.TestRuleIgnoreTestSuites$1.evaluate(TestRuleIgnoreTestSuites.java:54)
	at com.carrotsearch.randomizedtesting.rules.StatementAdapter.evaluate(StatementAdapter.java:36)
	at com.carrotsearch.randomizedtesting.ThreadLeakControl$StatementRunner.run(ThreadLeakControl.java:368)
	at java.lang.Thread.run(Thread.java:748)


FAILED:  org.apache.solr.update.TestInPlaceUpdatesDistrib.test

Error Message:
Thread pool didn't terminate within 15 secs

Stack Trace:
java.lang.AssertionError: Thread pool didn't terminate within 15 secs
	at __randomizedtesting.SeedInfo.seed([A4E4F05D7D7D4780:2CB0CF87D3812A78]:0)
	at org.junit.Assert.fail(Assert.java:88)
	at org.junit.Assert.assertTrue(Assert.java:41)
	at org.apache.solr.update.TestInPlaceUpdatesDistrib.reorderedDBQsResurrectionTest(TestInPlaceUpdatesDistrib.java:852)
	at org.apache.solr.update.TestInPlaceUpdatesDistrib.test(TestInPlaceUpdatesDistrib.java:179)
	at sun.reflect.NativeMethodAccessorImpl.invoke0(Native Method)
	at sun.reflect.NativeMethodAccessorImpl.invoke(NativeMethodAccessorImpl.java:62)
	at sun.reflect.DelegatingMethodAccessorImpl.invoke(DelegatingMethodAccessorImpl.java:43)
	at java.lang.reflect.Method.invoke(Method.java:498)
	at com.carrotsearch.randomizedtesting.RandomizedRunner.invoke(RandomizedRunner.java:1750)
	at com.carrotsearch.randomizedtesting.RandomizedRunner$8.evaluate(RandomizedRunner.java:938)
	at com.carrotsearch.randomizedtesting.RandomizedRunner$9.evaluate(RandomizedRunner.java:974)
	at com.carrotsearch.randomizedtesting.RandomizedRunner$10.evaluate(RandomizedRunner.java:988)
	at org.apache.solr.BaseDistributedSearchTestCase$ShardsRepeatRule$ShardsFixedStatement.callStatement(BaseDistributedSearchTestCase.java:1082)
	at org.apache.solr.BaseDistributedSearchTestCase$ShardsRepeatRule$ShardsStatement.evaluate(BaseDistributedSearchTestCase.java:1054)
	at com.carrotsearch.randomizedtesting.rules.SystemPropertiesRestoreRule$1.evaluate(SystemPropertiesRestoreRule.java:57)
	at org.apache.lucene.util.TestRuleSetupTeardownChained$1.evaluate(TestRuleSetupTeardownChained.java:49)
	at org.apache.lucene.util.AbstractBeforeAfterRule$1.evaluate(AbstractBeforeAfterRule.java:45)
	at org.apache.lucene.util.TestRuleThreadAndTestName$1.evaluate(TestRuleThreadAndTestName.java:48)
	at org.apache.lucene.util.TestRuleIgnoreAfterMaxFailures$1.evaluate(TestRuleIgnoreAfterMaxFailures.java:64)
	at org.apache.lucene.util.TestRuleMarkFailure$1.evaluate(TestRuleMarkFailure.java:47)
	at com.carrotsearch.randomizedtesting.rules.StatementAdapter.evaluate(StatementAdapter.java:36)
	at com.carrotsearch.randomizedtesting.ThreadLeakControl$StatementRunner.run(ThreadLeakControl.java:368)
	at com.carrotsearch.randomizedtesting.ThreadLeakControl.forkTimeoutingTask(ThreadLeakControl.java:817)
	at com.carrotsearch.randomizedtesting.ThreadLeakControl$3.evaluate(ThreadLeakControl.java:468)
	at com.carrotsearch.randomizedtesting.RandomizedRunner.runSingleTest(RandomizedRunner.java:947)
	at com.carrotsearch.randomizedtesting.RandomizedRunner$5.evaluate(RandomizedRunner.java:832)
	at com.carrotsearch.randomizedtesting.RandomizedRunner$6.evaluate(RandomizedRunner.java:883)
	at com.carrotsearch.randomizedtesting.RandomizedRunner$7.evaluate(RandomizedRunner.java:894)
	at com.carrotsearch.randomizedtesting.rules.StatementAdapter.evaluate(StatementAdapter.java:36)
	at com.carrotsearch.randomizedtesting.rules.SystemPropertiesRestoreRule$1.evaluate(SystemPropertiesRestoreRule.java:57)
	at org.apache.lucene.util.AbstractBeforeAfterRule$1.evaluate(AbstractBeforeAfterRule.java:45)
	at com.carrotsearch.randomizedtesting.rules.StatementAdapter.evaluate(StatementAdapter.java:36)
	at org.apache.lucene.util.TestRuleStoreClassName$1.evaluate(TestRuleStoreClassName.java:41)
	at com.carrotsearch.randomizedtesting.rules.NoShadowingOrOverridesOnMethodsRule$1.evaluate(NoShadowingOrOverridesOnMethodsRule.java:40)
	at com.carrotsearch.randomizedtesting.rules.NoShadowingOrOverridesOnMethodsRule$1.evaluate(NoShadowingOrOverridesOnMethodsRule.java:40)
	at com.carrotsearch.randomizedtesting.rules.StatementAdapter.evaluate(StatementAdapter.java:36)
	at com.carrotsearch.randomizedtesting.rules.StatementAdapter.evaluate(StatementAdapter.java:36)
	at com.carrotsearch.randomizedtesting.rules.StatementAdapter.evaluate(StatementAdapter.java:36)
	at org.apache.lucene.util.TestRuleAssertionsRequired$1.evaluate(TestRuleAssertionsRequired.java:53)
	at org.apache.lucene.util.TestRuleMarkFailure$1.evaluate(TestRuleMarkFailure.java:47)
	at org.apache.lucene.util.TestRuleIgnoreAfterMaxFailures$1.evaluate(TestRuleIgnoreAfterMaxFailures.java:64)
	at org.apache.lucene.util.TestRuleIgnoreTestSuites$1.evaluate(TestRuleIgnoreTestSuites.java:54)
	at com.carrotsearch.randomizedtesting.rules.StatementAdapter.evaluate(StatementAdapter.java:36)
	at com.carrotsearch.randomizedtesting.ThreadLeakControl$StatementRunner.run(ThreadLeakControl.java:368)
	at java.lang.Thread.run(Thread.java:748)


FAILED:  org.apache.solr.update.PeerSyncTest.test

Error Message:
Unexpected exception type, expected SolrException but got org.apache.solr.client.solrj.SolrServerException: Timeout occurred while waiting response from server at: http://127.0.0.1:57828/uu_t/r/collection1

Stack Trace:
junit.framework.AssertionFailedError: Unexpected exception type, expected SolrException but got org.apache.solr.client.solrj.SolrServerException: Timeout occurred while waiting response from server at: http://127.0.0.1:57828/uu_t/r/collection1
	at __randomizedtesting.SeedInfo.seed([A4E4F05D7D7D4780:2CB0CF87D3812A78]:0)
	at org.apache.lucene.util.LuceneTestCase.expectThrows(LuceneTestCase.java:2700)
	at org.apache.lucene.util.LuceneTestCase.expectThrows(LuceneTestCase.java:2689)
	at org.apache.solr.update.PeerSyncTest.test(PeerSyncTest.java:279)
	at sun.reflect.NativeMethodAccessorImpl.invoke0(Native Method)
	at sun.reflect.NativeMethodAccessorImpl.invoke(NativeMethodAccessorImpl.java:62)
	at sun.reflect.DelegatingMethodAccessorImpl.invoke(DelegatingMethodAccessorImpl.java:43)
	at java.lang.reflect.Method.invoke(Method.java:498)
	at com.carrotsearch.randomizedtesting.RandomizedRunner.invoke(RandomizedRunner.java:1750)
	at com.carrotsearch.randomizedtesting.RandomizedRunner$8.evaluate(RandomizedRunner.java:938)
	at com.carrotsearch.randomizedtesting.RandomizedRunner$9.evaluate(RandomizedRunner.java:974)
	at com.carrotsearch.randomizedtesting.RandomizedRunner$10.evaluate(RandomizedRunner.java:988)
	at org.apache.solr.BaseDistributedSearchTestCase$ShardsRepeatRule$ShardsFixedStatement.callStatement(BaseDistributedSearchTestCase.java:1082)
	at org.apache.solr.BaseDistributedSearchTestCase$ShardsRepeatRule$ShardsStatement.evaluate(BaseDistributedSearchTestCase.java:1054)
	at com.carrotsearch.randomizedtesting.rules.SystemPropertiesRestoreRule$1.evaluate(SystemPropertiesRestoreRule.java:57)
	at org.apache.lucene.util.TestRuleSetupTeardownChained$1.evaluate(TestRuleSetupTeardownChained.java:49)
	at org.apache.lucene.util.AbstractBeforeAfterRule$1.evaluate(AbstractBeforeAfterRule.java:45)
	at org.apache.lucene.util.TestRuleThreadAndTestName$1.evaluate(TestRuleThreadAndTestName.java:48)
	at org.apache.lucene.util.TestRuleIgnoreAfterMaxFailures$1.evaluate(TestRuleIgnoreAfterMaxFailures.java:64)
	at org.apache.lucene.util.TestRuleMarkFailure$1.evaluate(TestRuleMarkFailure.java:47)
	at com.carrotsearch.randomizedtesting.rules.StatementAdapter.evaluate(StatementAdapter.java:36)
	at com.carrotsearch.randomizedtesting.ThreadLeakControl$StatementRunner.run(ThreadLeakControl.java:368)
	at com.carrotsearch.randomizedtesting.ThreadLeakControl.forkTimeoutingTask(ThreadLeakControl.java:817)
	at com.carrotsearch.randomizedtesting.ThreadLeakControl$3.evaluate(ThreadLeakControl.java:468)
	at com.carrotsearch.randomizedtesting.RandomizedRunner.runSingleTest(RandomizedRunner.java:947)
	at com.carrotsearch.randomizedtesting.RandomizedRunner$5.evaluate(RandomizedRunner.java:832)
	at com.carrotsearch.randomizedtesting.RandomizedRunner$6.evaluate(RandomizedRunner.java:883)
	at com.carrotsearch.randomizedtesting.RandomizedRunner$7.evaluate(RandomizedRunner.java:894)
	at com.carrotsearch.randomizedtesting.rules.StatementAdapter.evaluate(StatementAdapter.java:36)
	at com.carrotsearch.randomizedtesting.rules.SystemPropertiesRestoreRule$1.evaluate(SystemPropertiesRestoreRule.java:57)
	at org.apache.lucene.util.AbstractBeforeAfterRule$1.evaluate(AbstractBeforeAfterRule.java:45)
	at com.carrotsearch.randomizedtesting.rules.StatementAdapter.evaluate(StatementAdapter.java:36)
	at org.apache.lucene.util.TestRuleStoreClassName$1.evaluate(TestRuleStoreClassName.java:41)
	at com.carrotsearch.randomizedtesting.rules.NoShadowingOrOverridesOnMethodsRule$1.evaluate(NoShadowingOrOverridesOnMethodsRule.java:40)
	at com.carrotsearch.randomizedtesting.rules.NoShadowingOrOverridesOnMethodsRule$1.evaluate(NoShadowingOrOverridesOnMethodsRule.java:40)
	at com.carrotsearch.randomizedtesting.rules.StatementAdapter.evaluate(StatementAdapter.java:36)
	at com.carrotsearch.randomizedtesting.rules.StatementAdapter.evaluate(StatementAdapter.java:36)
	at com.carrotsearch.randomizedtesting.rules.StatementAdapter.evaluate(StatementAdapter.java:36)
	at org.apache.lucene.util.TestRuleAssertionsRequired$1.evaluate(TestRuleAssertionsRequired.java:53)
	at org.apache.lucene.util.TestRuleMarkFailure$1.evaluate(TestRuleMarkFailure.java:47)
	at org.apache.lucene.util.TestRuleIgnoreAfterMaxFailures$1.evaluate(TestRuleIgnoreAfterMaxFailures.java:64)
	at org.apache.lucene.util.TestRuleIgnoreTestSuites$1.evaluate(TestRuleIgnoreTestSuites.java:54)
	at com.carrotsearch.randomizedtesting.rules.StatementAdapter.evaluate(StatementAdapter.java:36)
	at com.carrotsearch.randomizedtesting.ThreadLeakControl$StatementRunner.run(ThreadLeakControl.java:368)
	at java.lang.Thread.run(Thread.java:748)
Caused by: org.apache.solr.client.solrj.SolrServerException: Timeout occurred while waiting response from server at: http://127.0.0.1:57828/uu_t/r/collection1
	at org.apache.solr.client.solrj.impl.HttpSolrClient.executeMethod(HttpSolrClient.java:660)
	at org.apache.solr.client.solrj.impl.HttpSolrClient.request(HttpSolrClient.java:255)
	at org.apache.solr.client.solrj.impl.HttpSolrClient.request(HttpSolrClient.java:244)
	at org.apache.solr.client.solrj.SolrRequest.process(SolrRequest.java:207)
	at org.apache.solr.client.solrj.SolrRequest.process(SolrRequest.java:224)
	at org.apache.solr.BaseDistributedSearchTestCase.add(BaseDistributedSearchTestCase.java:576)
	at org.apache.solr.update.PeerSyncTest.lambda$test$0(PeerSyncTest.java:281)
	at org.apache.lucene.util.LuceneTestCase.expectThrows(LuceneTestCase.java:2695)
	... 43 more
Caused by: java.net.SocketTimeoutException: Read timed out
	at java.net.SocketInputStream.socketRead0(Native Method)
	at java.net.SocketInputStream.socketRead(SocketInputStream.java:116)
	at java.net.SocketInputStream.read(SocketInputStream.java:171)
	at java.net.SocketInputStream.read(SocketInputStream.java:141)
	at org.apache.http.impl.io.SessionInputBufferImpl.streamRead(SessionInputBufferImpl.java:137)
	at org.apache.http.impl.io.SessionInputBufferImpl.fillBuffer(SessionInputBufferImpl.java:153)
	at org.apache.http.impl.io.SessionInputBufferImpl.readLine(SessionInputBufferImpl.java:282)
	at org.apache.http.impl.conn.DefaultHttpResponseParser.parseHead(DefaultHttpResponseParser.java:138)
	at org.apache.http.impl.conn.DefaultHttpResponseParser.parseHead(DefaultHttpResponseParser.java:56)
	at org.apache.http.impl.io.AbstractMessageParser.parse(AbstractMessageParser.java:259)
	at org.apache.http.impl.DefaultBHttpClientConnection.receiveResponseHeader(DefaultBHttpClientConnection.java:163)
	at org.apache.http.impl.conn.CPoolProxy.receiveResponseHeader(CPoolProxy.java:165)
	at org.apache.http.protocol.HttpRequestExecutor.doReceiveResponse(HttpRequestExecutor.java:273)
	at org.apache.http.protocol.HttpRequestExecutor.execute(HttpRequestExecutor.java:125)
	at org.apache.http.impl.execchain.MainClientExec.execute(MainClientExec.java:272)
	at org.apache.http.impl.execchain.ProtocolExec.execute(ProtocolExec.java:185)
	at org.apache.http.impl.execchain.RetryExec.execute(RetryExec.java:89)
	at org.apache.http.impl.execchain.RedirectExec.execute(RedirectExec.java:110)
	at org.apache.http.impl.client.InternalHttpClient.doExecute(InternalHttpClient.java:185)
	at org.apache.http.impl.client.CloseableHttpClient.execute(CloseableHttpClient.java:83)
	at org.apache.http.impl.client.CloseableHttpClient.execute(CloseableHttpClient.java:56)
	at org.apache.solr.client.solrj.impl.HttpSolrClient.executeMethod(HttpSolrClient.java:548)
	... 50 more




Build Log:
[...truncated 13707 lines...]
   [junit4] Suite: org.apache.solr.update.TestInPlaceUpdatesDistrib
   [junit4]   2> Creating dataDir: C:\Users\jenkins\workspace\Lucene-Solr-8.x-Windows\solr\build\solr-core\test\J1\temp\solr.update.TestInPlaceUpdatesDistrib_A4E4F05D7D7D4780-001\init-core-data-001
   [junit4]   2> 1299050 WARN  (SUITE-TestInPlaceUpdatesDistrib-seed#[A4E4F05D7D7D4780]-worker) [    ] o.a.s.SolrTestCaseJ4 startTrackingSearchers: numOpens=2500 numCloses=2500
   [junit4]   2> 1299050 INFO  (SUITE-TestInPlaceUpdatesDistrib-seed#[A4E4F05D7D7D4780]-worker) [    ] o.a.s.SolrTestCaseJ4 Using PointFields (NUMERIC_POINTS_SYSPROP=true) w/NUMERIC_DOCVALUES_SYSPROP=true
   [junit4]   2> 1299056 INFO  (SUITE-TestInPlaceUpdatesDistrib-seed#[A4E4F05D7D7D4780]-worker) [    ] o.a.s.SolrTestCaseJ4 Randomized ssl (false) and clientAuth (false) via: @org.apache.solr.util.RandomizeSSL(reason=, value=NaN, ssl=NaN, clientAuth=NaN)
   [junit4]   2> 1299056 INFO  (SUITE-TestInPlaceUpdatesDistrib-seed#[A4E4F05D7D7D4780]-worker) [    ] o.a.s.SolrTestCaseJ4 SecureRandom sanity checks: test.solr.allowed.securerandom=null & java.security.egd=file:/dev/./urandom
   [junit4]   2> 1299057 INFO  (SUITE-TestInPlaceUpdatesDistrib-seed#[A4E4F05D7D7D4780]-worker) [    ] o.a.s.BaseDistributedSearchTestCase Setting hostContext system property: /wj/
   [junit4]   2> 1299057 INFO  (SUITE-TestInPlaceUpdatesDistrib-seed#[A4E4F05D7D7D4780]-worker) [    ] o.a.s.SolrTestCaseJ4 updateLog impl=solr.CdcrUpdateLog
   [junit4]   2> 1299058 INFO  (SUITE-TestInPlaceUpdatesDistrib-seed#[A4E4F05D7D7D4780]-worker) [    ] o.a.s.SolrTestCaseJ4 ####initCore
   [junit4]   2> 1299059 INFO  (SUITE-TestInPlaceUpdatesDistrib-seed#[A4E4F05D7D7D4780]-worker) [    ] o.a.s.c.SolrResourceLoader [null] Added 2 libs to classloader, from paths: [/C:/Users/jenkins/workspace/Lucene-Solr-8.x-Windows/solr/core/src/test-files/solr/collection1/lib, /C:/Users/jenkins/workspace/Lucene-Solr-8.x-Windows/solr/core/src/test-files/solr/collection1/lib/classes]
   [junit4]   2> 1299135 INFO  (SUITE-TestInPlaceUpdatesDistrib-seed#[A4E4F05D7D7D4780]-worker) [    ] o.a.s.c.SolrConfig Using Lucene MatchVersion: 8.1.0
   [junit4]   2> 1299160 INFO  (SUITE-TestInPlaceUpdatesDistrib-seed#[A4E4F05D7D7D4780]-worker) [    ] o.a.s.s.IndexSchema [null] Schema name=inplace-updates
   [junit4]   2> 1299168 INFO  (SUITE-TestInPlaceUpdatesDistrib-seed#[A4E4F05D7D7D4780]-worker) [    ] o.a.s.s.IndexSchema Loaded schema inplace-updates/1.6 with uniqueid field id
   [junit4]   2> 1302465 INFO  (SUITE-TestInPlaceUpdatesDistrib-seed#[A4E4F05D7D7D4780]-worker) [    ] o.a.s.h.c.HttpShardHandlerFactory Host whitelist initialized: WhitelistHostChecker [whitelistHosts=null, whitelistHostCheckingEnabled=false]
   [junit4]   2> 1302472 WARN  (SUITE-TestInPlaceUpdatesDistrib-seed#[A4E4F05D7D7D4780]-worker) [    ] o.e.j.u.s.S.config No Client EndPointIdentificationAlgorithm configured for SslContextFactory@d883b1[provider=null,keyStore=null,trustStore=null]
   [junit4]   2> 1302483 WARN  (SUITE-TestInPlaceUpdatesDistrib-seed#[A4E4F05D7D7D4780]-worker) [    ] o.e.j.u.s.S.config No Client EndPointIdentificationAlgorithm configured for SslContextFactory@169625d[provider=null,keyStore=null,trustStore=null]
   [junit4]   2> 1302567 INFO  (SUITE-TestInPlaceUpdatesDistrib-seed#[A4E4F05D7D7D4780]-worker) [    ] o.a.s.c.TransientSolrCoreCacheDefault Allocating transient cache for 2147483647 transient cores
   [junit4]   2> 1302567 INFO  (SUITE-TestInPlaceUpdatesDistrib-seed#[A4E4F05D7D7D4780]-worker) [    ] o.a.s.h.a.MetricsHistoryHandler No .system collection, keeping metrics history in memory.
   [junit4]   2> 1302610 INFO  (SUITE-TestInPlaceUpdatesDistrib-seed#[A4E4F05D7D7D4780]-worker) [    ] o.a.s.m.r.SolrJmxReporter JMX monitoring for 'solr.node' (registry 'solr.node') enabled at server: com.sun.jmx.mbeanserver.JmxMBeanServer@a292d2
   [junit4]   2> 1302618 INFO  (SUITE-TestInPlaceUpdatesDistrib-seed#[A4E4F05D7D7D4780]-worker) [    ] o.a.s.m.r.SolrJmxReporter JMX monitoring for 'solr.jvm' (registry 'solr.jvm') enabled at server: com.sun.jmx.mbeanserver.JmxMBeanServer@a292d2
   [junit4]   2> 1302618 INFO  (SUITE-TestInPlaceUpdatesDistrib-seed#[A4E4F05D7D7D4780]-worker) [    ] o.a.s.m.r.SolrJmxReporter JMX monitoring for 'solr.jetty' (registry 'solr.jetty') enabled at server: com.sun.jmx.mbeanserver.JmxMBeanServer@a292d2
   [junit4]   2> 1302622 INFO  (coreLoadExecutor-4887-thread-1) [    x:collection1] o.a.s.c.SolrResourceLoader [null] Added 2 libs to classloader, from paths: [/C:/Users/jenkins/workspace/Lucene-Solr-8.x-Windows/solr/core/src/test-files/solr/collection1/lib, /C:/Users/jenkins/workspace/Lucene-Solr-8.x-Windows/solr/core/src/test-files/solr/collection1/lib/classes]
   [junit4]   2> 1302727 INFO  (coreLoadExecutor-4887-thread-1) [    x:collection1] o.a.s.c.SolrConfig Using Lucene MatchVersion: 8.1.0
   [junit4]   2> 1302746 INFO  (coreLoadExecutor-4887-thread-1) [    x:collection1] o.a.s.s.IndexSchema [collection1] Schema name=inplace-updates
   [junit4]   2> 1302751 INFO  (coreLoadExecutor-4887-thread-1) [    x:collection1] o.a.s.s.IndexSchema Loaded schema inplace-updates/1.6 with uniqueid field id
   [junit4]   2> 1302752 INFO  (coreLoadExecutor-4887-thread-1) [    x:collection1] o.a.s.c.CoreContainer Creating SolrCore 'collection1' using configuration from instancedir C:\Users\jenkins\workspace\Lucene-Solr-8.x-Windows\solr\core\src\test-files\solr\collection1, trusted=true
   [junit4]   2> 1302752 INFO  (coreLoadExecutor-4887-thread-1) [    x:collection1] o.a.s.m.r.SolrJmxReporter JMX monitoring for 'solr.core.collection1' (registry 'solr.core.collection1') enabled at server: com.sun.jmx.mbeanserver.JmxMBeanServer@a292d2
   [junit4]   2> 1302752 INFO  (coreLoadExecutor-4887-thread-1) [    x:collection1] o.a.s.c.SolrCore [[collection1] ] Opening new SolrCore at [C:\Users\jenkins\workspace\Lucene-Solr-8.x-Windows\solr\core\src\test-files\solr\collection1], dataDir=[C:\Users\jenkins\workspace\Lucene-Solr-8.x-Windows\solr\build\solr-core\test\J1\temp\solr.update.TestInPlaceUpdatesDistrib_A4E4F05D7D7D4780-001\init-core-data-001\]
   [junit4]   2> 1302757 WARN  (coreLoadExecutor-4887-thread-1) [    x:collection1] o.a.s.c.RequestHandlers INVALID paramSet a in requestHandler {type = requestHandler,name = /dump,class = DumpRequestHandler,attributes = {initParams=a, name=/dump, class=DumpRequestHandler},args = {defaults={a=A,b=B}}}
   [junit4]   2> 1302878 INFO  (coreLoadExecutor-4887-thread-1) [    x:collection1] o.a.s.u.UpdateHandler Using UpdateLog implementation: org.apache.solr.update.CdcrUpdateLog
   [junit4]   2> 1302878 INFO  (coreLoadExecutor-4887-thread-1) [    x:collection1] o.a.s.u.UpdateLog Initializing UpdateLog: dataDir= defaultSyncLevel=FLUSH numRecordsToKeep=100 maxNumLogsToKeep=10 numVersionBuckets=65536
   [junit4]   2> 1302880 INFO  (coreLoadExecutor-4887-thread-1) [    x:collection1] o.a.s.u.CommitTracker Hard AutoCommit: disabled
   [junit4]   2> 1302880 INFO  (coreLoadExecutor-4887-thread-1) [    x:collection1] o.a.s.u.CommitTracker Soft AutoCommit: disabled
   [junit4]   2> 1302882 INFO  (coreLoadExecutor-4887-thread-1) [    x:collection1] o.a.s.s.SolrIndexSearcher Opening [Searcher@5a6d84[collection1] main]
   [junit4]   2> 1302882 WARN  (coreLoadExecutor-4887-thread-1) [    x:collection1] o.a.s.r.ManagedResourceStorage Cannot write to config directory C:\Users\jenkins\workspace\Lucene-Solr-8.x-Windows\solr\core\src\test-files\solr\collection1\conf; switching to use InMemory storage instead.
   [junit4]   2> 1302883 INFO  (coreLoadExecutor-4887-thread-1) [    x:collection1] o.a.s.h.ReplicationHandler Commits will be reserved for 10000ms.
   [junit4]   2> 1302883 INFO  (coreLoadExecutor-4887-thread-1) [    x:collection1] o.a.s.u.UpdateLog Could not find max version in index or recent updates, using new clock 1632320216217157632
   [junit4]   2> 1302888 INFO  (searcherExecutor-4888-thread-1-processing-x:collection1) [    x:collection1] o.a.s.c.SolrCore [collection1] Registered new searcher Searcher@5a6d84[collection1] main{ExitableDirectoryReader(UninvertingDirectoryReader())}
   [junit4]   2> 1302890 INFO  (SUITE-TestInPlaceUpdatesDistrib-seed#[A4E4F05D7D7D4780]-worker) [    ] o.a.s.SolrTestCaseJ4 ####initCore end
   [junit4]   2> 1302896 INFO  (TEST-TestInPlaceUpdatesDistrib.test-seed#[A4E4F05D7D7D4780]) [    ] o.a.s.c.ZkTestServer STARTING ZK TEST SERVER
   [junit4]   2> 1302897 INFO  (ZkTestServer Run Thread) [    ] o.a.s.c.ZkTestServer client port:0.0.0.0/0.0.0.0:0
   [junit4]   2> 1302897 INFO  (ZkTestServer Run Thread) [    ] o.a.s.c.ZkTestServer Starting server
   [junit4]   2> 1302997 INFO  (TEST-TestInPlaceUpdatesDistrib.test-seed#[A4E4F05D7D7D4780]) [    ] o.a.s.c.ZkTestServer start zk server on port:53147
   [junit4]   2> 1302997 INFO  (TEST-TestInPlaceUpdatesDistrib.test-seed#[A4E4F05D7D7D4780]) [    ] o.a.s.c.ZkTestServer parse host and port list: 127.0.0.1:53147
   [junit4]   2> 1302997 INFO  (TEST-TestInPlaceUpdatesDistrib.test-seed#[A4E4F05D7D7D4780]) [    ] o.a.s.c.ZkTestServer connecting to 127.0.0.1 53147
   [junit4]   2> 1303004 INFO  (zkConnectionManagerCallback-5644-thread-1) [    ] o.a.s.c.c.ConnectionManager zkClient has connected
   [junit4]   2> 1303009 INFO  (zkConnectionManagerCallback-5646-thread-1) [    ] o.a.s.c.c.ConnectionManager zkClient has connected
   [junit4]   2> 1303013 INFO  (TEST-TestInPlaceUpdatesDistrib.test-seed#[A4E4F05D7D7D4780]) [    ] o.a.s.c.ZkTestServer put C:\Users\jenkins\workspace\Lucene-Solr-8.x-Windows\solr\core\src\test-files\solr\collection1\conf\solrconfig-tlog.xml to /configs/conf1/solrconfig.xml
   [junit4]   2> 1303014 INFO  (TEST-TestInPlaceUpdatesDistrib.test-seed#[A4E4F05D7D7D4780]) [    ] o.a.s.c.ZkTestServer put C:\Users\jenkins\workspace\Lucene-Solr-8.x-Windows\solr\core\src\test-files\solr\collection1\conf\schema-inplace-updates.xml to /configs/conf1/schema.xml
   [junit4]   2> 1303017 INFO  (TEST-TestInPlaceUpdatesDistrib.test-seed#[A4E4F05D7D7D4780]) [    ] o.a.s.c.ZkTestServer put C:\Users\jenkins\workspace\Lucene-Solr-8.x-Windows\solr\core\src\test-files\solr\collection1\conf\solrconfig.snippet.randomindexconfig.xml to /configs/conf1/solrconfig.snippet.randomindexconfig.xml
   [junit4]   2> 1303018 INFO  (TEST-TestInPlaceUpdatesDistrib.test-seed#[A4E4F05D7D7D4780]) [    ] o.a.s.c.ZkTestServer put C:\Users\jenkins\workspace\Lucene-Solr-8.x-Windows\solr\core\src\test-files\solr\collection1\conf\stopwords.txt to /configs/conf1/stopwords.txt
   [junit4]   2> 1303020 INFO  (TEST-TestInPlaceUpdatesDistrib.test-seed#[A4E4F05D7D7D4780]) [    ] o.a.s.c.ZkTestServer put C:\Users\jenkins\workspace\Lucene-Solr-8.x-Windows\solr\core\src\test-files\solr\collection1\conf\protwords.txt to /configs/conf1/protwords.txt
   [junit4]   2> 1303022 INFO  (TEST-TestInPlaceUpdatesDistrib.test-seed#[A4E4F05D7D7D4780]) [    ] o.a.s.c.ZkTestServer put C:\Users\jenkins\workspace\Lucene-Solr-8.x-Windows\solr\core\src\test-files\solr\collection1\conf\currency.xml to /configs/conf1/currency.xml
   [junit4]   2> 1303024 INFO  (TEST-TestInPlaceUpdatesDistrib.test-seed#[A4E4F05D7D7D4780]) [    ] o.a.s.c.ZkTestServer put C:\Users\jenkins\workspace\Lucene-Solr-8.x-Windows\solr\core\src\test-files\solr\collection1\conf\enumsConfig.xml to /configs/conf1/enumsConfig.xml
   [junit4]   2> 1303026 INFO  (TEST-TestInPlaceUpdatesDistrib.test-seed#[A4E4F05D7D7D4780]) [    ] o.a.s.c.ZkTestServer put C:\Users\jenkins\workspace\Lucene-Solr-8.x-Windows\solr\core\src\test-files\solr\collection1\conf\open-exchange-rates.json to /configs/conf1/open-exchange-rates.json
   [junit4]   2> 1303029 INFO  (TEST-TestInPlaceUpdatesDistrib.test-seed#[A4E4F05D7D7D4780]) [    ] o.a.s.c.ZkTestServer put C:\Users\jenkins\workspace\Lucene-Solr-8.x-Windows\solr\core\src\test-files\solr\collection1\conf\mapping-ISOLatin1Accent.txt to /configs/conf1/mapping-ISOLatin1Accent.txt
   [junit4]   2> 1303031 INFO  (TEST-TestInPlaceUpdatesDistrib.test-seed#[A4E4F05D7D7D4780]) [    ] o.a.s.c.ZkTestServer put C:\Users\jenkins\workspace\Lucene-Solr-8.x-Windows\solr\core\src\test-files\solr\collection1\conf\old_synonyms.txt to /configs/conf1/old_synonyms.txt
   [junit4]   2> 1303033 INFO  (TEST-TestInPlaceUpdatesDistrib.test-seed#[A4E4F05D7D7D4780]) [    ] o.a.s.c.ZkTestServer put C:\Users\jenkins\workspace\Lucene-Solr-8.x-Windows\solr\core\src\test-files\solr\collection1\conf\synonyms.txt to /configs/conf1/synonyms.txt
   [junit4]   2> 1303035 INFO  (TEST-TestInPlaceUpdatesDistrib.test-seed#[A4E4F05D7D7D4780]) [    ] o.a.s.c.AbstractFullDistribZkTestBase Will use NRT replicas unless explicitly asked otherwise
   [junit4]   2> 1303760 WARN  (TEST-TestInPlaceUpdatesDistrib.test-seed#[A4E4F05D7D7D4780]) [    ] o.e.j.s.AbstractConnector Ignoring deprecated socket close linger time
   [junit4]   2> 1303760 INFO  (TEST-TestInPlaceUpdatesDistrib.test-seed#[A4E4F05D7D7D4780]) [    ] o.a.s.c.s.e.JettySolrRunner Start Jetty (original configured port=0)
   [junit4]   2> 1303760 INFO  (TEST-TestInPlaceUpdatesDistrib.test-seed#[A4E4F05D7D7D4780]) [    ] o.a.s.c.s.e.JettySolrRunner Trying to start Jetty on port 0 try number 1 ...
   [junit4]   2> 1303760 INFO  (TEST-TestInPlaceUpdatesDistrib.test-seed#[A4E4F05D7D7D4780]) [    ] o.e.j.s.Server jetty-9.4.14.v20181114; built: 2018-11-14T21:20:31.478Z; git: c4550056e785fb5665914545889f21dc136ad9e6; jvm 1.8.0_201-b09
   [junit4]   2> 1303761 INFO  (TEST-TestInPlaceUpdatesDistrib.test-seed#[A4E4F05D7D7D4780]) [    ] o.e.j.s.session DefaultSessionIdManager workerName=node0
   [junit4]   2> 1303761 INFO  (TEST-TestInPlaceUpdatesDistrib.test-seed#[A4E4F05D7D7D4780]) [    ] o.e.j.s.session No SessionScavenger set, using defaults
   [junit4]   2> 1303761 INFO  (TEST-TestInPlaceUpdatesDistrib.test-seed#[A4E4F05D7D7D4780]) [    ] o.e.j.s.session node0 Scavenging every 600000ms
   [junit4]   2> 1303768 INFO  (TEST-TestInPlaceUpdatesDistrib.test-seed#[A4E4F05D7D7D4780]) [    ] o.e.j.s.h.ContextHandler Started o.e.j.s.ServletContextHandler@1647f45{/wj,null,AVAILABLE}
   [junit4]   2> 1303768 INFO  (TEST-TestInPlaceUpdatesDistrib.test-seed#[A4E4F05D7D7D4780]) [    ] o.e.j.s.AbstractConnector Started ServerConnector@e96f3d{HTTP/1.1,[http/1.1, h2c]}{127.0.0.1:53155}
   [junit4]   2> 1303768 INFO  (TEST-TestInPlaceUpdatesDistrib.test-seed#[A4E4F05D7D7D4780]) [    ] o.e.j.s.Server Started @1303808ms
   [junit4]   2> 1303768 INFO  (TEST-TestInPlaceUpdatesDistrib.test-seed#[A4E4F05D7D7D4780]) [    ] o.a.s.c.s.e.JettySolrRunner Jetty properties: {solr.data.dir=C:\Users\jenkins\workspace\Lucene-Solr-8.x-Windows\solr\build\solr-core\test\J1\temp\solr.update.TestInPlaceUpdatesDistrib_A4E4F05D7D7D4780-001\tempDir-001/control/data, hostContext=/wj, hostPort=53155, coreRootDirectory=C:\Users\jenkins\workspace\Lucene-Solr-8.x-Windows\solr\build\solr-core\test\J1\temp\solr.update.TestInPlaceUpdatesDistrib_A4E4F05D7D7D4780-001\control-001\cores}
   [junit4]   2> 1303768 ERROR (TEST-TestInPlaceUpdatesDistrib.test-seed#[A4E4F05D7D7D4780]) [    ] o.a.s.u.StartupLoggingUtils Missing Java Option solr.log.dir. Logging may be missing or incomplete.
   [junit4]   2> 1303768 INFO  (TEST-TestInPlaceUpdatesDistrib.test-seed#[A4E4F05D7D7D4780]) [    ] o.a.s.s.SolrDispatchFilter Using logger factory org.apache.logging.slf4j.Log4jLoggerFactory
   [junit4]   2> 1303768 INFO  (TEST-TestInPlaceUpdatesDistrib.test-seed#[A4E4F05D7D7D4780]) [    ] o.a.s.s.SolrDispatchFilter  ___      _       Welcome to Apache Solr™ version 8.1.0
   [junit4]   2> 1303768 INFO  (TEST-TestInPlaceUpdatesDistrib.test-seed#[A4E4F05D7D7D4780]) [    ] o.a.s.s.SolrDispatchFilter / __| ___| |_ _   Starting in cloud mode on port null
   [junit4]   2> 1303768 INFO  (TEST-TestInPlaceUpdatesDistrib.test-seed#[A4E4F05D7D7D4780]) [    ] o.a.s.s.SolrDispatchFilter \__ \/ _ \ | '_|  Install dir: null
   [junit4]   2> 1303768 INFO  (TEST-TestInPlaceUpdatesDistrib.test-seed#[A4E4F05D7D7D4780]) [    ] o.a.s.s.SolrDispatchFilter |___/\___/_|_|    Start time: 2019-05-01T09:11:07.242Z
   [junit4]   2> 1303774 INFO  (zkConnectionManagerCallback-5648-thread-1) [    ] o.a.s.c.c.ConnectionManager zkClient has connected
   [junit4]   2> 1303775 INFO  (TEST-TestInPlaceUpdatesDistrib.test-seed#[A4E4F05D7D7D4780]) [    ] o.a.s.s.SolrDispatchFilter Loading solr.xml from SolrHome (not found in ZooKeeper)
   [junit4]   2> 1303775 INFO  (TEST-TestInPlaceUpdatesDistrib.test-seed#[A4E4F05D7D7D4780]) [    ] o.a.s.c.SolrXmlConfig Loading container configuration from C:\Users\jenkins\workspace\Lucene-Solr-8.x-Windows\solr\build\solr-core\test\J1\temp\solr.update.TestInPlaceUpdatesDistrib_A4E4F05D7D7D4780-001\control-001\solr.xml
   [junit4]   2> 1303786 INFO  (TEST-TestInPlaceUpdatesDistrib.test-seed#[A4E4F05D7D7D4780]) [    ] o.a.s.c.SolrXmlConfig Configuration parameter autoReplicaFailoverWorkLoopDelay is ignored
   [junit4]   2> 1303786 INFO  (TEST-TestInPlaceUpdatesDistrib.test-seed#[A4E4F05D7D7D4780]) [    ] o.a.s.c.SolrXmlConfig Configuration parameter autoReplicaFailoverBadNodeExpiration is ignored
   [junit4]   2> 1303787 INFO  (TEST-TestInPlaceUpdatesDistrib.test-seed#[A4E4F05D7D7D4780]) [    ] o.a.s.c.SolrXmlConfig MBean server found: com.sun.jmx.mbeanserver.JmxMBeanServer@a292d2, but no JMX reporters were configured - adding default JMX reporter.
   [junit4]   2> 1304865 INFO  (TEST-TestInPlaceUpdatesDistrib.test-seed#[A4E4F05D7D7D4780]) [    ] o.a.s.h.c.HttpShardHandlerFactory Host whitelist initialized: WhitelistHostChecker [whitelistHosts=null, whitelistHostCheckingEnabled=false]
   [junit4]   2> 1304871 WARN  (TEST-TestInPlaceUpdatesDistrib.test-seed#[A4E4F05D7D7D4780]) [    ] o.e.j.u.s.S.config No Client EndPointIdentificationAlgorithm configured for SslContextFactory@1e7cc85[provider=null,keyStore=null,trustStore=null]
   [junit4]   2> 1304880 WARN  (TEST-TestInPlaceUpdatesDistrib.test-seed#[A4E4F05D7D7D4780]) [    ] o.e.j.u.s.S.config No Client EndPointIdentificationAlgorithm configured for SslContextFactory@9369ab[provider=null,keyStore=null,trustStore=null]
   [junit4]   2> 1304881 INFO  (TEST-TestInPlaceUpdatesDistrib.test-seed#[A4E4F05D7D7D4780]) [    ] o.a.s.c.ZkContainer Zookeeper client=127.0.0.1:53147/solr
   [junit4]   2> 1304883 INFO  (zkConnectionManagerCallback-5655-thread-1) [    ] o.a.s.c.c.ConnectionManager zkClient has connected
   [junit4]   2> 1304891 INFO  (zkConnectionManagerCallback-5657-thread-1) [    ] o.a.s.c.c.ConnectionManager zkClient has connected
   [junit4]   2> 1305035 INFO  (TEST-TestInPlaceUpdatesDistrib.test-seed#[A4E4F05D7D7D4780]) [    ] o.a.s.c.OverseerElectionContext I am going to be the leader 127.0.0.1:53155_wj
   [junit4]   2> 1305036 INFO  (TEST-TestInPlaceUpdatesDistrib.test-seed#[A4E4F05D7D7D4780]) [    ] o.a.s.c.Overseer Overseer (id=72063309247217668-127.0.0.1:53155_wj-n_0000000000) starting
   [junit4]   2> 1305046 INFO  (zkConnectionManagerCallback-5664-thread-1) [    ] o.a.s.c.c.ConnectionManager zkClient has connected
   [junit4]   2> 1305050 INFO  (TEST-TestInPlaceUpdatesDistrib.test-seed#[A4E4F05D7D7D4780]) [    ] o.a.s.c.s.i.ZkClientClusterStateProvider Cluster at 127.0.0.1:53147/solr ready
   [junit4]   2> 1305051 INFO  (TEST-TestInPlaceUpdatesDistrib.test-seed#[A4E4F05D7D7D4780]) [    ] o.a.s.c.ZkController Register node as live in ZooKeeper:/live_nodes/127.0.0.1:53155_wj
   [junit4]   2> 1305058 INFO  (OverseerStateUpdate-72063309247217668-127.0.0.1:53155_wj-n_0000000000) [n:127.0.0.1:53155_wj    ] o.a.s.c.Overseer Starting to work on the main queue : 127.0.0.1:53155_wj
   [junit4]   2> 1305062 INFO  (OverseerStateUpdate-72063309247217668-127.0.0.1:53155_wj-n_0000000000) [n:127.0.0.1:53155_wj    ] o.a.s.c.c.ZkStateReader Updated live nodes from ZooKeeper... (0) -> (1)
   [junit4]   2> 1305063 INFO  (zkCallback-5663-thread-1) [    ] o.a.s.c.c.ZkStateReader Updated live nodes from ZooKeeper... (0) -> (1)
   [junit4]   2> 1305137 INFO  (TEST-TestInPlaceUpdatesDistrib.test-seed#[A4E4F05D7D7D4780]) [    ] o.a.s.h.a.MetricsHistoryHandler No .system collection, keeping metrics history in memory.
   [junit4]   2> 1305188 INFO  (TEST-TestInPlaceUpdatesDistrib.test-seed#[A4E4F05D7D7D4780]) [    ] o.a.s.m.r.SolrJmxReporter JMX monitoring for 'solr.node' (registry 'solr.node') enabled at server: com.sun.jmx.mbeanserver.JmxMBeanServer@a292d2
   [junit4]   2> 1305201 INFO  (TEST-TestInPlaceUpdatesDistrib.test-seed#[A4E4F05D7D7D4780]) [    ] o.a.s.m.r.SolrJmxReporter JMX monitoring for 'solr.jvm' (registry 'solr.jvm') enabled at server: com.sun.jmx.mbeanserver.JmxMBeanServer@a292d2
   [junit4]   2> 1305202 INFO  (TEST-TestInPlaceUpdatesDistrib.test-seed#[A4E4F05D7D7D4780]) [    ] o.a.s.m.r.SolrJmxReporter JMX monitoring for 'solr.jetty' (registry 'solr.jetty') enabled at server: com.sun.jmx.mbeanserver.JmxMBeanServer@a292d2
   [junit4]   2> 1305205 INFO  (TEST-TestInPlaceUpdatesDistrib.test-seed#[A4E4F05D7D7D4780]) [    ] o.a.s.c.CorePropertiesLocator Found 0 core definitions underneath C:\Users\jenkins\workspace\Lucene-Solr-8.x-Windows\solr\build\solr-core\test\J1\temp\solr.update.TestInPlaceUpdatesDistrib_A4E4F05D7D7D4780-001\control-001\cores
   [junit4]   2> 1305283 INFO  (zkConnectionManagerCallback-5670-thread-1) [    ] o.a.s.c.c.ConnectionManager zkClient has connected
   [junit4]   2> 1305285 INFO  (TEST-TestInPlaceUpdatesDistrib.test-seed#[A4E4F05D7D7D4780]) [    ] o.a.s.c.c.ZkStateReader Updated live nodes from ZooKeeper... (0) -> (1)
   [junit4]   2> 1305287 INFO  (TEST-TestInPlaceUpdatesDistrib.test-seed#[A4E4F05D7D7D4780]) [    ] o.a.s.c.s.i.ZkClientClusterStateProvider Cluster at 127.0.0.1:53147/solr ready
   [junit4]   2> 1305290 INFO  (qtp21430058-15121) [n:127.0.0.1:53155_wj    ] o.a.s.h.a.CollectionsHandler Invoked Collection Action :create with params collection.configName=conf1&name=control_collection&nrtReplicas=1&action=CREATE&numShards=1&createNodeSet=127.0.0.1:53155_wj&wt=javabin&version=2 and sendToOCPQueue=true
   [junit4]   2> 1305295 INFO  (OverseerThreadFactory-4902-thread-1) [    ] o.a.s.c.a.c.CreateCollectionCmd Create collection control_collection
   [junit4]   2> 1305406 INFO  (qtp21430058-15124) [n:127.0.0.1:53155_wj    x:control_collection_shard1_replica_n1] o.a.s.h.a.CoreAdminOperation core create command qt=/admin/cores&collection.configName=conf1&newCollection=true&name=control_collection_shard1_replica_n1&action=CREATE&numShards=1&collection=control_collection&shard=shard1&wt=javabin&version=2&replicaType=NRT
   [junit4]   2> 1305407 INFO  (qtp21430058-15124) [n:127.0.0.1:53155_wj    x:control_collection_shard1_replica_n1] o.a.s.c.TransientSolrCoreCacheDefault Allocating transient cache for 4 transient cores
   [junit4]   2> 1306445 INFO  (qtp21430058-15124) [n:127.0.0.1:53155_wj c:control_collection s:shard1  x:control_collection_shard1_replica_n1] o.a.s.c.SolrConfig Using Lucene MatchVersion: 8.1.0
   [junit4]   2> 1306470 INFO  (qtp21430058-15124) [n:127.0.0.1:53155_wj c:control_collection s:shard1  x:control_collection_shard1_replica_n1] o.a.s.s.IndexSchema [control_collection_shard1_replica_n1] Schema name=inplace-updates
   [junit4]   2> 1306476 INFO  (qtp21430058-15124) [n:127.0.0.1:53155_wj c:control_collection s:shard1  x:control_collection_shard1_replica_n1] o.a.s.s.IndexSchema Loaded schema inplace-updates/1.6 with uniqueid field id
   [junit4]   2> 1306476 INFO  (qtp21430058-15124) [n:127.0.0.1:53155_wj c:control_collection s:shard1  x:control_collection_shard1_replica_n1] o.a.s.c.CoreContainer Creating SolrCore 'control_collection_shard1_replica_n1' using configuration from collection control_collection, trusted=true
   [junit4]   2> 1306477 INFO  (qtp21430058-15124) [n:127.0.0.1:53155_wj c:control_collection s:shard1  x:control_collection_shard1_replica_n1] o.a.s.m.r.SolrJmxReporter JMX monitoring for 'solr.core.control_collection.shard1.replica_n1' (registry 'solr.core.control_collection.shard1.replica_n1') enabled at server: com.sun.jmx.mbeanserver.JmxMBeanServer@a292d2
   [junit4]   2> 1306477 INFO  (qtp21430058-15124) [n:127.0.0.1:53155_wj c:control_collection s:shard1  x:control_collection_shard1_replica_n1] o.a.s.c.SolrCore [[control_collection_shard1_replica_n1] ] Opening new SolrCore at [C:\Users\jenkins\workspace\Lucene-Solr-8.x-Windows\solr\build\solr-core\test\J1\temp\solr.update.TestInPlaceUpdatesDistrib_A4E4F05D7D7D4780-001\control-001\cores\control_collection_shard1_replica_n1], dataDir=[C:\Users\jenkins\workspace\Lucene-Solr-8.x-Windows\solr\build\solr-core\test\J1\temp\solr.update.TestInPlaceUpdatesDistrib_A4E4F05D7D7D4780-001\control-001\cores\control_collection_shard1_replica_n1\data\]
   [junit4]   2> 1306482 WARN  (qtp21430058-15124) [n:127.0.0.1:53155_wj c:control_collection s:shard1  x:control_collection_shard1_replica_n1] o.a.s.c.RequestHandlers INVALID paramSet a in requestHandler {type = requestHandler,name = /dump,class = DumpRequestHandler,attributes = {initParams=a, name=/dump, class=DumpRequestHandler},args = {defaults={a=A,b=B}}}
   [junit4]   2> 1306587 INFO  (qtp21430058-15124) [n:127.0.0.1:53155_wj c:control_collection s:shard1  x:control_collection_shard1_replica_n1] o.a.s.u.UpdateHandler Using UpdateLog implementation: org.apache.solr.update.CdcrUpdateLog
   [junit4]   2> 1306587 INFO  (qtp21430058-15124) [n:127.0.0.1:53155_wj c:control_collection s:shard1  x:control_collection_shard1_replica_n1] o.a.s.u.UpdateLog Initializing UpdateLog: dataDir= defaultSyncLevel=FLUSH numRecordsToKeep=100 maxNumLogsToKeep=10 numVersionBuckets=65536
   [junit4]   2> 1306590 INFO  (qtp21430058-15124) [n:127.0.0.1:53155_wj c:control_collection s:shard1  x:control_collection_shard1_replica_n1] o.a.s.u.CommitTracker Hard AutoCommit: disabled
   [junit4]   2> 1306590 INFO  (qtp21430058-15124) [n:127.0.0.1:53155_wj c:control_collection s:shard1  x:control_collection_shard1_replica_n1] o.a.s.u.CommitTracker Soft AutoCommit: disabled
   [junit4]   2> 1306592 INFO  (qtp21430058-15124) [n:127.0.0.1:53155_wj c:control_collection s:shard1  x:control_collection_shard1_replica_n1] o.a.s.s.SolrIndexSearcher Opening [Searcher@170e581[control_collection_shard1_replica_n1] main]
   [junit4]   2> 1306593 INFO  (qtp21430058-15124) [n:127.0.0.1:53155_wj c:control_collection s:shard1  x:control_collection_shard1_replica_n1] o.a.s.r.ManagedResourceStorage Configured ZooKeeperStorageIO with znodeBase: /configs/conf1
   [junit4]   2> 1306594 INFO  (qtp21430058-15124) [n:127.0.0.1:53155_wj c:control_collection s:shard1  x:control_collection_shard1_replica_n1] o.a.s.r.ManagedResourceStorage Loaded null at path _rest_managed.json using ZooKeeperStorageIO:path=/configs/conf1
   [junit4]   2> 1306594 INFO  (qtp21430058-15124) [n:127.0.0.1:53155_wj c:control_collection s:shard1  x:control_collection_shard1_replica_n1] o.a.s.h.ReplicationHandler Commits will be reserved for 10000ms.
   [junit4]   2> 1306594 INFO  (qtp21430058-15124) [n:127.0.0.1:53155_wj c:control_collection s:shard1  x:control_collection_shard1_replica_n1] o.a.s.u.UpdateLog Could not find max version in index or recent updates, using new clock 1632320220108423168
   [junit4]   2> 1306598 INFO  (searcherExecutor-4907-thread-1-processing-n:127.0.0.1:53155_wj x:control_collection_shard1_replica_n1 c:control_collection s:shard1) [n:127.0.0.1:53155_wj c:control_collection s:shard1  x:control_collection_shard1_replica_n1] o.a.s.c.SolrCore [control_collection_shard1_replica_n1] Registered new searcher Searcher@170e581[control_collection_shard1_replica_n1] main{ExitableDirectoryReader(UninvertingDirectoryReader())}
   [junit4]   2> 1306601 INFO  (qtp21430058-15124) [n:127.0.0.1:53155_wj c:control_collection s:shard1  x:control_collection_shard1_replica_n1] o.a.s.c.ZkShardTerms Successful update of terms at /collections/control_collection/terms/shard1 to Terms{values={core_node2=0}, version=0}
   [junit4]   2> 1306602 INFO  (qtp21430058-15124) [n:127.0.0.1:53155_wj c:control_collection s:shard1  x:control_collection_shard1_replica_n1] o.a.s.c.ShardLeaderElectionContextBase make sure parent is created /collections/control_collection/leaders/shard1
   [junit4]   2> 1306607 INFO  (qtp21430058-15124) [n:127.0.0.1:53155_wj c:control_collection s:shard1  x:control_collection_shard1_replica_n1] o.a.s.c.ShardLeaderElectionContext Enough replicas found to continue.
   [junit4]   2> 1306607 INFO  (qtp21430058-15124) [n:127.0.0.1:53155_wj c:control_collection s:shard1  x:control_collection_shard1_replica_n1] o.a.s.c.ShardLeaderElectionContext I may be the new leader - try and sync
   [junit4]   2> 1306607 INFO  (qtp21430058-15124) [n:127.0.0.1:53155_wj c:control_collection s:shard1  x:control_collection_shard1_replica_n1] o.a.s.c.SyncStrategy Sync replicas to http://127.0.0.1:53155/wj/control_collection_shard1_replica_n1/
   [junit4]   2> 1306607 INFO  (qtp21430058-15124) [n:127.0.0.1:53155_wj c:control_collection s:shard1  x:control_collection_shard1_replica_n1] o.a.s.c.SyncStrategy Sync Success - now sync replicas to me
   [junit4]   2> 1306608 INFO  (qtp21430058-15124) [n:127.0.0.1:53155_wj c:control_collection s:shard1  x:control_collection_shard1_replica_n1] o.a.s.c.SyncStrategy http://127.0.0.1:53155/wj/control_collection_shard1_replica_n1/ has no replicas
   [junit4]   2> 1306608 INFO  (qtp21430058-15124) [n:127.0.0.1:53155_wj c:control_collection s:shard1  x:control_collection_shard1_replica_n1] o.a.s.c.ShardLeaderElectionContextBase Creating leader registration node /collections/control_collection/leaders/shard1/leader after winning as /collections/control_collection/leader_elect/shard1/election/72063309247217668-core_node2-n_0000000000
   [junit4]   2> 1306611 INFO  (qtp21430058-15124) [n:127.0.0.1:53155_wj c:control_collection s:shard1  x:control_collection_shard1_replica_n1] o.a.s.c.ShardLeaderElectionContext I am the new leader: http://127.0.0.1:53155/wj/control_collection_shard1_replica_n1/ shard1
   [junit4]   2> 1306714 INFO  (zkCallback-5656-thread-1) [    ] o.a.s.c.c.ZkStateReader A cluster state change: [WatchedEvent state:SyncConnected type:NodeDataChanged path:/collections/control_collection/state.json] for collection [control_collection] has occurred - updating... (live nodes size: [1])
   [junit4]   2> 1306715 INFO  (qtp21430058-15124) [n:127.0.0.1:53155_wj c:control_collection s:shard1  x:control_collection_shard1_replica_n1] o.a.s.c.ZkController I am the leader, no recovery necessary
   [junit4]   2> 1306718 INFO  (qtp21430058-15124) [n:127.0.0.1:53155_wj c:control_collection s:shard1  x:control_collection_shard1_replica_n1] o.a.s.s.HttpSolrCall [admin] webapp=null path=/admin/cores params={qt=/admin/cores&collection.configName=conf1&newCollection=true&name=control_collection_shard1_replica_n1&action=CREATE&numShards=1&collection=control_collection&shard=shard1&wt=javabin&version=2&replicaType=NRT} status=0 QTime=1313
   [junit4]   2> 1306723 INFO  (qtp21430058-15121) [n:127.0.0.1:53155_wj    ] o.a.s.h.a.CollectionsHandler Wait for new collection to be active for at most 45 seconds. Check all shard replicas
   [junit4]   2> 1306819 INFO  (zkCallback-5656-thread-2) [    ] o.a.s.c.c.ZkStateReader A cluster state change: [WatchedEvent state:SyncConnected type:NodeDataChanged path:/collections/control_collection/state.json] for collection [control_collection] has occurred - updating... (live nodes size: [1])
   [junit4]   2> 1306819 INFO  (zkCallback-5656-thread-1) [    ] o.a.s.c.c.ZkStateReader A cluster state change: [WatchedEvent state:SyncConnected type:NodeDataChanged path:/collections/control_collection/state.json] for collection [control_collection] has occurred - updating... (live nodes size: [1])
   [junit4]   2> 1306821 INFO  (qtp21430058-15121) [n:127.0.0.1:53155_wj    ] o.a.s.s.HttpSolrCall [admin] webapp=null path=/admin/collections params={collection.configName=conf1&name=control_collection&nrtReplicas=1&action=CREATE&numShards=1&createNodeSet=127.0.0.1:53155_wj&wt=javabin&version=2} status=0 QTime=1531
   [junit4]   2> 1306825 WARN  (NIOServerCxn.Factory:0.0.0.0/0.0.0.0:0) [    ] o.a.z.s.NIOServerCnxn Unable to read additional data from client sessionid 0x1000532ad050006, likely client has closed socket
   [junit4]   2> 1306835 INFO  (zkConnectionManagerCallback-5676-thread-1) [    ] o.a.s.c.c.ConnectionManager zkClient has connected
   [junit4]   2> 1306838 INFO  (TEST-TestInPlaceUpdatesDistrib.test-seed#[A4E4F05D7D7D4780]) [    ] o.a.s.c.c.ZkStateReader Updated live nodes from ZooKeeper... (0) -> (1)
   [junit4]   2> 1306839 INFO  (TEST-TestInPlaceUpdatesDistrib.test-seed#[A4E4F05D7D7D4780]) [    ] o.a.s.c.s.i.ZkClientClusterStateProvider Cluster at 127.0.0.1:53147/solr ready
   [junit4]   2> 1306839 INFO  (TEST-TestInPlaceUpdatesDistrib.test-seed#[A4E4F05D7D7D4780]) [    ] o.a.s.c.ChaosMonkey monkey: init - expire sessions:false cause connection loss:false
   [junit4]   2> 1306842 INFO  (qtp21430058-15120) [n:127.0.0.1:53155_wj    ] o.a.s.h.a.CollectionsHandler Invoked Collection Action :create with params collection.configName=conf1&name=collection1&nrtReplicas=1&action=CREATE&numShards=1&createNodeSet=&stateFormat=1&wt=javabin&version=2 and sendToOCPQueue=true
   [junit4]   2> 1306847 INFO  (OverseerCollectionConfigSetProcessor-72063309247217668-127.0.0.1:53155_wj-n_0000000000) [    ] o.a.s.c.OverseerTaskQueue Response ZK path: /overseer/collection-queue-work/qnr-0000000000 doesn't exist.  Requestor may have disconnected from ZooKeeper
   [junit4]   2> 1306847 INFO  (OverseerThreadFactory-4902-thread-2) [    ] o.a.s.c.a.c.CreateCollectionCmd Create collection collection1
   [junit4]   2> 1307052 WARN  (OverseerThreadFactory-4902-thread-2) [    ] o.a.s.c.a.c.CreateCollectionCmd It is unusual to create a collection (collection1) without cores.
   [junit4]   2> 1307054 INFO  (qtp21430058-15120) [n:127.0.0.1:53155_wj    ] o.a.s.h.a.CollectionsHandler Wait for new collection to be active for at most 45 seconds. Check all shard replicas
   [junit4]   2> 1307055 INFO  (qtp21430058-15120) [n:127.0.0.1:53155_wj    ] o.a.s.s.HttpSolrCall [admin] webapp=null path=/admin/collections params={collection.configName=conf1&name=collection1&nrtReplicas=1&action=CREATE&numShards=1&createNodeSet=&stateFormat=1&wt=javabin&version=2} status=0 QTime=213
   [junit4]   2> 1307057 INFO  (TEST-TestInPlaceUpdatesDistrib.test-seed#[A4E4F05D7D7D4780]) [    ] o.a.s.c.AbstractFullDistribZkTestBase Creating jetty instances pullReplicaCount=0 numOtherReplicas=3
   [junit4]   2> 1307751 INFO  (TEST-TestInPlaceUpdatesDistrib.test-seed#[A4E4F05D7D7D4780]) [    ] o.a.s.c.AbstractFullDistribZkTestBase create jetty 1 in directory C:\Users\jenkins\workspace\Lucene-Solr-8.x-Windows\solr\build\solr-core\test\J1\temp\solr.update.TestInPlaceUpdatesDistrib_A4E4F05D7D7D4780-001\shard-1-001 of type NRT
   [junit4]   2> 1307758 WARN  (closeThreadPool-5677-thread-1) [    ] o.e.j.s.AbstractConnector Ignoring deprecated socket close linger time
   [junit4]   2> 1307759 INFO  (closeThreadPool-5677-thread-1) [    ] o.a.s.c.s.e.JettySolrRunner Start Jetty (original configured port=0)
   [junit4]   2> 1307759 INFO  (closeThreadPool-5677-thread-1) [    ] o.a.s.c.s.e.JettySolrRunner Trying to start Jetty on port 0 try number 1 ...
   [junit4]   2> 1307759 INFO  (closeThreadPool-5677-thread-1) [    ] o.e.j.s.Server jetty-9.4.14.v20181114; built: 2018-11-14T21:20:31.478Z; git: c4550056e785fb5665914545889f21dc136ad9e6; jvm 1.8.0_201-b09
   [junit4]   2> 1307760 INFO  (closeThreadPool-5677-thread-1) [    ] o.e.j.s.session DefaultSessionIdManager workerName=node0
   [junit4]   2> 1307760 INFO  (closeThreadPool-5677-thread-1) [    ] o.e.j.s.session No SessionScavenger set, using defaults
   [junit4]   2> 1307760 INFO  (closeThreadPool-5677-thread-1) [    ] o.e.j.s.session node0 Scavenging every 660000ms
   [junit4]   2> 1307764 INFO  (closeThreadPool-5677-thread-1) [    ] o.e.j.s.h.ContextHandler Started o.e.j.s.ServletContextHandler@3bbe8a{/wj,null,AVAILABLE}
   [junit4]   2> 1307775 INFO  (closeThreadPool-5677-thread-1) [    ] o.e.j.s.AbstractConnector Started ServerConnector@c2cc74{HTTP/1.1,[http/1.1, h2c]}{127.0.0.1:53208}
   [junit4]   2> 1307775 INFO  (closeThreadPool-5677-thread-1) [    ] o.e.j.s.Server Started @1307814ms
   [junit4]   2> 1307775 INFO  (closeThreadPool-5677-thread-1) [    ] o.a.s.c.s.e.JettySolrRunner Jetty properties: {solr.data.dir=C:\Users\jenkins\workspace\Lucene-Solr-8.x-Windows\solr\build\solr-core\test\J1\temp\solr.update.TestInPlaceUpdatesDistrib_A4E4F05D7D7D4780-001\tempDir-001/jetty1, solrconfig=solrconfig.xml, hostContext=/wj, hostPort=53208, coreRootDirectory=C:\Users\jenkins\workspace\Lucene-Solr-8.x-Windows\solr\build\solr-core\test\J1\..\..\..\..\..\..\..\..\..\Users\jenkins\workspace\Lucene-Solr-8.x-Windows\solr\build\solr-core\test\J1\temp\solr.update.TestInPlaceUpdatesDistrib_A4E4F05D7D7D4780-001\shard-1-001\cores}
   [junit4]   2> 1307775 ERROR (closeThreadPool-5677-thread-1) [    ] o.a.s.u.StartupLoggingUtils Missing Java Option solr.log.dir. Logging may be missing or incomplete.
   [junit4]   2> 1307775 INFO  (closeThreadPool-5677-thread-1) [    ] o.a.s.s.SolrDispatchFilter Using logger factory org.apache.logging.slf4j.Log4jLoggerFactory
   [junit4]   2> 1307775 INFO  (closeThreadPool-5677-thread-1) [    ] o.a.s.s.SolrDispatchFilter  ___      _       Welcome to Apache Solr™ version 8.1.0
   [junit4]   2> 1307775 INFO  (closeThreadPool-5677-thread-1) [    ] o.a.s.s.SolrDispatchFilter / __| ___| |_ _   Starting in cloud mode on port null
   [junit4]   2> 1307775 INFO  (closeThreadPool-5677-thread-1) [    ] o.a.s.s.SolrDispatchFilter \__ \/ _ \ | '_|  Install dir: null
   [junit4]   2> 1307777 INFO  (closeThreadPool-5677-thread-1) [    ] o.a.s.s.SolrDispatchFilter |___/\___/_|_|    Start time: 2019-05-01T09:11:11.249Z
   [junit4]   2> 1307788 INFO  (zkConnectionManagerCallback-5679-thread-1) [    ] o.a.s.c.c.ConnectionManager zkClient has connected
   [junit4]   2> 1307795 INFO  (closeThreadPool-5677-thread-1) [    ] o.a.s.s.SolrDispatchFilter Loading solr.xml from SolrHome (not found in ZooKeeper)
   [junit4]   2> 1307795 INFO  (closeThreadPool-5677-thread-1) [    ] o.a.s.c.SolrXmlConfig Loading container configuration from C:\Users\jenkins\workspace\Lucene-Solr-8.x-Windows\solr\build\solr-core\test\J1\temp\solr.update.TestInPlaceUpdatesDistrib_A4E4F05D7D7D4780-001\shard-1-001\solr.xml
   [junit4]   2> 1307809 INFO  (closeThreadPool-5677-thread-1) [    ] o.a.s.c.SolrXmlConfig Configuration parameter autoReplicaFailoverWorkLoopDelay is ignored
   [junit4]   2> 1307809 INFO  (closeThreadPool-5677-thread-1) [    ] o.a.s.c.SolrXmlConfig Configuration parameter autoReplicaFailoverBadNodeExpiration is ignored
   [junit4]   2> 1307810 INFO  (closeThreadPool-5677-thread-1) [    ] o.a.s.c.SolrXmlConfig MBean server found: com.sun.jmx.mbeanserver.JmxMBeanServer@a292d2, but no JMX reporters were configured - adding default JMX reporter.
   [junit4]   2> 1308406 INFO  (TEST-TestInPlaceUpdatesDistrib.test-seed#[A4E4F05D7D7D4780]) [    ] o.a.s.c.AbstractFullDistribZkTestBase create jetty 2 in directory C:\Users\jenkins\workspace\Lucene-Solr-8.x-Windows\solr\build\solr-core\test\J1\temp\solr.update.TestInPlaceUpdatesDistrib_A4E4F05D7D7D4780-001\shard-2-001 of type NRT
   [junit4]   2> 1308460 WARN  (closeThreadPool-5677-thread-2) [    ] o.e.j.s.AbstractConnector Ignoring deprecated socket close linger time
   [junit4]   2> 1308464 INFO  (closeThreadPool-5677-thread-2) [    ] o.a.s.c.s.e.JettySolrRunner Start Jetty (original configured port=0)
   [junit4]   2> 1308464 INFO  (closeThreadPool-5677-thread-2) [    ] o.a.s.c.s.e.JettySolrRunner Trying to start Jetty on port 0 try number 1 ...
   [junit4]   2> 1308464 INFO  (closeThreadPool-5677-thread-2) [    ] o.e.j.s.Server jetty-9.4.14.v20181114; built: 2018-11-14T21:20:31.478Z; git: c4550056e785fb5665914545889f21dc136ad9e6; jvm 1.8.0_201-b09
   [junit4]   2> 1308464 INFO  (closeThreadPool-5677-thread-2) [    ] o.e.j.s.session DefaultSessionIdManager workerName=node0
   [junit4]   2> 1308464 INFO  (closeThreadPool-5677-thread-2) [    ] o.e.j.s.session No SessionScavenger set, using defaults
   [junit4]   2> 1308464 INFO  (closeThreadPool-5677-thread-2) [    ] o.e.j.s.session node0 Scavenging every 660000ms
   [junit4]   2> 1308464 INFO  (closeThreadPool-5677-thread-2) [    ] o.e.j.s.h.ContextHandler Started o.e.j.s.ServletContextHandler@1f6c74a{/wj,null,AVAILABLE}
   [junit4]   2> 1308549 INFO  (closeThreadPool-5677-thread-2) [    ] o.e.j.s.AbstractConnector Started ServerConnector@153e422{HTTP/1.1,[http/1.1, h2c]}{127.0.0.1:53217}
   [junit4]   2> 1308549 INFO  (closeThreadPool-5677-thread-2) [    ] o.e.j.s.Server Started @1308588ms
   [junit4]   2> 1308549 INFO  (closeThreadPool-5677-thread-2) [    ] o.a.s.c.s.e.JettySolrRunner Jetty properties: {solr.data.dir=C:\Users\jenkins\workspace\Lucene-Solr-8.x-Windows\solr\build\solr-core\test\J1\temp\solr.update.TestInPlaceUpdatesDistrib_A4E4F05D7D7D4780-001\tempDir-001/jetty2, solrconfig=solrconfig.xml, hostContext=/wj, hostPort=53217, coreRootDirectory=C:\Users\jenkins\workspace\Lucene-Solr-8.x-Windows\solr\build\solr-core\test\J1\..\..\..\..\..\..\..\..\..\Users\jenkins\workspace\Lucene-Solr-8.x-Windows\solr\build\solr-core\test\J1\temp\solr.update.TestInPlaceUpdatesDistrib_A4E4F05D7D7D4780-001\shard-2-001\cores}
   [junit4]   2> 1308549 ERROR (closeThreadPool-5677-thread-2) [    ] o.a.s.u.StartupLoggingUtils Missing Java Option solr.log.dir. Logging may be missing or incomplete.
   [junit4]   2> 1308549 INFO  (closeThreadPool-5677-thread-2) [    ] o.a.s.s.SolrDispatchFilter Using logger factory org.apache.logging.slf4j.Log4jLoggerFactory
   [junit4]   2> 1308549 INFO  (closeThreadPool-5677-thread-2) [    ] o.a.s.s.SolrDispatchFilter  ___      _       Welcome to Apache Solr™ version 8.1.0
   [junit4]   2> 1308549 INFO  (closeThreadPool-5677-thread-2) [    ] o.a.s.s.SolrDispatchFilter / __| ___| |_ _   Starting in cloud mode on port null
   [junit4]   2> 1308549 INFO  (closeThreadPool-5677-thread-2) [    ] o.a.s.s.SolrDispatchFilter \__ \/ _ \ | '_|  Install dir: null
   [junit4]   2> 1308549 INFO  (closeThreadPool-5677-thread-2) [    ] o.a.s.s.SolrDispatchFilter |___/\___/_|_|    Start time: 2019-05-01T09:11:12.023Z
   [junit4]   2> 1308856 INFO  (OverseerCollectionConfigSetProcessor-72063309247217668-127.0.0.1:53155_wj-n_0000000000) [    ] o.a.s.c.OverseerTaskQueue Response ZK path: /overseer/collection-queue-work/qnr-0000000002 doesn't exist.  Requestor may have disconnected from ZooKeeper
   [junit4]   2> 1308935 INFO  (closeThreadPool-5677-thread-1) [    ] o.a.s.h.c.HttpShardHandlerFactory Host whitelist initialized: WhitelistHostChecker [whitelistHosts=null, whitelistHostCheckingEnabled=false]
   [junit4]   2> 1308935 INFO  (zkConnectionManagerCallback-5682-thread-1) [    ] o.a.s.c.c.ConnectionManager zkClient has connected
   [junit4]   2> 1308938 INFO  (closeThreadPool-5677-thread-2) [    ] o.a.s.s.SolrDispatchFilter Loading solr.xml from SolrHome (not found in ZooKeeper)
   [junit4]   2> 1308938 INFO  (closeThreadPool-5677-thread-2) [    ] o.a.s.c.SolrXmlConfig Loading container configuration from C:\Users\jenkins\workspace\Lucene-Solr-8.x-Windows\solr\build\solr-core\test\J1\temp\solr.update.TestInPlaceUpdatesDistrib_A4E4F05D7D7D4780-001\shard-2-001\solr.xml
   [junit4]   2> 1308940 WARN  (closeThreadPool-5677-thread-1) [    ] o.e.j.u.s.S.config No Client EndPointIdentificationAlgorithm configured for SslContextFactory@ff0c11[provider=null,keyStore=null,trustStore=null]
   [junit4]   2> 1308950 INFO  (closeThreadPool-5677-thread-2) [    ] o.a.s.c.SolrXmlConfig Configuration parameter autoReplicaFailoverWorkLoopDelay is ignored
   [junit4]   2> 1308950 INFO  (closeThreadPool-5677-thread-2) [    ] o.a.s.c.SolrXmlConfig Configuration parameter autoReplicaFailoverBadNodeExpiration is ignored
   [junit4]   2> 1308953 INFO  (closeThreadPool-5677-thread-2) [    ] o.a.s.c.SolrXmlConfig MBean server found: com.sun.jmx.mbeanserver.JmxMBeanServer@a292d2, but no JMX reporters were configured - adding default JMX reporter.
   [junit4]   2> 1308996 WARN  (closeThreadPool-5677-thread-1) [    ] o.e.j.u.s.S.config No Client EndPointIdentificationAlgorithm configured for SslContextFactory@507b90[provider=null,keyStore=null,trustStore=null]
   [junit4]   2> 1308998 INFO  (closeThreadPool-5677-thread-1) [    ] o.a.s.c.ZkContainer Zookeeper client=127.0.0.1:53147/solr
   [junit4]   2> 1309004 INFO  (TEST-TestInPlaceUpdatesDistrib.test-seed#[A4E4F05D7D7D4780]) [    ] o.a.s.c.AbstractFullDistribZkTestBase create jetty 3 in directory C:\Users\jenkins\workspace\Lucene-Solr-8.x-Windows\solr\build\solr-core\test\J1\temp\solr.update.TestInPlaceUpdatesDistrib_A4E4F05D7D7D4780-001\shard-3-001 of type NRT
   [junit4]   2> 1309007 WARN  (closeThreadPool-5677-thread-3) [    ] o.e.j.s.AbstractConnector Ignoring deprecated socket close linger time
   [junit4]   2> 1309008 INFO  (closeThreadPool-5677-thread-3) [    ] o.a.s.c.s.e.JettySolrRunner Start Jetty (original configured port=0)
   [junit4]   2> 1309008 INFO  (closeThreadPool-5677-thread-3) [    ] o.a.s.c.s.e.JettySolrRunner Trying to start Jetty on port 0 try number 1 ...
   [junit4]   2> 1309008 INFO  (closeThreadPool-5677-thread-3) [    ] o.e.j.s.Server jetty-9.4.14.v20181114; built: 2018-11-14T21:20:31.478Z; git: c4550056e785fb5665914545889f21dc136ad9e6; jvm 1.8.0_201-b09
   [junit4]   2> 1309009 INFO  (closeThreadPool-5677-thread-3) [    ] o.e.j.s.session DefaultSessionIdManager workerName=node0
   [junit4]   2> 1309009 INFO  (closeThreadPool-5677-thread-3) [    ] o.e.j.s.session No SessionScavenger set, using defaults
   [junit4]   2> 1309009 INFO  (closeThreadPool-5677-thread-3) [    ] o.e.j.s.session node0 Scavenging every 600000ms
   [junit4]   2> 1309010 INFO  (closeThreadPool-5677-thread-3) [    ] o.e.j.s.h.ContextHandler Started o.e.j.s.ServletContextHandler@1fcbd1c{/wj,null,AVAILABLE}
   [junit4]   2> 1309011 INFO  (closeThreadPool-5677-thread-3) [    ] o.e.j.s.AbstractConnector Started ServerConnector@99992e{HTTP/1.1,[http/1.1, h2c]}{127.0.0.1:53230}
   [junit4]   2> 1309011 INFO  (closeThreadPool-5677-thread-3) [    ] o.e.j.s.Server Started @1309050ms
   [junit4]   2> 1309011 INFO  (closeThreadPool-5677-thread-3) [    ] o.a.s.c.s.e.JettySolrRunner Jetty properties: {solr.data.dir=C:\Users\jenkins\workspace\Lucene-Solr-8.x-Windows\solr\build\solr-core\test\J1\temp\solr.update.TestInPlaceUpdatesDistrib_A4E4F05D7D7D4780-001\tempDir-001/jetty3, solrconfig=solrconfig.xml, hostContext=/wj, hostPort=53230, coreRootDirectory=C:\Users\jenkins\workspace\Lucene-Solr-8.x-Windows\solr\build\solr-core\test\J1\..\..\..\..\..\..\..\..\..\Users\jenkins\workspace\Lucene-Solr-8.x-Windows\solr\build\solr-core\test\J1\temp\solr.update.TestInPlaceUpdatesDistrib_A4E4F05D7D7D4780-001\shard-3-001\cores}
   [junit4]   2> 1309012 ERROR (closeThreadPool-5677-thread-3) [    ] o.a.s.u.StartupLoggingUtils Missing Java Option solr.log.dir. Logging may be missing or incomplete.
   [junit4]   2> 1309012 INFO  (closeThreadPool-5677-thread-3) [    ] o.a.s.s.SolrDispatchFilter Using logger factory org.apache.logging.slf4j.Log4jLoggerFactory
   [junit4]   2> 1309012 INFO  (closeThreadPool-5677-thread-3) [    ] o.a.s.s.SolrDispatchFilter  ___      _       Welcome to Apache Solr™ version 8.1.0
   [junit4]   2> 1309012 INFO  (closeThreadPool-5677-thread-3) [    ] o.a.s.s.SolrDispatchFilter / __| ___| |_ _   Starting in cloud mode on port null
   [junit4]   2> 1309012 INFO  (closeThreadPool-5677-thread-3) [    ] o.a.s.s.SolrDispatchFilter \__ \/ _ \ | '_|  Install dir: null
   [junit4]   2> 1309012 INFO  (closeThreadPool-5677-thread-3) [    ] o.a.s.s.SolrDispatchFilter |___/\___/_|_|    Start time: 2019-05-01T09:11:12.486Z
   [junit4]   2> 1309020 INFO  (zkConnectionManagerCallback-5689-thread-1) [    ] o.a.s.c.c.ConnectionManager zkClient has connected
   [junit4]   2> 1309027 INFO  (zkConnectionManagerCallback-5691-thread-1) [    ] o.a.s.c.c.ConnectionManager zkClient has connected
   [junit4]   2> 1309028 INFO  (closeThreadPool-5677-thread-3) [    ] o.a.s.s.SolrDispatchFilter Loading solr.xml from SolrHome (not found in ZooKeeper)
   [junit4]   2> 1309028 INFO  (closeThreadPool-5677-thread-3) [    ] o.a.s.c.SolrXmlConfig Loading container configuration from C:\Users\jenkins\workspace\Lucene-Solr-8.x-Windows\solr\build\solr-core\test\J1\temp\solr.update.TestInPlaceUpdatesDistrib_A4E4F05D7D7D4780-001\shard-3-001\solr.xml
   [junit4]   2> 1309028 WARN  (NIOServerCxn.Factory:0.0.0.0/0.0.0.0:0) [    ] o.a.z.s.NIOServerCnxn Unable to read additional data from client sessionid 0x1000532ad05000b, likely client has closed socket
   [junit4]   2> 1309034 INFO  (closeThreadPool-5677-thread-3) [    ] o.a.s.c.SolrXmlConfig Configuration parameter autoReplicaFailoverWorkLoopDelay is ignored
   [junit4]   2> 1309034 INFO  (closeThreadPool-5677-thread-3) [    ] o.a.s.c.SolrXmlConfig Configuration parameter autoReplicaFailoverBadNodeExpiration is ignored
   [junit4]   2> 1309036 INFO  (closeThreadPool-5677-thread-3) [    ] o.a.s.c.SolrXmlConfig MBean server found: com.sun.jmx.mbeanserver.JmxMBeanServer@a292d2, but no JMX reporters were configured - adding default JMX reporter.
   [junit4]   2> 1309154 INFO  (zkConnectionManagerCallback-5693-thread-1) [    ] o.a.s.c.c.ConnectionManager zkClient has connected
   [junit4]   2> 1309159 INFO  (closeThreadPool-5677-thread-1) [n:127.0.0.1:53208_wj    ] o.a.s.c.c.ZkStateReader Updated live nodes from ZooKeeper... (0) -> (1)
   [junit4]   2> 1309171 INFO  (closeThreadPool-5677-thread-1) [n:127.0.0.1:53208_wj    ] o.a.s.c.ZkController Publish node=127.0.0.1:53208_wj as DOWN
   [junit4]   2> 1309171 INFO  (closeThreadPool-5677-thread-1) [n:127.0.0.1:53208_wj    ] o.a.s.c.TransientSolrCoreCacheDefault Allocating transient cache for 4 transient cores
   [junit4]   2> 1309171 INFO  (closeThreadPool-5677-thread-1) [n:127.0.0.1:53208_wj    ] o.a.s.c.ZkController Register node as live in ZooKeeper:/live_nodes/127.0.0.1:53208_wj
   [junit4]   2> 1309178 INFO  (zkCallback-5656-thread-3) [    ] o.a.s.c.c.ZkStateReader Updated live nodes from ZooKeeper... (1) -> (2)
   [junit4]   2> 1309178 INFO  (zkCallback-5663-thread-1) [    ] o.a.s.c.c.ZkStateReader Updated live nodes from ZooKeeper... (1) -> (2)
   [junit4]   2> 1309178 INFO  (zkCallback-5675-thread-1) [    ] o.a.s.c.c.ZkStateReader Updated live nodes from ZooKeeper... (1) -> (2)
   [junit4]   2> 1309249 INFO  (zkCallback-5692-thread-1) [    ] o.a.s.c.c.ZkStateReader Updated live nodes from ZooKeeper... (1) -> (2)
   [junit4]   2> 1309515 INFO  (zkConnectionManagerCallback-5701-thread-1) [    ] o.a.s.c.c.ConnectionManager zkClient has connected
   [junit4]   2> 1309515 INFO  (closeThreadPool-5677-thread-1) [n:127.0.0.1:53208_wj    ] o.a.s.c.c.ZkStateReader Updated live nodes from ZooKeeper... (0) -> (2)
   [junit4]   2> 1309519 INFO  (closeThreadPool-5677-thread-1) [n:127.0.0.1:53208_wj    ] o.a.s.c.s.i.ZkClientClusterStateProvider Cluster at 127.0.0.1:53147/solr ready
   [junit4]   2> 1309519 INFO  (closeThreadPool-5677-thread-1) [n:127.0.0.1:53208_wj    ] o.a.s.h.a.MetricsHistoryHandler No .system collection, keeping metrics history in memory.
   [junit4]   2> 1309564 INFO  (closeThreadPool-5677-thread-1) [n:127.0.0.1:53208_wj    ] o.a.s.m.r.SolrJmxReporter JMX monitoring for 'solr.node' (registry 'solr.node') enabled at server: com.sun.jmx.mbeanserver.JmxMBeanServer@a292d2
   [junit4]   2> 1309576 INFO  (closeThreadPool-5677-thread-1) [n:127.0.0.1:53208_wj    ] o.a.s.m.r.SolrJmxReporter JMX monitoring for 'solr.jvm' (registry 'solr.jvm') enabled at server: com.sun.jmx.mbeanserver.JmxMBeanServer@a292d2
   [junit4]   2> 1309576 INFO  (closeThreadPool-5677-thread-1) [n:127.0.0.1:53208_wj    ] o.a.s.m.r.SolrJmxReporter JMX monitoring for 'solr.jetty' (registry 'solr.jetty') enabled at server: com.sun.jmx.mbeanserver.JmxMBeanServer@a292d2
   [junit4]   2> 1309580 INFO  (closeThreadPool-5677-thread-1) [n:127.0.0.1:53208_wj    ] o.a.s.c.CorePropertiesLocator Found 0 core definitions underneath C:\Users\jenkins\workspace\Lucene-Solr-8.x-Windows\solr\build\solr-core\test\J1\..\..\..\..\..\..\..\..\..\Users\jenkins\workspace\Lucene-Solr-8.x-Windows\solr\build\solr-core\test\J1\temp\solr.update.TestInPlaceUpdatesDistrib_A4E4F05D7D7D4780-001\shard-1-001\cores
   [junit4]   2> 1310313 INFO  (closeThreadPool-5677-thread-2) [    ] o.a.s.h.c.HttpShardHandlerFactory Host whitelist initialized: WhitelistHostChecker [whitelistHosts=null, whitelistHostCheckingEnabled=false]
   [junit4]   2> 1310319 WARN  (closeThreadPool-5677-thread-2) [    ] o.e.j.u.s.S.config No Client EndPointIdentificationAlgorithm configured for SslContextFactory@e8df4c[provider=null,keyStore=null,trustStore=null]
   [junit4]   2> 1310324 WARN  (closeThreadPool-5677-thread-2) [    ] o.e.j.u.s.S.config No Client EndPointIdentificationAlgorithm configured for SslContextFactory@4536a[provider=null,keyStore=null,trustStore=null]
   [junit4]   2> 1310326 INFO  (closeThreadPool-5677-thread-2) [    ] o.a.s.c.ZkContainer Zookeeper client=127.0.0.1:53147/solr
   [junit4]   2> 1310331 INFO  (zkConnectionManagerCallback-5708-thread-1) [    ] o.a.s.c.c.ConnectionManager zkClient has connected
   [junit4]   2> 1310333 WARN  (NIOServerCxn.Factory:0.0.0.0/0.0.0.0:0) [    ] o.a.z.s.NIOServerCnxn Unable to read additional data from client sessionid 0x1000532ad05000e, likely client has closed socket
   [junit4]   2> 1310337 INFO  (zkConnectionManagerCallback-5710-thread-1) [    ] o.a.s.c.c.ConnectionManager zkClient has connected
   [junit4]   2> 1310344 INFO  (closeThreadPool-5677-thread-2) [n:127.0.0.1:53217_wj    ] o.a.s.c.c.ZkStateReader Updated live nodes from ZooKeeper... (0) -> (2)
   [junit4]   2> 1310349 INFO  (closeThreadPool-5677-thread-2) [n:127.0.0.1:53217_wj    ] o.a.s.c.ZkController Publish node=127.0.0.1:53217_wj as DOWN
   [junit4]   2> 1310350 INFO  (closeThreadPool-5677-thread-2) [n:127.0.0.1:53217_wj    ] o.a.s.c.TransientSolrCoreCacheDefault Allocating transient cache for 4 transient cores
   [junit4]   2> 1310350 INFO  (closeThreadPool-5677-thread-2) [n:127.0.0.1:53217_wj    ] o.a.s.c.ZkController Register node as live in ZooKeeper:/live_nodes/127.0.0.1:53217_wj
   [junit4]   2> 1310351 INFO  (zkCallback-5656-thread-3) [    ] o.a.s.c.c.ZkStateReader Updated live nodes from ZooKeeper... (2) -> (3)
   [junit4]   2> 1310351 INFO  (zkCallback-5675-thread-1) [    ] o.a.s.c.c.ZkStateReader Updated live nodes from ZooKeeper... (2) -> (3)
   [junit4]   2> 1310351 INFO  (zkCallback-5663-thread-1) [    ] o.a.s.c.c.ZkStateReader Updated live nodes from ZooKeeper... (2) -> (3)
   [junit4]   2> 1310353 INFO  (zkCallback-5692-thread-1) [    ] o.a.s.c.c.ZkStateReader Updated live nodes from ZooKeeper... (2) -> (3)
   [junit4]   2> 1310413 INFO  (zkCallback-5700-thread-1) [    ] o.a.s.c.c.ZkStateReader Updated live nodes from ZooKeeper... (2) -> (3)
   [junit4]   2> 1310414 INFO  (zkCallback-5709-thread-1) [    ] o.a.s.c.c.ZkStateReader Updated live nodes from ZooKeeper... (2) -> (3)
   [junit4]   2> 1310420 INFO  (zkConnectionManagerCallback-5717-thread-1) [    ] o.a.s.c.c.ConnectionManager zkClient has connected
   [junit4]   2> 1310424 INFO  (closeThreadPool-5677-thread-2) [n:127.0.0.1:53217_wj    ] o.a.s.c.c.ZkStateReader Updated live nodes from ZooKeeper... (0) -> (3)
   [junit4]   2> 1310426 INFO  (closeThreadPool-5677-thread-2) [n:127.0.0.1:53217_wj    ] o.a.s.c.s.i.ZkClientClusterStateProvider Cluster at 127.0.0.1:53147/solr ready
   [junit4]   2> 1310426 INFO  (closeThreadPool-5677-thread-2) [n:127.0.0.1:53217_wj    ] o.a.s.h.a.MetricsHistoryHandler No .system collection, keeping metrics history in memory.
   [junit4]   2> 1310460 INFO  (closeThreadPool-5677-thread-2) [n:127.0.0.1:53217_wj    ] o.a.s.m.r.SolrJmxReporter JMX monitoring for 'solr.node' (registry 'solr.node') enabled at server: com.sun.jmx.mbeanserver.JmxMBeanServer@a292d2
   [junit4]   2> 1310475 INFO  (closeThreadPool-5677-thread-2) [n:127.0.0.1:53217_wj    ] o.a.s.m.r.SolrJmxReporter JMX monitoring for 'solr.jvm' (registry 'solr.jvm') enabled at server: com.sun.jmx.mbeanserver.JmxMBeanServer@a292d2
   [junit4]   2> 1310475 INFO  (closeThreadPool-5677-thread-2) [n:127.0.0.1:53217_wj    ] o.a.s.m.r.SolrJmxReporter JMX monitoring for 'solr.jetty' (registry 'solr.jetty') enabled at server: com.sun.jmx.mbeanserver.JmxMBeanServer@a292d2
   [junit4]   2> 1310477 INFO  (closeThreadPool-5677-thread-2) [n:127.0.0.1:53217_wj    ] o.a.s.c.CorePropertiesLocator Found 0 core definitions underneath C:\Users\jenkins\workspace\Lucene-Solr-8.x-Windows\solr\build\solr-core\test\J1\..\..\..\..\..\..\..\..\..\Users\jenkins\workspace\Lucene-Solr-8.x-Windows\solr\build\solr-core\test\J1\temp\solr.update.TestInPlaceUpdatesDistrib_A4E4F05D7D7D4780-001\shard-2-001\cores
   [junit4]   2> 1310895 INFO  (closeThreadPool-5677-thread-3) [    ] o.a.s.h.c.HttpShardHandlerFactory Host whitelist initialized: WhitelistHostChecker [whitelistHosts=null, whitelistHostCheckingEnabled=false]
   [junit4]   2> 1310897 WARN  (closeThreadPool-5677-thread-3) [    ] o.e.j.u.s.S.config No Client EndPointIdentificationAlgorithm configured for SslContextFactory@e98b66[provider=null,keyStore=null,trustStore=null]
   [junit4]   2> 1310903 WARN  (closeThreadPool-5677-thread-3) [    ] o.e.j.u.s.S.config No Client EndPointIdentificationAlgorithm configured for SslContextFactory@d7438b[provider=null,keyStore=null,trustStore=null]
   [junit4]   2> 1310904 INFO  (closeThreadPool-5677-thread-3) [    ] o.a.s.c.ZkContainer Zookeeper client=127.0.0.1:53147/solr
   [junit4]   2> 1310908 INFO  (zkConnectionManagerCallback-5724-thread-1) [    ] o.a.s.c.c.ConnectionManager zkClient has connected
   [junit4]   2> 1310913 INFO  (zkConnectionManagerCallback-5726-thread-1) [    ] o.a.s.c.c.ConnectionManager zkClient has connected
   [junit4]   2> 1310920 INFO  (closeThreadPool-5677-thread-3) [n:127.0.0.1:53230_wj    ] o.a.s.c.c.ZkStateReader Updated live nodes from ZooKeeper... (0) -> (3)
   [junit4]   2> 1310925 INFO  (closeThreadPool-5677-thread-3) [n:127.0.0.1:53230_wj    ] o.a.s.c.ZkController Publish node=127.0.0.1:53230_wj as DOWN
   [junit4]   2> 1310926 INFO  (closeThreadPool-5677-thread-3) [n:127.0.0.1:53230_wj    ] o.a.s.c.TransientSolrCoreCacheDefault Allocating transient cache for 4 transient cores
   [junit4]   2> 1310926 INFO  (closeThreadPool-5677-thread-3) [n:127.0.0.1:53230_wj    ] o.a.s.c.ZkController Register node as live in ZooKeeper:/live_nodes/127.0.0.1:53230_wj
   [junit4]   2> 1310929 INFO  (zkCallback-5700-thread-1) [    ] o.a.s.c.c.ZkStateReader Updated live nodes from ZooKeeper... (3) -> (4)
   [junit4]   2> 1310929 INFO  (zkCallback-5663-thread-1) [    ] o.a.s.c.c.ZkStateReader Updated live nodes from ZooKeeper... (3) -> (4)
   [junit4]   2> 1310929 INFO  (zkCallback-5656-thread-3) [    ] o.a.s.c.c.ZkStateReader Updated live nodes from ZooKeeper... (3) -> (4)
   [junit4]   2> 1310929 INFO  (zkCallback-5692-thread-1) [    ] o.a.s.c.c.ZkStateReader Updated live nodes from ZooKeeper... (3) -> (4)
   [junit4]   2> 1310929 INFO  (zkCallback-5709-thread-1) [    ] o.a.s.c.c.ZkStateReader Updated live nodes from ZooKeeper... (3) -> (4)
   [junit4]   2> 1310929 INFO  (zkCallback-5675-thread-1) [    ] o.a.s.c.c.ZkStateReader Updated live nodes from ZooKeeper... (3) -> (4)
   [junit4]   2> 1310930 INFO  (zkCallback-5716-thread-1) [    ] o.a.s.c.c.ZkStateReader Updated live nodes from ZooKeeper... (3) -> (4)
   [junit4]   2> 1310930 INFO  (zkCallback-5725-thread-1) [    ] o.a.s.c.c.ZkStateReader Updated live nodes from ZooKeeper... (3) -> (4)
   [junit4]   2> 1311006 INFO  (zkConnectionManagerCallback-5733-thread-1) [    ] o.a.s.c.c.ConnectionManager zkClient has connected
   [junit4]   2> 1311008 INFO  (closeThreadPool-5677-thread-3) [n:127.0.0.1:53230_wj    ] o.a.s.c.c.ZkStateReader Updated live nodes from ZooKeeper... (0) -> (4)
   [junit4]   2> 1311010 INFO  (closeThreadPool-5677-thread-3) [n:127.0.0.1:53230_wj    ] o.a.s.c.s.i.ZkClientClusterStateProvider Cluster at 127.0.0.1:53147/solr ready
   [junit4]   2> 1311010 INFO  (closeThreadPool-5677-thread-3) [n:127.0.0.1:53230_wj    ] o.a.s.h.a.MetricsHistoryHandler No .system collection, keeping metrics history in memory.
   [junit4]   2> 1311046 INFO  (closeThreadPool-5677-thread-3) [n:127.0.0.1:53230_wj    ] o.a.s.m.r.SolrJmxReporter JMX monitoring for 'solr.node' (registry 'solr.node') enabled at server: com.sun.jmx.mbeanserver.JmxMBeanServer@a292d2
   [junit4]   2> 1311058 INFO  (closeThreadPool-5677-thread-3) [n:127.0.0.1:53230_wj    ] o.a.s.m.r.SolrJmxReporter JMX monitoring for 'solr.jvm' (registry 'solr.jvm') enabled at server: com.sun.jmx.mbeanserver.JmxMBeanServer@a292d2
   [junit4]   2> 1311058 INFO  (closeThreadPool-5677-thread-3) [n:127.0.0.1:53230_wj    ] o.a.s.m.r.SolrJmxReporter JMX monitoring for 'solr.jetty' (registry 'solr.jetty') enabled at server: com.sun.jmx.mbeanserver.JmxMBeanServer@a292d2
   [junit4]   2> 1311062 INFO  (closeThreadPool-5677-thread-3) [n:127.0.0.1:53230_wj    ] o.a.s.c.CorePropertiesLocator Found 0 core definitions underneath C:\Users\jenkins\workspace\Lucene-Solr-8.x-Windows\solr\build\solr-core\test\J1\..\..\..\..\..\..\..\..\..\Users\jenkins\workspace\Lucene-Solr-8.x-Windows\solr\build\solr-core\test\J1\temp\solr.update.TestInPlaceUpdatesDistrib_A4E4F05D7D7D4780-001\shard-3-001\cores
   [junit4]   2> 1311143 INFO  (qtp21430058-15123) [n:127.0.0.1:53155_wj    ] o.a.s.h.a.CollectionsHandler Invoked Collection Action :addreplica with params node=127.0.0.1:53208_wj&action=ADDREPLICA&collection=collection1&shard=shard1&type=NRT&wt=javabin&version=2 and sendToOCPQueue=true
   [junit4]   2> 1311144 INFO  (qtp21430058-15121) [n:127.0.0.1:53155_wj    ] o.a.s.h.a.CollectionsHandler Invoked Collection Action :addreplica with params node=127.0.0.1:53217_wj&action=ADDREPLICA&collection=collection1&shard=shard1&type=NRT&wt=javabin&version=2 and sendToOCPQueue=true
   [junit4]   2> 1311145 INFO  (qtp21430058-15122) [n:127.0.0.1:53155_wj    ] o.a.s.h.a.CollectionsHandler Invoked Collection Action :addreplica with params node=127.0.0.1:53230_wj&action=ADDREPLICA&collection=collection1&shard=shard1&type=NRT&wt=javabin&version=2 and sendToOCPQueue=true
   [junit4]   2> 1311149 INFO  (OverseerThreadFactory-4902-thread-3) [ c:collection1 s:shard1  ] o.a.s.c.a.c.AddReplicaCmd Node Identified 127.0.0.1:53208_wj for creating new replica of shard shard1 for collection collection1
   [junit4]   2> 1311151 INFO  (OverseerThreadFactory-4902-thread-3) [ c:collection1 s:shard1  ] o.a.s.c.a.c.AddReplicaCmd Returning CreateReplica command.
   [junit4]   2> 1311156 INFO  (qtp25680876-15183) [n:127.0.0.1:53208_wj    x:collection1_shard1_replica_n1] o.a.s.h.a.CoreAdminOperation core create command qt=/admin/cores&collection.configName=conf1&name=collection1_shard1_replica_n1&action=CREATE&collection=collection1&shard=shard1&wt=javabin&version=2&replicaType=NRT
   [junit4]   2> 1312187 INFO  (qtp25680876-15183) [n:127.0.0.1:53208_wj c:collection1 s:shard1  x:collection1_shard1_replica_n1] o.a.s.c.SolrConfig Using Lucene MatchVersion: 8.1.0
   [junit4]   2> 1312220 INFO  (qtp25680876-15183) [n:127.0.0.1:53208_wj c:collection1 s:shard1  x:collection1_shard1_replica_n1] o.a.s.s.IndexSchema [collection1_shard1_replica_n1] Schema name=inplace-updates
   [junit4]   2> 1312226 INFO  (qtp25680876-15183) [n:127.0.0.1:53208_wj c:collection1 s:shard1  x:collection1_shard1_replica_n1] o.a.s.s.IndexSchema Loaded schema inplace-updates/1.6 with uniqueid field id
   [junit4]   2> 1312226 INFO  (qtp25680876-15183) [n:127.0.0.1:53208_wj c:collection1 s:shard1  x:collection1_shard1_replica_n1] o.a.s.c.CoreContainer Creating SolrCore 'collection1_shard1_replica_n1' using configuration from collection collection1, trusted=true
   [junit4]   2> 1312227 INFO  (qtp25680876-15183) [n:127.0.0.1:53208_wj c:collection1 s:shard1  x:collection1_shard1_replica_n1] o.a.s.m.r.SolrJmxReporter JMX monitoring for 'solr.core.collection1.shard1.replica_n1' (registry 'solr.core.collection1.shard1.replica_n1') enabled at server: com.sun.jmx.mbeanserver.JmxMBeanServer@a292d2
   [junit4]   2> 1312227 INFO  (qtp25680876-15183) [n:127.0.0.1:53208_wj c:collection1 s:shard1  x:collection1_shard1_replica_n1] o.a.s.c.SolrCore [[collection1_shard1_replica_n1] ] Opening new SolrCore at [C:\Users\jenkins\workspace\Lucene-Solr-8.x-Windows\solr\build\solr-core\test\J1\temp\solr.update.TestInPlaceUpdatesDistrib_A4E4F05D7D7D4780-001\shard-1-001\cores\collection1_shard1_replica_n1], dataDir=[C:\Users\jenkins\workspace\Lucene-Solr-8.x-Windows\solr\build\solr-core\test\J1\..\..\..\..\..\..\..\..\..\Users\jenkins\workspace\Lucene-Solr-8.x-Windows\solr\build\solr-core\test\J1\temp\solr.update.TestInPlaceUpdatesDistrib_A4E4F05D7D7D4780-001\shard-1-001\cores\collection1_shard1_replica_n1\data\]
   [junit4]   2> 1312232 WARN  (qtp25680876-15183) [n:127.0.0.1:53208_wj c:collection1 s:shard1  x:collection1_shard1_replica_n1] o.a.s.c.RequestHandlers INVALID paramSet a in requestHandler {type = requestHandler,name = /dump,class = DumpRequestHandler,attributes = {initParams=a, name=/dump, class=DumpRequestHandler},args = {defaults={a=A,b=B}}}
   [junit4]   2> 1312336 INFO  (qtp25680876-15183) [n:127.0.0.1:53208_wj c:collection1 s:shard1  x:collection1_shard1_replica_n1] o.a.s.u.UpdateHandler Using UpdateLog implementation: org.apache.solr.update.CdcrUpdateLog
   [junit4]   2> 1312336 INFO  (qtp25680876-15183) [n:127.0.0.1:53208_wj c:collection1 s:shard1  x:collection1_shard1_replica_n1] o.a.s.u.UpdateLog Initializing UpdateLog: dataDir= defaultSyncLevel=FLUSH numRecordsToKeep=100 maxNumLogsToKeep=10 numVersionBuckets=65536
   [junit4]   2> 1312339 INFO  (qtp25680876-15183) [n:127.0.0.1:53208_wj c:collection1 s:shard1  x:collection1_shard1_replica_n1] o.a.s.u.CommitTracker Hard AutoCommit: disabled
   [junit4]   2> 1312339 INFO  (qtp25680876-15183) [n:127.0.0.1:53208_wj c:collection1 s:shard1  x:collection1_shard1_replica_n1] o.a.s.u.CommitTracker Soft AutoCommit: disabled
   [junit4]   2> 1312341 INFO  (qtp25680876-15183) [n:127.0.0.1:53208_wj c:collection1 s:shard1  x:collection1_shard1_replica_n1] o.a.s.s.SolrIndexSearcher Opening [Searcher@379cef[collection1_shard1_replica_n1] main]
   [junit4]   2> 1312343 INFO  (qtp25680876-15183) [n:127.0.0.1:53208_wj c:collection1 s:shard1  x:collection1_shard1_replica_n1] o.a.s.r.ManagedResourceStorage Configured ZooKeeperStorageIO with znodeBase: /configs/conf1
   [junit4]   2> 1312343 INFO  (qtp25680876-15183) [n:127.0.0.1:53208_wj c:collection1 s:shard1  x:collection1_shard1_replica_n1] o.a.s.r.ManagedResourceStorage Loaded null at path _rest_managed.json using ZooKeeperStorageIO:path=/configs/conf1
   [junit4]   2> 1312343 INFO  (qtp25680876-15183) [n:127.0.0.1:53208_wj c:collection1 s:shard1  x:collection1_shard1_replica_n1] o.a.s.h.ReplicationHandler Commits will be reserved for 10000ms.
   [junit4]   2> 1312344 INFO  (qtp25680876-15183) [n:127.0.0.1:53208_wj c:collection1 s:shard1  x:collection1_shard1_replica_n1] o.a.s.u.UpdateLog Could not find max version in index or recent updates, using new clock 1632320226137735168
   [junit4]   2> 1312347 INFO  (searcherExecutor-4939-thread-1-processing-n:127.0.0.1:53208_wj x:collection1_shard1_replica_n1 c:collection1 s:shard1) [n:127.0.0.1:53208_wj c:collection1 s:shard1  x:collection1_shard1_replica_n1] o.a.s.c.SolrCore [collection1_shard1_replica_n1] Registered new searcher Searcher@379cef[collection1_shard1_replica_n1] main{ExitableDirectoryReader(UninvertingDirectoryReader())}
   [junit4]   2> 1312352 INFO  (qtp25680876-15183) [n:127.0.0.1:53208_wj c:collection1 s:shard1  x:collection1_shard1_replica_n1] o.a.s.c.ZkShardTerms Successful update of terms at /collections/collection1/terms/shard1 to Terms{values={core_node2=0}, version=0}
   [junit4]   2> 1312352 INFO  (qtp25680876-15183) [n:127.0.0.1:53208_wj c:collection1 s:shard1  x:collection1_shard1_replica_n1] o.a.s.c.ShardLeaderElectionContextBase make sure parent is created /collections/collection1/leaders/shard1
   [junit4]   2> 1312355 INFO  (qtp25680876-15183) [n:127.0.0.1:53208_wj c:collection1 s:shard1  x:collection1_shard1_replica_n1] o.a.s.c.ShardLeaderElectionContext Enough replicas found to continue.
   [junit4]   2> 1312355 INFO  (qtp25680876-15183) [n:127.0.0.1:53208_wj c:collection1 s:shard1  x:collection1_shard1_replica_n1] o.a.s.c.ShardLeaderElectionContext I may be the new leader - try and sync
   [junit4]   2> 1312355 INFO  (qtp25680876-15183) [n:127.0.0.1:53208_wj c:collection1 s:shard1  x:collection1_shard1_replica_n1] o.a.s.c.SyncStrategy Sync replicas to http://127.0.0.1:53208/wj/collection1_shard1_replica_n1/
   [junit4]   2> 1312355 INFO  (qtp25680876-15183) [n:127.0.0.1:53208_wj c:collection1 s:shard1  x:collection1_shard1_replica_n1] o.a.s.c.SyncStrategy Sync Success - now sync replicas to me
   [junit4]   2> 1312355 INFO  (qtp25680876-15183) [n:127.0.0.1:53208_wj c:collection1 s:shard1  x:collection1_shard1_replica_n1] o.a.s.c.SyncStrategy http://127.0.0.1:53208/wj/collection1_shard1_replica_n1/ has no replicas
   [junit4]   2> 1312355 INFO  (qtp25680876-15183) [n:127.0.0.1:53208_wj c:collection1 s:shard1  x:collection1_shard1_replica_n1] o.a.s.c.ShardLeaderElectionContextBase Creating leader registration node /collections/collection1/leaders/shard1/leader after winning as /collections/collection1/leader_elect/shard1/election/72063309247217676-core_node2-n_0000000000
   [junit4]   2> 1312357 INFO  (qtp25680876-15183) [n:127.0.0.1:53208_wj c:collection1 s:shard1  x:collection1_shard1_replica_n1] o.a.s.c.ShardLeaderElectionContext I am the new leader: http://127.0.0.1:53208/wj/collection1_shard1_replica_n1/ shard1
   [junit4]   2> 1312462 INFO  (qtp25680876-15183) [n:127.0.0.1:53208_wj c:collection1 s:shard1  x:collection1_shard1_replica_n1] o.a.s.c.ZkController I am the leader, no recovery necessary
   [junit4]   2> 1312468 INFO  (qtp25680876-15183) [n:127.0.0.1:53208_wj c:collection1 s:shard1  x:collection1_shard1_replica_n1] o.a.s.s.HttpSolrCall [admin] webapp=null path=/admin/cores params={qt=/admin/cores&collection.configName=conf1&name=collection1_shard1_replica_n1&action=CREATE&collection=collection1&shard=shard1&wt=javabin&version=2&replicaType=NRT} status=0 QTime=1311
   [junit4]   2> 1312471 INFO  (qtp21430058-15123) [n:127.0.0.1:53155_wj c:collection1   ] o.a.s.s.HttpSolrCall [admin] webapp=null path=/admin/collections params={node=127.0.0.1:53208_wj&action=ADDREPLICA&collection=collection1&shard=shard1&type=NRT&wt=javabin&version=2} status=0 QTime=1327
   [junit4]   2> 1313152 INFO  (OverseerCollectionConfigSetProcessor-72063309247217668-127.0.0.1:53155_wj-n_0000000000) [    ] o.a.s.c.OverseerTaskQueue Response ZK path: /overseer/collection-queue-work/qnr-0000000004 doesn't exist.  Requestor may have disconnected from ZooKeeper
   [junit4]   2> 1313153 INFO  (OverseerThreadFactory-4902-thread-4) [ c:collection1 s:shard1  ] o.a.s.c.a.c.AddReplicaCmd Node Identified 127.0.0.1:53217_wj for creating new replica of shard shard1 for collection collection1
   [junit4]   2> 1313154 INFO  (OverseerThreadFactory-4902-thread-4) [ c:collection1 s:shard1  ] o.a.s.c.a.c.AddReplicaCmd Returning CreateReplica command.
   [junit4]   2> 1313162 INFO  (qtp17815513-15198) [n:127.0.0.1:53217_wj    x:collection1_shard1_replica_n3] o.a.s.h.a.CoreAdminOperation core create command qt=/admin/cores&collection.configName=conf1&name=collection1_shard1_replica_n3&action=CREATE&collection=collection1&shard=shard1&wt=javabin&version=2&replicaType=NRT
   [junit4]   2> 1314207 INFO  (qtp17815513-15198) [n:127.0.0.1:53217_wj c:collection1 s:shard1  x:collection1_shard1_replica_n3] o.a.s.c.SolrConfig Using Lucene MatchVersion: 8.1.0
   [junit4]   2> 1314229 INFO  (qtp17815513-15198) [n:127.0.0.1:53217_wj c:collection1 s:shard1  x:collection1_shard1_replica_n3] o.a.s.s.IndexSchema [collection1_shard1_replica_n3] Schema name=inplace-updates
   [junit4]   2> 1314235 INFO  (qtp17815513-15198) [n:127.0.0.1:53217_wj c:collection1 s:shard1  x:collection1_shard1_replica_n3] o.a.s.s.IndexSchema Loaded schema inplace-updates/1.6 with uniqueid field id
   [junit4]   2> 1314235 INFO  (qtp17815513-15198) [n:127.0.0.1:53217_wj c:collection1 s:shard1  x:collection1_shard1_replica_n3] o.a.s.c.CoreContainer Creating SolrCore 'collection1_shard1_replica_n3' using configuration from collection collection1, trusted=true
   [junit4]   2> 1314236 INFO  (qtp17815513-15198) [n:127.0.0.1:53217_wj c:collection1 s:shard1  x:collection1_shard1_replica_n3] o.a.s.m.r.SolrJmxReporter JMX monitoring for 'solr.core.collection1.shard1.replica_n3' (registry 'solr.core.collection1.shard1.replica_n3') enabled at server: com.sun.jmx.mbeanserver.JmxMBeanServer@a292d2
   [junit4]   2> 1314236 INFO  (qtp17815513-15198) [n:127.0.0.1:53217_wj c:collection1 s:shard1  x:collection1_shard1_replica_n3] o.a.s.c.SolrCore [[collection1_shard1_replica_n

[...truncated too long message...]

grationTest, CloudExitableDirectoryReaderTest, TestRawResponseWriter, EchoParamsTest, LeaderFailureAfterFreshStartTest, TestDeleteCollectionOnDownNodes, BlockJoinFacetSimpleTest, MetricTriggerIntegrationTest, NodeMarkersRegistrationTest, CachingDirectoryFactoryTest, CurrencyRangeFacetCloudTest, TestCrossCoreJoin, TestCollectionAPI, AutoAddReplicasIntegrationTest, SpatialHeatmapFacetsTest, TestEmbeddedSolrServerSchemaAPI, DistributedFacetSimpleRefinementLongTailTest, SubstringBytesRefFilterTest, RollingRestartTest, AutoScalingHandlerTest, TestSolr4Spatial, ClusterStateUpdateTest, TestXIncludeConfig, TestCloudInspectUtil, CircularListTest, CacheHeaderTest, ForceLeaderWithTlogReplicasTest, TestSSLRandomization, DataDrivenBlockJoinTest, TestExceedMaxTermLength, MigrateRouteKeyTest, TestCloudManagedSchema, TestSimTriggerIntegration, ProtectedTermFilterFactoryTest, TestCollapseQParserPlugin, TestShortCircuitedRequests, TestGraphMLResponseWriter, TestJmxIntegration, TestSimpleQParserPlugin, RecoveryAfterSoftCommitTest, TestFunctionQuery, TestPullReplica, TestDistributedMap, TestQuerySenderListener, TestPostingsSolrHighlighter, SolrCoreCheckLockOnStartupTest, CdcrBidirectionalTest, CdcrOpsAndBoundariesTest, TestCustomSort, TestSimDistributedQueue, TestUnInvertedFieldException, TestInfoStreamLogging, TestNumericTerms32, OutputWriterTest, CustomCollectionTest, TestSimNodeLostTrigger, ScheduledTriggerTest, TestReplicaProperties, DistributedFacetPivotSmallTest, CreateRoutedAliasTest, CollectionsAPIDistributedZkTest, TestReloadAndDeleteDocs, TestScoreJoinQPNoScore, SystemInfoHandlerTest, TestAuthorizationFramework, MoveReplicaTest, TestLogWatcher, AtomicUpdateProcessorFactoryTest, MetricsConfigTest, TestGroupingSearch, TestRecovery, TestSchemaManager, V2StandaloneTest, BasicDistributedZkTest, TestSchemaSimilarityResource, DateMathParserTest, FileUtilsTest, TestManagedSchemaAPI, SignatureUpdateProcessorFactoryTest, DistributedFacetPivotLongTailTest, PreAnalyzedUpdateProcessorTest, RAMDirectoryFactoryTest, ClassificationUpdateProcessorFactoryTest, LeaderElectionContextKeyTest, MetricsHistoryIntegrationTest, SolrIndexConfigTest, TaggingAttributeTest, TestCloudSearcherWarming, TestConfigOverlay, TestStressLiveNodes, WrapperMergePolicyFactoryTest, TestCloudNestedDocsSort, TestDelegationWithHadoopAuth, SolrSlf4jReporterTest, TestMacroExpander, TestSolrConfigHandlerCloud, SecurityConfHandlerTest, AnalysisErrorHandlingTest, TestLRUStatsCache, DistributedTermsComponentTest, TestHighFrequencyDictionaryFactory, ShowFileRequestHandlerTest, BinaryUpdateRequestHandlerTest, TestFieldCacheWithThreads, BlockCacheTest, SliceStateTest, AnalyticsMergeStrategyTest, TermsComponentTest, DocumentBuilderTest, CustomTermsComponentTest, TestCodecSupport, SolrMetricsIntegrationTest, DistributedFacetExistsSmallTest, HdfsChaosMonkeyNothingIsSafeTest, JWTAuthPluginTest, TestReversedWildcardFilterFactory, ReindexCollectionTest, TestHdfsBackupRestoreCore, TestSchemaNameResource, TestPivotHelperCode, TestRandomCollapseQParserPlugin, Tagger2Test, CdcrWithNodesRestartsTest, SolrShardReporterTest, TestLRUCache, TestRandomFaceting, HighlighterMaxOffsetTest, TestIndexingPerformance, TestLegacyBM25SimilarityFactory, TestConfigReload, HealthCheckHandlerTest, IgnoreCommitOptimizeUpdateProcessorFactoryTest, TestSlowCompositeReaderWrapper, TestReplicationHandlerBackup, TestFaceting, HdfsLockFactoryTest, ChaosMonkeyNothingIsSafeWithPullReplicasTest, ChaosMonkeySafeLeaderWithPullReplicasTest, ConcurrentCreateRoutedAliasTest, ConnectionManagerTest, DeleteLastCustomShardedReplicaTest, DeleteNodeTest, DeleteReplicaTest, DeleteStatusTest, DistributedQueueTest, LeaderTragicEventTest, LeaderVoteWaitTimeoutTest, LegacyCloudClusterPropTest, MoveReplicaHDFSFailoverTest, MoveReplicaHDFSTest, MultiThreadedOCPTest, NestedShardedAtomicUpdateTest, OverseerCollectionConfigSetProcessorTest, RecoveryZkTest, RemoteQueryErrorTest, ReplaceNodeNoTargetTest, ReplaceNodeTest, ReplicationFactorTest, TestCloudPhrasesIdentificationComponent, TestCloudRecovery, TestDistribDocBasedVersion, TestHashPartitioner, TestOnReconnectListenerSupport, TestPrepRecovery, TestSolrCloudWithDelegationTokens, TestStressCloudBlindAtomicUpdates, TestStressInPlaceUpdates, TestWithCollection, CollectionReloadTest, CollectionTooManyReplicasTest, SimpleCollectionCreateDeleteTest, TestCollectionsAPIViaSolrCloudCluster, TestHdfsCloudBackupRestore, ComputePlanActionTest, ExecutePlanActionTest, HttpTriggerListenerTest, IndexSizeTriggerTest, NodeAddedTriggerTest, ScheduledMaintenanceTriggerTest, SystemLogListenerTest, TriggerCooldownIntegrationTest, TriggerSetPropertiesIntegrationTest, TestSimClusterStateProvider, TestSimComputePlanAction, TestSimDistribStateManager, TestSimExtremeIndexing, TestSimGenericDistributedQueue, TestSimNodeAddedTrigger, TestSimPolicyCloud, BaseCdcrDistributedZkTest, CdcrRequestHandlerTest, HdfsBasicDistributedZk2Test, HdfsBasicDistributedZkTest, HdfsRecoveryZkTest, HdfsRestartWhileUpdatingTest, HdfsSyncSliceTest, HdfsTlogReplayBufferedWhileIndexingTest, HdfsWriteToMultipleCollectionsTest, StressHdfsTest, TestClusterStateMutator, ZkStateWriterTest, RuleEngineTest, RulesTest, ByteBuffersDirectoryFactoryTest, PluginInfoTest, QueryResultKeyTest, ResourceLoaderTest, TestBackupRepositoryFactory, TestBadConfig, TestConfigSetProperties, TestCoreContainer, TestDynamicURP, TestInitParams, TestMergePolicyConfig, TestQuerySenderNoQuery, TestSimpleTextCodec, TestSolrIndexConfig, TestSolrCloudSnapshots, TestBlobHandler, TestRestoreCore, TestSQLHandler, TestSQLHandlerNonCloud, TestSolrConfigHandlerConcurrent, V2ApiIntegrationTest, XmlUpdateRequestHandlerTest, XsltUpdateRequestHandlerTest, AdminHandlersProxyTest, AutoscalingHistoryHandlerTest, CoreAdminCreateDiscoverTest, DaemonStreamApiTest, LoggingHandlerTest, MBeansHandlerTest, TestApiFramework, TestCollectionAPIs, TestCoreAdminApis, BadComponentTest, CustomHighlightComponentTest, DistributedExpandComponentTest, DistributedMLTComponentTest, DistributedQueryComponentOptimizationTest, DistributedSpellCheckComponentTest, ReplicaListTransformerTest, ResponseLogComponentTest, ShardsWhitelistTest, ShufflingReplicaListTransformerTest, SpellCheckComponentTest, TermVectorComponentDistributedTest, TestExportWriter, EmbeddedSolrNoSerializeTest, TaggerTest, UninvertDocValuesMergePolicyTest, TestLegacyTerms, TestNumericRangeQuery32, SolrCoreMetricManagerTest, SolrJmxReporterTest, TestRemoteStreaming, TestMacros, JSONWriterTest, TestBinaryResponseWriter, TestCustomDocTransformer, TestGeoJSONResponseWriter, TestPushWriter, TestRetrieveFieldsOptimizer, TestChildDocTransformerHierarchy, TestSubQueryTransformerCrossCore, TestManagedResource, TestManagedResourceStorage, TestBulkSchemaAPI, TestManagedSynonymGraphFilterFactory, DocValuesMultiTest, EnumFieldTest, ExternalFileFieldSortTest, IndexSchemaTest, NumericFieldsTest, OpenExchangeRatesOrgProviderTest, SchemaApiFailureTest, SynonymTokenizerTest, TestBinaryField, TestCollationField, TestCollationFieldDocValues, TestHalfAndHalfDocValues, TestManagedSchema, TestDocSet, TestElisionMultitermQuery, TestFilteredDocIdSet, TestGraphTermsQParserPlugin, TestIndexSearcher, TestLFUCache, TestPseudoReturnFields, TestRangeQuery, TestSurroundQueryParser, TestXmlQParser, TestXmlQParserPlugin, TestJsonFacetRefinement, TestJsonFacetsStatsParsing, TestJsonFacetsWithNestedObjects, DistanceFunctionTest, BJQParserTest, BlockJoinFacetDistribTest, BlockJoinFacetRandomTest, SimpleMLTQParserTest, TestClassicSimilarityFactory, TestDFISimilarityFactory, TestDFRSimilarityFactory, TestIBSimilarityFactory, TestLMDirichletSimilarityFactory, TestSweetSpotSimilarityFactory, TestDistribIDF, BasicAuthStandaloneTest, TestRuleBasedAuthorizationPlugin, TestImpersonationWithHadoopAuth, TestSolrCloudWithHadoopAuthPlugin, TestZkAclsWithHadoopAuth, DirectSolrConnectionTest, HttpSolrCallGetCoreTest, DirectSolrSpellCheckerTest, IndexBasedSpellCheckerTest, SpellCheckCollatorWithCollapseTest, SpellPossibilityIteratorTest, SpellingQueryConverterTest, TestSuggestSpellingConverter, WordBreakSolrSpellCheckerTest, SuggesterTSTTest, SuggesterTest, SuggesterWFSTTest, TestAnalyzedSuggestions, TestBlendedInfixSuggestions, TestFileDictionaryLookup, TestPhraseSuggestions, BlockDirectoryTest, BufferStoreTest, HdfsDirectoryTest, TestDocTermOrds, TestDocTermOrdsUninvertLimit, TestFieldCacheReopen, TestFieldCacheSort, TestFieldCacheSortRandom, TestFieldCacheVsDocValues, TestLegacyFieldCache, TestUninvertingReader, AddBlockUpdateTest, CdcrUpdateLogTest, DirectUpdateHandlerTest, MaxSizeAutoCommitTest, PeerSyncTest]
   [junit4] Completed [816/855 (3!)] on J0 in 149.78s, 1 test, 1 failure <<< FAILURES!

[...truncated 9089 lines...]
BUILD FAILED
C:\Users\jenkins\workspace\Lucene-Solr-8.x-Windows\build.xml:634: The following error occurred while executing this line:
C:\Users\jenkins\workspace\Lucene-Solr-8.x-Windows\build.xml:128: Found 1 violations in source files (File uses Mockito but has no assumeWorkingMockito() call).

Total time: 146 minutes 50 seconds
Build step 'Invoke Ant' marked build as failure
Archiving artifacts
Setting ANT_1_8_2_HOME=C:\Users\jenkins\tools\hudson.tasks.Ant_AntInstallation\ANT_1.8.2
[WARNINGS] Skipping publisher since build result is FAILURE
Recording test results
Setting ANT_1_8_2_HOME=C:\Users\jenkins\tools\hudson.tasks.Ant_AntInstallation\ANT_1.8.2
Email was triggered for: Failure - Any
Sending email for trigger: Failure - Any
Setting ANT_1_8_2_HOME=C:\Users\jenkins\tools\hudson.tasks.Ant_AntInstallation\ANT_1.8.2
Setting ANT_1_8_2_HOME=C:\Users\jenkins\tools\hudson.tasks.Ant_AntInstallation\ANT_1.8.2
Setting ANT_1_8_2_HOME=C:\Users\jenkins\tools\hudson.tasks.Ant_AntInstallation\ANT_1.8.2
Setting ANT_1_8_2_HOME=C:\Users\jenkins\tools\hudson.tasks.Ant_AntInstallation\ANT_1.8.2
Setting ANT_1_8_2_HOME=C:\Users\jenkins\tools\hudson.tasks.Ant_AntInstallation\ANT_1.8.2
Setting ANT_1_8_2_HOME=C:\Users\jenkins\tools\hudson.tasks.Ant_AntInstallation\ANT_1.8.2

Mime
View raw message