lucene-dev mailing list archives

Site index · List index
Message view « Date » · « Thread »
Top « Date » · « Thread »
From Policeman Jenkins Server <jenk...@thetaphi.de>
Subject [JENKINS] Lucene-Solr-8.x-Linux (64bit/jdk-11.0.2) - Build # 498 - Still Failing!
Date Thu, 02 May 2019 02:33:28 GMT
Build: https://jenkins.thetaphi.de/job/Lucene-Solr-8.x-Linux/498/
Java: 64bit/jdk-11.0.2 -XX:+UseCompressedOops -XX:+UseParallelGC

3 tests failed.
FAILED:  org.apache.solr.update.TestInPlaceUpdatesDistrib.test

Error Message:
Thread pool didn't terminate within 15 secs

Stack Trace:
java.lang.AssertionError: Thread pool didn't terminate within 15 secs
	at __randomizedtesting.SeedInfo.seed([C8E1DBA83B7C78B8:40B5E47295801540]:0)
	at org.junit.Assert.fail(Assert.java:88)
	at org.junit.Assert.assertTrue(Assert.java:41)
	at org.apache.solr.update.TestInPlaceUpdatesDistrib.reorderedDeletesTest(TestInPlaceUpdatesDistrib.java:776)
	at org.apache.solr.update.TestInPlaceUpdatesDistrib.test(TestInPlaceUpdatesDistrib.java:175)
	at java.base/jdk.internal.reflect.NativeMethodAccessorImpl.invoke0(Native Method)
	at java.base/jdk.internal.reflect.NativeMethodAccessorImpl.invoke(NativeMethodAccessorImpl.java:62)
	at java.base/jdk.internal.reflect.DelegatingMethodAccessorImpl.invoke(DelegatingMethodAccessorImpl.java:43)
	at java.base/java.lang.reflect.Method.invoke(Method.java:566)
	at com.carrotsearch.randomizedtesting.RandomizedRunner.invoke(RandomizedRunner.java:1750)
	at com.carrotsearch.randomizedtesting.RandomizedRunner$8.evaluate(RandomizedRunner.java:938)
	at com.carrotsearch.randomizedtesting.RandomizedRunner$9.evaluate(RandomizedRunner.java:974)
	at com.carrotsearch.randomizedtesting.RandomizedRunner$10.evaluate(RandomizedRunner.java:988)
	at org.apache.solr.BaseDistributedSearchTestCase$ShardsRepeatRule$ShardsFixedStatement.callStatement(BaseDistributedSearchTestCase.java:1082)
	at org.apache.solr.BaseDistributedSearchTestCase$ShardsRepeatRule$ShardsStatement.evaluate(BaseDistributedSearchTestCase.java:1054)
	at com.carrotsearch.randomizedtesting.rules.SystemPropertiesRestoreRule$1.evaluate(SystemPropertiesRestoreRule.java:57)
	at org.apache.lucene.util.TestRuleSetupTeardownChained$1.evaluate(TestRuleSetupTeardownChained.java:49)
	at org.apache.lucene.util.AbstractBeforeAfterRule$1.evaluate(AbstractBeforeAfterRule.java:45)
	at org.apache.lucene.util.TestRuleThreadAndTestName$1.evaluate(TestRuleThreadAndTestName.java:48)
	at org.apache.lucene.util.TestRuleIgnoreAfterMaxFailures$1.evaluate(TestRuleIgnoreAfterMaxFailures.java:64)
	at org.apache.lucene.util.TestRuleMarkFailure$1.evaluate(TestRuleMarkFailure.java:47)
	at com.carrotsearch.randomizedtesting.rules.StatementAdapter.evaluate(StatementAdapter.java:36)
	at com.carrotsearch.randomizedtesting.ThreadLeakControl$StatementRunner.run(ThreadLeakControl.java:368)
	at com.carrotsearch.randomizedtesting.ThreadLeakControl.forkTimeoutingTask(ThreadLeakControl.java:817)
	at com.carrotsearch.randomizedtesting.ThreadLeakControl$3.evaluate(ThreadLeakControl.java:468)
	at com.carrotsearch.randomizedtesting.RandomizedRunner.runSingleTest(RandomizedRunner.java:947)
	at com.carrotsearch.randomizedtesting.RandomizedRunner$5.evaluate(RandomizedRunner.java:832)
	at com.carrotsearch.randomizedtesting.RandomizedRunner$6.evaluate(RandomizedRunner.java:883)
	at com.carrotsearch.randomizedtesting.RandomizedRunner$7.evaluate(RandomizedRunner.java:894)
	at com.carrotsearch.randomizedtesting.rules.StatementAdapter.evaluate(StatementAdapter.java:36)
	at com.carrotsearch.randomizedtesting.rules.SystemPropertiesRestoreRule$1.evaluate(SystemPropertiesRestoreRule.java:57)
	at org.apache.lucene.util.AbstractBeforeAfterRule$1.evaluate(AbstractBeforeAfterRule.java:45)
	at com.carrotsearch.randomizedtesting.rules.StatementAdapter.evaluate(StatementAdapter.java:36)
	at org.apache.lucene.util.TestRuleStoreClassName$1.evaluate(TestRuleStoreClassName.java:41)
	at com.carrotsearch.randomizedtesting.rules.NoShadowingOrOverridesOnMethodsRule$1.evaluate(NoShadowingOrOverridesOnMethodsRule.java:40)
	at com.carrotsearch.randomizedtesting.rules.NoShadowingOrOverridesOnMethodsRule$1.evaluate(NoShadowingOrOverridesOnMethodsRule.java:40)
	at com.carrotsearch.randomizedtesting.rules.StatementAdapter.evaluate(StatementAdapter.java:36)
	at com.carrotsearch.randomizedtesting.rules.StatementAdapter.evaluate(StatementAdapter.java:36)
	at org.apache.lucene.util.TestRuleAssertionsRequired$1.evaluate(TestRuleAssertionsRequired.java:53)
	at org.apache.lucene.util.TestRuleMarkFailure$1.evaluate(TestRuleMarkFailure.java:47)
	at org.apache.lucene.util.TestRuleIgnoreAfterMaxFailures$1.evaluate(TestRuleIgnoreAfterMaxFailures.java:64)
	at org.apache.lucene.util.TestRuleIgnoreTestSuites$1.evaluate(TestRuleIgnoreTestSuites.java:54)
	at com.carrotsearch.randomizedtesting.rules.StatementAdapter.evaluate(StatementAdapter.java:36)
	at com.carrotsearch.randomizedtesting.ThreadLeakControl$StatementRunner.run(ThreadLeakControl.java:368)
	at java.base/java.lang.Thread.run(Thread.java:834)


FAILED:  org.apache.solr.update.PeerSyncTest.test

Error Message:
Unexpected exception type, expected SolrException but got org.apache.solr.client.solrj.SolrServerException: Timeout occurred while waiting response from server at: http://127.0.0.1:45157/td_bvx/js/collection1

Stack Trace:
junit.framework.AssertionFailedError: Unexpected exception type, expected SolrException but got org.apache.solr.client.solrj.SolrServerException: Timeout occurred while waiting response from server at: http://127.0.0.1:45157/td_bvx/js/collection1
	at __randomizedtesting.SeedInfo.seed([C8E1DBA83B7C78B8:40B5E47295801540]:0)
	at org.apache.lucene.util.LuceneTestCase.expectThrows(LuceneTestCase.java:2700)
	at org.apache.lucene.util.LuceneTestCase.expectThrows(LuceneTestCase.java:2689)
	at org.apache.solr.update.PeerSyncTest.test(PeerSyncTest.java:279)
	at java.base/jdk.internal.reflect.NativeMethodAccessorImpl.invoke0(Native Method)
	at java.base/jdk.internal.reflect.NativeMethodAccessorImpl.invoke(NativeMethodAccessorImpl.java:62)
	at java.base/jdk.internal.reflect.DelegatingMethodAccessorImpl.invoke(DelegatingMethodAccessorImpl.java:43)
	at java.base/java.lang.reflect.Method.invoke(Method.java:566)
	at com.carrotsearch.randomizedtesting.RandomizedRunner.invoke(RandomizedRunner.java:1750)
	at com.carrotsearch.randomizedtesting.RandomizedRunner$8.evaluate(RandomizedRunner.java:938)
	at com.carrotsearch.randomizedtesting.RandomizedRunner$9.evaluate(RandomizedRunner.java:974)
	at com.carrotsearch.randomizedtesting.RandomizedRunner$10.evaluate(RandomizedRunner.java:988)
	at org.apache.solr.BaseDistributedSearchTestCase$ShardsRepeatRule$ShardsFixedStatement.callStatement(BaseDistributedSearchTestCase.java:1082)
	at org.apache.solr.BaseDistributedSearchTestCase$ShardsRepeatRule$ShardsStatement.evaluate(BaseDistributedSearchTestCase.java:1054)
	at com.carrotsearch.randomizedtesting.rules.SystemPropertiesRestoreRule$1.evaluate(SystemPropertiesRestoreRule.java:57)
	at org.apache.lucene.util.TestRuleSetupTeardownChained$1.evaluate(TestRuleSetupTeardownChained.java:49)
	at org.apache.lucene.util.AbstractBeforeAfterRule$1.evaluate(AbstractBeforeAfterRule.java:45)
	at org.apache.lucene.util.TestRuleThreadAndTestName$1.evaluate(TestRuleThreadAndTestName.java:48)
	at org.apache.lucene.util.TestRuleIgnoreAfterMaxFailures$1.evaluate(TestRuleIgnoreAfterMaxFailures.java:64)
	at org.apache.lucene.util.TestRuleMarkFailure$1.evaluate(TestRuleMarkFailure.java:47)
	at com.carrotsearch.randomizedtesting.rules.StatementAdapter.evaluate(StatementAdapter.java:36)
	at com.carrotsearch.randomizedtesting.ThreadLeakControl$StatementRunner.run(ThreadLeakControl.java:368)
	at com.carrotsearch.randomizedtesting.ThreadLeakControl.forkTimeoutingTask(ThreadLeakControl.java:817)
	at com.carrotsearch.randomizedtesting.ThreadLeakControl$3.evaluate(ThreadLeakControl.java:468)
	at com.carrotsearch.randomizedtesting.RandomizedRunner.runSingleTest(RandomizedRunner.java:947)
	at com.carrotsearch.randomizedtesting.RandomizedRunner$5.evaluate(RandomizedRunner.java:832)
	at com.carrotsearch.randomizedtesting.RandomizedRunner$6.evaluate(RandomizedRunner.java:883)
	at com.carrotsearch.randomizedtesting.RandomizedRunner$7.evaluate(RandomizedRunner.java:894)
	at com.carrotsearch.randomizedtesting.rules.StatementAdapter.evaluate(StatementAdapter.java:36)
	at com.carrotsearch.randomizedtesting.rules.SystemPropertiesRestoreRule$1.evaluate(SystemPropertiesRestoreRule.java:57)
	at org.apache.lucene.util.AbstractBeforeAfterRule$1.evaluate(AbstractBeforeAfterRule.java:45)
	at com.carrotsearch.randomizedtesting.rules.StatementAdapter.evaluate(StatementAdapter.java:36)
	at org.apache.lucene.util.TestRuleStoreClassName$1.evaluate(TestRuleStoreClassName.java:41)
	at com.carrotsearch.randomizedtesting.rules.NoShadowingOrOverridesOnMethodsRule$1.evaluate(NoShadowingOrOverridesOnMethodsRule.java:40)
	at com.carrotsearch.randomizedtesting.rules.NoShadowingOrOverridesOnMethodsRule$1.evaluate(NoShadowingOrOverridesOnMethodsRule.java:40)
	at com.carrotsearch.randomizedtesting.rules.StatementAdapter.evaluate(StatementAdapter.java:36)
	at com.carrotsearch.randomizedtesting.rules.StatementAdapter.evaluate(StatementAdapter.java:36)
	at org.apache.lucene.util.TestRuleAssertionsRequired$1.evaluate(TestRuleAssertionsRequired.java:53)
	at org.apache.lucene.util.TestRuleMarkFailure$1.evaluate(TestRuleMarkFailure.java:47)
	at org.apache.lucene.util.TestRuleIgnoreAfterMaxFailures$1.evaluate(TestRuleIgnoreAfterMaxFailures.java:64)
	at org.apache.lucene.util.TestRuleIgnoreTestSuites$1.evaluate(TestRuleIgnoreTestSuites.java:54)
	at com.carrotsearch.randomizedtesting.rules.StatementAdapter.evaluate(StatementAdapter.java:36)
	at com.carrotsearch.randomizedtesting.ThreadLeakControl$StatementRunner.run(ThreadLeakControl.java:368)
	at java.base/java.lang.Thread.run(Thread.java:834)
Caused by: org.apache.solr.client.solrj.SolrServerException: Timeout occurred while waiting response from server at: http://127.0.0.1:45157/td_bvx/js/collection1
	at org.apache.solr.client.solrj.impl.HttpSolrClient.executeMethod(HttpSolrClient.java:660)
	at org.apache.solr.client.solrj.impl.HttpSolrClient.request(HttpSolrClient.java:255)
	at org.apache.solr.client.solrj.impl.HttpSolrClient.request(HttpSolrClient.java:244)
	at org.apache.solr.client.solrj.SolrRequest.process(SolrRequest.java:207)
	at org.apache.solr.client.solrj.SolrRequest.process(SolrRequest.java:224)
	at org.apache.solr.BaseDistributedSearchTestCase.add(BaseDistributedSearchTestCase.java:576)
	at org.apache.solr.update.PeerSyncTest.lambda$test$0(PeerSyncTest.java:281)
	at org.apache.lucene.util.LuceneTestCase.expectThrows(LuceneTestCase.java:2695)
	... 42 more
Caused by: java.net.SocketTimeoutException: Read timed out
	at java.base/java.net.SocketInputStream.socketRead0(Native Method)
	at java.base/java.net.SocketInputStream.socketRead(SocketInputStream.java:115)
	at java.base/java.net.SocketInputStream.read(SocketInputStream.java:168)
	at java.base/java.net.SocketInputStream.read(SocketInputStream.java:140)
	at org.apache.http.impl.io.SessionInputBufferImpl.streamRead(SessionInputBufferImpl.java:137)
	at org.apache.http.impl.io.SessionInputBufferImpl.fillBuffer(SessionInputBufferImpl.java:153)
	at org.apache.http.impl.io.SessionInputBufferImpl.readLine(SessionInputBufferImpl.java:282)
	at org.apache.http.impl.conn.DefaultHttpResponseParser.parseHead(DefaultHttpResponseParser.java:138)
	at org.apache.http.impl.conn.DefaultHttpResponseParser.parseHead(DefaultHttpResponseParser.java:56)
	at org.apache.http.impl.io.AbstractMessageParser.parse(AbstractMessageParser.java:259)
	at org.apache.http.impl.DefaultBHttpClientConnection.receiveResponseHeader(DefaultBHttpClientConnection.java:163)
	at org.apache.http.impl.conn.CPoolProxy.receiveResponseHeader(CPoolProxy.java:165)
	at org.apache.http.protocol.HttpRequestExecutor.doReceiveResponse(HttpRequestExecutor.java:273)
	at org.apache.http.protocol.HttpRequestExecutor.execute(HttpRequestExecutor.java:125)
	at org.apache.http.impl.execchain.MainClientExec.execute(MainClientExec.java:272)
	at org.apache.http.impl.execchain.ProtocolExec.execute(ProtocolExec.java:185)
	at org.apache.http.impl.execchain.RetryExec.execute(RetryExec.java:89)
	at org.apache.http.impl.execchain.RedirectExec.execute(RedirectExec.java:110)
	at org.apache.http.impl.client.InternalHttpClient.doExecute(InternalHttpClient.java:185)
	at org.apache.http.impl.client.CloseableHttpClient.execute(CloseableHttpClient.java:83)
	at org.apache.http.impl.client.CloseableHttpClient.execute(CloseableHttpClient.java:56)
	at org.apache.solr.client.solrj.impl.HttpSolrClient.executeMethod(HttpSolrClient.java:548)
	... 49 more


FAILED:  org.apache.solr.update.PeerSyncWithLeaderTest.test

Error Message:
Unexpected exception type, expected SolrException but got org.apache.solr.client.solrj.SolrServerException: Timeout occurred while waiting response from server at: http://127.0.0.1:34003/collection1

Stack Trace:
junit.framework.AssertionFailedError: Unexpected exception type, expected SolrException but got org.apache.solr.client.solrj.SolrServerException: Timeout occurred while waiting response from server at: http://127.0.0.1:34003/collection1
	at __randomizedtesting.SeedInfo.seed([C8E1DBA83B7C78B8:40B5E47295801540]:0)
	at org.apache.lucene.util.LuceneTestCase.expectThrows(LuceneTestCase.java:2700)
	at org.apache.lucene.util.LuceneTestCase.expectThrows(LuceneTestCase.java:2689)
	at org.apache.solr.update.PeerSyncTest.test(PeerSyncTest.java:279)
	at java.base/jdk.internal.reflect.NativeMethodAccessorImpl.invoke0(Native Method)
	at java.base/jdk.internal.reflect.NativeMethodAccessorImpl.invoke(NativeMethodAccessorImpl.java:62)
	at java.base/jdk.internal.reflect.DelegatingMethodAccessorImpl.invoke(DelegatingMethodAccessorImpl.java:43)
	at java.base/java.lang.reflect.Method.invoke(Method.java:566)
	at com.carrotsearch.randomizedtesting.RandomizedRunner.invoke(RandomizedRunner.java:1750)
	at com.carrotsearch.randomizedtesting.RandomizedRunner$8.evaluate(RandomizedRunner.java:938)
	at com.carrotsearch.randomizedtesting.RandomizedRunner$9.evaluate(RandomizedRunner.java:974)
	at com.carrotsearch.randomizedtesting.RandomizedRunner$10.evaluate(RandomizedRunner.java:988)
	at org.apache.solr.BaseDistributedSearchTestCase$ShardsRepeatRule$ShardsFixedStatement.callStatement(BaseDistributedSearchTestCase.java:1082)
	at org.apache.solr.BaseDistributedSearchTestCase$ShardsRepeatRule$ShardsStatement.evaluate(BaseDistributedSearchTestCase.java:1054)
	at com.carrotsearch.randomizedtesting.rules.SystemPropertiesRestoreRule$1.evaluate(SystemPropertiesRestoreRule.java:57)
	at org.apache.lucene.util.TestRuleSetupTeardownChained$1.evaluate(TestRuleSetupTeardownChained.java:49)
	at org.apache.lucene.util.AbstractBeforeAfterRule$1.evaluate(AbstractBeforeAfterRule.java:45)
	at org.apache.lucene.util.TestRuleThreadAndTestName$1.evaluate(TestRuleThreadAndTestName.java:48)
	at org.apache.lucene.util.TestRuleIgnoreAfterMaxFailures$1.evaluate(TestRuleIgnoreAfterMaxFailures.java:64)
	at org.apache.lucene.util.TestRuleMarkFailure$1.evaluate(TestRuleMarkFailure.java:47)
	at com.carrotsearch.randomizedtesting.rules.StatementAdapter.evaluate(StatementAdapter.java:36)
	at com.carrotsearch.randomizedtesting.ThreadLeakControl$StatementRunner.run(ThreadLeakControl.java:368)
	at com.carrotsearch.randomizedtesting.ThreadLeakControl.forkTimeoutingTask(ThreadLeakControl.java:817)
	at com.carrotsearch.randomizedtesting.ThreadLeakControl$3.evaluate(ThreadLeakControl.java:468)
	at com.carrotsearch.randomizedtesting.RandomizedRunner.runSingleTest(RandomizedRunner.java:947)
	at com.carrotsearch.randomizedtesting.RandomizedRunner$5.evaluate(RandomizedRunner.java:832)
	at com.carrotsearch.randomizedtesting.RandomizedRunner$6.evaluate(RandomizedRunner.java:883)
	at com.carrotsearch.randomizedtesting.RandomizedRunner$7.evaluate(RandomizedRunner.java:894)
	at com.carrotsearch.randomizedtesting.rules.StatementAdapter.evaluate(StatementAdapter.java:36)
	at com.carrotsearch.randomizedtesting.rules.SystemPropertiesRestoreRule$1.evaluate(SystemPropertiesRestoreRule.java:57)
	at org.apache.lucene.util.AbstractBeforeAfterRule$1.evaluate(AbstractBeforeAfterRule.java:45)
	at com.carrotsearch.randomizedtesting.rules.StatementAdapter.evaluate(StatementAdapter.java:36)
	at org.apache.lucene.util.TestRuleStoreClassName$1.evaluate(TestRuleStoreClassName.java:41)
	at com.carrotsearch.randomizedtesting.rules.NoShadowingOrOverridesOnMethodsRule$1.evaluate(NoShadowingOrOverridesOnMethodsRule.java:40)
	at com.carrotsearch.randomizedtesting.rules.NoShadowingOrOverridesOnMethodsRule$1.evaluate(NoShadowingOrOverridesOnMethodsRule.java:40)
	at com.carrotsearch.randomizedtesting.rules.StatementAdapter.evaluate(StatementAdapter.java:36)
	at com.carrotsearch.randomizedtesting.rules.StatementAdapter.evaluate(StatementAdapter.java:36)
	at org.apache.lucene.util.TestRuleAssertionsRequired$1.evaluate(TestRuleAssertionsRequired.java:53)
	at org.apache.lucene.util.TestRuleMarkFailure$1.evaluate(TestRuleMarkFailure.java:47)
	at org.apache.lucene.util.TestRuleIgnoreAfterMaxFailures$1.evaluate(TestRuleIgnoreAfterMaxFailures.java:64)
	at org.apache.lucene.util.TestRuleIgnoreTestSuites$1.evaluate(TestRuleIgnoreTestSuites.java:54)
	at com.carrotsearch.randomizedtesting.rules.StatementAdapter.evaluate(StatementAdapter.java:36)
	at com.carrotsearch.randomizedtesting.ThreadLeakControl$StatementRunner.run(ThreadLeakControl.java:368)
	at java.base/java.lang.Thread.run(Thread.java:834)
Caused by: org.apache.solr.client.solrj.SolrServerException: Timeout occurred while waiting response from server at: http://127.0.0.1:34003/collection1
	at org.apache.solr.client.solrj.impl.HttpSolrClient.executeMethod(HttpSolrClient.java:660)
	at org.apache.solr.client.solrj.impl.HttpSolrClient.request(HttpSolrClient.java:255)
	at org.apache.solr.client.solrj.impl.HttpSolrClient.request(HttpSolrClient.java:244)
	at org.apache.solr.client.solrj.SolrRequest.process(SolrRequest.java:207)
	at org.apache.solr.client.solrj.SolrRequest.process(SolrRequest.java:224)
	at org.apache.solr.BaseDistributedSearchTestCase.add(BaseDistributedSearchTestCase.java:576)
	at org.apache.solr.update.PeerSyncTest.lambda$test$0(PeerSyncTest.java:281)
	at org.apache.lucene.util.LuceneTestCase.expectThrows(LuceneTestCase.java:2695)
	... 42 more
Caused by: java.net.SocketTimeoutException: Read timed out
	at java.base/java.net.SocketInputStream.socketRead0(Native Method)
	at java.base/java.net.SocketInputStream.socketRead(SocketInputStream.java:115)
	at java.base/java.net.SocketInputStream.read(SocketInputStream.java:168)
	at java.base/java.net.SocketInputStream.read(SocketInputStream.java:140)
	at org.apache.http.impl.io.SessionInputBufferImpl.streamRead(SessionInputBufferImpl.java:137)
	at org.apache.http.impl.io.SessionInputBufferImpl.fillBuffer(SessionInputBufferImpl.java:153)
	at org.apache.http.impl.io.SessionInputBufferImpl.readLine(SessionInputBufferImpl.java:282)
	at org.apache.http.impl.conn.DefaultHttpResponseParser.parseHead(DefaultHttpResponseParser.java:138)
	at org.apache.http.impl.conn.DefaultHttpResponseParser.parseHead(DefaultHttpResponseParser.java:56)
	at org.apache.http.impl.io.AbstractMessageParser.parse(AbstractMessageParser.java:259)
	at org.apache.http.impl.DefaultBHttpClientConnection.receiveResponseHeader(DefaultBHttpClientConnection.java:163)
	at org.apache.http.impl.conn.CPoolProxy.receiveResponseHeader(CPoolProxy.java:165)
	at org.apache.http.protocol.HttpRequestExecutor.doReceiveResponse(HttpRequestExecutor.java:273)
	at org.apache.http.protocol.HttpRequestExecutor.execute(HttpRequestExecutor.java:125)
	at org.apache.http.impl.execchain.MainClientExec.execute(MainClientExec.java:272)
	at org.apache.http.impl.execchain.ProtocolExec.execute(ProtocolExec.java:185)
	at org.apache.http.impl.execchain.RetryExec.execute(RetryExec.java:89)
	at org.apache.http.impl.execchain.RedirectExec.execute(RedirectExec.java:110)
	at org.apache.http.impl.client.InternalHttpClient.doExecute(InternalHttpClient.java:185)
	at org.apache.http.impl.client.CloseableHttpClient.execute(CloseableHttpClient.java:83)
	at org.apache.http.impl.client.CloseableHttpClient.execute(CloseableHttpClient.java:56)
	at org.apache.solr.client.solrj.impl.HttpSolrClient.executeMethod(HttpSolrClient.java:548)
	... 49 more




Build Log:
[...truncated 13452 lines...]
   [junit4] Suite: org.apache.solr.update.PeerSyncWithLeaderTest
   [junit4]   2> Creating dataDir: /home/jenkins/workspace/Lucene-Solr-8.x-Linux/solr/build/solr-core/test/J2/temp/solr.update.PeerSyncWithLeaderTest_C8E1DBA83B7C78B8-001/init-core-data-001
   [junit4]   2> 269235 WARN  (SUITE-PeerSyncWithLeaderTest-seed#[C8E1DBA83B7C78B8]-worker) [    ] o.a.s.SolrTestCaseJ4 startTrackingSearchers: numOpens=2 numCloses=2
   [junit4]   2> 269236 INFO  (SUITE-PeerSyncWithLeaderTest-seed#[C8E1DBA83B7C78B8]-worker) [    ] o.a.s.SolrTestCaseJ4 Using TrieFields (NUMERIC_POINTS_SYSPROP=false) w/NUMERIC_DOCVALUES_SYSPROP=true
   [junit4]   2> 269236 INFO  (SUITE-PeerSyncWithLeaderTest-seed#[C8E1DBA83B7C78B8]-worker) [    ] o.a.s.SolrTestCaseJ4 Randomized ssl (false) and clientAuth (false) via: @org.apache.solr.SolrTestCaseJ4$SuppressSSL(bugUrl="https://issues.apache.org/jira/browse/SOLR-5776")
   [junit4]   2> 269236 INFO  (SUITE-PeerSyncWithLeaderTest-seed#[C8E1DBA83B7C78B8]-worker) [    ] o.a.s.SolrTestCaseJ4 SecureRandom sanity checks: test.solr.allowed.securerandom=null & java.security.egd=file:/dev/./urandom
   [junit4]   2> 269236 INFO  (SUITE-PeerSyncWithLeaderTest-seed#[C8E1DBA83B7C78B8]-worker) [    ] o.a.s.BaseDistributedSearchTestCase Setting hostContext system property: /
   [junit4]   2> 269237 INFO  (TEST-PeerSyncWithLeaderTest.test-seed#[C8E1DBA83B7C78B8]) [    ] o.a.s.SolrTestCaseJ4 ####initCore
   [junit4]   2> 269237 INFO  (TEST-PeerSyncWithLeaderTest.test-seed#[C8E1DBA83B7C78B8]) [    ] o.a.s.c.SolrResourceLoader [null] Added 2 libs to classloader, from paths: [/home/jenkins/workspace/Lucene-Solr-8.x-Linux/solr/core/src/test-files/solr/collection1/lib, /home/jenkins/workspace/Lucene-Solr-8.x-Linux/solr/core/src/test-files/solr/collection1/lib/classes]
   [junit4]   2> 269255 INFO  (TEST-PeerSyncWithLeaderTest.test-seed#[C8E1DBA83B7C78B8]) [    ] o.a.s.c.SolrConfig Using Lucene MatchVersion: 8.2.0
   [junit4]   2> 269271 INFO  (TEST-PeerSyncWithLeaderTest.test-seed#[C8E1DBA83B7C78B8]) [    ] o.a.s.s.IndexSchema [null] Schema name=test
   [junit4]   2> 269378 WARN  (TEST-PeerSyncWithLeaderTest.test-seed#[C8E1DBA83B7C78B8]) [    ] o.a.s.c.SolrResourceLoader Solr loaded a deprecated plugin/analysis class [solr.EnumField]. Please consult documentation how to replace it accordingly.
   [junit4]   2> 269387 INFO  (TEST-PeerSyncWithLeaderTest.test-seed#[C8E1DBA83B7C78B8]) [    ] o.a.s.s.IndexSchema Loaded schema test/1.0 with uniqueid field id
   [junit4]   2> 269460 INFO  (TEST-PeerSyncWithLeaderTest.test-seed#[C8E1DBA83B7C78B8]) [    ] o.a.s.h.c.HttpShardHandlerFactory Host whitelist initialized: WhitelistHostChecker [whitelistHosts=null, whitelistHostCheckingEnabled=false]
   [junit4]   2> 269472 WARN  (TEST-PeerSyncWithLeaderTest.test-seed#[C8E1DBA83B7C78B8]) [    ] o.e.j.u.s.S.config No Client EndPointIdentificationAlgorithm configured for SslContextFactory@83084c6[provider=null,keyStore=null,trustStore=null]
   [junit4]   2> 269480 WARN  (TEST-PeerSyncWithLeaderTest.test-seed#[C8E1DBA83B7C78B8]) [    ] o.e.j.u.s.S.config No Client EndPointIdentificationAlgorithm configured for SslContextFactory@4efe65e[provider=null,keyStore=null,trustStore=null]
   [junit4]   2> 269490 INFO  (TEST-PeerSyncWithLeaderTest.test-seed#[C8E1DBA83B7C78B8]) [    ] o.a.s.c.TransientSolrCoreCacheDefault Allocating transient cache for 2147483647 transient cores
   [junit4]   2> 269490 INFO  (TEST-PeerSyncWithLeaderTest.test-seed#[C8E1DBA83B7C78B8]) [    ] o.a.s.h.a.MetricsHistoryHandler No .system collection, keeping metrics history in memory.
   [junit4]   2> 269499 INFO  (TEST-PeerSyncWithLeaderTest.test-seed#[C8E1DBA83B7C78B8]) [    ] o.a.s.m.r.SolrJmxReporter JMX monitoring for 'solr.node' (registry 'solr.node') enabled at server: com.sun.jmx.mbeanserver.JmxMBeanServer@684685b1
   [junit4]   2> 269505 INFO  (TEST-PeerSyncWithLeaderTest.test-seed#[C8E1DBA83B7C78B8]) [    ] o.a.s.m.r.SolrJmxReporter JMX monitoring for 'solr.jvm' (registry 'solr.jvm') enabled at server: com.sun.jmx.mbeanserver.JmxMBeanServer@684685b1
   [junit4]   2> 269505 INFO  (TEST-PeerSyncWithLeaderTest.test-seed#[C8E1DBA83B7C78B8]) [    ] o.a.s.m.r.SolrJmxReporter JMX monitoring for 'solr.jetty' (registry 'solr.jetty') enabled at server: com.sun.jmx.mbeanserver.JmxMBeanServer@684685b1
   [junit4]   2> 269515 INFO  (coreLoadExecutor-1954-thread-1) [    x:collection1] o.a.s.c.SolrResourceLoader [null] Added 2 libs to classloader, from paths: [/home/jenkins/workspace/Lucene-Solr-8.x-Linux/solr/core/src/test-files/solr/collection1/lib, /home/jenkins/workspace/Lucene-Solr-8.x-Linux/solr/core/src/test-files/solr/collection1/lib/classes]
   [junit4]   2> 269530 INFO  (coreLoadExecutor-1954-thread-1) [    x:collection1] o.a.s.c.SolrConfig Using Lucene MatchVersion: 8.2.0
   [junit4]   2> 269545 INFO  (coreLoadExecutor-1954-thread-1) [    x:collection1] o.a.s.s.IndexSchema [collection1] Schema name=test
   [junit4]   2> 269628 INFO  (coreLoadExecutor-1954-thread-1) [    x:collection1] o.a.s.s.IndexSchema Loaded schema test/1.0 with uniqueid field id
   [junit4]   2> 269671 INFO  (coreLoadExecutor-1954-thread-1) [    x:collection1] o.a.s.c.CoreContainer Creating SolrCore 'collection1' using configuration from instancedir /home/jenkins/workspace/Lucene-Solr-8.x-Linux/solr/core/src/test-files/solr/collection1, trusted=true
   [junit4]   2> 269672 INFO  (coreLoadExecutor-1954-thread-1) [    x:collection1] o.a.s.m.r.SolrJmxReporter JMX monitoring for 'solr.core.collection1' (registry 'solr.core.collection1') enabled at server: com.sun.jmx.mbeanserver.JmxMBeanServer@684685b1
   [junit4]   2> 269672 INFO  (coreLoadExecutor-1954-thread-1) [    x:collection1] o.a.s.c.SolrCore [[collection1] ] Opening new SolrCore at [/home/jenkins/workspace/Lucene-Solr-8.x-Linux/solr/core/src/test-files/solr/collection1], dataDir=[/home/jenkins/workspace/Lucene-Solr-8.x-Linux/solr/build/solr-core/test/J2/temp/solr.update.PeerSyncWithLeaderTest_C8E1DBA83B7C78B8-001/init-core-data-001/]
   [junit4]   2> 269675 INFO  (coreLoadExecutor-1954-thread-1) [    x:collection1] o.a.s.u.RandomMergePolicy RandomMergePolicy wrapping class org.apache.lucene.index.LogByteSizeMergePolicy: [LogByteSizeMergePolicy: minMergeSize=1677721, mergeFactor=43, maxMergeSize=2147483648, maxMergeSizeForForcedMerge=9223372036854775807, calibrateSizeByDeletes=false, maxMergeDocs=2147483647, maxCFSSegmentSizeMB=8.796093022207999E12, noCFSRatio=0.7628132883329787]
   [junit4]   2> 269684 WARN  (coreLoadExecutor-1954-thread-1) [    x:collection1] o.a.s.c.RequestHandlers INVALID paramSet a in requestHandler {type = requestHandler,name = /dump,class = DumpRequestHandler,attributes = {initParams=a, name=/dump, class=DumpRequestHandler},args = {defaults={a=A,b=B}}}
   [junit4]   2> 269718 INFO  (coreLoadExecutor-1954-thread-1) [    x:collection1] o.a.s.u.UpdateHandler Using UpdateLog implementation: org.apache.solr.update.UpdateLog
   [junit4]   2> 269718 INFO  (coreLoadExecutor-1954-thread-1) [    x:collection1] o.a.s.u.UpdateLog Initializing UpdateLog: dataDir= defaultSyncLevel=FLUSH numRecordsToKeep=100 maxNumLogsToKeep=10 numVersionBuckets=65536
   [junit4]   2> 269719 INFO  (coreLoadExecutor-1954-thread-1) [    x:collection1] o.a.s.u.CommitTracker Hard AutoCommit: disabled
   [junit4]   2> 269719 INFO  (coreLoadExecutor-1954-thread-1) [    x:collection1] o.a.s.u.CommitTracker Soft AutoCommit: disabled
   [junit4]   2> 269720 INFO  (coreLoadExecutor-1954-thread-1) [    x:collection1] o.a.s.u.RandomMergePolicy RandomMergePolicy wrapping class org.apache.lucene.index.TieredMergePolicy: [TieredMergePolicy: maxMergeAtOnce=12, maxMergeAtOnceExplicit=22, maxMergedSegmentMB=78.609375, floorSegmentMB=2.0576171875, forceMergeDeletesPctAllowed=3.724773032128885, segmentsPerTier=29.0, maxCFSSegmentSizeMB=8.796093022207999E12, noCFSRatio=0.7477288487475543, deletesPctAllowed=24.588552933540026
   [junit4]   2> 269721 INFO  (coreLoadExecutor-1954-thread-1) [    x:collection1] o.a.s.s.SolrIndexSearcher Opening [Searcher@706b3cbb[collection1] main]
   [junit4]   2> 269721 WARN  (coreLoadExecutor-1954-thread-1) [    x:collection1] o.a.s.r.ManagedResourceStorage Cannot write to config directory /home/jenkins/workspace/Lucene-Solr-8.x-Linux/solr/core/src/test-files/solr/collection1/conf; switching to use InMemory storage instead.
   [junit4]   2> 269721 INFO  (coreLoadExecutor-1954-thread-1) [    x:collection1] o.a.s.h.ReplicationHandler Commits will be reserved for 10000ms.
   [junit4]   2> 269721 INFO  (coreLoadExecutor-1954-thread-1) [    x:collection1] o.a.s.u.UpdateLog Could not find max version in index or recent updates, using new clock 1632383288793366528
   [junit4]   2> 269724 INFO  (TEST-PeerSyncWithLeaderTest.test-seed#[C8E1DBA83B7C78B8]) [    ] o.a.s.SolrTestCaseJ4 ####initCore end
   [junit4]   2> 269727 INFO  (searcherExecutor-1955-thread-1-processing-x:collection1) [    x:collection1] o.a.s.c.SolrCore [collection1] Registered new searcher Searcher@706b3cbb[collection1] main{ExitableDirectoryReader(UninvertingDirectoryReader())}
   [junit4]   2> 269870 INFO  (TEST-PeerSyncWithLeaderTest.test-seed#[C8E1DBA83B7C78B8]) [    ] o.a.s.SolrTestCaseJ4 Writing core.properties file to /home/jenkins/workspace/Lucene-Solr-8.x-Linux/solr/build/solr-core/test/J2/temp/solr.update.PeerSyncWithLeaderTest_C8E1DBA83B7C78B8-001/tempDir-001/control/cores/collection1
   [junit4]   2> 269871 WARN  (TEST-PeerSyncWithLeaderTest.test-seed#[C8E1DBA83B7C78B8]) [    ] o.e.j.s.AbstractConnector Ignoring deprecated socket close linger time
   [junit4]   2> 269872 INFO  (TEST-PeerSyncWithLeaderTest.test-seed#[C8E1DBA83B7C78B8]) [    ] o.a.s.c.s.e.JettySolrRunner Start Jetty (original configured port=0)
   [junit4]   2> 269872 INFO  (TEST-PeerSyncWithLeaderTest.test-seed#[C8E1DBA83B7C78B8]) [    ] o.a.s.c.s.e.JettySolrRunner Trying to start Jetty on port 0 try number 1 ...
   [junit4]   2> 269872 INFO  (TEST-PeerSyncWithLeaderTest.test-seed#[C8E1DBA83B7C78B8]) [    ] o.e.j.s.Server jetty-9.4.14.v20181114; built: 2018-11-14T21:20:31.478Z; git: c4550056e785fb5665914545889f21dc136ad9e6; jvm 11.0.2+9
   [junit4]   2> 269879 INFO  (TEST-PeerSyncWithLeaderTest.test-seed#[C8E1DBA83B7C78B8]) [    ] o.e.j.s.session DefaultSessionIdManager workerName=node0
   [junit4]   2> 269879 INFO  (TEST-PeerSyncWithLeaderTest.test-seed#[C8E1DBA83B7C78B8]) [    ] o.e.j.s.session No SessionScavenger set, using defaults
   [junit4]   2> 269880 INFO  (TEST-PeerSyncWithLeaderTest.test-seed#[C8E1DBA83B7C78B8]) [    ] o.e.j.s.session node0 Scavenging every 600000ms
   [junit4]   2> 269880 INFO  (TEST-PeerSyncWithLeaderTest.test-seed#[C8E1DBA83B7C78B8]) [    ] o.e.j.s.h.ContextHandler Started o.e.j.s.ServletContextHandler@614799ab{/,null,AVAILABLE}
   [junit4]   2> 269880 INFO  (TEST-PeerSyncWithLeaderTest.test-seed#[C8E1DBA83B7C78B8]) [    ] o.e.j.s.AbstractConnector Started ServerConnector@1e8878f3{HTTP/1.1,[http/1.1, h2c]}{127.0.0.1:45471}
   [junit4]   2> 269880 INFO  (TEST-PeerSyncWithLeaderTest.test-seed#[C8E1DBA83B7C78B8]) [    ] o.e.j.s.Server Started @269901ms
   [junit4]   2> 269880 INFO  (TEST-PeerSyncWithLeaderTest.test-seed#[C8E1DBA83B7C78B8]) [    ] o.a.s.c.s.e.JettySolrRunner Jetty properties: {schema=schema.xml, hostContext=/, solrconfig=solrconfig-tlog.xml, hostPort=45471, coreRootDirectory=/home/jenkins/workspace/Lucene-Solr-8.x-Linux/solr/build/solr-core/test/J2/temp/solr.update.PeerSyncWithLeaderTest_C8E1DBA83B7C78B8-001/tempDir-001/control/cores}
   [junit4]   2> 269881 ERROR (TEST-PeerSyncWithLeaderTest.test-seed#[C8E1DBA83B7C78B8]) [    ] o.a.s.u.StartupLoggingUtils Missing Java Option solr.log.dir. Logging may be missing or incomplete.
   [junit4]   2> 269881 INFO  (TEST-PeerSyncWithLeaderTest.test-seed#[C8E1DBA83B7C78B8]) [    ] o.a.s.s.SolrDispatchFilter Using logger factory org.apache.logging.slf4j.Log4jLoggerFactory
   [junit4]   2> 269881 INFO  (TEST-PeerSyncWithLeaderTest.test-seed#[C8E1DBA83B7C78B8]) [    ] o.a.s.s.SolrDispatchFilter  ___      _       Welcome to Apache Solr™ version 8.2.0
   [junit4]   2> 269881 INFO  (TEST-PeerSyncWithLeaderTest.test-seed#[C8E1DBA83B7C78B8]) [    ] o.a.s.s.SolrDispatchFilter / __| ___| |_ _   Starting in standalone mode on port null
   [junit4]   2> 269881 INFO  (TEST-PeerSyncWithLeaderTest.test-seed#[C8E1DBA83B7C78B8]) [    ] o.a.s.s.SolrDispatchFilter \__ \/ _ \ | '_|  Install dir: null
   [junit4]   2> 269881 INFO  (TEST-PeerSyncWithLeaderTest.test-seed#[C8E1DBA83B7C78B8]) [    ] o.a.s.s.SolrDispatchFilter |___/\___/_|_|    Start time: 2019-05-02T01:53:37.213280Z
   [junit4]   2> 269881 INFO  (TEST-PeerSyncWithLeaderTest.test-seed#[C8E1DBA83B7C78B8]) [    ] o.a.s.c.SolrXmlConfig Loading container configuration from /home/jenkins/workspace/Lucene-Solr-8.x-Linux/solr/build/solr-core/test/J2/temp/solr.update.PeerSyncWithLeaderTest_C8E1DBA83B7C78B8-001/tempDir-001/control/solr.xml
   [junit4]   2> 269883 INFO  (TEST-PeerSyncWithLeaderTest.test-seed#[C8E1DBA83B7C78B8]) [    ] o.a.s.c.SolrXmlConfig Configuration parameter autoReplicaFailoverWorkLoopDelay is ignored
   [junit4]   2> 269883 INFO  (TEST-PeerSyncWithLeaderTest.test-seed#[C8E1DBA83B7C78B8]) [    ] o.a.s.c.SolrXmlConfig Configuration parameter autoReplicaFailoverBadNodeExpiration is ignored
   [junit4]   2> 269884 INFO  (TEST-PeerSyncWithLeaderTest.test-seed#[C8E1DBA83B7C78B8]) [    ] o.a.s.c.SolrXmlConfig MBean server found: com.sun.jmx.mbeanserver.JmxMBeanServer@684685b1, but no JMX reporters were configured - adding default JMX reporter.
   [junit4]   2> 270267 INFO  (TEST-PeerSyncWithLeaderTest.test-seed#[C8E1DBA83B7C78B8]) [    ] o.a.s.h.c.HttpShardHandlerFactory Host whitelist initialized: WhitelistHostChecker [whitelistHosts=null, whitelistHostCheckingEnabled=false]
   [junit4]   2> 270268 WARN  (TEST-PeerSyncWithLeaderTest.test-seed#[C8E1DBA83B7C78B8]) [    ] o.e.j.u.s.S.config No Client EndPointIdentificationAlgorithm configured for SslContextFactory@4a01243[provider=null,keyStore=null,trustStore=null]
   [junit4]   2> 270270 WARN  (TEST-PeerSyncWithLeaderTest.test-seed#[C8E1DBA83B7C78B8]) [    ] o.e.j.u.s.S.config No Client EndPointIdentificationAlgorithm configured for SslContextFactory@4cc24c0d[provider=null,keyStore=null,trustStore=null]
   [junit4]   2> 270278 INFO  (TEST-PeerSyncWithLeaderTest.test-seed#[C8E1DBA83B7C78B8]) [    ] o.a.s.c.TransientSolrCoreCacheDefault Allocating transient cache for 4 transient cores
   [junit4]   2> 270278 INFO  (TEST-PeerSyncWithLeaderTest.test-seed#[C8E1DBA83B7C78B8]) [    ] o.a.s.h.a.MetricsHistoryHandler No .system collection, keeping metrics history in memory.
   [junit4]   2> 270289 INFO  (TEST-PeerSyncWithLeaderTest.test-seed#[C8E1DBA83B7C78B8]) [    ] o.a.s.m.r.SolrJmxReporter JMX monitoring for 'solr.node' (registry 'solr.node') enabled at server: com.sun.jmx.mbeanserver.JmxMBeanServer@684685b1
   [junit4]   2> 270295 INFO  (TEST-PeerSyncWithLeaderTest.test-seed#[C8E1DBA83B7C78B8]) [    ] o.a.s.m.r.SolrJmxReporter JMX monitoring for 'solr.jvm' (registry 'solr.jvm') enabled at server: com.sun.jmx.mbeanserver.JmxMBeanServer@684685b1
   [junit4]   2> 270296 INFO  (TEST-PeerSyncWithLeaderTest.test-seed#[C8E1DBA83B7C78B8]) [    ] o.a.s.m.r.SolrJmxReporter JMX monitoring for 'solr.jetty' (registry 'solr.jetty') enabled at server: com.sun.jmx.mbeanserver.JmxMBeanServer@684685b1
   [junit4]   2> 270297 INFO  (TEST-PeerSyncWithLeaderTest.test-seed#[C8E1DBA83B7C78B8]) [    ] o.a.s.c.CorePropertiesLocator Found 1 core definitions underneath /home/jenkins/workspace/Lucene-Solr-8.x-Linux/solr/build/solr-core/test/J2/temp/solr.update.PeerSyncWithLeaderTest_C8E1DBA83B7C78B8-001/tempDir-001/control/cores
   [junit4]   2> 270297 INFO  (TEST-PeerSyncWithLeaderTest.test-seed#[C8E1DBA83B7C78B8]) [    ] o.a.s.c.CorePropertiesLocator Cores are: [collection1]
   [junit4]   2> 270297 INFO  (coreLoadExecutor-1968-thread-1) [    x:collection1] o.a.s.c.SolrResourceLoader [null] Added 2 libs to classloader, from paths: [/home/jenkins/workspace/Lucene-Solr-8.x-Linux/solr/core/src/test-files/solr/collection1/lib, /home/jenkins/workspace/Lucene-Solr-8.x-Linux/solr/core/src/test-files/solr/collection1/lib/classes]
   [junit4]   2> 270313 INFO  (coreLoadExecutor-1968-thread-1) [    x:collection1] o.a.s.c.SolrConfig Using Lucene MatchVersion: 8.2.0
   [junit4]   2> 270341 INFO  (coreLoadExecutor-1968-thread-1) [    x:collection1] o.a.s.s.IndexSchema [collection1] Schema name=test
   [junit4]   2> 270411 INFO  (coreLoadExecutor-1968-thread-1) [    x:collection1] o.a.s.s.IndexSchema Loaded schema test/1.0 with uniqueid field id
   [junit4]   2> 270417 INFO  (coreLoadExecutor-1968-thread-1) [    x:collection1] o.a.s.c.CoreContainer Creating SolrCore 'collection1' using configuration from configset /home/jenkins/workspace/Lucene-Solr-8.x-Linux/solr/core/src/test-files/solr/collection1, trusted=true
   [junit4]   2> 270418 INFO  (coreLoadExecutor-1968-thread-1) [    x:collection1] o.a.s.m.r.SolrJmxReporter JMX monitoring for 'solr.core.collection1' (registry 'solr.core.collection1') enabled at server: com.sun.jmx.mbeanserver.JmxMBeanServer@684685b1
   [junit4]   2> 270418 INFO  (coreLoadExecutor-1968-thread-1) [    x:collection1] o.a.s.c.SolrCore [[collection1] ] Opening new SolrCore at [/home/jenkins/workspace/Lucene-Solr-8.x-Linux/solr/core/src/test-files/solr/collection1], dataDir=[/home/jenkins/workspace/Lucene-Solr-8.x-Linux/solr/build/solr-core/test/J2/temp/solr.update.PeerSyncWithLeaderTest_C8E1DBA83B7C78B8-001/tempDir-001/control/cores/collection1/data/]
   [junit4]   2> 270419 INFO  (coreLoadExecutor-1968-thread-1) [    x:collection1] o.a.s.u.RandomMergePolicy RandomMergePolicy wrapping class org.apache.lucene.index.LogByteSizeMergePolicy: [LogByteSizeMergePolicy: minMergeSize=1677721, mergeFactor=43, maxMergeSize=2147483648, maxMergeSizeForForcedMerge=9223372036854775807, calibrateSizeByDeletes=false, maxMergeDocs=2147483647, maxCFSSegmentSizeMB=8.796093022207999E12, noCFSRatio=0.7628132883329787]
   [junit4]   2> 270420 WARN  (coreLoadExecutor-1968-thread-1) [    x:collection1] o.a.s.c.RequestHandlers INVALID paramSet a in requestHandler {type = requestHandler,name = /dump,class = DumpRequestHandler,attributes = {initParams=a, name=/dump, class=DumpRequestHandler},args = {defaults={a=A,b=B}}}
   [junit4]   2> 270445 INFO  (coreLoadExecutor-1968-thread-1) [    x:collection1] o.a.s.u.UpdateHandler Using UpdateLog implementation: org.apache.solr.update.UpdateLog
   [junit4]   2> 270445 INFO  (coreLoadExecutor-1968-thread-1) [    x:collection1] o.a.s.u.UpdateLog Initializing UpdateLog: dataDir= defaultSyncLevel=FLUSH numRecordsToKeep=100 maxNumLogsToKeep=10 numVersionBuckets=65536
   [junit4]   2> 270446 INFO  (coreLoadExecutor-1968-thread-1) [    x:collection1] o.a.s.u.CommitTracker Hard AutoCommit: disabled
   [junit4]   2> 270446 INFO  (coreLoadExecutor-1968-thread-1) [    x:collection1] o.a.s.u.CommitTracker Soft AutoCommit: disabled
   [junit4]   2> 270447 INFO  (coreLoadExecutor-1968-thread-1) [    x:collection1] o.a.s.u.RandomMergePolicy RandomMergePolicy wrapping class org.apache.lucene.index.TieredMergePolicy: [TieredMergePolicy: maxMergeAtOnce=12, maxMergeAtOnceExplicit=22, maxMergedSegmentMB=78.609375, floorSegmentMB=2.0576171875, forceMergeDeletesPctAllowed=3.724773032128885, segmentsPerTier=29.0, maxCFSSegmentSizeMB=8.796093022207999E12, noCFSRatio=0.7477288487475543, deletesPctAllowed=24.588552933540026
   [junit4]   2> 270448 INFO  (coreLoadExecutor-1968-thread-1) [    x:collection1] o.a.s.s.SolrIndexSearcher Opening [Searcher@44fa103b[collection1] main]
   [junit4]   2> 270448 WARN  (coreLoadExecutor-1968-thread-1) [    x:collection1] o.a.s.r.ManagedResourceStorage Cannot write to config directory /home/jenkins/workspace/Lucene-Solr-8.x-Linux/solr/core/src/test-files/solr/collection1/conf; switching to use InMemory storage instead.
   [junit4]   2> 270448 INFO  (coreLoadExecutor-1968-thread-1) [    x:collection1] o.a.s.h.ReplicationHandler Commits will be reserved for 10000ms.
   [junit4]   2> 270448 INFO  (coreLoadExecutor-1968-thread-1) [    x:collection1] o.a.s.u.UpdateLog Could not find max version in index or recent updates, using new clock 1632383289555681280
   [junit4]   2> 270450 INFO  (searcherExecutor-1969-thread-1-processing-x:collection1) [    x:collection1] o.a.s.c.SolrCore [collection1] Registered new searcher Searcher@44fa103b[collection1] main{ExitableDirectoryReader(UninvertingDirectoryReader())}
   [junit4]   2> 270573 INFO  (TEST-PeerSyncWithLeaderTest.test-seed#[C8E1DBA83B7C78B8]) [    ] o.a.s.SolrTestCaseJ4 Writing core.properties file to /home/jenkins/workspace/Lucene-Solr-8.x-Linux/solr/build/solr-core/test/J2/temp/solr.update.PeerSyncWithLeaderTest_C8E1DBA83B7C78B8-001/tempDir-001/shard0/cores/collection1
   [junit4]   2> 270573 WARN  (TEST-PeerSyncWithLeaderTest.test-seed#[C8E1DBA83B7C78B8]) [    ] o.e.j.s.AbstractConnector Ignoring deprecated socket close linger time
   [junit4]   2> 270574 INFO  (TEST-PeerSyncWithLeaderTest.test-seed#[C8E1DBA83B7C78B8]) [    ] o.a.s.c.s.e.JettySolrRunner Start Jetty (original configured port=0)
   [junit4]   2> 270574 INFO  (TEST-PeerSyncWithLeaderTest.test-seed#[C8E1DBA83B7C78B8]) [    ] o.a.s.c.s.e.JettySolrRunner Trying to start Jetty on port 0 try number 1 ...
   [junit4]   2> 270574 INFO  (TEST-PeerSyncWithLeaderTest.test-seed#[C8E1DBA83B7C78B8]) [    ] o.e.j.s.Server jetty-9.4.14.v20181114; built: 2018-11-14T21:20:31.478Z; git: c4550056e785fb5665914545889f21dc136ad9e6; jvm 11.0.2+9
   [junit4]   2> 270574 INFO  (TEST-PeerSyncWithLeaderTest.test-seed#[C8E1DBA83B7C78B8]) [    ] o.e.j.s.session DefaultSessionIdManager workerName=node0
   [junit4]   2> 270574 INFO  (TEST-PeerSyncWithLeaderTest.test-seed#[C8E1DBA83B7C78B8]) [    ] o.e.j.s.session No SessionScavenger set, using defaults
   [junit4]   2> 270574 INFO  (TEST-PeerSyncWithLeaderTest.test-seed#[C8E1DBA83B7C78B8]) [    ] o.e.j.s.session node0 Scavenging every 660000ms
   [junit4]   2> 270574 INFO  (TEST-PeerSyncWithLeaderTest.test-seed#[C8E1DBA83B7C78B8]) [    ] o.e.j.s.h.ContextHandler Started o.e.j.s.ServletContextHandler@393efc52{/,null,AVAILABLE}
   [junit4]   2> 270575 INFO  (TEST-PeerSyncWithLeaderTest.test-seed#[C8E1DBA83B7C78B8]) [    ] o.e.j.s.AbstractConnector Started ServerConnector@523f447d{HTTP/1.1,[http/1.1, h2c]}{127.0.0.1:34003}
   [junit4]   2> 270575 INFO  (TEST-PeerSyncWithLeaderTest.test-seed#[C8E1DBA83B7C78B8]) [    ] o.e.j.s.Server Started @270595ms
   [junit4]   2> 270575 INFO  (TEST-PeerSyncWithLeaderTest.test-seed#[C8E1DBA83B7C78B8]) [    ] o.a.s.c.s.e.JettySolrRunner Jetty properties: {schema=schema.xml, hostContext=/, solrconfig=solrconfig-tlog.xml, hostPort=34003, coreRootDirectory=/home/jenkins/workspace/Lucene-Solr-8.x-Linux/solr/build/solr-core/test/J2/temp/solr.update.PeerSyncWithLeaderTest_C8E1DBA83B7C78B8-001/tempDir-001/shard0/cores}
   [junit4]   2> 270575 ERROR (TEST-PeerSyncWithLeaderTest.test-seed#[C8E1DBA83B7C78B8]) [    ] o.a.s.u.StartupLoggingUtils Missing Java Option solr.log.dir. Logging may be missing or incomplete.
   [junit4]   2> 270575 INFO  (TEST-PeerSyncWithLeaderTest.test-seed#[C8E1DBA83B7C78B8]) [    ] o.a.s.s.SolrDispatchFilter Using logger factory org.apache.logging.slf4j.Log4jLoggerFactory
   [junit4]   2> 270575 INFO  (TEST-PeerSyncWithLeaderTest.test-seed#[C8E1DBA83B7C78B8]) [    ] o.a.s.s.SolrDispatchFilter  ___      _       Welcome to Apache Solr™ version 8.2.0
   [junit4]   2> 270575 INFO  (TEST-PeerSyncWithLeaderTest.test-seed#[C8E1DBA83B7C78B8]) [    ] o.a.s.s.SolrDispatchFilter / __| ___| |_ _   Starting in standalone mode on port null
   [junit4]   2> 270575 INFO  (TEST-PeerSyncWithLeaderTest.test-seed#[C8E1DBA83B7C78B8]) [    ] o.a.s.s.SolrDispatchFilter \__ \/ _ \ | '_|  Install dir: null
   [junit4]   2> 270575 INFO  (TEST-PeerSyncWithLeaderTest.test-seed#[C8E1DBA83B7C78B8]) [    ] o.a.s.s.SolrDispatchFilter |___/\___/_|_|    Start time: 2019-05-02T01:53:37.907566Z
   [junit4]   2> 270575 INFO  (TEST-PeerSyncWithLeaderTest.test-seed#[C8E1DBA83B7C78B8]) [    ] o.a.s.c.SolrXmlConfig Loading container configuration from /home/jenkins/workspace/Lucene-Solr-8.x-Linux/solr/build/solr-core/test/J2/temp/solr.update.PeerSyncWithLeaderTest_C8E1DBA83B7C78B8-001/tempDir-001/shard0/solr.xml
   [junit4]   2> 270577 INFO  (TEST-PeerSyncWithLeaderTest.test-seed#[C8E1DBA83B7C78B8]) [    ] o.a.s.c.SolrXmlConfig Configuration parameter autoReplicaFailoverWorkLoopDelay is ignored
   [junit4]   2> 270577 INFO  (TEST-PeerSyncWithLeaderTest.test-seed#[C8E1DBA83B7C78B8]) [    ] o.a.s.c.SolrXmlConfig Configuration parameter autoReplicaFailoverBadNodeExpiration is ignored
   [junit4]   2> 270578 INFO  (TEST-PeerSyncWithLeaderTest.test-seed#[C8E1DBA83B7C78B8]) [    ] o.a.s.c.SolrXmlConfig MBean server found: com.sun.jmx.mbeanserver.JmxMBeanServer@684685b1, but no JMX reporters were configured - adding default JMX reporter.
   [junit4]   2> 270744 INFO  (TEST-PeerSyncWithLeaderTest.test-seed#[C8E1DBA83B7C78B8]) [    ] o.a.s.h.c.HttpShardHandlerFactory Host whitelist initialized: WhitelistHostChecker [whitelistHosts=null, whitelistHostCheckingEnabled=false]
   [junit4]   2> 270745 WARN  (TEST-PeerSyncWithLeaderTest.test-seed#[C8E1DBA83B7C78B8]) [    ] o.e.j.u.s.S.config No Client EndPointIdentificationAlgorithm configured for SslContextFactory@749b53b8[provider=null,keyStore=null,trustStore=null]
   [junit4]   2> 270747 WARN  (TEST-PeerSyncWithLeaderTest.test-seed#[C8E1DBA83B7C78B8]) [    ] o.e.j.u.s.S.config No Client EndPointIdentificationAlgorithm configured for SslContextFactory@ae90e83[provider=null,keyStore=null,trustStore=null]
   [junit4]   2> 270754 INFO  (TEST-PeerSyncWithLeaderTest.test-seed#[C8E1DBA83B7C78B8]) [    ] o.a.s.c.TransientSolrCoreCacheDefault Allocating transient cache for 4 transient cores
   [junit4]   2> 270754 INFO  (TEST-PeerSyncWithLeaderTest.test-seed#[C8E1DBA83B7C78B8]) [    ] o.a.s.h.a.MetricsHistoryHandler No .system collection, keeping metrics history in memory.
   [junit4]   2> 270764 INFO  (TEST-PeerSyncWithLeaderTest.test-seed#[C8E1DBA83B7C78B8]) [    ] o.a.s.m.r.SolrJmxReporter JMX monitoring for 'solr.node' (registry 'solr.node') enabled at server: com.sun.jmx.mbeanserver.JmxMBeanServer@684685b1
   [junit4]   2> 270771 INFO  (TEST-PeerSyncWithLeaderTest.test-seed#[C8E1DBA83B7C78B8]) [    ] o.a.s.m.r.SolrJmxReporter JMX monitoring for 'solr.jvm' (registry 'solr.jvm') enabled at server: com.sun.jmx.mbeanserver.JmxMBeanServer@684685b1
   [junit4]   2> 270771 INFO  (TEST-PeerSyncWithLeaderTest.test-seed#[C8E1DBA83B7C78B8]) [    ] o.a.s.m.r.SolrJmxReporter JMX monitoring for 'solr.jetty' (registry 'solr.jetty') enabled at server: com.sun.jmx.mbeanserver.JmxMBeanServer@684685b1
   [junit4]   2> 270772 INFO  (TEST-PeerSyncWithLeaderTest.test-seed#[C8E1DBA83B7C78B8]) [    ] o.a.s.c.CorePropertiesLocator Found 1 core definitions underneath /home/jenkins/workspace/Lucene-Solr-8.x-Linux/solr/build/solr-core/test/J2/temp/solr.update.PeerSyncWithLeaderTest_C8E1DBA83B7C78B8-001/tempDir-001/shard0/cores
   [junit4]   2> 270772 INFO  (TEST-PeerSyncWithLeaderTest.test-seed#[C8E1DBA83B7C78B8]) [    ] o.a.s.c.CorePropertiesLocator Cores are: [collection1]
   [junit4]   2> 270773 INFO  (coreLoadExecutor-1982-thread-1) [    x:collection1] o.a.s.c.SolrResourceLoader [null] Added 2 libs to classloader, from paths: [/home/jenkins/workspace/Lucene-Solr-8.x-Linux/solr/core/src/test-files/solr/collection1/lib, /home/jenkins/workspace/Lucene-Solr-8.x-Linux/solr/core/src/test-files/solr/collection1/lib/classes]
   [junit4]   2> 270783 INFO  (coreLoadExecutor-1982-thread-1) [    x:collection1] o.a.s.c.SolrConfig Using Lucene MatchVersion: 8.2.0
   [junit4]   2> 270793 INFO  (coreLoadExecutor-1982-thread-1) [    x:collection1] o.a.s.s.IndexSchema [collection1] Schema name=test
   [junit4]   2> 270852 INFO  (coreLoadExecutor-1982-thread-1) [    x:collection1] o.a.s.s.IndexSchema Loaded schema test/1.0 with uniqueid field id
   [junit4]   2> 270857 INFO  (coreLoadExecutor-1982-thread-1) [    x:collection1] o.a.s.c.CoreContainer Creating SolrCore 'collection1' using configuration from configset /home/jenkins/workspace/Lucene-Solr-8.x-Linux/solr/core/src/test-files/solr/collection1, trusted=true
   [junit4]   2> 270857 INFO  (coreLoadExecutor-1982-thread-1) [    x:collection1] o.a.s.m.r.SolrJmxReporter JMX monitoring for 'solr.core.collection1' (registry 'solr.core.collection1') enabled at server: com.sun.jmx.mbeanserver.JmxMBeanServer@684685b1
   [junit4]   2> 270857 INFO  (coreLoadExecutor-1982-thread-1) [    x:collection1] o.a.s.c.SolrCore [[collection1] ] Opening new SolrCore at [/home/jenkins/workspace/Lucene-Solr-8.x-Linux/solr/core/src/test-files/solr/collection1], dataDir=[/home/jenkins/workspace/Lucene-Solr-8.x-Linux/solr/build/solr-core/test/J2/temp/solr.update.PeerSyncWithLeaderTest_C8E1DBA83B7C78B8-001/tempDir-001/shard0/cores/collection1/data/]
   [junit4]   2> 270858 INFO  (coreLoadExecutor-1982-thread-1) [    x:collection1] o.a.s.u.RandomMergePolicy RandomMergePolicy wrapping class org.apache.lucene.index.LogByteSizeMergePolicy: [LogByteSizeMergePolicy: minMergeSize=1677721, mergeFactor=43, maxMergeSize=2147483648, maxMergeSizeForForcedMerge=9223372036854775807, calibrateSizeByDeletes=false, maxMergeDocs=2147483647, maxCFSSegmentSizeMB=8.796093022207999E12, noCFSRatio=0.7628132883329787]
   [junit4]   2> 270859 WARN  (coreLoadExecutor-1982-thread-1) [    x:collection1] o.a.s.c.RequestHandlers INVALID paramSet a in requestHandler {type = requestHandler,name = /dump,class = DumpRequestHandler,attributes = {initParams=a, name=/dump, class=DumpRequestHandler},args = {defaults={a=A,b=B}}}
   [junit4]   2> 270881 INFO  (coreLoadExecutor-1982-thread-1) [    x:collection1] o.a.s.u.UpdateHandler Using UpdateLog implementation: org.apache.solr.update.UpdateLog
   [junit4]   2> 270881 INFO  (coreLoadExecutor-1982-thread-1) [    x:collection1] o.a.s.u.UpdateLog Initializing UpdateLog: dataDir= defaultSyncLevel=FLUSH numRecordsToKeep=100 maxNumLogsToKeep=10 numVersionBuckets=65536
   [junit4]   2> 270882 INFO  (coreLoadExecutor-1982-thread-1) [    x:collection1] o.a.s.u.CommitTracker Hard AutoCommit: disabled
   [junit4]   2> 270882 INFO  (coreLoadExecutor-1982-thread-1) [    x:collection1] o.a.s.u.CommitTracker Soft AutoCommit: disabled
   [junit4]   2> 270882 INFO  (coreLoadExecutor-1982-thread-1) [    x:collection1] o.a.s.u.RandomMergePolicy RandomMergePolicy wrapping class org.apache.lucene.index.TieredMergePolicy: [TieredMergePolicy: maxMergeAtOnce=12, maxMergeAtOnceExplicit=22, maxMergedSegmentMB=78.609375, floorSegmentMB=2.0576171875, forceMergeDeletesPctAllowed=3.724773032128885, segmentsPerTier=29.0, maxCFSSegmentSizeMB=8.796093022207999E12, noCFSRatio=0.7477288487475543, deletesPctAllowed=24.588552933540026
   [junit4]   2> 270882 INFO  (coreLoadExecutor-1982-thread-1) [    x:collection1] o.a.s.s.SolrIndexSearcher Opening [Searcher@487b046d[collection1] main]
   [junit4]   2> 270882 WARN  (coreLoadExecutor-1982-thread-1) [    x:collection1] o.a.s.r.ManagedResourceStorage Cannot write to config directory /home/jenkins/workspace/Lucene-Solr-8.x-Linux/solr/core/src/test-files/solr/collection1/conf; switching to use InMemory storage instead.
   [junit4]   2> 270883 INFO  (coreLoadExecutor-1982-thread-1) [    x:collection1] o.a.s.h.ReplicationHandler Commits will be reserved for 10000ms.
   [junit4]   2> 270883 INFO  (coreLoadExecutor-1982-thread-1) [    x:collection1] o.a.s.u.UpdateLog Could not find max version in index or recent updates, using new clock 1632383290011811840
   [junit4]   2> 270884 INFO  (searcherExecutor-1983-thread-1-processing-x:collection1) [    x:collection1] o.a.s.c.SolrCore [collection1] Registered new searcher Searcher@487b046d[collection1] main{ExitableDirectoryReader(UninvertingDirectoryReader())}
   [junit4]   2> 270969 INFO  (TEST-PeerSyncWithLeaderTest.test-seed#[C8E1DBA83B7C78B8]) [    ] o.a.s.SolrTestCaseJ4 Writing core.properties file to /home/jenkins/workspace/Lucene-Solr-8.x-Linux/solr/build/solr-core/test/J2/temp/solr.update.PeerSyncWithLeaderTest_C8E1DBA83B7C78B8-001/tempDir-001/shard1/cores/collection1
   [junit4]   2> 270970 WARN  (TEST-PeerSyncWithLeaderTest.test-seed#[C8E1DBA83B7C78B8]) [    ] o.e.j.s.AbstractConnector Ignoring deprecated socket close linger time
   [junit4]   2> 270970 INFO  (TEST-PeerSyncWithLeaderTest.test-seed#[C8E1DBA83B7C78B8]) [    ] o.a.s.c.s.e.JettySolrRunner Start Jetty (original configured port=0)
   [junit4]   2> 270970 INFO  (TEST-PeerSyncWithLeaderTest.test-seed#[C8E1DBA83B7C78B8]) [    ] o.a.s.c.s.e.JettySolrRunner Trying to start Jetty on port 0 try number 1 ...
   [junit4]   2> 270970 INFO  (TEST-PeerSyncWithLeaderTest.test-seed#[C8E1DBA83B7C78B8]) [    ] o.e.j.s.Server jetty-9.4.14.v20181114; built: 2018-11-14T21:20:31.478Z; git: c4550056e785fb5665914545889f21dc136ad9e6; jvm 11.0.2+9
   [junit4]   2> 270971 INFO  (TEST-PeerSyncWithLeaderTest.test-seed#[C8E1DBA83B7C78B8]) [    ] o.e.j.s.session DefaultSessionIdManager workerName=node0
   [junit4]   2> 270971 INFO  (TEST-PeerSyncWithLeaderTest.test-seed#[C8E1DBA83B7C78B8]) [    ] o.e.j.s.session No SessionScavenger set, using defaults
   [junit4]   2> 270971 INFO  (TEST-PeerSyncWithLeaderTest.test-seed#[C8E1DBA83B7C78B8]) [    ] o.e.j.s.session node0 Scavenging every 600000ms
   [junit4]   2> 270972 INFO  (TEST-PeerSyncWithLeaderTest.test-seed#[C8E1DBA83B7C78B8]) [    ] o.e.j.s.h.ContextHandler Started o.e.j.s.ServletContextHandler@20be3b29{/,null,AVAILABLE}
   [junit4]   2> 270972 INFO  (TEST-PeerSyncWithLeaderTest.test-seed#[C8E1DBA83B7C78B8]) [    ] o.e.j.s.AbstractConnector Started ServerConnector@691ac711{HTTP/1.1,[http/1.1, h2c]}{127.0.0.1:37719}
   [junit4]   2> 270972 INFO  (TEST-PeerSyncWithLeaderTest.test-seed#[C8E1DBA83B7C78B8]) [    ] o.e.j.s.Server Started @270992ms
   [junit4]   2> 270972 INFO  (TEST-PeerSyncWithLeaderTest.test-seed#[C8E1DBA83B7C78B8]) [    ] o.a.s.c.s.e.JettySolrRunner Jetty properties: {schema=schema.xml, hostContext=/, solrconfig=solrconfig-tlog.xml, hostPort=37719, coreRootDirectory=/home/jenkins/workspace/Lucene-Solr-8.x-Linux/solr/build/solr-core/test/J2/temp/solr.update.PeerSyncWithLeaderTest_C8E1DBA83B7C78B8-001/tempDir-001/shard1/cores}
   [junit4]   2> 270972 ERROR (TEST-PeerSyncWithLeaderTest.test-seed#[C8E1DBA83B7C78B8]) [    ] o.a.s.u.StartupLoggingUtils Missing Java Option solr.log.dir. Logging may be missing or incomplete.
   [junit4]   2> 270972 INFO  (TEST-PeerSyncWithLeaderTest.test-seed#[C8E1DBA83B7C78B8]) [    ] o.a.s.s.SolrDispatchFilter Using logger factory org.apache.logging.slf4j.Log4jLoggerFactory
   [junit4]   2> 270972 INFO  (TEST-PeerSyncWithLeaderTest.test-seed#[C8E1DBA83B7C78B8]) [    ] o.a.s.s.SolrDispatchFilter  ___      _       Welcome to Apache Solr™ version 8.2.0
   [junit4]   2> 270972 INFO  (TEST-PeerSyncWithLeaderTest.test-seed#[C8E1DBA83B7C78B8]) [    ] o.a.s.s.SolrDispatchFilter / __| ___| |_ _   Starting in standalone mode on port null
   [junit4]   2> 270972 INFO  (TEST-PeerSyncWithLeaderTest.test-seed#[C8E1DBA83B7C78B8]) [    ] o.a.s.s.SolrDispatchFilter \__ \/ _ \ | '_|  Install dir: null
   [junit4]   2> 270972 INFO  (TEST-PeerSyncWithLeaderTest.test-seed#[C8E1DBA83B7C78B8]) [    ] o.a.s.s.SolrDispatchFilter |___/\___/_|_|    Start time: 2019-05-02T01:53:38.304717Z
   [junit4]   2> 270972 INFO  (TEST-PeerSyncWithLeaderTest.test-seed#[C8E1DBA83B7C78B8]) [    ] o.a.s.c.SolrXmlConfig Loading container configuration from /home/jenkins/workspace/Lucene-Solr-8.x-Linux/solr/build/solr-core/test/J2/temp/solr.update.PeerSyncWithLeaderTest_C8E1DBA83B7C78B8-001/tempDir-001/shard1/solr.xml
   [junit4]   2> 270974 INFO  (TEST-PeerSyncWithLeaderTest.test-seed#[C8E1DBA83B7C78B8]) [    ] o.a.s.c.SolrXmlConfig Configuration parameter autoReplicaFailoverWorkLoopDelay is ignored
   [junit4]   2> 270974 INFO  (TEST-PeerSyncWithLeaderTest.test-seed#[C8E1DBA83B7C78B8]) [    ] o.a.s.c.SolrXmlConfig Configuration parameter autoReplicaFailoverBadNodeExpiration is ignored
   [junit4]   2> 270975 INFO  (TEST-PeerSyncWithLeaderTest.test-seed#[C8E1DBA83B7C78B8]) [    ] o.a.s.c.SolrXmlConfig MBean server found: com.sun.jmx.mbeanserver.JmxMBeanServer@684685b1, but no JMX reporters were configured - adding default JMX reporter.
   [junit4]   2> 271041 INFO  (TEST-PeerSyncWithLeaderTest.test-seed#[C8E1DBA83B7C78B8]) [    ] o.a.s.h.c.HttpShardHandlerFactory Host whitelist initialized: WhitelistHostChecker [whitelistHosts=null, whitelistHostCheckingEnabled=false]
   [junit4]   2> 271042 WARN  (TEST-PeerSyncWithLeaderTest.test-seed#[C8E1DBA83B7C78B8]) [    ] o.e.j.u.s.S.config No Client EndPointIdentificationAlgorithm configured for SslContextFactory@2e4d1b23[provider=null,keyStore=null,trustStore=null]
   [junit4]   2> 271045 WARN  (TEST-PeerSyncWithLeaderTest.test-seed#[C8E1DBA83B7C78B8]) [    ] o.e.j.u.s.S.config No Client EndPointIdentificationAlgorithm configured for SslContextFactory@648217b6[provider=null,keyStore=null,trustStore=null]
   [junit4]   2> 271053 INFO  (TEST-PeerSyncWithLeaderTest.test-seed#[C8E1DBA83B7C78B8]) [    ] o.a.s.c.TransientSolrCoreCacheDefault Allocating transient cache for 4 transient cores
   [junit4]   2> 271053 INFO  (TEST-PeerSyncWithLeaderTest.test-seed#[C8E1DBA83B7C78B8]) [    ] o.a.s.h.a.MetricsHistoryHandler No .system collection, keeping metrics history in memory.
   [junit4]   2> 271064 INFO  (TEST-PeerSyncWithLeaderTest.test-seed#[C8E1DBA83B7C78B8]) [    ] o.a.s.m.r.SolrJmxReporter JMX monitoring for 'solr.node' (registry 'solr.node') enabled at server: com.sun.jmx.mbeanserver.JmxMBeanServer@684685b1
   [junit4]   2> 271071 INFO  (TEST-PeerSyncWithLeaderTest.test-seed#[C8E1DBA83B7C78B8]) [    ] o.a.s.m.r.SolrJmxReporter JMX monitoring for 'solr.jvm' (registry 'solr.jvm') enabled at server: com.sun.jmx.mbeanserver.JmxMBeanServer@684685b1
   [junit4]   2> 271071 INFO  (TEST-PeerSyncWithLeaderTest.test-seed#[C8E1DBA83B7C78B8]) [    ] o.a.s.m.r.SolrJmxReporter JMX monitoring for 'solr.jetty' (registry 'solr.jetty') enabled at server: com.sun.jmx.mbeanserver.JmxMBeanServer@684685b1
   [junit4]   2> 271072 INFO  (TEST-PeerSyncWithLeaderTest.test-seed#[C8E1DBA83B7C78B8]) [    ] o.a.s.c.CorePropertiesLocator Found 1 core definitions underneath /home/jenkins/workspace/Lucene-Solr-8.x-Linux/solr/build/solr-core/test/J2/temp/solr.update.PeerSyncWithLeaderTest_C8E1DBA83B7C78B8-001/tempDir-001/shard1/cores
   [junit4]   2> 271072 INFO  (TEST-PeerSyncWithLeaderTest.test-seed#[C8E1DBA83B7C78B8]) [    ] o.a.s.c.CorePropertiesLocator Cores are: [collection1]
   [junit4]   2> 271073 INFO  (coreLoadExecutor-1996-thread-1) [    x:collection1] o.a.s.c.SolrResourceLoader [null] Added 2 libs to classloader, from paths: [/home/jenkins/workspace/Lucene-Solr-8.x-Linux/solr/core/src/test-files/solr/collection1/lib, /home/jenkins/workspace/Lucene-Solr-8.x-Linux/solr/core/src/test-files/solr/collection1/lib/classes]
   [junit4]   2> 271085 INFO  (coreLoadExecutor-1996-thread-1) [    x:collection1] o.a.s.c.SolrConfig Using Lucene MatchVersion: 8.2.0
   [junit4]   2> 271095 INFO  (coreLoadExecutor-1996-thread-1) [    x:collection1] o.a.s.s.IndexSchema [collection1] Schema name=test
   [junit4]   2> 271172 INFO  (coreLoadExecutor-1996-thread-1) [    x:collection1] o.a.s.s.IndexSchema Loaded schema test/1.0 with uniqueid field id
   [junit4]   2> 271181 INFO  (coreLoadExecutor-1996-thread-1) [    x:collection1] o.a.s.c.CoreContainer Creating SolrCore 'collection1' using configuration from configset /home/jenkins/workspace/Lucene-Solr-8.x-Linux/solr/core/src/test-files/solr/collection1, trusted=true
   [junit4]   2> 271181 INFO  (coreLoadExecutor-1996-thread-1) [    x:collection1] o.a.s.m.r.SolrJmxReporter JMX monitoring for 'solr.core.collection1' (registry 'solr.core.collection1') enabled at server: com.sun.jmx.mbeanserver.JmxMBeanServer@684685b1
   [junit4]   2> 271181 INFO  (coreLoadExecutor-1996-thread-1) [    x:collection1] o.a.s.c.SolrCore [[collection1] ] Opening new SolrCore at [/home/jenkins/workspace/Lucene-Solr-8.x-Linux/solr/core/src/test-files/solr/collection1], dataDir=[/home/jenkins/workspace/Lucene-Solr-8.x-Linux/solr/build/solr-core/test/J2/temp/solr.update.PeerSyncWithLeaderTest_C8E1DBA83B7C78B8-001/tempDir-001/shard1/cores/collection1/data/]
   [junit4]   2> 271183 INFO  (coreLoadExecutor-1996-thread-1) [    x:collection1] o.a.s.u.RandomMergePolicy RandomMergePolicy wrapping class org.apache.lucene.index.LogByteSizeMergePolicy: [LogByteSizeMergePolicy: minMergeSize=1677721, mergeFactor=43, maxMergeSize=2147483648, maxMergeSizeForForcedMerge=9223372036854775807, calibrateSizeByDeletes=false, maxMergeDocs=2147483647, maxCFSSegmentSizeMB=8.796093022207999E12, noCFSRatio=0.7628132883329787]
   [junit4]   2> 271185 WARN  (coreLoadExecutor-1996-thread-1) [    x:collection1] o.a.s.c.RequestHandlers INVALID paramSet a in requestHandler {type = requestHandler,name = /dump,class = DumpRequestHandler,attributes = {initParams=a, name=/dump, class=DumpRequestHandler},args = {defaults={a=A,b=B}}}
   [junit4]   2> 271228 INFO  (coreLoadExecutor-1996-thread-1) [    x:collection1] o.a.s.u.UpdateHandler Using UpdateLog implementation: org.apache.solr.update.UpdateLog
   [junit4]   2> 271228 INFO  (coreLoadExecutor-1996-thread-1) [    x:collection1] o.a.s.u.UpdateLog Initializing UpdateLog: dataDir= defaultSyncLevel=FLUSH numRecordsToKeep=100 maxNumLogsToKeep=10 numVersionBuckets=65536
   [junit4]   2> 271229 INFO  (coreLoadExecutor-1996-thread-1) [    x:collection1] o.a.s.u.CommitTracker Hard AutoCommit: disabled
   [junit4]   2> 271229 INFO  (coreLoadExecutor-1996-thread-1) [    x:collection1] o.a.s.u.CommitTracker Soft AutoCommit: disabled
   [junit4]   2> 271230 INFO  (coreLoadExecutor-1996-thread-1) [    x:collection1] o.a.s.u.RandomMergePolicy RandomMergePolicy wrapping class org.apache.lucene.index.TieredMergePolicy: [TieredMergePolicy: maxMergeAtOnce=12, maxMergeAtOnceExplicit=22, maxMergedSegmentMB=78.609375, floorSegmentMB=2.0576171875, forceMergeDeletesPctAllowed=3.724773032128885, segmentsPerTier=29.0, maxCFSSegmentSizeMB=8.796093022207999E12, noCFSRatio=0.7477288487475543, deletesPctAllowed=24.588552933540026
   [junit4]   2> 271230 INFO  (coreLoadExecutor-1996-thread-1) [    x:collection1] o.a.s.s.SolrIndexSearcher Opening [Searcher@1a712240[collection1] main]
   [junit4]   2> 271231 WARN  (coreLoadExecutor-1996-thread-1) [    x:collection1] o.a.s.r.ManagedResourceStorage Cannot write to config directory /home/jenkins/workspace/Lucene-Solr-8.x-Linux/solr/core/src/test-files/solr/collection1/conf; switching to use InMemory storage instead.
   [junit4]   2> 271231 INFO  (coreLoadExecutor-1996-thread-1) [    x:collection1] o.a.s.h.ReplicationHandler Commits will be reserved for 10000ms.
   [junit4]   2> 271231 INFO  (coreLoadExecutor-1996-thread-1) [    x:collection1] o.a.s.u.UpdateLog Could not find max version in index or recent updates, using new clock 1632383290376716288
   [junit4]   2> 271233 INFO  (searcherExecutor-1997-thread-1-processing-x:collection1) [    x:collection1] o.a.s.c.SolrCore [collection1] Registered new searcher Searcher@1a712240[collection1] main{ExitableDirectoryReader(UninvertingDirectoryReader())}
   [junit4]   2> 271327 INFO  (TEST-PeerSyncWithLeaderTest.test-seed#[C8E1DBA83B7C78B8]) [    ] o.a.s.SolrTestCaseJ4 Writing core.properties file to /home/jenkins/workspace/Lucene-Solr-8.x-Linux/solr/build/solr-core/test/J2/temp/solr.update.PeerSyncWithLeaderTest_C8E1DBA83B7C78B8-001/tempDir-001/shard2/cores/collection1
   [junit4]   2> 271328 WARN  (TEST-PeerSyncWithLeaderTest.test-seed#[C8E1DBA83B7C78B8]) [    ] o.e.j.s.AbstractConnector Ignoring deprecated socket close linger time
   [junit4]   2> 271328 INFO  (TEST-PeerSyncWithLeaderTest.test-seed#[C8E1DBA83B7C78B8]) [    ] o.a.s.c.s.e.JettySolrRunner Start Jetty (original configured port=0)
   [junit4]   2> 271328 INFO  (TEST-PeerSyncWithLeaderTest.test-seed#[C8E1DBA83B7C78B8]) [    ] o.a.s.c.s.e.JettySolrRunner Trying to start Jetty on port 0 try number 1 ...
   [junit4]   2> 271328 INFO  (TEST-PeerSyncWithLeaderTest.test-seed#[C8E1DBA83B7C78B8]) [    ] o.e.j.s.Server jetty-9.4.14.v20181114; built: 2018-11-14T21:20:31.478Z; git: c4550056e785fb5665914545889f21dc136ad9e6; jvm 11.0.2+9
   [junit4]   2> 271330 INFO  (TEST-PeerSyncWithLeaderTest.test-seed#[C8E1DBA83B7C78B8]) [    ] o.e.j.s.session DefaultSessionIdManager workerName=node0
   [junit4]   2> 271330 INFO  (TEST-PeerSyncWithLeaderTest.test-seed#[C8E1DBA83B7C78B8]) [    ] o.e.j.s.session No SessionScavenger set, using defaults
   [junit4]   2> 271330 INFO  (TEST-PeerSyncWithLeaderTest.test-seed#[C8E1DBA83B7C78B8]) [    ] o.e.j.s.session node0 Scavenging every 660000ms
   [junit4]   2> 271330 INFO  (TEST-PeerSyncWithLeaderTest.test-seed#[C8E1DBA83B7C78B8]) [    ] o.e.j.s.h.ContextHandler Started o.e.j.s.ServletContextHandler@137062d1{/,null,AVAILABLE}
   [junit4]   2> 271330 INFO  (TEST-PeerSyncWithLeaderTest.test-seed#[C8E1DBA83B7C78B8]) [    ] o.e.j.s.AbstractConnector Started ServerConnector@9f2b5fe{HTTP/1.1,[http/1.1, h2c]}{127.0.0.1:33231}
   [junit4]   2> 271330 INFO  (TEST-PeerSyncWithLeaderTest.test-seed#[C8E1DBA83B7C78B8]) [    ] o.e.j.s.Server Started @271351ms
   [junit4]   2> 271330 INFO  (TEST-PeerSyncWithLeaderTest.test-seed#[C8E1DBA83B7C78B8]) [    ] o.a.s.c.s.e.JettySolrRunner Jetty properties: {schema=schema.xml, hostContext=/, solrconfig=solrconfig-tlog.xml, hostPort=33231, coreRootDirectory=/home/jenkins/workspace/Lucene-Solr-8.x-Linux/solr/build/solr-core/test/J2/temp/solr.update.PeerSyncWithLeaderTest_C8E1DBA83B7C78B8-001/tempDir-001/shard2/cores}
   [junit4]   2> 271331 ERROR (TEST-PeerSyncWithLeaderTest.test-seed#[C8E1DBA83B7C78B8]) [    ] o.a.s.u.StartupLoggingUtils Missing Java Option solr.log.dir. Logging may be missing or incomplete.
   [junit4]   2> 271331 INFO  (TEST-PeerSyncWithLeaderTest.test-seed#[C8E1DBA83B7C78B8]) [    ] o.a.s.s.SolrDispatchFilter Using logger factory org.apache.logging.slf4j.Log4jLoggerFactory
   [junit4]   2> 271331 INFO  (TEST-PeerSyncWithLeaderTest.test-seed#[C8E1DBA83B7C78B8]) [    ] o.a.s.s.SolrDispatchFilter  ___      _       Welcome to Apache Solr™ version 8.2.0
   [junit4]   2> 271331 INFO  (TEST-PeerSyncWithLeaderTest.test-seed#[C8E1DBA83B7C78B8]) [    ] o.a.s.s.SolrDispatchFilter / __| ___| |_ _   Starting in standalone mode on port null
   [junit4]   2> 271331 INFO  (TEST-PeerSyncWithLeaderTest.test-seed#[C8E1DBA83B7C78B8]) [    ] o.a.s.s.SolrDispatchFilter \__ \/ _ \ | '_|  Install dir: null
   [junit4]   2> 271331 INFO  (TEST-PeerSyncWithLeaderTest.test-seed#[C8E1DBA83B7C78B8]) [    ] o.a.s.s.SolrDispatchFilter |___/\___/_|_|    Start time: 2019-05-02T01:53:38.663204Z
   [junit4]   2> 271331 INFO  (TEST-PeerSyncWithLeaderTest.test-seed#[C8E1DBA83B7C78B8]) [    ] o.a.s.c.SolrXmlConfig Loading container configuration from /home/jenkins/workspace/Lucene-Solr-8.x-Linux/solr/build/solr-core/test/J2/temp/solr.update.PeerSyncWithLeaderTest_C8E1DBA83B7C78B8-001/tempDir-001/shard2/solr.xml
   [junit4]   2> 271333 INFO  (TEST-PeerSyncWithLeaderTest.test-seed#[C8E1DBA83B7C78B8]) [    ] o.a.s.c.SolrXmlConfig Configuration parameter autoReplicaFailoverWorkLoopDelay is ignored
   [junit4]   2> 271333 INFO  (TEST-PeerSyncWithLeaderTest.test-seed#[C8E1DBA83B7C78B8]) [    ] o.a.s.c.SolrXmlConfig Configuration parameter autoReplicaFailoverBadNodeExpiration is ignored
   [junit4]   2> 271333 INFO  (TEST-PeerSyncWithLeaderTest.test-seed#[C8E1DBA83B7C78B8]) [    ] o.a.s.c.SolrXmlConfig MBean server found: com.sun.jmx.mbeanserver.JmxMBeanServer@684685b1, but no JMX reporters were configured - adding default JMX reporter.
   [junit4]   2> 271395 INFO  (TEST-PeerSyncWithLeaderTest.test-seed#[C8E1DBA83B7C78B8]) [    ] o.a.s.h.c.HttpShardHandlerFactory Host whitelist initialized: WhitelistHostChecker [whitelistHosts=null, whitelistHostCheckingEnabled=false]
   [junit4]   2> 271396 WARN  (TEST-PeerSyncWithLeaderTest.test-seed#[C8E1DBA83B7C78B8]) [    ] o.e.j.u.s.S.config No Client EndPointIdentificationAlgorithm configured for SslContextFactory@74d35a27[provider=null,keyStore=null,trustStore=null]
   [junit4]   2> 271398 WARN  (TEST-PeerSyncWithLeaderTest.test-seed#[C8E1DBA83B7C78B8]) [    ] o.e.j.u.s.S.config No Client EndPointIdentificationAlgorithm configured for SslContextFactory@54fb81ae[provider=null,keyStore=null,trustStore=null]
   [junit4]   2> 271405 INFO  (TEST-PeerSyncWithLeaderTest.test-seed#[C8E1DBA83B7C78B8]) [    ] o.a.s.c.TransientSolrCoreCacheDefault Allocating transient cache for 4 transient cores
   [junit4]   2> 271405 INFO  (TEST-PeerSyncWithLeaderTest.test-seed#[C8E1DBA83B7C78B8]) [    ] o.a.s.h.a.MetricsHistoryHandler No .system collection, keeping metrics history in memory.
   [junit4]   2> 271415 INFO  (TEST-PeerSyncWithLeaderTest.test-seed#[C8E1DBA83B7C78B8]) [    ] o.a.s.m.r.SolrJmxReporter JMX monitoring for 'solr.node' (registry 'solr.node') enabled at server: com.sun.jmx.mbeanserver.JmxMBeanServer@684685b1
   [junit4]   2> 271421 INFO  (TEST-PeerSyncWithLeaderTest.test-seed#[C8E1DBA83B7C78B8]) [    ] o.a.s.m.r.SolrJmxReporter JMX monitoring for 'solr.jvm' (registry 'solr.jvm') enabled at server: com.sun.jmx.mbeanserver.JmxMBeanServer@684685b1
   [junit4]   2> 271421 INFO  (TEST-PeerSyncWithLeaderTest.test-seed#[C8E1DBA83B7C78B8]) [    ] o.a.s.m.r.SolrJmxReporter JMX monitoring for 'solr.jetty' (registry 'solr.jetty') enabled at server: com.sun.jmx.mbeanserver.JmxMBeanServer@684685b1
   [junit4]   2> 271422 INFO  (TEST-PeerSyncWithLeaderTest.test-seed#[C8E1DBA83B7C78B8]) [    ] o.a.s.c.CorePropertiesLocator Found 1 core definitions underneath /home/jenkins/workspace/Lucene-Solr-8.x-Linux/solr/build/solr-core/test/J2/temp/solr.update.PeerSyncWithLeaderTest_C8E1DBA83B7C78B8-001/tempDir-001/shard2/cores
   [junit4]   2> 271422 INFO  (TEST-PeerSyncWithLeaderTest.test-seed#[C8E1DBA83B7C78B8]) [    ] o.a.s.c.CorePropertiesLocator Cores are: [collection1]
   [junit4]   2> 271423 INFO  (coreLoadExecutor-2010-thread-1) [    x:collection1] o.a.s.c.SolrResourceLoader [null] Added 2 libs to classloader, from paths: [/home/jenkins/workspace/Lucene-Solr-8.x-Linux/solr/core/src/test-files/solr/collection1/lib, /home/jenkins/workspace/Lucene-Solr-8.x-Linux/solr/core/src/test-files/solr/collection1/lib/classes]
   [junit4]   2> 271438 INFO  (coreLoadExecutor-2010-thread-1) [    x:collection1] o.a.s.c.SolrConfig Using Lucene MatchVersion: 8.2.0
   [junit4]   2> 271458 INFO  (coreLoadExecutor-2010-thread-1) [    x:collection1] o.a.s.s.IndexSchema [collection1] Schema name=test
   [junit4]   2> 271536 INFO  (coreLoadExecutor-2010-thread-1) [    x:collection1] o.a.s.s.IndexSchema Loaded schema test/1.0 with uniqueid field id
   [junit4]   2> 271544 INFO  (coreLoadExecutor-2010-thread-1) [    x:collection1] o.a.s.c.CoreContainer Creating SolrCore 'collection1' using configuration from configset /home/jenkins/workspace/Lucene-Solr-8.x-Linux/solr/core/src/test-files/solr/collection1, trusted=true
   [junit4]   2> 271544 INFO  (coreLoadExecutor-2010-thread-1) [    x:collection1] o.a.s.m.r.SolrJmxReporter JMX monitoring for 'solr.core.collection1' (registry 'solr.core.collection1') enabled at server: com.sun.jmx.mbeanserver.JmxMBeanServer@684685b1
   [junit4]   2> 271544 INFO  (coreLoadExecutor-2010-thread-1) [    x:collection1] o.a.s.c.SolrCore [[collection1] ] Opening new SolrCore at [/home/jenkins/workspace/Lucene-Solr-8.x-Linux/solr/core/src/test-files/solr/collection1], dataDir=[/home/jenkins/workspace/Lucene-Solr-8.x-Linux/solr/build/solr-core/test/J2/temp/solr.update.PeerSyncWithLeaderTest_C8E1DBA83B7C78B8-001/tempDir-001/shard2/cores/collection1/data/]
   [junit4]   2> 271545 INFO  (coreLoadExecutor-2010-thread-1) [    x:collection1] o.a.s.u.RandomMergePolicy RandomMergePolicy wrapping class org.apache.lucene.index.LogByteSizeMergePolicy: [LogByteSizeMergePolicy: minMergeSize=1677721, mergeFactor=43, maxMergeSize=2147483648, maxMergeSizeForForcedMerge=9223372036854775807, calibrateSizeByDeletes=false, maxMergeDocs=2147483647, maxCFSSegmentSizeMB=8.796093022207999E12, noCFSRatio=0.7628132883329787]
   [junit4]   2> 271546 WARN  (coreLoadExecutor-2010-thread-1) [    x:collection1] o.a.s.c.RequestHandlers INVALID paramSet a in requestHandler {type = requestHandler,name = /dump,class = DumpRequestHandler,attributes = {initParams=a, name=/dump, class=DumpRequestHandler},args = {defaults={a=A,b=B}}}
   [junit4]   2> 271578 INFO  (coreLoadExecutor-2010-thread-1) [    x:collection1] o.a.s.u.UpdateHandler Using UpdateLog implementation: org.apache.solr.update.UpdateLog
   [junit4]   2> 271578 INFO  (coreLoadExecutor-2010-thread-1) [    x:collection1] o.a.s.u.UpdateLog Initializing UpdateLog: dataDir= defaultSyncLevel=FLUSH numRecordsToKeep=100 maxNumLogsToKeep=10 numVersionBuckets=65536
   [junit4]   2> 271579 INFO  (coreLoadExecutor-2010-thread-1) [    x:collection1] o.a.s.u.CommitTracker Hard AutoCommit: disabled
   [junit4]   2> 271579 INFO  (coreLoadExecutor-2010-thread-1) [    x:collection1] o.a.s.u.CommitTracker Soft AutoCommit: disabled
   [junit4]   2> 271580 INFO  (coreLoadExecutor-2010-thread-1) [    x:collection1] o.a.s.u.RandomMergePolicy RandomMergePolicy wrapping class org.apache.lucene.index.TieredMergePolicy: [TieredMergePolicy: maxMergeAtOnce=12, maxMergeAtOnceExplicit=22, maxMergedSegmentMB=78.609375, floorSegmentMB=2.0576171875, forceMergeDeletesPctAllowed=3.724773032128885, segmentsPerTier=29.0, maxCFSSegmentSizeMB=8.796093022207999E12, noCFSRatio=0.7477288487475543, deletesPctAllowed=24.588552933540026
   [junit4]   2> 271580 INFO  (coreLoadExecutor-2010-thread-1) [    x:collection1] o.a.s.s.SolrIndexSearcher Opening [Searcher@27d2059d[collection1] main]
   [junit4]   2> 271581 WARN  (coreLoadExecutor-2010-thread-1) [    x:collection1] o.a.s.r.ManagedResourceStorage Cannot write to config directory /home/jenkins/workspace/Lucene-Solr-8.x-Linux/solr/core/src/test-files/solr/collection1/conf; switching to use InMemory storage instead.
   [junit4]   2> 271581 INFO  (coreLoadExecutor-2010-thread-1) [    x:collection1] o.a.s.h.ReplicationHandler Commits will be reserved for 10000ms.
   [junit4]   2> 271581 INFO  (coreLoadExecutor-2010-thread-1) [    x:collection1] o.a.s.u.UpdateLog Could not find max version in index or recent updates, using new clock 1632383290743717888
   [junit4]   2> 271583 INFO  (searcherExecutor-2011-thread-1-processing-x:collection1) [    x:collection1] o.a.s.c.SolrCore [collection1] Registered new searcher Searcher@27d2059d[collection1] main{ExitableDirectoryReader(UninvertingDirectoryReader())}
   [junit4]   2> 271591 INFO  (TEST-PeerSyncWithLeaderTest.test-seed#[C8E1DBA83B7C78B8]) [    ] o.a.s.SolrTestCaseJ4 ###Starting test
   [junit4]   2> 271601 INFO  (qtp524766263-7133) [    x:collection1] o.a.s.u.p.LogUpdateProcessorFactory [collection1]  webapp= path=/update params={update.distrib=FROMLEADER&wt=javabin&version=2}{add=[1 (1)]} 0 3
   [junit4]   2> 271605 WARN  (qtp1555446878-7154) [    x:collection1] o.a.s.u.PeerSyncWithLeader no frame of reference to tell if we've missed updates
   [junit4]   2> 271605 INFO  (qtp1555446878-7154) [    x:collection1] o.a.s.c.S.Request [collection1]  webapp= path=/get params={syncWithLeader=http://127.0.0.1:34003/collection1&qt=/get&getVersions=100&wt=javabin&version=2} status=0 QTime=0
   [junit4]   2> 271607 INFO  (qtp1555446878-7155) [    x:collection1] o.a.s.u.p.LogUpdateProcessorFactory [collection1]  webapp= path=/update params={update.distrib=FROMLEADER&wt=javabin&version=2}{add=[1 (1)]} 0 1
   [junit4]   2> 271608 INFO  (qtp1555446878-7153) [    x:collection1] o.a.s.u.PeerSyncWithLeader PeerSync: core=collection1 url= START leader=http://127.0.0.1:34003/collection1 nUpdates=100
   [junit4]   2> 271616 INFO  (qtp524766263-7132) [    x:collection1] o.a.s.s.SolrIndexSearcher Opening [Searcher@b7fb39d[collection1] realtime]
   [junit4]   2> 271616 INFO  (qtp524766263-7132) [    x:collection1] o.a.s.u.IndexFingerprint IndexFingerprint millis:6.0 result:{maxVersionSpecified=9223372036854775807, maxVersionEncountered=1, maxInHash=1, versionsHash=-5451962507482445012, numVersions=1, numDocs=1, maxDoc=1}
   [junit4]   2> 271616 INFO  (qtp524766263-7132) [    x:collection1] o.a.s.c.S.Request [collection1]  webapp= path=/get params={distrib=false&qt=/get&getFingerprint=9223372036854775807&wt=javabin&version=2} status=0 QTime=7
   [junit4]   2> 271620 INFO  (qtp1555446878-7153) [    x:collection1] o.a.s.s.SolrIndexSearcher Opening [Searcher@5f21771e[collection1] realtime]
   [junit4]   2> 271620 INFO  (qtp1555446878-7153) [    x:collection1] o.a.s.u.IndexFingerprint IndexFingerprint millis:3.0 result:{maxVersionSpecified=9223372036854775807, maxVersionEncountered=1, maxInHash=1, versionsHash=-5451962507482445012, numVersions=1, numDocs=1, maxDoc=1}
   [junit4]   2> 271620 INFO  (qtp1555446878-7153) [    x:collection1] o.a.s.u.PeerSyncWithLeader Fingerprint comparison result: 0
   [junit4]   2> 271620 INFO  (qtp1555446878-7153) [    x:collection1] o.a.s.c.S.Request [collection1]  webapp= path=/get params={syncWithLeader=http://127.0.0.1:34003/collection1&qt=/get&getVersions=100&wt=javabin&version=2} status=0 QTime=12
   [junit4]   2> 271621 INFO  (qtp524766263-7133) [    x:collection1] o.a.s.u.DirectUpdateHandler2 start commit{_version_=1632383290785660928,optimize=false,openSearcher=true,waitSearcher=true,expungeDeletes=false,softCommit=false,prepareCommit=false}
   [junit4]   2> 271621 INFO  (qtp524766263-7133) [    x:collection1] o.a.s.u.SolrIndexWriter Calling setCommitData with IW:org.apache.solr.update.SolrIndexWriter@7bd0669f commitCommandVersion:1632383290785660928
   [junit4]   2> 271622 INFO  (qtp524766263-7133) [    x:collection1] o.a.s.s.SolrIndexSearcher Opening [Searcher@5ff9927[collection1] main]
   [junit4]   2> 271622 INFO  (qtp524766263-7133) [    x:collection1] o.a.s.u.DirectUpdateHandler2 end_commit_flush
   [junit4]   2> 271624 INFO  (searcherExecutor-1983-thread-1-processing-x:collection1) [    x:collection1] o.a.s.c.SolrCore [collection1] Registered new searcher Searcher@5ff9927[collection1] main{ExitableDirectoryReader(UninvertingDirectoryReader(Uninverting(_0(8.2.0):c1:[diagnostics={os=Linux, java.vendor=Oracle Corporation, java.version=11.0.2, java.vm.version=11.0.2+9, lucene.version=8.2.0, os.arch=amd64, java.runtime.version=11.0.2+9, source=flush, os.version=4.18.0-17-generic, timestamp=1556762018943}]:[attributes={Lucene50StoredFieldsFormat.mode=BEST_COMPRESSION}])))}
   [junit4]   2> 271624 INFO  (qtp524766263-7133) [    x:collection1] o.a.s.u.p.LogUpdateProcessorFactory [collection1]  webapp= path=/update params={waitSearcher=true&commit=true&softCommit=false&wt=javabin&version=2}{commit=} 0 3
   [junit4]   2> 271625 INFO  (qtp1555446878-7154) [    x:collection1] o.a.s.u.DirectUpdateHandler2 start commit{_version_=1632383290789855232,optimize=false,openSearcher=true,waitSearcher=true,expungeDeletes=false,softCommit=false,prepareCommit=false}
   [junit4]   2> 271625 INFO  (qtp1555446878-7154) [    x:collection1] o.a.s.u.SolrIndexWriter Calling setCommitData with IW:org.apache.solr.update.SolrIndexWriter@2f07d762 commitCommandVersion:1632383290789855232
   [junit4]   2> 271626 INFO  (qtp1555446878-7154) [    x:collection1] o.a.s.s.SolrIndexSearcher Opening [Searcher@1866dea2[collection1] main]
   [junit4]   2> 271628 INFO  (qtp1555446878-7154) [    x:collection1] o.a.s.u.DirectUpdateHandler2 end_commit_flush
   [junit4]   2> 271628 INFO  (searcherExecutor-1997-thread-1-processing-x:collection1) [    x:collection1] o.a.s.c.SolrCore [collection1] Registered new searcher Searcher@1866dea2[collection1] main{ExitableDirectoryReader(UninvertingDirectoryReader(Uninverting(_0(8.2.0):c1:[diagnostics={os=Linux, java.vendor=Oracle Corporation, java.version=11.0.2, java.vm.version=11.0.2+9, lucene.version=8.2.0, os.arch=amd64, java.runtime.version=11.0.2+9, source=flush, os.version=4.18.0-17-generic, timestamp=1556762018950}]:[attributes={Lucene50StoredFieldsFormat.mode=BEST_COMPRESSION}])))}
   [junit4]   2> 271629 INFO  (qtp1555446878-7154) [    x:collection1] o.a.s.u.p.LogUpdateProcessorFactory [collection1]  webapp= path=/update params={waitSearcher=true&commit=true&softCommit=false&wt=javabin&version=2}{commit=} 0 4
   [junit4]   2> 271629 INFO  (qtp524766263-7134) [    x:collection1] o.a.s.c.S.Request [collection1]  webapp= path=/select params={q=*:*&wt=javabin&version=2} hits=1 status=0 QTime=0
   [junit4]   2> 271631 INFO  (qtp1555446878-7155) [    x:collection1] o.a.s.c.S.Request [collection1]  webapp= path=/select params={q=*:*&wt=javabin&version=2} hits=1 status=0 QTime=0
   [junit4]   2> 271637 INFO  (qtp524766263-7132) [    x:collection1] o.a.s.u.p.LogUpdateProcessorFactory [collection1]  webapp= path=/update params={update.distrib=FROMLEADER&wt=javabin&version=2}{add=[2 (2)]} 0 3
   [junit4]   2> 271638 INFO  (qtp1555446878-7153) [    x:collection1] o.a.s.u.PeerSyncWithLeader PeerSync: core=collection1 url= START leader=http://127.0.0.1:34003/collection1 nUpdates=100
   [junit4]   2> 271641 INFO  (qtp524766263-7133) [    x:collection1] o.a.s.s.SolrIndexSearcher Opening [Searcher@2b6a71c9[collection1] realtime]
   [junit4]   2> 271642 INFO  (qtp524766263-7133) [    x:collection1] o.a.s.u.IndexFingerprint IndexFingerprint millis:3.0 result:{maxVersionSpecified=9223372036854775807, maxVersionEncountered=2, maxInHash=2, versionsHash=-1218814014108643565, numVersions=2, numDocs=2, maxDoc=1}
   [junit4]   2> 271642 INFO  (qtp524766263-7133) [    x:collection1] o.a.s.c.S.Request [collection1]  webapp= path=/get params={distrib=false&qt=/get&getFingerprint=9223372036854775807&wt=javabin&version=2} status=0 QTime=3
   [junit4]   2> 271642 INFO  (qtp1555446878-7153) [    x:collection1] o.a.s.u.IndexFingerprint IndexFingerprint millis:0.0 result:{maxVersionSpecified=9223372036854775807, maxVersionEncountered=1, maxInHash=1, versionsHash=-5451962507482445012, numVersions=1, numDocs=1, maxDoc=1}
   [junit4]   2> 271642 INFO  (qtp1555446878-7153) [    x:collection1] o.a.s.u.PeerSyncWithLeader Fingerprint comparison result: 1
   [junit4]   2> 271642 INFO  (qtp1555446878-7153) [    x:collection1] o.a.s.u.PeerSyncWithLeader Leader fingerprint: {maxVersionSpecified=9223372036854775807, maxVersionEncountered=2, maxInHash=2, versionsHash=-1218814014108643565, numVersions=2, numDocs=2, maxDoc=1}, Our fingerprint: {maxVersionSpecified=9223372036854775807, maxVersionEncountered=1, maxInHash=1, versionsHash=-5451962507482445012, numVersions=1, numDocs=1, maxDoc=1}
   [junit4]   2> 271643 INFO  (qtp524766263-7134) [    x:collection1] o.a.s.u.IndexFingerprint IndexFingerprint millis:0.0 result:{maxVersionSpecified=9223372036854775807, maxVersionEncountered=2, maxInHash=2, versionsHash=-1218814014108643565, numVersions=2, numDocs=2, maxDoc=1}
   [junit4]   2> 271643 INFO  (qtp524766263-7134) [    x:collection1] o.a.s.c.S.Request [collection1]  webapp= path=/get params={distrib=false&qt=/get&fingerprint=true&getVersions=100&wt=javabin&version=2} status=0 QTime=0
   [junit4]   2> 271644 INFO  (qtp1555446878-7153) [    x:collection1] o.a.s.u.PeerSyncWithLeader Leader fingerprint {maxVersionSpecified=9223372036854775807, maxVersionEncountered=2, maxInHash=2, versionsHash=-1218814014108643565, numVersions=2, numDocs=2, maxDoc=1}
   [junit4]   2> 271644 INFO  (qtp1555446878-7153) [    x:collection1] o.a.s.u.PeerSyncWithLeader PeerSync: core=collection1 url=  Received 2 versions from http://127.0.0.1:34003/collection1
   [junit4]   2> 271645 INFO  (qtp1555446878-7153) [    x:collection1] o.a.s.u.PeerSyncWithLeader PeerSync: core=collection1 url= Requesting updates from http://127.0.0.1:34003/collection1 n=1 versions=2
   [junit4]   2> 271646 INFO  (qtp524766263-7132) [    x:collection1] o.a.s.c.S.Request [collection1]  webapp= path=/get params={getUpdates=2&distrib=false&qt=/get&onlyIfActive=false&skipDbq=true&wt=javabin&version=2} status=0 QTime=0
   [junit4]   2> 271649 INFO  (qtp1555446878-7153) [    x:collection1] o.a.s.u.p.LogUpdateProcessorFactory [collection1] {add=[2 (2)]} 0 2
   [junit4]   2> 271651 INFO  (qtp1555446878-7153) [    x:collection1] o.a.s.s.SolrIndexSearcher Opening [Searcher@5b46356a[collection1] realtime]
   [junit4]   2> 271652 INFO  (qtp1555446878-7153) [    x:collection1] o.a.s.u.IndexFingerprint IndexFingerprint millis:3.0 result:{maxVersionSpecified=9223372036854775807, maxVersionEncountered=2, maxInHash=2, versionsHash=-1218814014108643565, numVersions=2, numDocs=2, maxDoc=1}
   [junit4]   2> 271652 INFO  (qtp1555446878-7153) [    x:collection1] o.a.s.u.PeerSyncWithLeader Fingerprint comparison result: 0
   [junit4]   2> 271652 INFO  (qtp1555446878-7153) [    x:collection1] o.a.s.u.PeerSyncWithLeader PeerSync: core=collection1 url= DONE. sync succeeded
   [junit4]   2> 271652 INFO  (qtp1555446878-7153) [    x:collection1] o.a.s.c.S.Request [collection1]  webapp= path=/get params={syncWithLeader=http://127.0.0.1:34003/collection1&qt=/get&getVersions=100&wt=javabin&version=2} status=0 QTime=14
   [junit4]   2> 271653 INFO  (qtp524766263-7133) [    x:collection1] o.a.s.u.DirectUpdateHandler2 start commit{_version_=1632383290819215360,optimize=false,openSearcher=true,waitSearcher=true,expungeDeletes=false,softCommit=false,prepareCommit=false}
   [junit4]   2> 271653 INFO  (qtp524766263-7133) [    x:collection1] o.a.s.u.SolrIndexWriter Calling setCommitData with IW:org.apache.solr.update.SolrIndexWriter@7bd0669f commitCommandVersion:1632383290819215360
   [junit4]   2> 271653 INFO  (qtp524766263-7133) [    x:collection1] o.a.s.s.SolrIndexSearcher Opening [Searcher@6cbe5110[collection1] main]
   [junit4]   2> 271655 INFO  (qtp524766263-7133) [    x:collection1] o.a.s.u.DirectUpdateHandler2 end_commit_flush
   [junit4]   2> 271655 INFO  (searcherExecutor-1983-thread-1-processing-x:collection1) [    x:collection1] o.a.s.c.SolrCore [collection1] Registered new searcher Searcher@6cbe5110[collection1] main{ExitableDirectoryReader(UninvertingDirectoryReader(Uninverting(_0(8.2.0):c1:[diagnostics={os=Linux, java.vendor=Oracle Corporation, java.version=11.0.2, java.vm.version=11.0.2+9, lucene.version=8.2.0, os.arch=amd64, java.runtime.version=11.0.2+9, source=flush, os.version=4.18.0-17-generic, timestamp=1556762018943}]:[attributes={Lucene50StoredFieldsFormat.mode=BEST_COMPRESSION}]) Uninverting(_1(8.2.0):c1:[diagnostics={os=Linux, java.vendor=Oracle Corporation, java.version=11.0.2, java.vm.version=11.0.2+9, lucene.version=8.2.0, os.arch=amd64, java.runtime.version=11.0.2+9, source=flush, os.version=4.18.0-17-generic, timestamp=1556762018972}]:[attributes={Lucene50StoredFieldsFormat.mode=BEST_COMPRESSION}])))}
   [junit4]   2> 271656 INFO  (qtp524766263-7133) [    x:collection1] o.a.s.u.p.LogUpdateProcessorFactory [collection1]  webapp= path=/update params={waitSearcher=true&commit=true&softCommit=false&wt=javabin&version=2}{commit=} 0 3
   [junit4]   2> 271656 INFO  (qtp1555446878-7154) [    x:collection1] o.a.s.u.DirectUpdateHandler2 start commit{_version_=1632383290822361088,optimize=false,openSearcher=true,waitSearcher=true,expungeDeletes=false,softCommit=false,prepareCommit=false}
   [junit4]   2> 271656 INFO  (qtp1555446878-7154) [    x:collection1] o.a.s.u.SolrIndexWriter Calling setCommitData with IW:org.apache.solr.update.SolrIndexWriter@2f07d762 commitCommandVersion:1632383290822361088
   [junit4]   2> 271657 INFO  (qtp1555446878-7154) [    x:collection1] o.a.s.s.SolrIndexSearcher Opening [Searcher@6cb1fc8b[collection1] main]
   [junit4]   2> 271658 INFO  (qtp1555446878-7154) [    x:collection1] o.a.s.u.DirectUpdateHandler2 end_commit_flush
   [junit4]   2> 271659 INFO  (searcherExecutor-1997-thread-1-processing-x:collection1) [    x:collection1] o.a.s.c.SolrCore [collection1] Registered new searcher Searcher@6cb1fc8b[collection1] main{ExitableDirectoryReader(UninvertingDirectoryReader(Uninverting(_0(8.2.0):c1:[diagnostics={os=Linux, java.vendor=Oracle Corporation, java.version=11.0.2, java.vm.version=11.0.2+9, lucene.version=8.2.0, os.arch=amd64, java.runtime.version=11.0.2+9, source=flush, os.version=4.18.0-17-generic, timestamp=1556762018950}]:[attributes={Lucene50StoredFieldsFormat.mode=BEST_COMPRESSION}]) Uninverting(_1(8.2.0):c1:[diagnostics={os=Linux, java.vendor=Oracle Corporation, java.version=11.0.2, java.vm.version=11.0.2+9, lucene.version=8.2.0, os.arch=amd64, java.runtime.version=11.0.2+9, source=flush, os.version=4.18.0-17-generic, timestamp=1556762018982}]:[attributes={Lucene50StoredFieldsFormat.mode=BEST_COMPRESSION}])))}
   [junit4]   2> 271659 INFO  (qtp1555446878-7154) [    x:collection1] o.a.s.u.p.LogUpdateProcessorFactory [collection1]  webapp= path=/update params={waitSearcher=true&commit=true&softCommit=false&wt=javabin&version=2}{commit=} 0 2
   [junit4]   2> 271660 INFO  (qtp524766263-7134) [    x:collection1] o.a.s.c.S.Request [collection1]  webapp= path=/select params={q=*:*&wt=javabin&version=2} hits=2 status=0 QTime=0
   [junit4]   2> 271661 INFO  (qtp1555446878-7155) [    x:collection1] o.a.s.c.S.Request [collection1]  webapp= path=/select params={q=*:*&wt=javabin&version=2} hits=2 status=0 QTime=0
   [junit4]   2> 271664 INFO  (qtp524766263-7132) [    x:collection1] o.a.s.u.p.LogUpdateProcessorFactory [collection1]  webapp= path=/update params={update.distrib=FROMLEADER&wt=javabin&version=2}{add=[3 (3)]} 0 2
   [junit4]   2> 271674 INFO  (qtp524766263-7133) [    x:collection1] o.a.s.u.p.LogUpdateProcessorFactory [collection1]  webapp= path=/update params={update.distrib=FROMLEADER&wt=javabin&version=2}{add=[4 (4)]} 0 6
   [junit4]   2> 271675 INFO  (qtp524766263-7134) [    x:collection1] o.a.s.u.p.LogUpdateProces

[...truncated too long message...]

ode, service url = null, agent id = null] for registry solr.node / com.codahale.metrics.MetricRegistry@37fc63a3
   [junit4]   2> 2097809 INFO  (SUITE-TestInPlaceUpdatesDistrib-seed#[C8E1DBA83B7C78B8]-worker) [    ] o.a.s.m.SolrMetricManager Closing metric reporters for registry=solr.jvm, tag=null
   [junit4]   2> 2097809 INFO  (SUITE-TestInPlaceUpdatesDistrib-seed#[C8E1DBA83B7C78B8]-worker) [    ] o.a.s.m.r.SolrJmxReporter Closing reporter [org.apache.solr.metrics.reporters.SolrJmxReporter@1645a399: rootName = null, domain = solr.jvm, service url = null, agent id = null] for registry solr.jvm / com.codahale.metrics.MetricRegistry@295ba119
   [junit4]   2> 2097810 INFO  (SUITE-TestInPlaceUpdatesDistrib-seed#[C8E1DBA83B7C78B8]-worker) [    ] o.a.s.m.SolrMetricManager Closing metric reporters for registry=solr.jetty, tag=null
   [junit4]   2> 2097810 INFO  (SUITE-TestInPlaceUpdatesDistrib-seed#[C8E1DBA83B7C78B8]-worker) [    ] o.a.s.m.r.SolrJmxReporter Closing reporter [org.apache.solr.metrics.reporters.SolrJmxReporter@c9d801c: rootName = null, domain = solr.jetty, service url = null, agent id = null] for registry solr.jetty / com.codahale.metrics.MetricRegistry@7317392b
   [junit4]   2> NOTE: leaving temporary files on disk at: /home/jenkins/workspace/Lucene-Solr-8.x-Linux/solr/build/solr-core/test/J2/temp/solr.update.TestInPlaceUpdatesDistrib_C8E1DBA83B7C78B8-001
   [junit4]   2> May 02, 2019 2:24:05 AM com.carrotsearch.randomizedtesting.ThreadLeakControl checkThreadLeaks
   [junit4]   2> WARNING: Will linger awaiting termination of 3 leaked thread(s).
   [junit4]   2> NOTE: test params are: codec=Lucene80, sim=Asserting(org.apache.lucene.search.similarities.AssertingSimilarity@ba51dd), locale=en-SD, timezone=SystemV/MST7MDT
   [junit4]   2> NOTE: Linux 4.18.0-17-generic amd64/Oracle Corporation 11.0.2 (64-bit)/cpus=8,threads=1,free=132627888,total=530579456
   [junit4]   2> NOTE: All tests run in this JVM: [TestStressReorder, TestSkipOverseerOperations, TestFunctionQuery, TestCloudConsistency, PrimUtilsTest, SolrRequestParserTest, AtomicUpdatesTest, TestSolrJ, BlockJoinFacetDistribTest, TestAnalyzeInfixSuggestions, TestMinHashQParser, TestSlowCompositeReaderWrapper, CdcrBootstrapTest, TestSimNodeAddedTrigger, DefaultValueUpdateProcessorTest, TestNumericRangeQuery32, ClusterStateUpdateTest, TestPullReplicaErrorHandling, HealthCheckHandlerTest, SolrMetricsIntegrationTest, TriggerCooldownIntegrationTest, OutputWriterTest, DistributedFacetExistsSmallTest, TestLegacyFieldCache, HdfsAutoAddReplicasIntegrationTest, BitVectorTest, DeleteReplicaTest, TestElisionMultitermQuery, CleanupOldIndexTest, PhrasesIdentificationComponentTest, TestManagedSchemaAPI, SOLR749Test, PeerSyncWithLeaderTest, TestReloadAndDeleteDocs, TestZkChroot, TestPartialUpdateDeduplication, SpellCheckCollatorWithCollapseTest, FieldAnalysisRequestHandlerTest, BadIndexSchemaTest, GraphQueryTest, ConnectionManagerTest, ImplicitSnitchTest, TestQueryUtils, DistribCursorPagingTest, TestCloudPhrasesIdentificationComponent, TestSurroundQueryParser, MissingSegmentRecoveryTest, TestSimpleQParserPlugin, TestSimDistribStateManager, TestFileDictionaryLookup, TestRTimerTree, TestRebalanceLeaders, ZkShardTermsTest, ConvertedLegacyTest, TestSystemIdResolver, SearchRateTriggerTest, TestFieldSortValues, TestSimTriggerIntegration, TestLegacyNumericUtils, MoveReplicaTest, TestStressLiveNodes, LukeRequestHandlerTest, TestRangeQuery, TestScoreJoinQPNoScore, TestOnReconnectListenerSupport, TestRecovery, TestSolrCloudWithSecureImpersonation, TestLogWatcher, SolrIndexSplitterTest, TestPointFields, TestFieldCache, RangeFacetCloudTest, TestDistribDocBasedVersion, TestBulkSchemaAPI, RegexBoostProcessorTest, FileBasedSpellCheckerTest, AddSchemaFieldsUpdateProcessorFactoryTest, TestSolrIndexConfig, TestBackupRepositoryFactory, SolrCloudExampleTest, TestReloadDeadlock, BasicZkTest, TermVectorComponentTest, SolrCoreMetricManagerTest, OverseerTest, OverseerRolesTest, CurrencyRangeFacetCloudTest, SimpleFacetsTest, HLLSerializationTest, TestManagedResource, OverriddenZkACLAndCredentialsProvidersTest, DistributedQueryElevationComponentTest, DocumentBuilderTest, TestSerializedLuceneMatchVersion, NotRequiredUniqueKeyTest, ByteBuffersDirectoryFactoryTest, TestSystemCollAutoCreate, HdfsLockFactoryTest, SuggesterTSTTest, PKIAuthenticationIntegrationTest, PeerSyncWithBufferUpdatesTest, ActionThrottleTest, TemplateUpdateProcessorTest, TestDynamicFieldResource, ForceLeaderTest, TestFoldingMultitermQuery, SolrTestCaseJ4Test, TestCloudJSONFacetSKG, AutoscalingHistoryHandlerTest, TestTrie, DistributedQueueTest, TestPerFieldSimilarityWithDefaultOverride, CustomCollectionTest, ZkControllerTest, TestImplicitCoreProperties, TestPKIAuthenticationPlugin, RestartWhileUpdatingTest, SolrCmdDistributorTest, TestConfigSetProperties, UpdateRequestProcessorFactoryTest, TestEmbeddedSolrServerSchemaAPI, TestPayloadScoreQParserPlugin, CollectionsAPISolrJTest, MetricsHistoryHandlerTest, TestExactStatsCache, TestLeaderElectionZkExpiry, TestStreamBody, DistributedMLTComponentTest, TestCustomDocTransformer, TestSchemaResource, TestDefaultStatsCache, TestSQLHandlerNonCloud, TestExpandComponent, HttpPartitionWithTlogReplicasTest, URLClassifyProcessorTest, HDFSCollectionsAPITest, TestLRUCache, TestSimpleTrackingShardHandler, RankQueryTest, AssignBackwardCompatibilityTest, ChaosMonkeyNothingIsSafeWithPullReplicasTest, LeaderElectionContextKeyTest, LeaderElectionIntegrationTest, MultiSolrCloudTestCaseTest, RecoveryZkTest, ReindexCollectionTest, TestCloudPivotFacet, TestCloudRecovery2, TestClusterProperties, TestConfigSetsAPI, TestRequestForwarding, TestTlogReplica, TestTolerantUpdateProcessorCloud, TestTolerantUpdateProcessorRandomCloud, AssignTest, AsyncCallRequestStatusResponseTest, CollectionReloadTest, CollectionTooManyReplicasTest, HdfsCollectionsAPIDistributedZkTest, ShardSplitTest, TestSimExecutePlanAction, TestSimExtremeIndexing, CdcrOpsAndBoundariesTest, CdcrReplicationHandlerTest, CdcrRequestHandlerTest, HdfsBasicDistributedZk2Test, HdfsBasicDistributedZkTest, HdfsChaosMonkeySafeLeaderTest, HdfsRecoverLeaseTest, AlternateDirectoryTest, CachingDirectoryFactoryTest, PluginInfoTest, QueryResultKeyTest, RAMDirectoryFactoryTest, TestBadConfig, TestConfig, TestConfigSets, TestCoreDiscovery, TestCustomStream, TestShardHandlerFactory, TestSimpleTextCodec, TestSolrConfigHandler, BinaryUpdateRequestHandlerTest, JsonLoaderTest, MoreLikeThisHandlerTest, PingRequestHandlerTest, TestCSVLoader, TestConfigReload, TestReplicationHandlerBackup, TestReplicationHandlerDiskOverFlow, V2ApiIntegrationTest, V2StandaloneTest, CoreAdminCreateDiscoverTest, CoreAdminHandlerTest, DaemonStreamApiTest, SystemInfoHandlerTest, TestApiFramework, TestCollectionAPIs, TestConfigsApi, TestCoreAdminApis, ZookeeperStatusHandlerTest, BadComponentTest, CustomHighlightComponentTest, DebugComponentTest, DistributedFacetPivotLargeTest, DistributedFacetPivotSmallAdvancedTest, DistributedSuggestComponentTest, QueryElevationComponentTest, ShardsWhitelistTest, StatsComponentTest, TestExportWriter, EmbeddedSolrNoSerializeTest, Tagger2Test, TaggerTest, XmlInterpolationTest, HighlighterMaxOffsetTest, UninvertDocValuesMergePolicyTest, SolrGraphiteReporterTest, SolrSlf4jReporterTest, SolrShardReporterTest, TestFieldResource, TestManagedStopFilterFactory, DateFieldTest, DocValuesMissingTest, ExternalFileFieldSortTest, NumericFieldsTest, OpenExchangeRatesOrgProviderTest, PreAnalyzedFieldManagedSchemaCloudTest, SchemaVersionSpecificBehaviorTest, SynonymTokenizerTest, TestBulkSchemaConcurrent, TestSortableTextField, TestUseDocValuesAsStored2, UUIDFieldTest, CursorMarkTest, LargeFieldTest, MergeStrategyTest, ReturnFieldsTest, SignificantTermsQParserPluginTest, SortSpecParsingTest, SpatialFilterTest, TestAddFieldRealTimeGet, TestCollapseQParserPlugin, TestComplexPhraseQParserPlugin, TestGraphTermsQParserPlugin, TestIndexSearcher, TestNoOpRegenerator, TestSmileRequest, TestSolr4Spatial2, TestSolrQueryParser, TestStandardQParsers, TestTrieFacet, TestValueSourceCache, TestXmlQParser, TestJsonFacetRefinement, TestJsonFacetsStatsParsing, TestMinMaxOnMultiValuedField, TestOrdValues, TestSortByMinMaxFunction, TestScoreJoinQPScore, TestJsonRequest, CloudMLTQParserTest, AuditLoggerPluginTest, BasicAuthIntegrationTest, TestRuleBasedAuthorizationPlugin, TestSha256AuthenticationProvider, TestDelegationWithHadoopAuth, TestSolrCloudWithHadoopAuthPlugin, HttpSolrCallGetCoreTest, BlockDirectoryTest, TestUninvertingReader, AddBlockUpdateTest, AnalysisErrorHandlingTest, TestAtomicUpdateErrorCases, TestInPlaceUpdateWithRouteField, TestInPlaceUpdatesDistrib]
   [junit4] Completed [827/855 (3!)] on J2 in 56.81s, 1 test, 1 failure <<< FAILURES!

[...truncated 9068 lines...]
BUILD FAILED
/home/jenkins/workspace/Lucene-Solr-8.x-Linux/build.xml:634: The following error occurred while executing this line:
/home/jenkins/workspace/Lucene-Solr-8.x-Linux/build.xml:128: Found 1 violations in source files (File uses Mockito but has no assumeWorkingMockito() call).

Total time: 77 minutes 31 seconds
Build step 'Invoke Ant' marked build as failure
Archiving artifacts
Setting ANT_1_8_2_HOME=/home/jenkins/tools/hudson.tasks.Ant_AntInstallation/ANT_1.8.2
[WARNINGS] Skipping publisher since build result is FAILURE
Recording test results
Setting ANT_1_8_2_HOME=/home/jenkins/tools/hudson.tasks.Ant_AntInstallation/ANT_1.8.2
Email was triggered for: Failure - Any
Sending email for trigger: Failure - Any
Setting ANT_1_8_2_HOME=/home/jenkins/tools/hudson.tasks.Ant_AntInstallation/ANT_1.8.2
Setting ANT_1_8_2_HOME=/home/jenkins/tools/hudson.tasks.Ant_AntInstallation/ANT_1.8.2
Setting ANT_1_8_2_HOME=/home/jenkins/tools/hudson.tasks.Ant_AntInstallation/ANT_1.8.2
Setting ANT_1_8_2_HOME=/home/jenkins/tools/hudson.tasks.Ant_AntInstallation/ANT_1.8.2
Setting ANT_1_8_2_HOME=/home/jenkins/tools/hudson.tasks.Ant_AntInstallation/ANT_1.8.2
Setting ANT_1_8_2_HOME=/home/jenkins/tools/hudson.tasks.Ant_AntInstallation/ANT_1.8.2

Mime
View raw message