lucene-dev mailing list archives

Site index · List index
Message view « Date » · « Thread »
Top « Date » · « Thread »
From Apache Jenkins Server <jenk...@builds.apache.org>
Subject [JENKINS] Lucene-Solr-NightlyTests-8.x - Build # 90 - Still Unstable
Date Sat, 04 May 2019 14:13:50 GMT
Build: https://builds.apache.org/job/Lucene-Solr-NightlyTests-8.x/90/

4 tests failed.
FAILED:  org.apache.solr.cloud.api.collections.ShardSplitTest.testSplitWithChaosMonkey

Error Message:
Address already in use

Stack Trace:
java.net.BindException: Address already in use
	at __randomizedtesting.SeedInfo.seed([56CD4FDDCA19775C:DDEA9C0C8B1FDCD8]:0)
	at sun.nio.ch.Net.bind0(Native Method)
	at sun.nio.ch.Net.bind(Net.java:433)
	at sun.nio.ch.Net.bind(Net.java:425)
	at sun.nio.ch.ServerSocketChannelImpl.bind(ServerSocketChannelImpl.java:223)
	at sun.nio.ch.ServerSocketAdaptor.bind(ServerSocketAdaptor.java:74)
	at org.eclipse.jetty.server.ServerConnector.openAcceptChannel(ServerConnector.java:342)
	at org.eclipse.jetty.server.ServerConnector.open(ServerConnector.java:308)
	at org.eclipse.jetty.server.AbstractNetworkConnector.doStart(AbstractNetworkConnector.java:80)
	at org.eclipse.jetty.server.ServerConnector.doStart(ServerConnector.java:236)
	at org.eclipse.jetty.util.component.AbstractLifeCycle.start(AbstractLifeCycle.java:68)
	at org.eclipse.jetty.server.Server.doStart(Server.java:394)
	at org.eclipse.jetty.util.component.AbstractLifeCycle.start(AbstractLifeCycle.java:68)
	at org.apache.solr.client.solrj.embedded.JettySolrRunner.retryOnPortBindFailure(JettySolrRunner.java:558)
	at org.apache.solr.client.solrj.embedded.JettySolrRunner.start(JettySolrRunner.java:497)
	at org.apache.solr.client.solrj.embedded.JettySolrRunner.start(JettySolrRunner.java:465)
	at org.apache.solr.cloud.api.collections.ShardSplitTest.testSplitWithChaosMonkey(ShardSplitTest.java:499)
	at sun.reflect.NativeMethodAccessorImpl.invoke0(Native Method)
	at sun.reflect.NativeMethodAccessorImpl.invoke(NativeMethodAccessorImpl.java:62)
	at sun.reflect.DelegatingMethodAccessorImpl.invoke(DelegatingMethodAccessorImpl.java:43)
	at java.lang.reflect.Method.invoke(Method.java:498)
	at com.carrotsearch.randomizedtesting.RandomizedRunner.invoke(RandomizedRunner.java:1750)
	at com.carrotsearch.randomizedtesting.RandomizedRunner$8.evaluate(RandomizedRunner.java:938)
	at com.carrotsearch.randomizedtesting.RandomizedRunner$9.evaluate(RandomizedRunner.java:974)
	at com.carrotsearch.randomizedtesting.RandomizedRunner$10.evaluate(RandomizedRunner.java:988)
	at org.apache.solr.BaseDistributedSearchTestCase$ShardsRepeatRule$ShardsFixedStatement.callStatement(BaseDistributedSearchTestCase.java:1082)
	at org.apache.solr.BaseDistributedSearchTestCase$ShardsRepeatRule$ShardsStatement.evaluate(BaseDistributedSearchTestCase.java:1054)
	at com.carrotsearch.randomizedtesting.rules.SystemPropertiesRestoreRule$1.evaluate(SystemPropertiesRestoreRule.java:57)
	at org.apache.lucene.util.TestRuleSetupTeardownChained$1.evaluate(TestRuleSetupTeardownChained.java:49)
	at org.apache.lucene.util.AbstractBeforeAfterRule$1.evaluate(AbstractBeforeAfterRule.java:45)
	at org.apache.lucene.util.TestRuleThreadAndTestName$1.evaluate(TestRuleThreadAndTestName.java:48)
	at org.apache.lucene.util.TestRuleIgnoreAfterMaxFailures$1.evaluate(TestRuleIgnoreAfterMaxFailures.java:64)
	at org.apache.lucene.util.TestRuleMarkFailure$1.evaluate(TestRuleMarkFailure.java:47)
	at com.carrotsearch.randomizedtesting.rules.StatementAdapter.evaluate(StatementAdapter.java:36)
	at com.carrotsearch.randomizedtesting.ThreadLeakControl$StatementRunner.run(ThreadLeakControl.java:368)
	at com.carrotsearch.randomizedtesting.ThreadLeakControl.forkTimeoutingTask(ThreadLeakControl.java:817)
	at com.carrotsearch.randomizedtesting.ThreadLeakControl$3.evaluate(ThreadLeakControl.java:468)
	at com.carrotsearch.randomizedtesting.RandomizedRunner.runSingleTest(RandomizedRunner.java:947)
	at com.carrotsearch.randomizedtesting.RandomizedRunner$5.evaluate(RandomizedRunner.java:832)
	at com.carrotsearch.randomizedtesting.RandomizedRunner$6.evaluate(RandomizedRunner.java:883)
	at com.carrotsearch.randomizedtesting.RandomizedRunner$7.evaluate(RandomizedRunner.java:894)
	at com.carrotsearch.randomizedtesting.rules.StatementAdapter.evaluate(StatementAdapter.java:36)
	at com.carrotsearch.randomizedtesting.rules.SystemPropertiesRestoreRule$1.evaluate(SystemPropertiesRestoreRule.java:57)
	at org.apache.lucene.util.AbstractBeforeAfterRule$1.evaluate(AbstractBeforeAfterRule.java:45)
	at com.carrotsearch.randomizedtesting.rules.StatementAdapter.evaluate(StatementAdapter.java:36)
	at org.apache.lucene.util.TestRuleStoreClassName$1.evaluate(TestRuleStoreClassName.java:41)
	at com.carrotsearch.randomizedtesting.rules.NoShadowingOrOverridesOnMethodsRule$1.evaluate(NoShadowingOrOverridesOnMethodsRule.java:40)
	at com.carrotsearch.randomizedtesting.rules.NoShadowingOrOverridesOnMethodsRule$1.evaluate(NoShadowingOrOverridesOnMethodsRule.java:40)
	at com.carrotsearch.randomizedtesting.rules.StatementAdapter.evaluate(StatementAdapter.java:36)
	at com.carrotsearch.randomizedtesting.rules.StatementAdapter.evaluate(StatementAdapter.java:36)
	at com.carrotsearch.randomizedtesting.rules.StatementAdapter.evaluate(StatementAdapter.java:36)
	at org.apache.lucene.util.TestRuleAssertionsRequired$1.evaluate(TestRuleAssertionsRequired.java:53)
	at org.apache.lucene.util.TestRuleMarkFailure$1.evaluate(TestRuleMarkFailure.java:47)
	at org.apache.lucene.util.TestRuleIgnoreAfterMaxFailures$1.evaluate(TestRuleIgnoreAfterMaxFailures.java:64)
	at org.apache.lucene.util.TestRuleIgnoreTestSuites$1.evaluate(TestRuleIgnoreTestSuites.java:54)
	at com.carrotsearch.randomizedtesting.rules.StatementAdapter.evaluate(StatementAdapter.java:36)
	at com.carrotsearch.randomizedtesting.ThreadLeakControl$StatementRunner.run(ThreadLeakControl.java:368)
	at java.lang.Thread.run(Thread.java:748)


FAILED:  junit.framework.TestSuite.org.apache.solr.cloud.api.collections.ShardSplitTest

Error Message:
10 threads leaked from SUITE scope at org.apache.solr.cloud.api.collections.ShardSplitTest:     1) Thread[id=201529, name=qtp1987571111-201529, state=TIMED_WAITING, group=TGRP-ShardSplitTest]         at sun.misc.Unsafe.park(Native Method)         at java.util.concurrent.locks.LockSupport.parkNanos(LockSupport.java:215)         at java.util.concurrent.locks.AbstractQueuedSynchronizer$ConditionObject.awaitNanos(AbstractQueuedSynchronizer.java:2078)         at org.eclipse.jetty.util.BlockingArrayQueue.poll(BlockingArrayQueue.java:392)         at org.eclipse.jetty.util.thread.QueuedThreadPool.idleJobPoll(QueuedThreadPool.java:656)         at org.eclipse.jetty.util.thread.QueuedThreadPool.access$800(QueuedThreadPool.java:46)         at org.eclipse.jetty.util.thread.QueuedThreadPool$2.run(QueuedThreadPool.java:720)         at java.lang.Thread.run(Thread.java:748)    2) Thread[id=201531, name=qtp1987571111-201531, state=TIMED_WAITING, group=TGRP-ShardSplitTest]         at sun.misc.Unsafe.park(Native Method)         at java.util.concurrent.locks.LockSupport.parkNanos(LockSupport.java:215)         at java.util.concurrent.locks.AbstractQueuedSynchronizer$ConditionObject.awaitNanos(AbstractQueuedSynchronizer.java:2078)         at org.eclipse.jetty.util.BlockingArrayQueue.poll(BlockingArrayQueue.java:392)         at org.eclipse.jetty.util.thread.QueuedThreadPool.idleJobPoll(QueuedThreadPool.java:656)         at org.eclipse.jetty.util.thread.QueuedThreadPool.access$800(QueuedThreadPool.java:46)         at org.eclipse.jetty.util.thread.QueuedThreadPool$2.run(QueuedThreadPool.java:720)         at java.lang.Thread.run(Thread.java:748)    3) Thread[id=201571, name=Scheduler-688191804, state=WAITING, group=TGRP-ShardSplitTest]         at sun.misc.Unsafe.park(Native Method)         at java.util.concurrent.locks.LockSupport.park(LockSupport.java:175)         at java.util.concurrent.locks.AbstractQueuedSynchronizer$ConditionObject.await(AbstractQueuedSynchronizer.java:2039)         at java.util.concurrent.ScheduledThreadPoolExecutor$DelayedWorkQueue.take(ScheduledThreadPoolExecutor.java:1081)         at java.util.concurrent.ScheduledThreadPoolExecutor$DelayedWorkQueue.take(ScheduledThreadPoolExecutor.java:809)         at java.util.concurrent.ThreadPoolExecutor.getTask(ThreadPoolExecutor.java:1074)         at java.util.concurrent.ThreadPoolExecutor.runWorker(ThreadPoolExecutor.java:1134)         at java.util.concurrent.ThreadPoolExecutor$Worker.run(ThreadPoolExecutor.java:624)         at java.lang.Thread.run(Thread.java:748)    4) Thread[id=201528, name=qtp1987571111-201528-acceptor-0@750efbf4-ServerConnector@66525003{HTTP/1.1,[http/1.1, h2c]}{127.0.0.1:43280}, state=RUNNABLE, group=TGRP-ShardSplitTest]         at sun.nio.ch.ServerSocketChannelImpl.accept0(Native Method)         at sun.nio.ch.ServerSocketChannelImpl.accept(ServerSocketChannelImpl.java:422)         at sun.nio.ch.ServerSocketChannelImpl.accept(ServerSocketChannelImpl.java:250)         at org.eclipse.jetty.server.ServerConnector.accept(ServerConnector.java:385)         at org.eclipse.jetty.server.AbstractConnector$Acceptor.run(AbstractConnector.java:648)         at org.eclipse.jetty.util.thread.QueuedThreadPool.runJob(QueuedThreadPool.java:765)         at org.eclipse.jetty.util.thread.QueuedThreadPool$2.run(QueuedThreadPool.java:683)         at java.lang.Thread.run(Thread.java:748)    5) Thread[id=201532, name=qtp1987571111-201532, state=TIMED_WAITING, group=TGRP-ShardSplitTest]         at sun.misc.Unsafe.park(Native Method)         at java.util.concurrent.locks.LockSupport.parkNanos(LockSupport.java:215)         at java.util.concurrent.locks.AbstractQueuedSynchronizer$ConditionObject.awaitNanos(AbstractQueuedSynchronizer.java:2078)         at org.eclipse.jetty.util.BlockingArrayQueue.poll(BlockingArrayQueue.java:392)         at org.eclipse.jetty.util.thread.QueuedThreadPool.idleJobPoll(QueuedThreadPool.java:656)         at org.eclipse.jetty.util.thread.QueuedThreadPool.access$800(QueuedThreadPool.java:46)         at org.eclipse.jetty.util.thread.QueuedThreadPool$2.run(QueuedThreadPool.java:720)         at java.lang.Thread.run(Thread.java:748)    6) Thread[id=201530, name=qtp1987571111-201530, state=TIMED_WAITING, group=TGRP-ShardSplitTest]         at sun.misc.Unsafe.park(Native Method)         at java.util.concurrent.locks.LockSupport.parkNanos(LockSupport.java:215)         at java.util.concurrent.locks.AbstractQueuedSynchronizer$ConditionObject.awaitNanos(AbstractQueuedSynchronizer.java:2078)         at org.eclipse.jetty.util.BlockingArrayQueue.poll(BlockingArrayQueue.java:392)         at org.eclipse.jetty.util.thread.QueuedThreadPool.idleJobPoll(QueuedThreadPool.java:656)         at org.eclipse.jetty.util.thread.QueuedThreadPool.access$800(QueuedThreadPool.java:46)         at org.eclipse.jetty.util.thread.QueuedThreadPool$2.run(QueuedThreadPool.java:720)         at java.lang.Thread.run(Thread.java:748)    7) Thread[id=201527, name=qtp1987571111-201527, state=RUNNABLE, group=TGRP-ShardSplitTest]         at sun.nio.ch.EPollArrayWrapper.epollWait(Native Method)         at sun.nio.ch.EPollArrayWrapper.poll(EPollArrayWrapper.java:269)         at sun.nio.ch.EPollSelectorImpl.doSelect(EPollSelectorImpl.java:93)         at sun.nio.ch.SelectorImpl.lockAndDoSelect(SelectorImpl.java:86)         at sun.nio.ch.SelectorImpl.select(SelectorImpl.java:97)         at sun.nio.ch.SelectorImpl.select(SelectorImpl.java:101)         at org.eclipse.jetty.io.ManagedSelector$SelectorProducer.select(ManagedSelector.java:423)         at org.eclipse.jetty.io.ManagedSelector$SelectorProducer.produce(ManagedSelector.java:360)         at org.eclipse.jetty.util.thread.strategy.EatWhatYouKill.produceTask(EatWhatYouKill.java:357)         at org.eclipse.jetty.util.thread.strategy.EatWhatYouKill.doProduce(EatWhatYouKill.java:181)         at org.eclipse.jetty.util.thread.strategy.EatWhatYouKill.tryProduce(EatWhatYouKill.java:168)         at org.eclipse.jetty.util.thread.strategy.EatWhatYouKill.produce(EatWhatYouKill.java:132)         at org.eclipse.jetty.io.ManagedSelector$$Lambda$54/164253678.run(Unknown Source)         at org.eclipse.jetty.util.thread.QueuedThreadPool.runJob(QueuedThreadPool.java:765)         at org.eclipse.jetty.util.thread.QueuedThreadPool$2.run(QueuedThreadPool.java:683)         at java.lang.Thread.run(Thread.java:748)    8) Thread[id=201534, name=Scheduler-1513684949, state=TIMED_WAITING, group=TGRP-ShardSplitTest]         at sun.misc.Unsafe.park(Native Method)         at java.util.concurrent.locks.LockSupport.parkNanos(LockSupport.java:215)         at java.util.concurrent.locks.AbstractQueuedSynchronizer$ConditionObject.awaitNanos(AbstractQueuedSynchronizer.java:2078)         at java.util.concurrent.ScheduledThreadPoolExecutor$DelayedWorkQueue.take(ScheduledThreadPoolExecutor.java:1093)         at java.util.concurrent.ScheduledThreadPoolExecutor$DelayedWorkQueue.take(ScheduledThreadPoolExecutor.java:809)         at java.util.concurrent.ThreadPoolExecutor.getTask(ThreadPoolExecutor.java:1074)         at java.util.concurrent.ThreadPoolExecutor.runWorker(ThreadPoolExecutor.java:1134)         at java.util.concurrent.ThreadPoolExecutor$Worker.run(ThreadPoolExecutor.java:624)         at java.lang.Thread.run(Thread.java:748)    9) Thread[id=201526, name=qtp1987571111-201526, state=RUNNABLE, group=TGRP-ShardSplitTest]         at sun.nio.ch.EPollArrayWrapper.epollWait(Native Method)         at sun.nio.ch.EPollArrayWrapper.poll(EPollArrayWrapper.java:269)         at sun.nio.ch.EPollSelectorImpl.doSelect(EPollSelectorImpl.java:93)         at sun.nio.ch.SelectorImpl.lockAndDoSelect(SelectorImpl.java:86)         at sun.nio.ch.SelectorImpl.select(SelectorImpl.java:97)         at sun.nio.ch.SelectorImpl.select(SelectorImpl.java:101)         at org.eclipse.jetty.io.ManagedSelector$SelectorProducer.select(ManagedSelector.java:423)         at org.eclipse.jetty.io.ManagedSelector$SelectorProducer.produce(ManagedSelector.java:360)         at org.eclipse.jetty.util.thread.strategy.EatWhatYouKill.produceTask(EatWhatYouKill.java:357)         at org.eclipse.jetty.util.thread.strategy.EatWhatYouKill.doProduce(EatWhatYouKill.java:181)         at org.eclipse.jetty.util.thread.strategy.EatWhatYouKill.tryProduce(EatWhatYouKill.java:168)         at org.eclipse.jetty.util.thread.strategy.EatWhatYouKill.produce(EatWhatYouKill.java:132)         at org.eclipse.jetty.io.ManagedSelector$$Lambda$54/164253678.run(Unknown Source)         at org.eclipse.jetty.util.thread.QueuedThreadPool.runJob(QueuedThreadPool.java:765)         at org.eclipse.jetty.util.thread.QueuedThreadPool$2.run(QueuedThreadPool.java:683)         at java.lang.Thread.run(Thread.java:748)   10) Thread[id=201533, name=qtp1987571111-201533, state=TIMED_WAITING, group=TGRP-ShardSplitTest]         at sun.misc.Unsafe.park(Native Method)         at java.util.concurrent.locks.LockSupport.parkNanos(LockSupport.java:215)         at java.util.concurrent.locks.AbstractQueuedSynchronizer$ConditionObject.awaitNanos(AbstractQueuedSynchronizer.java:2078)         at org.eclipse.jetty.util.BlockingArrayQueue.poll(BlockingArrayQueue.java:392)         at org.eclipse.jetty.util.thread.QueuedThreadPool.idleJobPoll(QueuedThreadPool.java:656)         at org.eclipse.jetty.util.thread.QueuedThreadPool.access$800(QueuedThreadPool.java:46)         at org.eclipse.jetty.util.thread.QueuedThreadPool$2.run(QueuedThreadPool.java:720)         at java.lang.Thread.run(Thread.java:748)

Stack Trace:
com.carrotsearch.randomizedtesting.ThreadLeakError: 10 threads leaked from SUITE scope at org.apache.solr.cloud.api.collections.ShardSplitTest: 
   1) Thread[id=201529, name=qtp1987571111-201529, state=TIMED_WAITING, group=TGRP-ShardSplitTest]
        at sun.misc.Unsafe.park(Native Method)
        at java.util.concurrent.locks.LockSupport.parkNanos(LockSupport.java:215)
        at java.util.concurrent.locks.AbstractQueuedSynchronizer$ConditionObject.awaitNanos(AbstractQueuedSynchronizer.java:2078)
        at org.eclipse.jetty.util.BlockingArrayQueue.poll(BlockingArrayQueue.java:392)
        at org.eclipse.jetty.util.thread.QueuedThreadPool.idleJobPoll(QueuedThreadPool.java:656)
        at org.eclipse.jetty.util.thread.QueuedThreadPool.access$800(QueuedThreadPool.java:46)
        at org.eclipse.jetty.util.thread.QueuedThreadPool$2.run(QueuedThreadPool.java:720)
        at java.lang.Thread.run(Thread.java:748)
   2) Thread[id=201531, name=qtp1987571111-201531, state=TIMED_WAITING, group=TGRP-ShardSplitTest]
        at sun.misc.Unsafe.park(Native Method)
        at java.util.concurrent.locks.LockSupport.parkNanos(LockSupport.java:215)
        at java.util.concurrent.locks.AbstractQueuedSynchronizer$ConditionObject.awaitNanos(AbstractQueuedSynchronizer.java:2078)
        at org.eclipse.jetty.util.BlockingArrayQueue.poll(BlockingArrayQueue.java:392)
        at org.eclipse.jetty.util.thread.QueuedThreadPool.idleJobPoll(QueuedThreadPool.java:656)
        at org.eclipse.jetty.util.thread.QueuedThreadPool.access$800(QueuedThreadPool.java:46)
        at org.eclipse.jetty.util.thread.QueuedThreadPool$2.run(QueuedThreadPool.java:720)
        at java.lang.Thread.run(Thread.java:748)
   3) Thread[id=201571, name=Scheduler-688191804, state=WAITING, group=TGRP-ShardSplitTest]
        at sun.misc.Unsafe.park(Native Method)
        at java.util.concurrent.locks.LockSupport.park(LockSupport.java:175)
        at java.util.concurrent.locks.AbstractQueuedSynchronizer$ConditionObject.await(AbstractQueuedSynchronizer.java:2039)
        at java.util.concurrent.ScheduledThreadPoolExecutor$DelayedWorkQueue.take(ScheduledThreadPoolExecutor.java:1081)
        at java.util.concurrent.ScheduledThreadPoolExecutor$DelayedWorkQueue.take(ScheduledThreadPoolExecutor.java:809)
        at java.util.concurrent.ThreadPoolExecutor.getTask(ThreadPoolExecutor.java:1074)
        at java.util.concurrent.ThreadPoolExecutor.runWorker(ThreadPoolExecutor.java:1134)
        at java.util.concurrent.ThreadPoolExecutor$Worker.run(ThreadPoolExecutor.java:624)
        at java.lang.Thread.run(Thread.java:748)
   4) Thread[id=201528, name=qtp1987571111-201528-acceptor-0@750efbf4-ServerConnector@66525003{HTTP/1.1,[http/1.1, h2c]}{127.0.0.1:43280}, state=RUNNABLE, group=TGRP-ShardSplitTest]
        at sun.nio.ch.ServerSocketChannelImpl.accept0(Native Method)
        at sun.nio.ch.ServerSocketChannelImpl.accept(ServerSocketChannelImpl.java:422)
        at sun.nio.ch.ServerSocketChannelImpl.accept(ServerSocketChannelImpl.java:250)
        at org.eclipse.jetty.server.ServerConnector.accept(ServerConnector.java:385)
        at org.eclipse.jetty.server.AbstractConnector$Acceptor.run(AbstractConnector.java:648)
        at org.eclipse.jetty.util.thread.QueuedThreadPool.runJob(QueuedThreadPool.java:765)
        at org.eclipse.jetty.util.thread.QueuedThreadPool$2.run(QueuedThreadPool.java:683)
        at java.lang.Thread.run(Thread.java:748)
   5) Thread[id=201532, name=qtp1987571111-201532, state=TIMED_WAITING, group=TGRP-ShardSplitTest]
        at sun.misc.Unsafe.park(Native Method)
        at java.util.concurrent.locks.LockSupport.parkNanos(LockSupport.java:215)
        at java.util.concurrent.locks.AbstractQueuedSynchronizer$ConditionObject.awaitNanos(AbstractQueuedSynchronizer.java:2078)
        at org.eclipse.jetty.util.BlockingArrayQueue.poll(BlockingArrayQueue.java:392)
        at org.eclipse.jetty.util.thread.QueuedThreadPool.idleJobPoll(QueuedThreadPool.java:656)
        at org.eclipse.jetty.util.thread.QueuedThreadPool.access$800(QueuedThreadPool.java:46)
        at org.eclipse.jetty.util.thread.QueuedThreadPool$2.run(QueuedThreadPool.java:720)
        at java.lang.Thread.run(Thread.java:748)
   6) Thread[id=201530, name=qtp1987571111-201530, state=TIMED_WAITING, group=TGRP-ShardSplitTest]
        at sun.misc.Unsafe.park(Native Method)
        at java.util.concurrent.locks.LockSupport.parkNanos(LockSupport.java:215)
        at java.util.concurrent.locks.AbstractQueuedSynchronizer$ConditionObject.awaitNanos(AbstractQueuedSynchronizer.java:2078)
        at org.eclipse.jetty.util.BlockingArrayQueue.poll(BlockingArrayQueue.java:392)
        at org.eclipse.jetty.util.thread.QueuedThreadPool.idleJobPoll(QueuedThreadPool.java:656)
        at org.eclipse.jetty.util.thread.QueuedThreadPool.access$800(QueuedThreadPool.java:46)
        at org.eclipse.jetty.util.thread.QueuedThreadPool$2.run(QueuedThreadPool.java:720)
        at java.lang.Thread.run(Thread.java:748)
   7) Thread[id=201527, name=qtp1987571111-201527, state=RUNNABLE, group=TGRP-ShardSplitTest]
        at sun.nio.ch.EPollArrayWrapper.epollWait(Native Method)
        at sun.nio.ch.EPollArrayWrapper.poll(EPollArrayWrapper.java:269)
        at sun.nio.ch.EPollSelectorImpl.doSelect(EPollSelectorImpl.java:93)
        at sun.nio.ch.SelectorImpl.lockAndDoSelect(SelectorImpl.java:86)
        at sun.nio.ch.SelectorImpl.select(SelectorImpl.java:97)
        at sun.nio.ch.SelectorImpl.select(SelectorImpl.java:101)
        at org.eclipse.jetty.io.ManagedSelector$SelectorProducer.select(ManagedSelector.java:423)
        at org.eclipse.jetty.io.ManagedSelector$SelectorProducer.produce(ManagedSelector.java:360)
        at org.eclipse.jetty.util.thread.strategy.EatWhatYouKill.produceTask(EatWhatYouKill.java:357)
        at org.eclipse.jetty.util.thread.strategy.EatWhatYouKill.doProduce(EatWhatYouKill.java:181)
        at org.eclipse.jetty.util.thread.strategy.EatWhatYouKill.tryProduce(EatWhatYouKill.java:168)
        at org.eclipse.jetty.util.thread.strategy.EatWhatYouKill.produce(EatWhatYouKill.java:132)
        at org.eclipse.jetty.io.ManagedSelector$$Lambda$54/164253678.run(Unknown Source)
        at org.eclipse.jetty.util.thread.QueuedThreadPool.runJob(QueuedThreadPool.java:765)
        at org.eclipse.jetty.util.thread.QueuedThreadPool$2.run(QueuedThreadPool.java:683)
        at java.lang.Thread.run(Thread.java:748)
   8) Thread[id=201534, name=Scheduler-1513684949, state=TIMED_WAITING, group=TGRP-ShardSplitTest]
        at sun.misc.Unsafe.park(Native Method)
        at java.util.concurrent.locks.LockSupport.parkNanos(LockSupport.java:215)
        at java.util.concurrent.locks.AbstractQueuedSynchronizer$ConditionObject.awaitNanos(AbstractQueuedSynchronizer.java:2078)
        at java.util.concurrent.ScheduledThreadPoolExecutor$DelayedWorkQueue.take(ScheduledThreadPoolExecutor.java:1093)
        at java.util.concurrent.ScheduledThreadPoolExecutor$DelayedWorkQueue.take(ScheduledThreadPoolExecutor.java:809)
        at java.util.concurrent.ThreadPoolExecutor.getTask(ThreadPoolExecutor.java:1074)
        at java.util.concurrent.ThreadPoolExecutor.runWorker(ThreadPoolExecutor.java:1134)
        at java.util.concurrent.ThreadPoolExecutor$Worker.run(ThreadPoolExecutor.java:624)
        at java.lang.Thread.run(Thread.java:748)
   9) Thread[id=201526, name=qtp1987571111-201526, state=RUNNABLE, group=TGRP-ShardSplitTest]
        at sun.nio.ch.EPollArrayWrapper.epollWait(Native Method)
        at sun.nio.ch.EPollArrayWrapper.poll(EPollArrayWrapper.java:269)
        at sun.nio.ch.EPollSelectorImpl.doSelect(EPollSelectorImpl.java:93)
        at sun.nio.ch.SelectorImpl.lockAndDoSelect(SelectorImpl.java:86)
        at sun.nio.ch.SelectorImpl.select(SelectorImpl.java:97)
        at sun.nio.ch.SelectorImpl.select(SelectorImpl.java:101)
        at org.eclipse.jetty.io.ManagedSelector$SelectorProducer.select(ManagedSelector.java:423)
        at org.eclipse.jetty.io.ManagedSelector$SelectorProducer.produce(ManagedSelector.java:360)
        at org.eclipse.jetty.util.thread.strategy.EatWhatYouKill.produceTask(EatWhatYouKill.java:357)
        at org.eclipse.jetty.util.thread.strategy.EatWhatYouKill.doProduce(EatWhatYouKill.java:181)
        at org.eclipse.jetty.util.thread.strategy.EatWhatYouKill.tryProduce(EatWhatYouKill.java:168)
        at org.eclipse.jetty.util.thread.strategy.EatWhatYouKill.produce(EatWhatYouKill.java:132)
        at org.eclipse.jetty.io.ManagedSelector$$Lambda$54/164253678.run(Unknown Source)
        at org.eclipse.jetty.util.thread.QueuedThreadPool.runJob(QueuedThreadPool.java:765)
        at org.eclipse.jetty.util.thread.QueuedThreadPool$2.run(QueuedThreadPool.java:683)
        at java.lang.Thread.run(Thread.java:748)
  10) Thread[id=201533, name=qtp1987571111-201533, state=TIMED_WAITING, group=TGRP-ShardSplitTest]
        at sun.misc.Unsafe.park(Native Method)
        at java.util.concurrent.locks.LockSupport.parkNanos(LockSupport.java:215)
        at java.util.concurrent.locks.AbstractQueuedSynchronizer$ConditionObject.awaitNanos(AbstractQueuedSynchronizer.java:2078)
        at org.eclipse.jetty.util.BlockingArrayQueue.poll(BlockingArrayQueue.java:392)
        at org.eclipse.jetty.util.thread.QueuedThreadPool.idleJobPoll(QueuedThreadPool.java:656)
        at org.eclipse.jetty.util.thread.QueuedThreadPool.access$800(QueuedThreadPool.java:46)
        at org.eclipse.jetty.util.thread.QueuedThreadPool$2.run(QueuedThreadPool.java:720)
        at java.lang.Thread.run(Thread.java:748)
	at __randomizedtesting.SeedInfo.seed([56CD4FDDCA19775C]:0)


FAILED:  junit.framework.TestSuite.org.apache.solr.cloud.api.collections.ShardSplitTest

Error Message:
There are still zombie threads that couldn't be terminated:    1) Thread[id=201534, name=Scheduler-1513684949, state=TIMED_WAITING, group=TGRP-ShardSplitTest]         at sun.misc.Unsafe.park(Native Method)         at java.util.concurrent.locks.LockSupport.parkNanos(LockSupport.java:215)         at java.util.concurrent.locks.AbstractQueuedSynchronizer$ConditionObject.awaitNanos(AbstractQueuedSynchronizer.java:2078)         at java.util.concurrent.ScheduledThreadPoolExecutor$DelayedWorkQueue.take(ScheduledThreadPoolExecutor.java:1093)         at java.util.concurrent.ScheduledThreadPoolExecutor$DelayedWorkQueue.take(ScheduledThreadPoolExecutor.java:809)         at java.util.concurrent.ThreadPoolExecutor.getTask(ThreadPoolExecutor.java:1074)         at java.util.concurrent.ThreadPoolExecutor.runWorker(ThreadPoolExecutor.java:1134)         at java.util.concurrent.ThreadPoolExecutor$Worker.run(ThreadPoolExecutor.java:624)         at java.lang.Thread.run(Thread.java:748)    2) Thread[id=201571, name=Scheduler-688191804, state=WAITING, group=TGRP-ShardSplitTest]         at sun.misc.Unsafe.park(Native Method)         at java.util.concurrent.locks.LockSupport.park(LockSupport.java:175)         at java.util.concurrent.locks.AbstractQueuedSynchronizer$ConditionObject.await(AbstractQueuedSynchronizer.java:2039)         at java.util.concurrent.ScheduledThreadPoolExecutor$DelayedWorkQueue.take(ScheduledThreadPoolExecutor.java:1081)         at java.util.concurrent.ScheduledThreadPoolExecutor$DelayedWorkQueue.take(ScheduledThreadPoolExecutor.java:809)         at java.util.concurrent.ThreadPoolExecutor.getTask(ThreadPoolExecutor.java:1074)         at java.util.concurrent.ThreadPoolExecutor.runWorker(ThreadPoolExecutor.java:1134)         at java.util.concurrent.ThreadPoolExecutor$Worker.run(ThreadPoolExecutor.java:624)         at java.lang.Thread.run(Thread.java:748)    3) Thread[id=201526, name=qtp1987571111-201526, state=RUNNABLE, group=TGRP-ShardSplitTest]         at sun.nio.ch.EPollArrayWrapper.epollWait(Native Method)         at sun.nio.ch.EPollArrayWrapper.poll(EPollArrayWrapper.java:269)         at sun.nio.ch.EPollSelectorImpl.doSelect(EPollSelectorImpl.java:93)         at sun.nio.ch.SelectorImpl.lockAndDoSelect(SelectorImpl.java:86)         at sun.nio.ch.SelectorImpl.select(SelectorImpl.java:97)         at sun.nio.ch.SelectorImpl.select(SelectorImpl.java:101)         at org.eclipse.jetty.io.ManagedSelector$SelectorProducer.select(ManagedSelector.java:423)         at org.eclipse.jetty.io.ManagedSelector$SelectorProducer.produce(ManagedSelector.java:360)         at org.eclipse.jetty.util.thread.strategy.EatWhatYouKill.produceTask(EatWhatYouKill.java:357)         at org.eclipse.jetty.util.thread.strategy.EatWhatYouKill.doProduce(EatWhatYouKill.java:181)         at org.eclipse.jetty.util.thread.strategy.EatWhatYouKill.tryProduce(EatWhatYouKill.java:168)         at org.eclipse.jetty.util.thread.strategy.EatWhatYouKill.produce(EatWhatYouKill.java:132)         at org.eclipse.jetty.io.ManagedSelector$$Lambda$54/164253678.run(Unknown Source)         at org.eclipse.jetty.util.thread.QueuedThreadPool.runJob(QueuedThreadPool.java:765)         at org.eclipse.jetty.util.thread.QueuedThreadPool$2.run(QueuedThreadPool.java:683)         at java.lang.Thread.run(Thread.java:748)    4) Thread[id=201527, name=qtp1987571111-201527, state=RUNNABLE, group=TGRP-ShardSplitTest]         at sun.nio.ch.EPollArrayWrapper.epollWait(Native Method)         at sun.nio.ch.EPollArrayWrapper.poll(EPollArrayWrapper.java:269)         at sun.nio.ch.EPollSelectorImpl.doSelect(EPollSelectorImpl.java:93)         at sun.nio.ch.SelectorImpl.lockAndDoSelect(SelectorImpl.java:86)         at sun.nio.ch.SelectorImpl.select(SelectorImpl.java:97)         at sun.nio.ch.SelectorImpl.select(SelectorImpl.java:101)         at org.eclipse.jetty.io.ManagedSelector$SelectorProducer.select(ManagedSelector.java:423)         at org.eclipse.jetty.io.ManagedSelector$SelectorProducer.produce(ManagedSelector.java:360)         at org.eclipse.jetty.util.thread.strategy.EatWhatYouKill.produceTask(EatWhatYouKill.java:357)         at org.eclipse.jetty.util.thread.strategy.EatWhatYouKill.doProduce(EatWhatYouKill.java:181)         at org.eclipse.jetty.util.thread.strategy.EatWhatYouKill.tryProduce(EatWhatYouKill.java:168)         at org.eclipse.jetty.util.thread.strategy.EatWhatYouKill.produce(EatWhatYouKill.java:132)         at org.eclipse.jetty.io.ManagedSelector$$Lambda$54/164253678.run(Unknown Source)         at org.eclipse.jetty.util.thread.QueuedThreadPool.runJob(QueuedThreadPool.java:765)         at org.eclipse.jetty.util.thread.QueuedThreadPool$2.run(QueuedThreadPool.java:683)         at java.lang.Thread.run(Thread.java:748)

Stack Trace:
com.carrotsearch.randomizedtesting.ThreadLeakError: There are still zombie threads that couldn't be terminated:
   1) Thread[id=201534, name=Scheduler-1513684949, state=TIMED_WAITING, group=TGRP-ShardSplitTest]
        at sun.misc.Unsafe.park(Native Method)
        at java.util.concurrent.locks.LockSupport.parkNanos(LockSupport.java:215)
        at java.util.concurrent.locks.AbstractQueuedSynchronizer$ConditionObject.awaitNanos(AbstractQueuedSynchronizer.java:2078)
        at java.util.concurrent.ScheduledThreadPoolExecutor$DelayedWorkQueue.take(ScheduledThreadPoolExecutor.java:1093)
        at java.util.concurrent.ScheduledThreadPoolExecutor$DelayedWorkQueue.take(ScheduledThreadPoolExecutor.java:809)
        at java.util.concurrent.ThreadPoolExecutor.getTask(ThreadPoolExecutor.java:1074)
        at java.util.concurrent.ThreadPoolExecutor.runWorker(ThreadPoolExecutor.java:1134)
        at java.util.concurrent.ThreadPoolExecutor$Worker.run(ThreadPoolExecutor.java:624)
        at java.lang.Thread.run(Thread.java:748)
   2) Thread[id=201571, name=Scheduler-688191804, state=WAITING, group=TGRP-ShardSplitTest]
        at sun.misc.Unsafe.park(Native Method)
        at java.util.concurrent.locks.LockSupport.park(LockSupport.java:175)
        at java.util.concurrent.locks.AbstractQueuedSynchronizer$ConditionObject.await(AbstractQueuedSynchronizer.java:2039)
        at java.util.concurrent.ScheduledThreadPoolExecutor$DelayedWorkQueue.take(ScheduledThreadPoolExecutor.java:1081)
        at java.util.concurrent.ScheduledThreadPoolExecutor$DelayedWorkQueue.take(ScheduledThreadPoolExecutor.java:809)
        at java.util.concurrent.ThreadPoolExecutor.getTask(ThreadPoolExecutor.java:1074)
        at java.util.concurrent.ThreadPoolExecutor.runWorker(ThreadPoolExecutor.java:1134)
        at java.util.concurrent.ThreadPoolExecutor$Worker.run(ThreadPoolExecutor.java:624)
        at java.lang.Thread.run(Thread.java:748)
   3) Thread[id=201526, name=qtp1987571111-201526, state=RUNNABLE, group=TGRP-ShardSplitTest]
        at sun.nio.ch.EPollArrayWrapper.epollWait(Native Method)
        at sun.nio.ch.EPollArrayWrapper.poll(EPollArrayWrapper.java:269)
        at sun.nio.ch.EPollSelectorImpl.doSelect(EPollSelectorImpl.java:93)
        at sun.nio.ch.SelectorImpl.lockAndDoSelect(SelectorImpl.java:86)
        at sun.nio.ch.SelectorImpl.select(SelectorImpl.java:97)
        at sun.nio.ch.SelectorImpl.select(SelectorImpl.java:101)
        at org.eclipse.jetty.io.ManagedSelector$SelectorProducer.select(ManagedSelector.java:423)
        at org.eclipse.jetty.io.ManagedSelector$SelectorProducer.produce(ManagedSelector.java:360)
        at org.eclipse.jetty.util.thread.strategy.EatWhatYouKill.produceTask(EatWhatYouKill.java:357)
        at org.eclipse.jetty.util.thread.strategy.EatWhatYouKill.doProduce(EatWhatYouKill.java:181)
        at org.eclipse.jetty.util.thread.strategy.EatWhatYouKill.tryProduce(EatWhatYouKill.java:168)
        at org.eclipse.jetty.util.thread.strategy.EatWhatYouKill.produce(EatWhatYouKill.java:132)
        at org.eclipse.jetty.io.ManagedSelector$$Lambda$54/164253678.run(Unknown Source)
        at org.eclipse.jetty.util.thread.QueuedThreadPool.runJob(QueuedThreadPool.java:765)
        at org.eclipse.jetty.util.thread.QueuedThreadPool$2.run(QueuedThreadPool.java:683)
        at java.lang.Thread.run(Thread.java:748)
   4) Thread[id=201527, name=qtp1987571111-201527, state=RUNNABLE, group=TGRP-ShardSplitTest]
        at sun.nio.ch.EPollArrayWrapper.epollWait(Native Method)
        at sun.nio.ch.EPollArrayWrapper.poll(EPollArrayWrapper.java:269)
        at sun.nio.ch.EPollSelectorImpl.doSelect(EPollSelectorImpl.java:93)
        at sun.nio.ch.SelectorImpl.lockAndDoSelect(SelectorImpl.java:86)
        at sun.nio.ch.SelectorImpl.select(SelectorImpl.java:97)
        at sun.nio.ch.SelectorImpl.select(SelectorImpl.java:101)
        at org.eclipse.jetty.io.ManagedSelector$SelectorProducer.select(ManagedSelector.java:423)
        at org.eclipse.jetty.io.ManagedSelector$SelectorProducer.produce(ManagedSelector.java:360)
        at org.eclipse.jetty.util.thread.strategy.EatWhatYouKill.produceTask(EatWhatYouKill.java:357)
        at org.eclipse.jetty.util.thread.strategy.EatWhatYouKill.doProduce(EatWhatYouKill.java:181)
        at org.eclipse.jetty.util.thread.strategy.EatWhatYouKill.tryProduce(EatWhatYouKill.java:168)
        at org.eclipse.jetty.util.thread.strategy.EatWhatYouKill.produce(EatWhatYouKill.java:132)
        at org.eclipse.jetty.io.ManagedSelector$$Lambda$54/164253678.run(Unknown Source)
        at org.eclipse.jetty.util.thread.QueuedThreadPool.runJob(QueuedThreadPool.java:765)
        at org.eclipse.jetty.util.thread.QueuedThreadPool$2.run(QueuedThreadPool.java:683)
        at java.lang.Thread.run(Thread.java:748)
	at __randomizedtesting.SeedInfo.seed([56CD4FDDCA19775C]:0)


FAILED:  org.apache.solr.cloud.autoscaling.HdfsAutoAddReplicasIntegrationTest.testSimple

Error Message:
Waiting for collection testSimple2 Timeout waiting to see state for collection=testSimple2 :DocCollection(testSimple2//collections/testSimple2/state.json/22)={   "pullReplicas":"0",   "replicationFactor":"2",   "shards":{     "shard1":{       "range":"80000000-ffffffff",       "state":"active",       "replicas":{         "core_node3":{           "dataDir":"hdfs://lucene2-us-west.apache.org:39086/solr_hdfs_home/testSimple2/core_node3/data/",           "base_url":"https://127.0.0.1:40482/solr",           "node_name":"127.0.0.1:40482_solr",           "type":"NRT",           "force_set_state":"false",           "ulogDir":"hdfs://lucene2-us-west.apache.org:39086/solr_hdfs_home/testSimple2/core_node3/data/tlog",           "core":"testSimple2_shard1_replica_n1",           "shared_storage":"true",           "state":"active",           "leader":"true"},         "core_node5":{           "dataDir":"hdfs://lucene2-us-west.apache.org:39086/solr_hdfs_home/testSimple2/core_node5/data/",           "base_url":"https://127.0.0.1:42107/solr",           "node_name":"127.0.0.1:42107_solr",           "type":"NRT",           "force_set_state":"false",           "ulogDir":"hdfs://lucene2-us-west.apache.org:39086/solr_hdfs_home/testSimple2/core_node5/data/tlog",           "core":"testSimple2_shard1_replica_n2",           "shared_storage":"true",           "state":"down"}}},     "shard2":{       "range":"0-7fffffff",       "state":"active",       "replicas":{         "core_node7":{           "dataDir":"hdfs://lucene2-us-west.apache.org:39086/solr_hdfs_home/testSimple2/core_node7/data/",           "base_url":"https://127.0.0.1:40482/solr",           "node_name":"127.0.0.1:40482_solr",           "type":"NRT",           "force_set_state":"false",           "ulogDir":"hdfs://lucene2-us-west.apache.org:39086/solr_hdfs_home/testSimple2/core_node7/data/tlog",           "core":"testSimple2_shard2_replica_n4",           "shared_storage":"true",           "state":"active",           "leader":"true"},         "core_node8":{           "dataDir":"hdfs://lucene2-us-west.apache.org:39086/solr_hdfs_home/testSimple2/core_node8/data/",           "base_url":"https://127.0.0.1:42107/solr",           "node_name":"127.0.0.1:42107_solr",           "type":"NRT",           "force_set_state":"false",           "ulogDir":"hdfs://lucene2-us-west.apache.org:39086/solr_hdfs_home/testSimple2/core_node8/data/tlog",           "core":"testSimple2_shard2_replica_n6",           "shared_storage":"true",           "state":"down"}}}},   "router":{"name":"compositeId"},   "maxShardsPerNode":"2",   "autoAddReplicas":"true",   "nrtReplicas":"2",   "tlogReplicas":"0"} Live Nodes: [127.0.0.1:38195_solr, 127.0.0.1:40482_solr] Last available state: DocCollection(testSimple2//collections/testSimple2/state.json/22)={   "pullReplicas":"0",   "replicationFactor":"2",   "shards":{     "shard1":{       "range":"80000000-ffffffff",       "state":"active",       "replicas":{         "core_node3":{           "dataDir":"hdfs://lucene2-us-west.apache.org:39086/solr_hdfs_home/testSimple2/core_node3/data/",           "base_url":"https://127.0.0.1:40482/solr",           "node_name":"127.0.0.1:40482_solr",           "type":"NRT",           "force_set_state":"false",           "ulogDir":"hdfs://lucene2-us-west.apache.org:39086/solr_hdfs_home/testSimple2/core_node3/data/tlog",           "core":"testSimple2_shard1_replica_n1",           "shared_storage":"true",           "state":"active",           "leader":"true"},         "core_node5":{           "dataDir":"hdfs://lucene2-us-west.apache.org:39086/solr_hdfs_home/testSimple2/core_node5/data/",           "base_url":"https://127.0.0.1:42107/solr",           "node_name":"127.0.0.1:42107_solr",           "type":"NRT",           "force_set_state":"false",           "ulogDir":"hdfs://lucene2-us-west.apache.org:39086/solr_hdfs_home/testSimple2/core_node5/data/tlog",           "core":"testSimple2_shard1_replica_n2",           "shared_storage":"true",           "state":"down"}}},     "shard2":{       "range":"0-7fffffff",       "state":"active",       "replicas":{         "core_node7":{           "dataDir":"hdfs://lucene2-us-west.apache.org:39086/solr_hdfs_home/testSimple2/core_node7/data/",           "base_url":"https://127.0.0.1:40482/solr",           "node_name":"127.0.0.1:40482_solr",           "type":"NRT",           "force_set_state":"false",           "ulogDir":"hdfs://lucene2-us-west.apache.org:39086/solr_hdfs_home/testSimple2/core_node7/data/tlog",           "core":"testSimple2_shard2_replica_n4",           "shared_storage":"true",           "state":"active",           "leader":"true"},         "core_node8":{           "dataDir":"hdfs://lucene2-us-west.apache.org:39086/solr_hdfs_home/testSimple2/core_node8/data/",           "base_url":"https://127.0.0.1:42107/solr",           "node_name":"127.0.0.1:42107_solr",           "type":"NRT",           "force_set_state":"false",           "ulogDir":"hdfs://lucene2-us-west.apache.org:39086/solr_hdfs_home/testSimple2/core_node8/data/tlog",           "core":"testSimple2_shard2_replica_n6",           "shared_storage":"true",           "state":"down"}}}},   "router":{"name":"compositeId"},   "maxShardsPerNode":"2",   "autoAddReplicas":"true",   "nrtReplicas":"2",   "tlogReplicas":"0"}

Stack Trace:
java.lang.AssertionError: Waiting for collection testSimple2
Timeout waiting to see state for collection=testSimple2 :DocCollection(testSimple2//collections/testSimple2/state.json/22)={
  "pullReplicas":"0",
  "replicationFactor":"2",
  "shards":{
    "shard1":{
      "range":"80000000-ffffffff",
      "state":"active",
      "replicas":{
        "core_node3":{
          "dataDir":"hdfs://lucene2-us-west.apache.org:39086/solr_hdfs_home/testSimple2/core_node3/data/",
          "base_url":"https://127.0.0.1:40482/solr",
          "node_name":"127.0.0.1:40482_solr",
          "type":"NRT",
          "force_set_state":"false",
          "ulogDir":"hdfs://lucene2-us-west.apache.org:39086/solr_hdfs_home/testSimple2/core_node3/data/tlog",
          "core":"testSimple2_shard1_replica_n1",
          "shared_storage":"true",
          "state":"active",
          "leader":"true"},
        "core_node5":{
          "dataDir":"hdfs://lucene2-us-west.apache.org:39086/solr_hdfs_home/testSimple2/core_node5/data/",
          "base_url":"https://127.0.0.1:42107/solr",
          "node_name":"127.0.0.1:42107_solr",
          "type":"NRT",
          "force_set_state":"false",
          "ulogDir":"hdfs://lucene2-us-west.apache.org:39086/solr_hdfs_home/testSimple2/core_node5/data/tlog",
          "core":"testSimple2_shard1_replica_n2",
          "shared_storage":"true",
          "state":"down"}}},
    "shard2":{
      "range":"0-7fffffff",
      "state":"active",
      "replicas":{
        "core_node7":{
          "dataDir":"hdfs://lucene2-us-west.apache.org:39086/solr_hdfs_home/testSimple2/core_node7/data/",
          "base_url":"https://127.0.0.1:40482/solr",
          "node_name":"127.0.0.1:40482_solr",
          "type":"NRT",
          "force_set_state":"false",
          "ulogDir":"hdfs://lucene2-us-west.apache.org:39086/solr_hdfs_home/testSimple2/core_node7/data/tlog",
          "core":"testSimple2_shard2_replica_n4",
          "shared_storage":"true",
          "state":"active",
          "leader":"true"},
        "core_node8":{
          "dataDir":"hdfs://lucene2-us-west.apache.org:39086/solr_hdfs_home/testSimple2/core_node8/data/",
          "base_url":"https://127.0.0.1:42107/solr",
          "node_name":"127.0.0.1:42107_solr",
          "type":"NRT",
          "force_set_state":"false",
          "ulogDir":"hdfs://lucene2-us-west.apache.org:39086/solr_hdfs_home/testSimple2/core_node8/data/tlog",
          "core":"testSimple2_shard2_replica_n6",
          "shared_storage":"true",
          "state":"down"}}}},
  "router":{"name":"compositeId"},
  "maxShardsPerNode":"2",
  "autoAddReplicas":"true",
  "nrtReplicas":"2",
  "tlogReplicas":"0"}
Live Nodes: [127.0.0.1:38195_solr, 127.0.0.1:40482_solr]
Last available state: DocCollection(testSimple2//collections/testSimple2/state.json/22)={
  "pullReplicas":"0",
  "replicationFactor":"2",
  "shards":{
    "shard1":{
      "range":"80000000-ffffffff",
      "state":"active",
      "replicas":{
        "core_node3":{
          "dataDir":"hdfs://lucene2-us-west.apache.org:39086/solr_hdfs_home/testSimple2/core_node3/data/",
          "base_url":"https://127.0.0.1:40482/solr",
          "node_name":"127.0.0.1:40482_solr",
          "type":"NRT",
          "force_set_state":"false",
          "ulogDir":"hdfs://lucene2-us-west.apache.org:39086/solr_hdfs_home/testSimple2/core_node3/data/tlog",
          "core":"testSimple2_shard1_replica_n1",
          "shared_storage":"true",
          "state":"active",
          "leader":"true"},
        "core_node5":{
          "dataDir":"hdfs://lucene2-us-west.apache.org:39086/solr_hdfs_home/testSimple2/core_node5/data/",
          "base_url":"https://127.0.0.1:42107/solr",
          "node_name":"127.0.0.1:42107_solr",
          "type":"NRT",
          "force_set_state":"false",
          "ulogDir":"hdfs://lucene2-us-west.apache.org:39086/solr_hdfs_home/testSimple2/core_node5/data/tlog",
          "core":"testSimple2_shard1_replica_n2",
          "shared_storage":"true",
          "state":"down"}}},
    "shard2":{
      "range":"0-7fffffff",
      "state":"active",
      "replicas":{
        "core_node7":{
          "dataDir":"hdfs://lucene2-us-west.apache.org:39086/solr_hdfs_home/testSimple2/core_node7/data/",
          "base_url":"https://127.0.0.1:40482/solr",
          "node_name":"127.0.0.1:40482_solr",
          "type":"NRT",
          "force_set_state":"false",
          "ulogDir":"hdfs://lucene2-us-west.apache.org:39086/solr_hdfs_home/testSimple2/core_node7/data/tlog",
          "core":"testSimple2_shard2_replica_n4",
          "shared_storage":"true",
          "state":"active",
          "leader":"true"},
        "core_node8":{
          "dataDir":"hdfs://lucene2-us-west.apache.org:39086/solr_hdfs_home/testSimple2/core_node8/data/",
          "base_url":"https://127.0.0.1:42107/solr",
          "node_name":"127.0.0.1:42107_solr",
          "type":"NRT",
          "force_set_state":"false",
          "ulogDir":"hdfs://lucene2-us-west.apache.org:39086/solr_hdfs_home/testSimple2/core_node8/data/tlog",
          "core":"testSimple2_shard2_replica_n6",
          "shared_storage":"true",
          "state":"down"}}}},
  "router":{"name":"compositeId"},
  "maxShardsPerNode":"2",
  "autoAddReplicas":"true",
  "nrtReplicas":"2",
  "tlogReplicas":"0"}
	at __randomizedtesting.SeedInfo.seed([56CD4FDDCA19775C:6E7E6B23EDEAA38D]:0)
	at org.junit.Assert.fail(Assert.java:88)
	at org.apache.solr.cloud.SolrCloudTestCase.waitForState(SolrCloudTestCase.java:310)
	at org.apache.solr.cloud.autoscaling.AutoAddReplicasIntegrationTest.testSimple(AutoAddReplicasIntegrationTest.java:169)
	at sun.reflect.NativeMethodAccessorImpl.invoke0(Native Method)
	at sun.reflect.NativeMethodAccessorImpl.invoke(NativeMethodAccessorImpl.java:62)
	at sun.reflect.DelegatingMethodAccessorImpl.invoke(DelegatingMethodAccessorImpl.java:43)
	at java.lang.reflect.Method.invoke(Method.java:498)
	at com.carrotsearch.randomizedtesting.RandomizedRunner.invoke(RandomizedRunner.java:1750)
	at com.carrotsearch.randomizedtesting.RandomizedRunner$8.evaluate(RandomizedRunner.java:938)
	at com.carrotsearch.randomizedtesting.RandomizedRunner$9.evaluate(RandomizedRunner.java:974)
	at com.carrotsearch.randomizedtesting.RandomizedRunner$10.evaluate(RandomizedRunner.java:988)
	at com.carrotsearch.randomizedtesting.rules.SystemPropertiesRestoreRule$1.evaluate(SystemPropertiesRestoreRule.java:57)
	at org.apache.lucene.util.TestRuleSetupTeardownChained$1.evaluate(TestRuleSetupTeardownChained.java:49)
	at org.apache.lucene.util.AbstractBeforeAfterRule$1.evaluate(AbstractBeforeAfterRule.java:45)
	at org.apache.lucene.util.TestRuleThreadAndTestName$1.evaluate(TestRuleThreadAndTestName.java:48)
	at org.apache.lucene.util.TestRuleIgnoreAfterMaxFailures$1.evaluate(TestRuleIgnoreAfterMaxFailures.java:64)
	at org.apache.lucene.util.TestRuleMarkFailure$1.evaluate(TestRuleMarkFailure.java:47)
	at com.carrotsearch.randomizedtesting.rules.StatementAdapter.evaluate(StatementAdapter.java:36)
	at com.carrotsearch.randomizedtesting.ThreadLeakControl$StatementRunner.run(ThreadLeakControl.java:368)
	at com.carrotsearch.randomizedtesting.ThreadLeakControl.forkTimeoutingTask(ThreadLeakControl.java:817)
	at com.carrotsearch.randomizedtesting.ThreadLeakControl$3.evaluate(ThreadLeakControl.java:468)
	at com.carrotsearch.randomizedtesting.RandomizedRunner.runSingleTest(RandomizedRunner.java:947)
	at com.carrotsearch.randomizedtesting.RandomizedRunner$5.evaluate(RandomizedRunner.java:832)
	at com.carrotsearch.randomizedtesting.RandomizedRunner$6.evaluate(RandomizedRunner.java:883)
	at com.carrotsearch.randomizedtesting.RandomizedRunner$7.evaluate(RandomizedRunner.java:894)
	at com.carrotsearch.randomizedtesting.rules.StatementAdapter.evaluate(StatementAdapter.java:36)
	at com.carrotsearch.randomizedtesting.rules.SystemPropertiesRestoreRule$1.evaluate(SystemPropertiesRestoreRule.java:57)
	at org.apache.lucene.util.AbstractBeforeAfterRule$1.evaluate(AbstractBeforeAfterRule.java:45)
	at com.carrotsearch.randomizedtesting.rules.StatementAdapter.evaluate(StatementAdapter.java:36)
	at org.apache.lucene.util.TestRuleStoreClassName$1.evaluate(TestRuleStoreClassName.java:41)
	at com.carrotsearch.randomizedtesting.rules.NoShadowingOrOverridesOnMethodsRule$1.evaluate(NoShadowingOrOverridesOnMethodsRule.java:40)
	at com.carrotsearch.randomizedtesting.rules.NoShadowingOrOverridesOnMethodsRule$1.evaluate(NoShadowingOrOverridesOnMethodsRule.java:40)
	at com.carrotsearch.randomizedtesting.rules.StatementAdapter.evaluate(StatementAdapter.java:36)
	at com.carrotsearch.randomizedtesting.rules.StatementAdapter.evaluate(StatementAdapter.java:36)
	at com.carrotsearch.randomizedtesting.rules.StatementAdapter.evaluate(StatementAdapter.java:36)
	at org.apache.lucene.util.TestRuleAssertionsRequired$1.evaluate(TestRuleAssertionsRequired.java:53)
	at org.apache.lucene.util.TestRuleMarkFailure$1.evaluate(TestRuleMarkFailure.java:47)
	at org.apache.lucene.util.TestRuleIgnoreAfterMaxFailures$1.evaluate(TestRuleIgnoreAfterMaxFailures.java:64)
	at org.apache.lucene.util.TestRuleIgnoreTestSuites$1.evaluate(TestRuleIgnoreTestSuites.java:54)
	at com.carrotsearch.randomizedtesting.rules.StatementAdapter.evaluate(StatementAdapter.java:36)
	at com.carrotsearch.randomizedtesting.ThreadLeakControl$StatementRunner.run(ThreadLeakControl.java:368)
	at java.lang.Thread.run(Thread.java:748)




Build Log:
[...truncated 14142 lines...]
   [junit4] Suite: org.apache.solr.cloud.autoscaling.HdfsAutoAddReplicasIntegrationTest
   [junit4]   2> 1839431 INFO  (SUITE-HdfsAutoAddReplicasIntegrationTest-seed#[56CD4FDDCA19775C]-worker) [    ] o.a.s.SolrTestCaseJ4 SecureRandom sanity checks: test.solr.allowed.securerandom=null & java.security.egd=file:/dev/./urandom
   [junit4]   2> Creating dataDir: /home/jenkins/jenkins-slave/workspace/Lucene-Solr-NightlyTests-8.x/checkout/solr/build/solr-core/test/J2/temp/solr.cloud.autoscaling.HdfsAutoAddReplicasIntegrationTest_56CD4FDDCA19775C-001/init-core-data-001
   [junit4]   2> 1839431 WARN  (SUITE-HdfsAutoAddReplicasIntegrationTest-seed#[56CD4FDDCA19775C]-worker) [    ] o.a.s.SolrTestCaseJ4 startTrackingSearchers: numOpens=55 numCloses=55
   [junit4]   2> 1839431 INFO  (SUITE-HdfsAutoAddReplicasIntegrationTest-seed#[56CD4FDDCA19775C]-worker) [    ] o.a.s.SolrTestCaseJ4 Using PointFields (NUMERIC_POINTS_SYSPROP=true) w/NUMERIC_DOCVALUES_SYSPROP=true
   [junit4]   2> 1839433 INFO  (SUITE-HdfsAutoAddReplicasIntegrationTest-seed#[56CD4FDDCA19775C]-worker) [    ] o.a.s.SolrTestCaseJ4 Randomized ssl (true) and clientAuth (true) via: @org.apache.solr.util.RandomizeSSL(reason=, ssl=NaN, value=NaN, clientAuth=NaN)
   [junit4]   1> Formatting using clusterid: testClusterID
   [junit4]   2> 1839475 WARN  (SUITE-HdfsAutoAddReplicasIntegrationTest-seed#[56CD4FDDCA19775C]-worker) [    ] o.a.h.m.i.MetricsConfig Cannot locate configuration: tried hadoop-metrics2-namenode.properties,hadoop-metrics2.properties
   [junit4]   2> 1839481 WARN  (SUITE-HdfsAutoAddReplicasIntegrationTest-seed#[56CD4FDDCA19775C]-worker) [    ] o.a.h.h.HttpRequestLog Jetty request log can only be enabled using Log4j
   [junit4]   2> 1839482 INFO  (SUITE-HdfsAutoAddReplicasIntegrationTest-seed#[56CD4FDDCA19775C]-worker) [    ] o.e.j.s.Server jetty-9.4.14.v20181114; built: 2018-11-14T21:20:31.478Z; git: c4550056e785fb5665914545889f21dc136ad9e6; jvm 1.8.0_191-b12
   [junit4]   2> 1839483 INFO  (SUITE-HdfsAutoAddReplicasIntegrationTest-seed#[56CD4FDDCA19775C]-worker) [    ] o.e.j.s.session DefaultSessionIdManager workerName=node0
   [junit4]   2> 1839483 INFO  (SUITE-HdfsAutoAddReplicasIntegrationTest-seed#[56CD4FDDCA19775C]-worker) [    ] o.e.j.s.session No SessionScavenger set, using defaults
   [junit4]   2> 1839483 INFO  (SUITE-HdfsAutoAddReplicasIntegrationTest-seed#[56CD4FDDCA19775C]-worker) [    ] o.e.j.s.session node0 Scavenging every 660000ms
   [junit4]   2> 1839484 INFO  (SUITE-HdfsAutoAddReplicasIntegrationTest-seed#[56CD4FDDCA19775C]-worker) [    ] o.e.j.s.h.ContextHandler Started o.e.j.s.ServletContextHandler@7358950b{static,/static,jar:file:/home/jenkins/.ivy2/cache/org.apache.hadoop/hadoop-hdfs/tests/hadoop-hdfs-3.2.0-tests.jar!/webapps/static,AVAILABLE}
   [junit4]   2> 1839626 INFO  (SUITE-HdfsAutoAddReplicasIntegrationTest-seed#[56CD4FDDCA19775C]-worker) [    ] o.e.j.s.h.ContextHandler Started o.e.j.w.WebAppContext@3d94f769{hdfs,/,file:///home/jenkins/jenkins-slave/workspace/Lucene-Solr-NightlyTests-8.x/checkout/solr/build/solr-core/test/J2/temp/jetty-lucene2-us-west.apache.org-34958-hdfs-_-any-7911531148281062196.dir/webapp/,AVAILABLE}{/hdfs}
   [junit4]   2> 1839627 INFO  (SUITE-HdfsAutoAddReplicasIntegrationTest-seed#[56CD4FDDCA19775C]-worker) [    ] o.e.j.s.AbstractConnector Started ServerConnector@22d6263e{HTTP/1.1,[http/1.1]}{lucene2-us-west.apache.org:34958}
   [junit4]   2> 1839627 INFO  (SUITE-HdfsAutoAddReplicasIntegrationTest-seed#[56CD4FDDCA19775C]-worker) [    ] o.e.j.s.Server Started @1839802ms
   [junit4]   2> 1839766 WARN  (SUITE-HdfsAutoAddReplicasIntegrationTest-seed#[56CD4FDDCA19775C]-worker) [    ] o.a.h.h.HttpRequestLog Jetty request log can only be enabled using Log4j
   [junit4]   2> 1839769 INFO  (SUITE-HdfsAutoAddReplicasIntegrationTest-seed#[56CD4FDDCA19775C]-worker) [    ] o.e.j.s.Server jetty-9.4.14.v20181114; built: 2018-11-14T21:20:31.478Z; git: c4550056e785fb5665914545889f21dc136ad9e6; jvm 1.8.0_191-b12
   [junit4]   2> 1839772 INFO  (SUITE-HdfsAutoAddReplicasIntegrationTest-seed#[56CD4FDDCA19775C]-worker) [    ] o.e.j.s.session DefaultSessionIdManager workerName=node0
   [junit4]   2> 1839772 INFO  (SUITE-HdfsAutoAddReplicasIntegrationTest-seed#[56CD4FDDCA19775C]-worker) [    ] o.e.j.s.session No SessionScavenger set, using defaults
   [junit4]   2> 1839772 INFO  (SUITE-HdfsAutoAddReplicasIntegrationTest-seed#[56CD4FDDCA19775C]-worker) [    ] o.e.j.s.session node0 Scavenging every 600000ms
   [junit4]   2> 1839773 INFO  (SUITE-HdfsAutoAddReplicasIntegrationTest-seed#[56CD4FDDCA19775C]-worker) [    ] o.e.j.s.h.ContextHandler Started o.e.j.s.ServletContextHandler@67d656d1{static,/static,jar:file:/home/jenkins/.ivy2/cache/org.apache.hadoop/hadoop-hdfs/tests/hadoop-hdfs-3.2.0-tests.jar!/webapps/static,AVAILABLE}
   [junit4]   2> 1839896 INFO  (SUITE-HdfsAutoAddReplicasIntegrationTest-seed#[56CD4FDDCA19775C]-worker) [    ] o.e.j.s.h.ContextHandler Started o.e.j.w.WebAppContext@491728e8{datanode,/,file:///home/jenkins/jenkins-slave/workspace/Lucene-Solr-NightlyTests-8.x/checkout/solr/build/solr-core/test/J2/temp/jetty-localhost-45120-datanode-_-any-967635827242075103.dir/webapp/,AVAILABLE}{/datanode}
   [junit4]   2> 1839896 INFO  (SUITE-HdfsAutoAddReplicasIntegrationTest-seed#[56CD4FDDCA19775C]-worker) [    ] o.e.j.s.AbstractConnector Started ServerConnector@51bf833d{HTTP/1.1,[http/1.1]}{localhost:45120}
   [junit4]   2> 1839896 INFO  (SUITE-HdfsAutoAddReplicasIntegrationTest-seed#[56CD4FDDCA19775C]-worker) [    ] o.e.j.s.Server Started @1840071ms
   [junit4]   2> 1840102 INFO  (Block report processor) [    ] BlockStateChange BLOCK* processReport 0xffbbef879d55b651: Processing first storage report for DS-5163b4d4-b31e-4bd8-b0a6-e9520725542b from datanode fea7da36-588d-4211-8874-523409c38d10
   [junit4]   2> 1840102 INFO  (Block report processor) [    ] BlockStateChange BLOCK* processReport 0xffbbef879d55b651: from storage DS-5163b4d4-b31e-4bd8-b0a6-e9520725542b node DatanodeRegistration(127.0.0.1:38563, datanodeUuid=fea7da36-588d-4211-8874-523409c38d10, infoPort=45758, infoSecurePort=0, ipcPort=35361, storageInfo=lv=-57;cid=testClusterID;nsid=1236279259;c=1556969409856), blocks: 0, hasStaleStorage: true, processing time: 0 msecs, invalidatedBlocks: 0
   [junit4]   2> 1840102 INFO  (Block report processor) [    ] BlockStateChange BLOCK* processReport 0xffbbef879d55b651: Processing first storage report for DS-526ee530-cf83-473f-b64b-cfd9a9ccd206 from datanode fea7da36-588d-4211-8874-523409c38d10
   [junit4]   2> 1840102 INFO  (Block report processor) [    ] BlockStateChange BLOCK* processReport 0xffbbef879d55b651: from storage DS-526ee530-cf83-473f-b64b-cfd9a9ccd206 node DatanodeRegistration(127.0.0.1:38563, datanodeUuid=fea7da36-588d-4211-8874-523409c38d10, infoPort=45758, infoSecurePort=0, ipcPort=35361, storageInfo=lv=-57;cid=testClusterID;nsid=1236279259;c=1556969409856), blocks: 0, hasStaleStorage: false, processing time: 0 msecs, invalidatedBlocks: 0
   [junit4]   2> 1840404 INFO  (TEST-HdfsAutoAddReplicasIntegrationTest.testSimple-seed#[56CD4FDDCA19775C]) [    ] o.a.s.SolrTestCaseJ4 ###Starting testSimple
   [junit4]   2> 1840404 INFO  (TEST-HdfsAutoAddReplicasIntegrationTest.testSimple-seed#[56CD4FDDCA19775C]) [    ] o.a.s.c.MiniSolrCloudCluster Starting cluster of 3 servers in /home/jenkins/jenkins-slave/workspace/Lucene-Solr-NightlyTests-8.x/checkout/solr/build/solr-core/test/J2/temp/solr.cloud.autoscaling.HdfsAutoAddReplicasIntegrationTest_56CD4FDDCA19775C-001/tempDir-002
   [junit4]   2> 1840405 INFO  (TEST-HdfsAutoAddReplicasIntegrationTest.testSimple-seed#[56CD4FDDCA19775C]) [    ] o.a.s.c.ZkTestServer STARTING ZK TEST SERVER
   [junit4]   2> 1840405 INFO  (ZkTestServer Run Thread) [    ] o.a.s.c.ZkTestServer client port:0.0.0.0/0.0.0.0:0
   [junit4]   2> 1840405 INFO  (ZkTestServer Run Thread) [    ] o.a.s.c.ZkTestServer Starting server
   [junit4]   2> 1840505 INFO  (TEST-HdfsAutoAddReplicasIntegrationTest.testSimple-seed#[56CD4FDDCA19775C]) [    ] o.a.s.c.ZkTestServer start zk server on port:40170
   [junit4]   2> 1840505 INFO  (TEST-HdfsAutoAddReplicasIntegrationTest.testSimple-seed#[56CD4FDDCA19775C]) [    ] o.a.s.c.ZkTestServer parse host and port list: 127.0.0.1:40170
   [junit4]   2> 1840505 INFO  (TEST-HdfsAutoAddReplicasIntegrationTest.testSimple-seed#[56CD4FDDCA19775C]) [    ] o.a.s.c.ZkTestServer connecting to 127.0.0.1 40170
   [junit4]   2> 1840524 INFO  (zkConnectionManagerCallback-6573-thread-1) [    ] o.a.s.c.c.ConnectionManager zkClient has connected
   [junit4]   2> 1840529 INFO  (zkConnectionManagerCallback-6575-thread-1) [    ] o.a.s.c.c.ConnectionManager zkClient has connected
   [junit4]   2> 1840530 INFO  (zkConnectionManagerCallback-6577-thread-1) [    ] o.a.s.c.c.ConnectionManager zkClient has connected
   [junit4]   2> 1840535 WARN  (jetty-launcher-6578-thread-2) [    ] o.e.j.s.AbstractConnector Ignoring deprecated socket close linger time
   [junit4]   2> 1840535 WARN  (jetty-launcher-6578-thread-1) [    ] o.e.j.s.AbstractConnector Ignoring deprecated socket close linger time
   [junit4]   2> 1840535 INFO  (jetty-launcher-6578-thread-2) [    ] o.a.s.c.s.e.JettySolrRunner Start Jetty (original configured port=0)
   [junit4]   2> 1840535 INFO  (jetty-launcher-6578-thread-2) [    ] o.a.s.c.s.e.JettySolrRunner Trying to start Jetty on port 0 try number 1 ...
   [junit4]   2> 1840535 INFO  (jetty-launcher-6578-thread-2) [    ] o.e.j.s.Server jetty-9.4.14.v20181114; built: 2018-11-14T21:20:31.478Z; git: c4550056e785fb5665914545889f21dc136ad9e6; jvm 1.8.0_191-b12
   [junit4]   2> 1840540 INFO  (jetty-launcher-6578-thread-1) [    ] o.a.s.c.s.e.JettySolrRunner Start Jetty (original configured port=0)
   [junit4]   2> 1840540 INFO  (jetty-launcher-6578-thread-1) [    ] o.a.s.c.s.e.JettySolrRunner Trying to start Jetty on port 0 try number 1 ...
   [junit4]   2> 1840540 INFO  (jetty-launcher-6578-thread-1) [    ] o.e.j.s.Server jetty-9.4.14.v20181114; built: 2018-11-14T21:20:31.478Z; git: c4550056e785fb5665914545889f21dc136ad9e6; jvm 1.8.0_191-b12
   [junit4]   2> 1840541 INFO  (jetty-launcher-6578-thread-2) [    ] o.e.j.s.session DefaultSessionIdManager workerName=node0
   [junit4]   2> 1840541 INFO  (jetty-launcher-6578-thread-2) [    ] o.e.j.s.session No SessionScavenger set, using defaults
   [junit4]   2> 1840541 WARN  (jetty-launcher-6578-thread-3) [    ] o.e.j.s.AbstractConnector Ignoring deprecated socket close linger time
   [junit4]   2> 1840541 INFO  (jetty-launcher-6578-thread-2) [    ] o.e.j.s.session node0 Scavenging every 660000ms
   [junit4]   2> 1840541 INFO  (jetty-launcher-6578-thread-3) [    ] o.a.s.c.s.e.JettySolrRunner Start Jetty (original configured port=0)
   [junit4]   2> 1840541 INFO  (jetty-launcher-6578-thread-3) [    ] o.a.s.c.s.e.JettySolrRunner Trying to start Jetty on port 0 try number 1 ...
   [junit4]   2> 1840541 INFO  (jetty-launcher-6578-thread-3) [    ] o.e.j.s.Server jetty-9.4.14.v20181114; built: 2018-11-14T21:20:31.478Z; git: c4550056e785fb5665914545889f21dc136ad9e6; jvm 1.8.0_191-b12
   [junit4]   2> 1840541 INFO  (jetty-launcher-6578-thread-2) [    ] o.e.j.s.h.ContextHandler Started o.e.j.s.ServletContextHandler@77e40e70{/solr,null,AVAILABLE}
   [junit4]   2> 1840541 WARN  (jetty-launcher-6578-thread-2) [    ] o.e.j.u.s.S.config No Client EndPointIdentificationAlgorithm configured for SslContextFactory@4d38ae8f[provider=null,keyStore=null,trustStore=null]
   [junit4]   2> 1840542 INFO  (jetty-launcher-6578-thread-2) [    ] o.e.j.s.AbstractConnector Started ServerConnector@260998cd{SSL,[ssl, http/1.1]}{127.0.0.1:42107}
   [junit4]   2> 1840542 INFO  (jetty-launcher-6578-thread-2) [    ] o.e.j.s.Server Started @1840718ms
   [junit4]   2> 1840542 INFO  (jetty-launcher-6578-thread-2) [    ] o.a.s.c.s.e.JettySolrRunner Jetty properties: {hostContext=/solr, hostPort=42107}
   [junit4]   2> 1840543 ERROR (jetty-launcher-6578-thread-2) [    ] o.a.s.u.StartupLoggingUtils Missing Java Option solr.log.dir. Logging may be missing or incomplete.
   [junit4]   2> 1840543 INFO  (jetty-launcher-6578-thread-2) [    ] o.a.s.s.SolrDispatchFilter Using logger factory org.apache.logging.slf4j.Log4jLoggerFactory
   [junit4]   2> 1840543 INFO  (jetty-launcher-6578-thread-2) [    ] o.a.s.s.SolrDispatchFilter  ___      _       Welcome to Apache Solr™ version 8.2.0
   [junit4]   2> 1840543 INFO  (jetty-launcher-6578-thread-2) [    ] o.a.s.s.SolrDispatchFilter / __| ___| |_ _   Starting in cloud mode on port null
   [junit4]   2> 1840543 INFO  (jetty-launcher-6578-thread-2) [    ] o.a.s.s.SolrDispatchFilter \__ \/ _ \ | '_|  Install dir: null
   [junit4]   2> 1840543 INFO  (jetty-launcher-6578-thread-2) [    ] o.a.s.s.SolrDispatchFilter |___/\___/_|_|    Start time: 2019-05-04T11:30:10.954Z
   [junit4]   2> 1840548 INFO  (jetty-launcher-6578-thread-1) [    ] o.e.j.s.session DefaultSessionIdManager workerName=node0
   [junit4]   2> 1840548 INFO  (jetty-launcher-6578-thread-1) [    ] o.e.j.s.session No SessionScavenger set, using defaults
   [junit4]   2> 1840548 INFO  (jetty-launcher-6578-thread-1) [    ] o.e.j.s.session node0 Scavenging every 600000ms
   [junit4]   2> 1840548 INFO  (jetty-launcher-6578-thread-3) [    ] o.e.j.s.session DefaultSessionIdManager workerName=node0
   [junit4]   2> 1840548 INFO  (jetty-launcher-6578-thread-3) [    ] o.e.j.s.session No SessionScavenger set, using defaults
   [junit4]   2> 1840548 INFO  (jetty-launcher-6578-thread-3) [    ] o.e.j.s.session node0 Scavenging every 600000ms
   [junit4]   2> 1840556 INFO  (jetty-launcher-6578-thread-3) [    ] o.e.j.s.h.ContextHandler Started o.e.j.s.ServletContextHandler@74fec508{/solr,null,AVAILABLE}
   [junit4]   2> 1840556 WARN  (jetty-launcher-6578-thread-3) [    ] o.e.j.u.s.S.config No Client EndPointIdentificationAlgorithm configured for SslContextFactory@53ade8ce[provider=null,keyStore=null,trustStore=null]
   [junit4]   2> 1840557 INFO  (jetty-launcher-6578-thread-1) [    ] o.e.j.s.h.ContextHandler Started o.e.j.s.ServletContextHandler@5f963353{/solr,null,AVAILABLE}
   [junit4]   2> 1840557 WARN  (jetty-launcher-6578-thread-1) [    ] o.e.j.u.s.S.config No Client EndPointIdentificationAlgorithm configured for SslContextFactory@309ce6a3[provider=null,keyStore=null,trustStore=null]
   [junit4]   2> 1840558 INFO  (jetty-launcher-6578-thread-3) [    ] o.e.j.s.AbstractConnector Started ServerConnector@2d352c9{SSL,[ssl, http/1.1]}{127.0.0.1:40482}
   [junit4]   2> 1840558 INFO  (jetty-launcher-6578-thread-1) [    ] o.e.j.s.AbstractConnector Started ServerConnector@238495d2{SSL,[ssl, http/1.1]}{127.0.0.1:38195}
   [junit4]   2> 1840558 INFO  (jetty-launcher-6578-thread-3) [    ] o.e.j.s.Server Started @1840733ms
   [junit4]   2> 1840558 INFO  (jetty-launcher-6578-thread-1) [    ] o.e.j.s.Server Started @1840733ms
   [junit4]   2> 1840558 INFO  (jetty-launcher-6578-thread-1) [    ] o.a.s.c.s.e.JettySolrRunner Jetty properties: {hostContext=/solr, hostPort=38195}
   [junit4]   2> 1840558 INFO  (jetty-launcher-6578-thread-3) [    ] o.a.s.c.s.e.JettySolrRunner Jetty properties: {hostContext=/solr, hostPort=40482}
   [junit4]   2> 1840558 ERROR (jetty-launcher-6578-thread-3) [    ] o.a.s.u.StartupLoggingUtils Missing Java Option solr.log.dir. Logging may be missing or incomplete.
   [junit4]   2> 1840558 ERROR (jetty-launcher-6578-thread-1) [    ] o.a.s.u.StartupLoggingUtils Missing Java Option solr.log.dir. Logging may be missing or incomplete.
   [junit4]   2> 1840558 INFO  (jetty-launcher-6578-thread-3) [    ] o.a.s.s.SolrDispatchFilter Using logger factory org.apache.logging.slf4j.Log4jLoggerFactory
   [junit4]   2> 1840558 INFO  (jetty-launcher-6578-thread-1) [    ] o.a.s.s.SolrDispatchFilter Using logger factory org.apache.logging.slf4j.Log4jLoggerFactory
   [junit4]   2> 1840558 INFO  (jetty-launcher-6578-thread-3) [    ] o.a.s.s.SolrDispatchFilter  ___      _       Welcome to Apache Solr™ version 8.2.0
   [junit4]   2> 1840558 INFO  (jetty-launcher-6578-thread-1) [    ] o.a.s.s.SolrDispatchFilter  ___      _       Welcome to Apache Solr™ version 8.2.0
   [junit4]   2> 1840558 INFO  (jetty-launcher-6578-thread-3) [    ] o.a.s.s.SolrDispatchFilter / __| ___| |_ _   Starting in cloud mode on port null
   [junit4]   2> 1840558 INFO  (jetty-launcher-6578-thread-1) [    ] o.a.s.s.SolrDispatchFilter / __| ___| |_ _   Starting in cloud mode on port null
   [junit4]   2> 1840558 INFO  (jetty-launcher-6578-thread-3) [    ] o.a.s.s.SolrDispatchFilter \__ \/ _ \ | '_|  Install dir: null
   [junit4]   2> 1840558 INFO  (jetty-launcher-6578-thread-1) [    ] o.a.s.s.SolrDispatchFilter \__ \/ _ \ | '_|  Install dir: null
   [junit4]   2> 1840558 INFO  (jetty-launcher-6578-thread-3) [    ] o.a.s.s.SolrDispatchFilter |___/\___/_|_|    Start time: 2019-05-04T11:30:10.969Z
   [junit4]   2> 1840558 INFO  (jetty-launcher-6578-thread-1) [    ] o.a.s.s.SolrDispatchFilter |___/\___/_|_|    Start time: 2019-05-04T11:30:10.969Z
   [junit4]   2> 1840564 INFO  (zkConnectionManagerCallback-6580-thread-1) [    ] o.a.s.c.c.ConnectionManager zkClient has connected
   [junit4]   2> 1840564 INFO  (jetty-launcher-6578-thread-2) [    ] o.a.s.s.SolrDispatchFilter solr.xml found in ZooKeeper. Loading...
   [junit4]   2> 1840567 INFO  (jetty-launcher-6578-thread-2) [    ] o.a.s.c.SolrXmlConfig Configuration parameter autoReplicaFailoverWorkLoopDelay is ignored
   [junit4]   2> 1840567 INFO  (jetty-launcher-6578-thread-2) [    ] o.a.s.c.SolrXmlConfig Configuration parameter autoReplicaFailoverBadNodeExpiration is ignored
   [junit4]   2> 1840568 INFO  (zkConnectionManagerCallback-6582-thread-1) [    ] o.a.s.c.c.ConnectionManager zkClient has connected
   [junit4]   2> 1840568 INFO  (jetty-launcher-6578-thread-3) [    ] o.a.s.s.SolrDispatchFilter solr.xml found in ZooKeeper. Loading...
   [junit4]   2> 1840569 INFO  (jetty-launcher-6578-thread-2) [    ] o.a.s.c.SolrXmlConfig MBean server found: com.sun.jmx.mbeanserver.JmxMBeanServer@384a7fbf, but no JMX reporters were configured - adding default JMX reporter.
   [junit4]   2> 1840570 INFO  (jetty-launcher-6578-thread-3) [    ] o.a.s.c.SolrXmlConfig Configuration parameter autoReplicaFailoverWorkLoopDelay is ignored
   [junit4]   2> 1840570 INFO  (jetty-launcher-6578-thread-3) [    ] o.a.s.c.SolrXmlConfig Configuration parameter autoReplicaFailoverBadNodeExpiration is ignored
   [junit4]   2> 1840571 INFO  (jetty-launcher-6578-thread-3) [    ] o.a.s.c.SolrXmlConfig MBean server found: com.sun.jmx.mbeanserver.JmxMBeanServer@384a7fbf, but no JMX reporters were configured - adding default JMX reporter.
   [junit4]   2> 1840572 INFO  (zkConnectionManagerCallback-6584-thread-1) [    ] o.a.s.c.c.ConnectionManager zkClient has connected
   [junit4]   2> 1840572 INFO  (jetty-launcher-6578-thread-1) [    ] o.a.s.s.SolrDispatchFilter solr.xml found in ZooKeeper. Loading...
   [junit4]   2> 1840573 WARN  (NIOServerCxn.Factory:0.0.0.0/0.0.0.0:0) [    ] o.a.z.s.NIOServerCnxn Unable to read additional data from client sessionid 0x10926de596a0003, likely client has closed socket
   [junit4]   2> 1840573 WARN  (NIOServerCxn.Factory:0.0.0.0/0.0.0.0:0) [    ] o.a.z.s.NIOServerCnxn Unable to read additional data from client sessionid 0x10926de596a0004, likely client has closed socket
   [junit4]   2> 1840576 INFO  (jetty-launcher-6578-thread-1) [    ] o.a.s.c.SolrXmlConfig Configuration parameter autoReplicaFailoverWorkLoopDelay is ignored
   [junit4]   2> 1840576 INFO  (jetty-launcher-6578-thread-1) [    ] o.a.s.c.SolrXmlConfig Configuration parameter autoReplicaFailoverBadNodeExpiration is ignored
   [junit4]   2> 1840577 INFO  (jetty-launcher-6578-thread-1) [    ] o.a.s.c.SolrXmlConfig MBean server found: com.sun.jmx.mbeanserver.JmxMBeanServer@384a7fbf, but no JMX reporters were configured - adding default JMX reporter.
   [junit4]   2> 1840646 INFO  (jetty-launcher-6578-thread-3) [    ] o.a.s.h.c.HttpShardHandlerFactory Host whitelist initialized: WhitelistHostChecker [whitelistHosts=null, whitelistHostCheckingEnabled=true]
   [junit4]   2> 1840646 WARN  (jetty-launcher-6578-thread-3) [    ] o.a.s.c.s.i.Http2SolrClient Create Http2SolrClient with HTTP/1.1 transport since Java 8 or lower versions does not support SSL + HTTP/2
   [junit4]   2> 1840670 WARN  (jetty-launcher-6578-thread-3) [    ] o.e.j.u.s.S.config No Client EndPointIdentificationAlgorithm configured for SslContextFactory@1f06c60c[provider=null,keyStore=null,trustStore=null]
   [junit4]   2> 1840673 INFO  (jetty-launcher-6578-thread-2) [    ] o.a.s.h.c.HttpShardHandlerFactory Host whitelist initialized: WhitelistHostChecker [whitelistHosts=null, whitelistHostCheckingEnabled=true]
   [junit4]   2> 1840673 WARN  (jetty-launcher-6578-thread-2) [    ] o.a.s.c.s.i.Http2SolrClient Create Http2SolrClient with HTTP/1.1 transport since Java 8 or lower versions does not support SSL + HTTP/2
   [junit4]   2> 1840675 INFO  (jetty-launcher-6578-thread-1) [    ] o.a.s.h.c.HttpShardHandlerFactory Host whitelist initialized: WhitelistHostChecker [whitelistHosts=null, whitelistHostCheckingEnabled=true]
   [junit4]   2> 1840676 WARN  (jetty-launcher-6578-thread-1) [    ] o.a.s.c.s.i.Http2SolrClient Create Http2SolrClient with HTTP/1.1 transport since Java 8 or lower versions does not support SSL + HTTP/2
   [junit4]   2> 1840676 WARN  (jetty-launcher-6578-thread-2) [    ] o.e.j.u.s.S.config No Client EndPointIdentificationAlgorithm configured for SslContextFactory@2bc2bc1f[provider=null,keyStore=null,trustStore=null]
   [junit4]   2> 1840676 WARN  (jetty-launcher-6578-thread-1) [    ] o.e.j.u.s.S.config No Client EndPointIdentificationAlgorithm configured for SslContextFactory@7066115f[provider=null,keyStore=null,trustStore=null]
   [junit4]   2> 1840677 WARN  (jetty-launcher-6578-thread-3) [    ] o.a.s.c.s.i.Http2SolrClient Create Http2SolrClient with HTTP/1.1 transport since Java 8 or lower versions does not support SSL + HTTP/2
   [junit4]   2> 1840678 WARN  (jetty-launcher-6578-thread-1) [    ] o.a.s.c.s.i.Http2SolrClient Create Http2SolrClient with HTTP/1.1 transport since Java 8 or lower versions does not support SSL + HTTP/2
   [junit4]   2> 1840679 WARN  (jetty-launcher-6578-thread-1) [    ] o.e.j.u.s.S.config No Client EndPointIdentificationAlgorithm configured for SslContextFactory@26f9eedf[provider=null,keyStore=null,trustStore=null]
   [junit4]   2> 1840679 WARN  (jetty-launcher-6578-thread-2) [    ] o.a.s.c.s.i.Http2SolrClient Create Http2SolrClient with HTTP/1.1 transport since Java 8 or lower versions does not support SSL + HTTP/2
   [junit4]   2> 1840679 WARN  (jetty-launcher-6578-thread-3) [    ] o.e.j.u.s.S.config No Client EndPointIdentificationAlgorithm configured for SslContextFactory@6eb10d06[provider=null,keyStore=null,trustStore=null]
   [junit4]   2> 1840680 INFO  (jetty-launcher-6578-thread-3) [    ] o.a.s.c.ZkContainer Zookeeper client=127.0.0.1:40170/solr
   [junit4]   2> 1840680 INFO  (jetty-launcher-6578-thread-1) [    ] o.a.s.c.ZkContainer Zookeeper client=127.0.0.1:40170/solr
   [junit4]   2> 1840682 WARN  (jetty-launcher-6578-thread-2) [    ] o.e.j.u.s.S.config No Client EndPointIdentificationAlgorithm configured for SslContextFactory@23a8a5f2[provider=null,keyStore=null,trustStore=null]
   [junit4]   2> 1840683 INFO  (jetty-launcher-6578-thread-2) [    ] o.a.s.c.ZkContainer Zookeeper client=127.0.0.1:40170/solr
   [junit4]   2> 1840684 INFO  (zkConnectionManagerCallback-6600-thread-1) [    ] o.a.s.c.c.ConnectionManager zkClient has connected
   [junit4]   2> 1840684 INFO  (zkConnectionManagerCallback-6605-thread-1) [    ] o.a.s.c.c.ConnectionManager zkClient has connected
   [junit4]   2> 1840684 INFO  (zkConnectionManagerCallback-6602-thread-1) [    ] o.a.s.c.c.ConnectionManager zkClient has connected
   [junit4]   2> 1840686 INFO  (zkConnectionManagerCallback-6607-thread-1) [    ] o.a.s.c.c.ConnectionManager zkClient has connected
   [junit4]   2> 1840686 INFO  (zkConnectionManagerCallback-6609-thread-1) [    ] o.a.s.c.c.ConnectionManager zkClient has connected
   [junit4]   2> 1840689 INFO  (zkConnectionManagerCallback-6611-thread-1) [    ] o.a.s.c.c.ConnectionManager zkClient has connected
   [junit4]   2> 1840782 INFO  (jetty-launcher-6578-thread-1) [n:127.0.0.1:38195_solr    ] o.a.s.c.OverseerElectionContext I am going to be the leader 127.0.0.1:38195_solr
   [junit4]   2> 1840783 INFO  (jetty-launcher-6578-thread-1) [n:127.0.0.1:38195_solr    ] o.a.s.c.Overseer Overseer (id=74633605253038089-127.0.0.1:38195_solr-n_0000000000) starting
   [junit4]   2> 1840804 INFO  (zkConnectionManagerCallback-6622-thread-1) [    ] o.a.s.c.c.ConnectionManager zkClient has connected
   [junit4]   2> 1840807 INFO  (jetty-launcher-6578-thread-1) [n:127.0.0.1:38195_solr    ] o.a.s.c.s.i.ZkClientClusterStateProvider Cluster at 127.0.0.1:40170/solr ready
   [junit4]   2> 1840808 INFO  (OverseerStateUpdate-74633605253038089-127.0.0.1:38195_solr-n_0000000000) [n:127.0.0.1:38195_solr    ] o.a.s.c.Overseer Starting to work on the main queue : 127.0.0.1:38195_solr
   [junit4]   2> 1840808 INFO  (jetty-launcher-6578-thread-1) [n:127.0.0.1:38195_solr    ] o.a.s.c.ZkController Register node as live in ZooKeeper:/live_nodes/127.0.0.1:38195_solr
   [junit4]   2> 1840813 INFO  (OverseerStateUpdate-74633605253038089-127.0.0.1:38195_solr-n_0000000000) [n:127.0.0.1:38195_solr    ] o.a.s.c.c.ZkStateReader Updated live nodes from ZooKeeper... (0) -> (1)
   [junit4]   2> 1840824 INFO  (zkCallback-6621-thread-1) [    ] o.a.s.c.c.ZkStateReader Updated live nodes from ZooKeeper... (0) -> (1)
   [junit4]   2> 1840828 INFO  (jetty-launcher-6578-thread-2) [n:127.0.0.1:42107_solr    ] o.a.s.c.c.ZkStateReader Updated live nodes from ZooKeeper... (0) -> (1)
   [junit4]   2> 1840831 INFO  (jetty-launcher-6578-thread-3) [n:127.0.0.1:40482_solr    ] o.a.s.c.c.ZkStateReader Updated live nodes from ZooKeeper... (0) -> (1)
   [junit4]   2> 1840831 INFO  (jetty-launcher-6578-thread-2) [n:127.0.0.1:42107_solr    ] o.a.s.c.ZkController Publish node=127.0.0.1:42107_solr as DOWN
   [junit4]   2> 1840831 INFO  (jetty-launcher-6578-thread-2) [n:127.0.0.1:42107_solr    ] o.a.s.c.TransientSolrCoreCacheDefault Allocating transient cache for 4 transient cores
   [junit4]   2> 1840831 INFO  (jetty-launcher-6578-thread-2) [n:127.0.0.1:42107_solr    ] o.a.s.c.ZkController Register node as live in ZooKeeper:/live_nodes/127.0.0.1:42107_solr
   [junit4]   2> 1840841 INFO  (jetty-launcher-6578-thread-3) [n:127.0.0.1:40482_solr    ] o.a.s.c.ZkController Publish node=127.0.0.1:40482_solr as DOWN
   [junit4]   2> 1840841 INFO  (jetty-launcher-6578-thread-3) [n:127.0.0.1:40482_solr    ] o.a.s.c.TransientSolrCoreCacheDefault Allocating transient cache for 4 transient cores
   [junit4]   2> 1840841 INFO  (jetty-launcher-6578-thread-3) [n:127.0.0.1:40482_solr    ] o.a.s.c.ZkController Register node as live in ZooKeeper:/live_nodes/127.0.0.1:40482_solr
   [junit4]   2> 1840862 INFO  (zkCallback-6610-thread-1) [    ] o.a.s.c.c.ZkStateReader Updated live nodes from ZooKeeper... (1) -> (3)
   [junit4]   2> 1840868 INFO  (zkCallback-6621-thread-1) [    ] o.a.s.c.c.ZkStateReader Updated live nodes from ZooKeeper... (1) -> (3)
   [junit4]   2> 1840868 INFO  (zkCallback-6606-thread-2) [    ] o.a.s.c.c.ZkStateReader Updated live nodes from ZooKeeper... (1) -> (3)
   [junit4]   2> 1840868 INFO  (zkCallback-6608-thread-1) [    ] o.a.s.c.c.ZkStateReader Updated live nodes from ZooKeeper... (1) -> (3)
   [junit4]   2> 1840874 INFO  (jetty-launcher-6578-thread-1) [n:127.0.0.1:38195_solr    ] o.a.s.h.a.MetricsHistoryHandler No .system collection, keeping metrics history in memory.
   [junit4]   2> 1840890 INFO  (jetty-launcher-6578-thread-1) [n:127.0.0.1:38195_solr    ] o.a.s.m.r.SolrJmxReporter JMX monitoring for 'solr.node' (registry 'solr.node') enabled at server: com.sun.jmx.mbeanserver.JmxMBeanServer@384a7fbf
   [junit4]   2> 1840896 INFO  (zkConnectionManagerCallback-6633-thread-1) [    ] o.a.s.c.c.ConnectionManager zkClient has connected
   [junit4]   2> 1840896 INFO  (zkConnectionManagerCallback-6628-thread-1) [    ] o.a.s.c.c.ConnectionManager zkClient has connected
   [junit4]   2> 1840897 INFO  (jetty-launcher-6578-thread-3) [n:127.0.0.1:40482_solr    ] o.a.s.c.c.ZkStateReader Updated live nodes from ZooKeeper... (0) -> (3)
   [junit4]   2> 1840897 INFO  (jetty-launcher-6578-thread-2) [n:127.0.0.1:42107_solr    ] o.a.s.c.c.ZkStateReader Updated live nodes from ZooKeeper... (0) -> (3)
   [junit4]   2> 1840897 INFO  (jetty-launcher-6578-thread-3) [n:127.0.0.1:40482_solr    ] o.a.s.c.s.i.ZkClientClusterStateProvider Cluster at 127.0.0.1:40170/solr ready
   [junit4]   2> 1840898 INFO  (jetty-launcher-6578-thread-2) [n:127.0.0.1:42107_solr    ] o.a.s.c.s.i.ZkClientClusterStateProvider Cluster at 127.0.0.1:40170/solr ready
   [junit4]   2> 1840898 INFO  (jetty-launcher-6578-thread-3) [n:127.0.0.1:40482_solr    ] o.a.s.h.a.MetricsHistoryHandler No .system collection, keeping metrics history in memory.
   [junit4]   2> 1840904 INFO  (jetty-launcher-6578-thread-2) [n:127.0.0.1:42107_solr    ] o.a.s.h.a.MetricsHistoryHandler No .system collection, keeping metrics history in memory.
   [junit4]   2> 1840928 INFO  (jetty-launcher-6578-thread-1) [n:127.0.0.1:38195_solr    ] o.a.s.m.r.SolrJmxReporter JMX monitoring for 'solr.jvm' (registry 'solr.jvm') enabled at server: com.sun.jmx.mbeanserver.JmxMBeanServer@384a7fbf
   [junit4]   2> 1840928 INFO  (jetty-launcher-6578-thread-1) [n:127.0.0.1:38195_solr    ] o.a.s.m.r.SolrJmxReporter JMX monitoring for 'solr.jetty' (registry 'solr.jetty') enabled at server: com.sun.jmx.mbeanserver.JmxMBeanServer@384a7fbf
   [junit4]   2> 1840929 INFO  (jetty-launcher-6578-thread-1) [n:127.0.0.1:38195_solr    ] o.a.s.c.CorePropertiesLocator Found 0 core definitions underneath /home/jenkins/jenkins-slave/workspace/Lucene-Solr-NightlyTests-8.x/checkout/solr/build/solr-core/test/J2/temp/solr.cloud.autoscaling.HdfsAutoAddReplicasIntegrationTest_56CD4FDDCA19775C-001/tempDir-002/node1/.
   [junit4]   2> 1840934 INFO  (jetty-launcher-6578-thread-3) [n:127.0.0.1:40482_solr    ] o.a.s.m.r.SolrJmxReporter JMX monitoring for 'solr.node' (registry 'solr.node') enabled at server: com.sun.jmx.mbeanserver.JmxMBeanServer@384a7fbf
   [junit4]   2> 1840938 INFO  (jetty-launcher-6578-thread-2) [n:127.0.0.1:42107_solr    ] o.a.s.m.r.SolrJmxReporter JMX monitoring for 'solr.node' (registry 'solr.node') enabled at server: com.sun.jmx.mbeanserver.JmxMBeanServer@384a7fbf
   [junit4]   2> 1840954 INFO  (jetty-launcher-6578-thread-3) [n:127.0.0.1:40482_solr    ] o.a.s.m.r.SolrJmxReporter JMX monitoring for 'solr.jvm' (registry 'solr.jvm') enabled at server: com.sun.jmx.mbeanserver.JmxMBeanServer@384a7fbf
   [junit4]   2> 1840955 INFO  (jetty-launcher-6578-thread-2) [n:127.0.0.1:42107_solr    ] o.a.s.m.r.SolrJmxReporter JMX monitoring for 'solr.jvm' (registry 'solr.jvm') enabled at server: com.sun.jmx.mbeanserver.JmxMBeanServer@384a7fbf
   [junit4]   2> 1840956 INFO  (jetty-launcher-6578-thread-2) [n:127.0.0.1:42107_solr    ] o.a.s.m.r.SolrJmxReporter JMX monitoring for 'solr.jetty' (registry 'solr.jetty') enabled at server: com.sun.jmx.mbeanserver.JmxMBeanServer@384a7fbf
   [junit4]   2> 1840956 INFO  (jetty-launcher-6578-thread-3) [n:127.0.0.1:40482_solr    ] o.a.s.m.r.SolrJmxReporter JMX monitoring for 'solr.jetty' (registry 'solr.jetty') enabled at server: com.sun.jmx.mbeanserver.JmxMBeanServer@384a7fbf
   [junit4]   2> 1840956 WARN  (jetty-launcher-6578-thread-2) [n:127.0.0.1:42107_solr    ] o.a.s.m.r.j.JmxMetricsReporter Unable to register gauge
   [junit4]   2>           => javax.management.InstanceNotFoundException: solr:dom1=node,category=CONTAINER,scope=cores,name=loaded
   [junit4]   2> 	at com.sun.jmx.interceptor.DefaultMBeanServerInterceptor.getMBean(DefaultMBeanServerInterceptor.java:1095)
   [junit4]   2> javax.management.InstanceNotFoundException: solr:dom1=node,category=CONTAINER,scope=cores,name=loaded
   [junit4]   2> 	at com.sun.jmx.interceptor.DefaultMBeanServerInterceptor.getMBean(DefaultMBeanServerInterceptor.java:1095) ~[?:1.8.0_191]
   [junit4]   2> 	at com.sun.jmx.interceptor.DefaultMBeanServerInterceptor.exclusiveUnregisterMBean(DefaultMBeanServerInterceptor.java:427) ~[?:1.8.0_191]
   [junit4]   2> 	at com.sun.jmx.interceptor.DefaultMBeanServerInterceptor.unregisterMBean(DefaultMBeanServerInterceptor.java:415) ~[?:1.8.0_191]
   [junit4]   2> 	at com.sun.jmx.mbeanserver.JmxMBeanServer.unregisterMBean(JmxMBeanServer.java:546) ~[?:1.8.0_191]
   [junit4]   2> 	at org.apache.solr.metrics.reporters.jmx.JmxMetricsReporter$JmxListener.registerMBean(JmxMetricsReporter.java:531) ~[java/:?]
   [junit4]   2> 	at org.apache.solr.metrics.reporters.jmx.JmxMetricsReporter$JmxListener.onGaugeAdded(JmxMetricsReporter.java:569) ~[java/:?]
   [junit4]   2> 	at com.codahale.metrics.MetricRegistry.notifyListenerOfAddedMetric(MetricRegistry.java:468) ~[metrics-core-4.0.5.jar:4.0.5]
   [junit4]   2> 	at com.codahale.metrics.MetricRegistry.onMetricAdded(MetricRegistry.java:462) ~[metrics-core-4.0.5.jar:4.0.5]
   [junit4]   2> 	at com.codahale.metrics.MetricRegistry.register(MetricRegistry.java:95) ~[metrics-core-4.0.5.jar:4.0.5]
   [junit4]   2> 	at org.apache.solr.metrics.SolrMetricManager.registerMetric(SolrMetricManager.java:656) ~[java/:?]
   [junit4]   2> 	at org.apache.solr.metrics.SolrMetricManager.registerGauge(SolrMetricManager.java:691) ~[java/:?]
   [junit4]   2> 	at org.apache.solr.core.CoreContainer.load(CoreContainer.java:666) ~[java/:?]
   [junit4]   2> 	at org.apache.solr.servlet.SolrDispatchFilter.createCoreContainer(SolrDispatchFilter.java:255) ~[java/:?]
   [junit4]   2> 	at org.apache.solr.servlet.SolrDispatchFilter.init(SolrDispatchFilter.java:175) ~[java/:?]
   [junit4]   2> 	at org.eclipse.jetty.servlet.FilterHolder.initialize(FilterHolder.java:136) ~[jetty-servlet-9.4.14.v20181114.jar:9.4.14.v20181114]
   [junit4]   2> 	at org.eclipse.jetty.servlet.ServletHandler.lambda$initialize$0(ServletHandler.java:750) ~[jetty-servlet-9.4.14.v20181114.jar:9.4.14.v20181114]
   [junit4]   2> 	at java.util.Spliterators$ArraySpliterator.forEachRemaining(Spliterators.java:948) ~[?:1.8.0_191]
   [junit4]   2> 	at java.util.stream.Streams$ConcatSpliterator.forEachRemaining(Streams.java:742) ~[?:1.8.0_191]
   [junit4]   2> 	at java.util.stream.Streams$ConcatSpliterator.forEachRemaining(Streams.java:742) ~[?:1.8.0_191]
   [junit4]   2> 	at java.util.stream.ReferencePipeline$Head.forEach(ReferencePipeline.java:580) ~[?:1.8.0_191]
   [junit4]   2> 	at org.eclipse.jetty.servlet.ServletHandler.initialize(ServletHandler.java:744) ~[jetty-servlet-9.4.14.v20181114.jar:9.4.14.v20181114]
   [junit4]   2> 	at org.eclipse.jetty.servlet.ServletHandler.updateMappings(ServletHandler.java:1449) ~[jetty-servlet-9.4.14.v20181114.jar:9.4.14.v20181114]
   [junit4]   2> 	at org.eclipse.jetty.servlet.ServletHandler.setFilterMappings(ServletHandler.java:1513) ~[jetty-servlet-9.4.14.v20181114.jar:9.4.14.v20181114]
   [junit4]   2> 	at org.eclipse.jetty.servlet.ServletHandler.addFilterMapping(ServletHandler.java:1158) ~[jetty-servlet-9.4.14.v20181114.jar:9.4.14.v20181114]
   [junit4]   2> 	at org.eclipse.jetty.servlet.ServletHandler.addFilterWithMapping(ServletHandler.java:995) ~[jetty-servlet-9.4.14.v20181114.jar:9.4.14.v20181114]
   [junit4]   2> 	at org.eclipse.jetty.servlet.ServletContextHandler.addFilter(ServletContextHandler.java:467) ~[jetty-servlet-9.4.14.v20181114.jar:9.4.14.v20181114]
   [junit4]   2> 	at org.apache.solr.client.solrj.embedded.JettySolrRunner$1.lifeCycleStarted(JettySolrRunner.java:384) ~[java/:?]
   [junit4]   2> 	at org.eclipse.jetty.util.component.AbstractLifeCycle.setStarted(AbstractLifeCycle.java:179) ~[jetty-util-9.4.14.v20181114.jar:9.4.14.v20181114]
   [junit4]   2> 	at org.eclipse.jetty.util.component.AbstractLifeCycle.start(AbstractLifeCycle.java:69) ~[jetty-util-9.4.14.v20181114.jar:9.4.14.v20181114]
   [junit4]   2> 	at org.apache.solr.client.solrj.embedded.JettySolrRunner.retryOnPortBindFailure(JettySolrRunner.java:558) ~[java/:?]
   [junit4]   2> 	at org.apache.solr.client.solrj.embedded.JettySolrRunner.start(JettySolrRunner.java:497) ~[java/:?]
   [junit4]   2> 	at org.apache.solr.client.solrj.embedded.JettySolrRunner.start(JettySolrRunner.java:465) ~[java/:?]
   [junit4]   2> 	at org.apache.solr.cloud.MiniSolrCloudCluster.startJettySolrRunner(MiniSolrCloudCluster.java:467) ~[java/:?]
   [junit4]   2> 	at org.apache.solr.cloud.MiniSolrCloudCluster.lambda$new$0(MiniSolrCloudCluster.java:300) ~[java/:?]
   [junit4]   2> 	at java.util.concurrent.FutureTask.run(FutureTask.java:266) ~[?:1.8.0_191]
   [junit4]   2> 	at org.apache.solr.common.util.ExecutorUtil$MDCAwareThreadPoolExecutor.lambda$execute$0(ExecutorUtil.java:209) ~[java/:?]
   [junit4]   2> 	at java.util.concurrent.ThreadPoolExecutor.runWorker(ThreadPoolExecutor.java:1149) ~[?:1.8.0_191]
   [junit4]   2> 	at java.util.concurrent.ThreadPoolExecutor$Worker.run(ThreadPoolExecutor.java:624) ~[?:1.8.0_191]
   [junit4]   2> 	at java.lang.Thread.run(Thread.java:748) [?:1.8.0_191]
   [junit4]   2> 1840960 INFO  (jetty-launcher-6578-thread-3) [n:127.0.0.1:40482_solr    ] o.a.s.c.CorePropertiesLocator Found 0 core definitions underneath /home/jenkins/jenkins-slave/workspace/Lucene-Solr-NightlyTests-8.x/checkout/solr/build/solr-core/test/J2/temp/solr.cloud.autoscaling.HdfsAutoAddReplicasIntegrationTest_56CD4FDDCA19775C-001/tempDir-002/node3/.
   [junit4]   2> 1840960 INFO  (jetty-launcher-6578-thread-2) [n:127.0.0.1:42107_solr    ] o.a.s.c.CorePropertiesLocator Found 0 core definitions underneath /home/jenkins/jenkins-slave/workspace/Lucene-Solr-NightlyTests-8.x/checkout/solr/build/solr-core/test/J2/temp/solr.cloud.autoscaling.HdfsAutoAddReplicasIntegrationTest_56CD4FDDCA19775C-001/tempDir-002/node2/.
   [junit4]   2> 1841033 INFO  (zkConnectionManagerCallback-6640-thread-1) [    ] o.a.s.c.c.ConnectionManager zkClient has connected
   [junit4]   2> 1841034 INFO  (TEST-HdfsAutoAddReplicasIntegrationTest.testSimple-seed#[56CD4FDDCA19775C]) [    ] o.a.s.c.c.ZkStateReader Updated live nodes from ZooKeeper... (0) -> (3)
   [junit4]   2> 1841036 INFO  (TEST-HdfsAutoAddReplicasIntegrationTest.testSimple-seed#[56CD4FDDCA19775C]) [    ] o.a.s.c.s.i.ZkClientClusterStateProvider Cluster at 127.0.0.1:40170/solr ready
   [junit4]   2> 1841055 INFO  (qtp146213463-21216) [n:127.0.0.1:42107_solr    ] o.a.s.s.HttpSolrCall [admin] webapp=null path=/cluster params={wt=javabin&version=2} status=0 QTime=3
   [junit4]   2> 1841067 INFO  (qtp1077193624-21228) [n:127.0.0.1:40482_solr    ] o.a.s.h.a.CollectionsHandler Invoked Collection Action :create with params collection.configName=conf&maxShardsPerNode=2&autoAddReplicas=true&name=testSimple1&nrtReplicas=2&action=CREATE&numShards=2&createNodeSet=127.0.0.1:38195_solr,127.0.0.1:42107_solr&wt=javabin&version=2 and sendToOCPQueue=true
   [junit4]   2> 1841072 INFO  (OverseerThreadFactory-4727-thread-1-processing-n:127.0.0.1:38195_solr) [n:127.0.0.1:38195_solr    ] o.a.s.c.a.c.CreateCollectionCmd Create collection testSimple1
   [junit4]   2> 1841180 INFO  (OverseerStateUpdate-74633605253038089-127.0.0.1:38195_solr-n_0000000000) [n:127.0.0.1:38195_solr    ] o.a.s.c.o.SliceMutator createReplica() {
   [junit4]   2>   "operation":"ADDREPLICA",
   [junit4]   2>   "collection":"testSimple1",
   [junit4]   2>   "shard":"shard1",
   [junit4]   2>   "core":"testSimple1_shard1_replica_n1",
   [junit4]   2>   "state":"down",
   [junit4]   2>   "base_url":"https://127.0.0.1:42107/solr",
   [junit4]   2>   "type":"NRT",
   [junit4]   2>   "waitForFinalState":"false"} 
   [junit4]   2> 1841181 INFO  (OverseerStateUpdate-74633605253038089-127.0.0.1:38195_solr-n_0000000000) [n:127.0.0.1:38195_solr    ] o.a.s.c.o.SliceMutator createReplica() {
   [junit4]   2>   "operation":"ADDREPLICA",
   [junit4]   2>   "collection":"testSimple1",
   [junit4]   2>   "shard":"shard1",
   [junit4]   2>   "core":"testSimple1_shard1_replica_n2",
   [junit4]   2>   "state":"down",
   [junit4]   2>   "base_url":"https://127.0.0.1:38195/solr",
   [junit4]   2>   "type":"NRT",
   [junit4]   2>   "waitForFinalState":"false"} 
   [junit4]   2> 1841183 INFO  (OverseerStateUpdate-74633605253038089-127.0.0.1:38195_solr-n_0000000000) [n:127.0.0.1:38195_solr    ] o.a.s.c.o.SliceMutator createReplica() {
   [junit4]   2>   "operation":"ADDREPLICA",
   [junit4]   2>   "collection":"testSimple1",
   [junit4]   2>   "shard":"shard2",
   [junit4]   2>   "core":"testSimple1_shard2_replica_n4",
   [junit4]   2>   "state":"down",
   [junit4]   2>   "base_url"

[...truncated too long message...]

ivy-fail:

ivy-configure:
[ivy:configure] :: loading settings :: file = /home/jenkins/jenkins-slave/workspace/Lucene-Solr-NightlyTests-8.x/checkout/lucene/top-level-ivy-settings.xml

resolve:

ivy-availability-check:
[loadresource] Do not set property disallowed.ivy.jars.list as its length is 0.

-ivy-fail-disallowed-ivy-version:

ivy-fail:

ivy-configure:
[ivy:configure] :: loading settings :: file = /home/jenkins/jenkins-slave/workspace/Lucene-Solr-NightlyTests-8.x/checkout/lucene/top-level-ivy-settings.xml

resolve:

ivy-availability-check:
[loadresource] Do not set property disallowed.ivy.jars.list as its length is 0.

-ivy-fail-disallowed-ivy-version:

ivy-fail:

ivy-fail:

ivy-configure:
[ivy:configure] :: loading settings :: file = /home/jenkins/jenkins-slave/workspace/Lucene-Solr-NightlyTests-8.x/checkout/lucene/top-level-ivy-settings.xml

resolve:

ivy-availability-check:
[loadresource] Do not set property disallowed.ivy.jars.list as its length is 0.

-ivy-fail-disallowed-ivy-version:

ivy-fail:

ivy-configure:
[ivy:configure] :: loading settings :: file = /home/jenkins/jenkins-slave/workspace/Lucene-Solr-NightlyTests-8.x/checkout/lucene/top-level-ivy-settings.xml

resolve:

ivy-availability-check:
[loadresource] Do not set property disallowed.ivy.jars.list as its length is 0.

-ivy-fail-disallowed-ivy-version:

ivy-fail:

ivy-fail:

ivy-configure:
[ivy:configure] :: loading settings :: file = /home/jenkins/jenkins-slave/workspace/Lucene-Solr-NightlyTests-8.x/checkout/lucene/top-level-ivy-settings.xml

resolve:

ivy-availability-check:
[loadresource] Do not set property disallowed.ivy.jars.list as its length is 0.

-ivy-fail-disallowed-ivy-version:

ivy-fail:

ivy-fail:

ivy-configure:
[ivy:configure] :: loading settings :: file = /home/jenkins/jenkins-slave/workspace/Lucene-Solr-NightlyTests-8.x/checkout/lucene/top-level-ivy-settings.xml

resolve:

ivy-availability-check:
[loadresource] Do not set property disallowed.ivy.jars.list as its length is 0.

-ivy-fail-disallowed-ivy-version:

ivy-fail:

ivy-fail:

ivy-configure:
[ivy:configure] :: loading settings :: file = /home/jenkins/jenkins-slave/workspace/Lucene-Solr-NightlyTests-8.x/checkout/lucene/top-level-ivy-settings.xml

resolve:

ivy-availability-check:
[loadresource] Do not set property disallowed.ivy.jars.list as its length is 0.

-ivy-fail-disallowed-ivy-version:

ivy-fail:

ivy-fail:

ivy-configure:
[ivy:configure] :: loading settings :: file = /home/jenkins/jenkins-slave/workspace/Lucene-Solr-NightlyTests-8.x/checkout/lucene/top-level-ivy-settings.xml

resolve:

ivy-availability-check:
[loadresource] Do not set property disallowed.ivy.jars.list as its length is 0.

-ivy-fail-disallowed-ivy-version:

ivy-fail:

ivy-fail:

ivy-configure:
[ivy:configure] :: loading settings :: file = /home/jenkins/jenkins-slave/workspace/Lucene-Solr-NightlyTests-8.x/checkout/lucene/top-level-ivy-settings.xml

resolve:

ivy-availability-check:
[loadresource] Do not set property disallowed.ivy.jars.list as its length is 0.

-ivy-fail-disallowed-ivy-version:

ivy-fail:

ivy-fail:

ivy-configure:
[ivy:configure] :: loading settings :: file = /home/jenkins/jenkins-slave/workspace/Lucene-Solr-NightlyTests-8.x/checkout/lucene/top-level-ivy-settings.xml

resolve:

ivy-availability-check:
[loadresource] Do not set property disallowed.ivy.jars.list as its length is 0.

-ivy-fail-disallowed-ivy-version:

ivy-fail:

ivy-fail:

ivy-configure:
[ivy:configure] :: loading settings :: file = /home/jenkins/jenkins-slave/workspace/Lucene-Solr-NightlyTests-8.x/checkout/lucene/top-level-ivy-settings.xml

resolve:

ivy-availability-check:
[loadresource] Do not set property disallowed.ivy.jars.list as its length is 0.

-ivy-fail-disallowed-ivy-version:

ivy-fail:

ivy-fail:

ivy-configure:
[ivy:configure] :: loading settings :: file = /home/jenkins/jenkins-slave/workspace/Lucene-Solr-NightlyTests-8.x/checkout/lucene/top-level-ivy-settings.xml

resolve:

ivy-availability-check:
[loadresource] Do not set property disallowed.ivy.jars.list as its length is 0.

-ivy-fail-disallowed-ivy-version:

ivy-fail:

ivy-fail:

ivy-configure:
[ivy:configure] :: loading settings :: file = /home/jenkins/jenkins-slave/workspace/Lucene-Solr-NightlyTests-8.x/checkout/lucene/top-level-ivy-settings.xml

resolve:

ivy-availability-check:
[loadresource] Do not set property disallowed.ivy.jars.list as its length is 0.

-ivy-fail-disallowed-ivy-version:

ivy-fail:

ivy-fail:

ivy-configure:
[ivy:configure] :: loading settings :: file = /home/jenkins/jenkins-slave/workspace/Lucene-Solr-NightlyTests-8.x/checkout/lucene/top-level-ivy-settings.xml

resolve:

jar-checksums:
    [mkdir] Created dir: /home/jenkins/jenkins-slave/workspace/Lucene-Solr-NightlyTests-8.x/checkout/solr/null899716151
     [copy] Copying 239 files to /home/jenkins/jenkins-slave/workspace/Lucene-Solr-NightlyTests-8.x/checkout/solr/null899716151
   [delete] Deleting directory /home/jenkins/jenkins-slave/workspace/Lucene-Solr-NightlyTests-8.x/checkout/solr/null899716151

check-working-copy:
[ivy:cachepath] :: resolving dependencies :: #;working@lucene2-us-west.apache.org
[ivy:cachepath] 	confs: [default]
[ivy:cachepath] 	found org.eclipse.jgit#org.eclipse.jgit;5.3.0.201903130848-r in public
[ivy:cachepath] 	found com.jcraft#jsch;0.1.54 in public
[ivy:cachepath] 	found com.jcraft#jzlib;1.1.1 in public
[ivy:cachepath] 	found com.googlecode.javaewah#JavaEWAH;1.1.6 in public
[ivy:cachepath] 	found org.slf4j#slf4j-api;1.7.2 in public
[ivy:cachepath] 	found org.bouncycastle#bcpg-jdk15on;1.60 in public
[ivy:cachepath] 	found org.bouncycastle#bcprov-jdk15on;1.60 in public
[ivy:cachepath] 	found org.bouncycastle#bcpkix-jdk15on;1.60 in public
[ivy:cachepath] 	found org.slf4j#slf4j-nop;1.7.2 in public
[ivy:cachepath] :: resolution report :: resolve 77ms :: artifacts dl 5ms
	---------------------------------------------------------------------
	|                  |            modules            ||   artifacts   |
	|       conf       | number| search|dwnlded|evicted|| number|dwnlded|
	---------------------------------------------------------------------
	|      default     |   9   |   0   |   0   |   0   ||   9   |   0   |
	---------------------------------------------------------------------
[wc-checker] Initializing working copy...
[wc-checker] Checking working copy status...

-jenkins-base:

BUILD SUCCESSFUL
Total time: 518 minutes 58 seconds
Archiving artifacts
java.lang.InterruptedException: no matches found within 10000
	at hudson.FilePath$ValidateAntFileMask.hasMatch(FilePath.java:2847)
	at hudson.FilePath$ValidateAntFileMask.invoke(FilePath.java:2726)
	at hudson.FilePath$ValidateAntFileMask.invoke(FilePath.java:2707)
	at hudson.FilePath$FileCallableWrapper.call(FilePath.java:3086)
Also:   hudson.remoting.Channel$CallSiteStackTrace: Remote call to lucene2
		at hudson.remoting.Channel.attachCallSiteStackTrace(Channel.java:1741)
		at hudson.remoting.UserRequest$ExceptionResponse.retrieve(UserRequest.java:357)
		at hudson.remoting.Channel.call(Channel.java:955)
		at hudson.FilePath.act(FilePath.java:1072)
		at hudson.FilePath.act(FilePath.java:1061)
		at hudson.FilePath.validateAntFileMask(FilePath.java:2705)
		at hudson.tasks.ArtifactArchiver.perform(ArtifactArchiver.java:243)
		at hudson.tasks.BuildStepCompatibilityLayer.perform(BuildStepCompatibilityLayer.java:81)
		at hudson.tasks.BuildStepMonitor$1.perform(BuildStepMonitor.java:20)
		at hudson.model.AbstractBuild$AbstractBuildExecution.perform(AbstractBuild.java:744)
		at hudson.model.AbstractBuild$AbstractBuildExecution.performAllBuildSteps(AbstractBuild.java:690)
		at hudson.model.Build$BuildExecution.post2(Build.java:186)
		at hudson.model.AbstractBuild$AbstractBuildExecution.post(AbstractBuild.java:635)
		at hudson.model.Run.execute(Run.java:1835)
		at hudson.model.FreeStyleBuild.run(FreeStyleBuild.java:43)
		at hudson.model.ResourceController.execute(ResourceController.java:97)
		at hudson.model.Executor.run(Executor.java:429)
Caused: hudson.FilePath$TunneledInterruptedException
	at hudson.FilePath$FileCallableWrapper.call(FilePath.java:3088)
	at hudson.remoting.UserRequest.perform(UserRequest.java:212)
	at hudson.remoting.UserRequest.perform(UserRequest.java:54)
	at hudson.remoting.Request$2.run(Request.java:369)
	at hudson.remoting.InterceptingExecutorService$1.call(InterceptingExecutorService.java:72)
	at java.util.concurrent.FutureTask.run(FutureTask.java:266)
	at java.util.concurrent.ThreadPoolExecutor.runWorker(ThreadPoolExecutor.java:1142)
	at java.util.concurrent.ThreadPoolExecutor$Worker.run(ThreadPoolExecutor.java:617)
	at java.lang.Thread.run(Thread.java:748)
Caused: java.lang.InterruptedException: java.lang.InterruptedException: no matches found within 10000
	at hudson.FilePath.act(FilePath.java:1074)
	at hudson.FilePath.act(FilePath.java:1061)
	at hudson.FilePath.validateAntFileMask(FilePath.java:2705)
	at hudson.tasks.ArtifactArchiver.perform(ArtifactArchiver.java:243)
	at hudson.tasks.BuildStepCompatibilityLayer.perform(BuildStepCompatibilityLayer.java:81)
	at hudson.tasks.BuildStepMonitor$1.perform(BuildStepMonitor.java:20)
	at hudson.model.AbstractBuild$AbstractBuildExecution.perform(AbstractBuild.java:744)
	at hudson.model.AbstractBuild$AbstractBuildExecution.performAllBuildSteps(AbstractBuild.java:690)
	at hudson.model.Build$BuildExecution.post2(Build.java:186)
	at hudson.model.AbstractBuild$AbstractBuildExecution.post(AbstractBuild.java:635)
	at hudson.model.Run.execute(Run.java:1835)
	at hudson.model.FreeStyleBuild.run(FreeStyleBuild.java:43)
	at hudson.model.ResourceController.execute(ResourceController.java:97)
	at hudson.model.Executor.run(Executor.java:429)
No artifacts found that match the file pattern "**/*.events,heapdumps/**,**/hs_err_pid*". Configuration error?
Recording test results
Build step 'Publish JUnit test result report' changed build result to UNSTABLE
Email was triggered for: Unstable (Test Failures)
Sending email for trigger: Unstable (Test Failures)

Mime
View raw message