lucene-dev mailing list archives

Site index · List index
Message view « Date » · « Thread »
Top « Date » · « Thread »
From Policeman Jenkins Server <jenk...@thetaphi.de>
Subject [JENKINS-EA] Lucene-Solr-8.x-Linux (64bit/jdk-13-ea+18) - Build # 500 - Still Failing!
Date Thu, 02 May 2019 12:31:58 GMT
Build: https://jenkins.thetaphi.de/job/Lucene-Solr-8.x-Linux/500/
Java: 64bit/jdk-13-ea+18 -XX:-UseCompressedOops -XX:+UseG1GC

3 tests failed.
FAILED:  org.apache.solr.update.TestInPlaceUpdatesDistrib.test

Error Message:
Thread pool didn't terminate within 15 secs

Stack Trace:
java.lang.AssertionError: Thread pool didn't terminate within 15 secs
	at __randomizedtesting.SeedInfo.seed([C1959AC1FC269610:49C1A51B52DAFBE8]:0)
	at org.junit.Assert.fail(Assert.java:88)
	at org.junit.Assert.assertTrue(Assert.java:41)
	at org.apache.solr.update.TestInPlaceUpdatesDistrib.reorderedDBQsResurrectionTest(TestInPlaceUpdatesDistrib.java:852)
	at org.apache.solr.update.TestInPlaceUpdatesDistrib.test(TestInPlaceUpdatesDistrib.java:179)
	at java.base/jdk.internal.reflect.NativeMethodAccessorImpl.invoke0(Native Method)
	at java.base/jdk.internal.reflect.NativeMethodAccessorImpl.invoke(NativeMethodAccessorImpl.java:62)
	at java.base/jdk.internal.reflect.DelegatingMethodAccessorImpl.invoke(DelegatingMethodAccessorImpl.java:43)
	at java.base/java.lang.reflect.Method.invoke(Method.java:567)
	at com.carrotsearch.randomizedtesting.RandomizedRunner.invoke(RandomizedRunner.java:1750)
	at com.carrotsearch.randomizedtesting.RandomizedRunner$8.evaluate(RandomizedRunner.java:938)
	at com.carrotsearch.randomizedtesting.RandomizedRunner$9.evaluate(RandomizedRunner.java:974)
	at com.carrotsearch.randomizedtesting.RandomizedRunner$10.evaluate(RandomizedRunner.java:988)
	at org.apache.solr.BaseDistributedSearchTestCase$ShardsRepeatRule$ShardsFixedStatement.callStatement(BaseDistributedSearchTestCase.java:1082)
	at org.apache.solr.BaseDistributedSearchTestCase$ShardsRepeatRule$ShardsStatement.evaluate(BaseDistributedSearchTestCase.java:1054)
	at com.carrotsearch.randomizedtesting.rules.SystemPropertiesRestoreRule$1.evaluate(SystemPropertiesRestoreRule.java:57)
	at org.apache.lucene.util.TestRuleSetupTeardownChained$1.evaluate(TestRuleSetupTeardownChained.java:49)
	at org.apache.lucene.util.AbstractBeforeAfterRule$1.evaluate(AbstractBeforeAfterRule.java:45)
	at org.apache.lucene.util.TestRuleThreadAndTestName$1.evaluate(TestRuleThreadAndTestName.java:48)
	at org.apache.lucene.util.TestRuleIgnoreAfterMaxFailures$1.evaluate(TestRuleIgnoreAfterMaxFailures.java:64)
	at org.apache.lucene.util.TestRuleMarkFailure$1.evaluate(TestRuleMarkFailure.java:47)
	at com.carrotsearch.randomizedtesting.rules.StatementAdapter.evaluate(StatementAdapter.java:36)
	at com.carrotsearch.randomizedtesting.ThreadLeakControl$StatementRunner.run(ThreadLeakControl.java:368)
	at com.carrotsearch.randomizedtesting.ThreadLeakControl.forkTimeoutingTask(ThreadLeakControl.java:817)
	at com.carrotsearch.randomizedtesting.ThreadLeakControl$3.evaluate(ThreadLeakControl.java:468)
	at com.carrotsearch.randomizedtesting.RandomizedRunner.runSingleTest(RandomizedRunner.java:947)
	at com.carrotsearch.randomizedtesting.RandomizedRunner$5.evaluate(RandomizedRunner.java:832)
	at com.carrotsearch.randomizedtesting.RandomizedRunner$6.evaluate(RandomizedRunner.java:883)
	at com.carrotsearch.randomizedtesting.RandomizedRunner$7.evaluate(RandomizedRunner.java:894)
	at com.carrotsearch.randomizedtesting.rules.StatementAdapter.evaluate(StatementAdapter.java:36)
	at com.carrotsearch.randomizedtesting.rules.SystemPropertiesRestoreRule$1.evaluate(SystemPropertiesRestoreRule.java:57)
	at org.apache.lucene.util.AbstractBeforeAfterRule$1.evaluate(AbstractBeforeAfterRule.java:45)
	at com.carrotsearch.randomizedtesting.rules.StatementAdapter.evaluate(StatementAdapter.java:36)
	at org.apache.lucene.util.TestRuleStoreClassName$1.evaluate(TestRuleStoreClassName.java:41)
	at com.carrotsearch.randomizedtesting.rules.NoShadowingOrOverridesOnMethodsRule$1.evaluate(NoShadowingOrOverridesOnMethodsRule.java:40)
	at com.carrotsearch.randomizedtesting.rules.NoShadowingOrOverridesOnMethodsRule$1.evaluate(NoShadowingOrOverridesOnMethodsRule.java:40)
	at com.carrotsearch.randomizedtesting.rules.StatementAdapter.evaluate(StatementAdapter.java:36)
	at com.carrotsearch.randomizedtesting.rules.StatementAdapter.evaluate(StatementAdapter.java:36)
	at org.apache.lucene.util.TestRuleAssertionsRequired$1.evaluate(TestRuleAssertionsRequired.java:53)
	at org.apache.lucene.util.TestRuleMarkFailure$1.evaluate(TestRuleMarkFailure.java:47)
	at org.apache.lucene.util.TestRuleIgnoreAfterMaxFailures$1.evaluate(TestRuleIgnoreAfterMaxFailures.java:64)
	at org.apache.lucene.util.TestRuleIgnoreTestSuites$1.evaluate(TestRuleIgnoreTestSuites.java:54)
	at com.carrotsearch.randomizedtesting.rules.StatementAdapter.evaluate(StatementAdapter.java:36)
	at com.carrotsearch.randomizedtesting.ThreadLeakControl$StatementRunner.run(ThreadLeakControl.java:368)
	at java.base/java.lang.Thread.run(Thread.java:835)


FAILED:  org.apache.solr.update.PeerSyncTest.test

Error Message:
Unexpected exception type, expected SolrException but got org.apache.solr.client.solrj.SolrServerException: Timeout occurred while waiting response from server at: http://127.0.0.1:38591/_ttp/f/collection1

Stack Trace:
junit.framework.AssertionFailedError: Unexpected exception type, expected SolrException but got org.apache.solr.client.solrj.SolrServerException: Timeout occurred while waiting response from server at: http://127.0.0.1:38591/_ttp/f/collection1
	at __randomizedtesting.SeedInfo.seed([C1959AC1FC269610:49C1A51B52DAFBE8]:0)
	at org.apache.lucene.util.LuceneTestCase.expectThrows(LuceneTestCase.java:2700)
	at org.apache.lucene.util.LuceneTestCase.expectThrows(LuceneTestCase.java:2689)
	at org.apache.solr.update.PeerSyncTest.test(PeerSyncTest.java:279)
	at java.base/jdk.internal.reflect.NativeMethodAccessorImpl.invoke0(Native Method)
	at java.base/jdk.internal.reflect.NativeMethodAccessorImpl.invoke(NativeMethodAccessorImpl.java:62)
	at java.base/jdk.internal.reflect.DelegatingMethodAccessorImpl.invoke(DelegatingMethodAccessorImpl.java:43)
	at java.base/java.lang.reflect.Method.invoke(Method.java:567)
	at com.carrotsearch.randomizedtesting.RandomizedRunner.invoke(RandomizedRunner.java:1750)
	at com.carrotsearch.randomizedtesting.RandomizedRunner$8.evaluate(RandomizedRunner.java:938)
	at com.carrotsearch.randomizedtesting.RandomizedRunner$9.evaluate(RandomizedRunner.java:974)
	at com.carrotsearch.randomizedtesting.RandomizedRunner$10.evaluate(RandomizedRunner.java:988)
	at org.apache.solr.BaseDistributedSearchTestCase$ShardsRepeatRule$ShardsFixedStatement.callStatement(BaseDistributedSearchTestCase.java:1082)
	at org.apache.solr.BaseDistributedSearchTestCase$ShardsRepeatRule$ShardsStatement.evaluate(BaseDistributedSearchTestCase.java:1054)
	at com.carrotsearch.randomizedtesting.rules.SystemPropertiesRestoreRule$1.evaluate(SystemPropertiesRestoreRule.java:57)
	at org.apache.lucene.util.TestRuleSetupTeardownChained$1.evaluate(TestRuleSetupTeardownChained.java:49)
	at org.apache.lucene.util.AbstractBeforeAfterRule$1.evaluate(AbstractBeforeAfterRule.java:45)
	at org.apache.lucene.util.TestRuleThreadAndTestName$1.evaluate(TestRuleThreadAndTestName.java:48)
	at org.apache.lucene.util.TestRuleIgnoreAfterMaxFailures$1.evaluate(TestRuleIgnoreAfterMaxFailures.java:64)
	at org.apache.lucene.util.TestRuleMarkFailure$1.evaluate(TestRuleMarkFailure.java:47)
	at com.carrotsearch.randomizedtesting.rules.StatementAdapter.evaluate(StatementAdapter.java:36)
	at com.carrotsearch.randomizedtesting.ThreadLeakControl$StatementRunner.run(ThreadLeakControl.java:368)
	at com.carrotsearch.randomizedtesting.ThreadLeakControl.forkTimeoutingTask(ThreadLeakControl.java:817)
	at com.carrotsearch.randomizedtesting.ThreadLeakControl$3.evaluate(ThreadLeakControl.java:468)
	at com.carrotsearch.randomizedtesting.RandomizedRunner.runSingleTest(RandomizedRunner.java:947)
	at com.carrotsearch.randomizedtesting.RandomizedRunner$5.evaluate(RandomizedRunner.java:832)
	at com.carrotsearch.randomizedtesting.RandomizedRunner$6.evaluate(RandomizedRunner.java:883)
	at com.carrotsearch.randomizedtesting.RandomizedRunner$7.evaluate(RandomizedRunner.java:894)
	at com.carrotsearch.randomizedtesting.rules.StatementAdapter.evaluate(StatementAdapter.java:36)
	at com.carrotsearch.randomizedtesting.rules.SystemPropertiesRestoreRule$1.evaluate(SystemPropertiesRestoreRule.java:57)
	at org.apache.lucene.util.AbstractBeforeAfterRule$1.evaluate(AbstractBeforeAfterRule.java:45)
	at com.carrotsearch.randomizedtesting.rules.StatementAdapter.evaluate(StatementAdapter.java:36)
	at org.apache.lucene.util.TestRuleStoreClassName$1.evaluate(TestRuleStoreClassName.java:41)
	at com.carrotsearch.randomizedtesting.rules.NoShadowingOrOverridesOnMethodsRule$1.evaluate(NoShadowingOrOverridesOnMethodsRule.java:40)
	at com.carrotsearch.randomizedtesting.rules.NoShadowingOrOverridesOnMethodsRule$1.evaluate(NoShadowingOrOverridesOnMethodsRule.java:40)
	at com.carrotsearch.randomizedtesting.rules.StatementAdapter.evaluate(StatementAdapter.java:36)
	at com.carrotsearch.randomizedtesting.rules.StatementAdapter.evaluate(StatementAdapter.java:36)
	at org.apache.lucene.util.TestRuleAssertionsRequired$1.evaluate(TestRuleAssertionsRequired.java:53)
	at org.apache.lucene.util.TestRuleMarkFailure$1.evaluate(TestRuleMarkFailure.java:47)
	at org.apache.lucene.util.TestRuleIgnoreAfterMaxFailures$1.evaluate(TestRuleIgnoreAfterMaxFailures.java:64)
	at org.apache.lucene.util.TestRuleIgnoreTestSuites$1.evaluate(TestRuleIgnoreTestSuites.java:54)
	at com.carrotsearch.randomizedtesting.rules.StatementAdapter.evaluate(StatementAdapter.java:36)
	at com.carrotsearch.randomizedtesting.ThreadLeakControl$StatementRunner.run(ThreadLeakControl.java:368)
	at java.base/java.lang.Thread.run(Thread.java:835)
Caused by: org.apache.solr.client.solrj.SolrServerException: Timeout occurred while waiting response from server at: http://127.0.0.1:38591/_ttp/f/collection1
	at org.apache.solr.client.solrj.impl.HttpSolrClient.executeMethod(HttpSolrClient.java:660)
	at org.apache.solr.client.solrj.impl.HttpSolrClient.request(HttpSolrClient.java:255)
	at org.apache.solr.client.solrj.impl.HttpSolrClient.request(HttpSolrClient.java:244)
	at org.apache.solr.client.solrj.SolrRequest.process(SolrRequest.java:207)
	at org.apache.solr.client.solrj.SolrRequest.process(SolrRequest.java:224)
	at org.apache.solr.BaseDistributedSearchTestCase.add(BaseDistributedSearchTestCase.java:576)
	at org.apache.solr.update.PeerSyncTest.lambda$test$0(PeerSyncTest.java:281)
	at org.apache.lucene.util.LuceneTestCase.expectThrows(LuceneTestCase.java:2695)
	... 42 more
Caused by: java.net.SocketTimeoutException: Read timed out
	at java.base/java.net.SocketInputStream.socketRead0(Native Method)
	at java.base/java.net.SocketInputStream.socketRead(SocketInputStream.java:115)
	at java.base/java.net.SocketInputStream.read(SocketInputStream.java:168)
	at java.base/java.net.SocketInputStream.read(SocketInputStream.java:140)
	at java.base/java.net.Socket$SocketInputStream.read(Socket.java:972)
	at org.apache.http.impl.io.SessionInputBufferImpl.streamRead(SessionInputBufferImpl.java:137)
	at org.apache.http.impl.io.SessionInputBufferImpl.fillBuffer(SessionInputBufferImpl.java:153)
	at org.apache.http.impl.io.SessionInputBufferImpl.readLine(SessionInputBufferImpl.java:282)
	at org.apache.http.impl.conn.DefaultHttpResponseParser.parseHead(DefaultHttpResponseParser.java:138)
	at org.apache.http.impl.conn.DefaultHttpResponseParser.parseHead(DefaultHttpResponseParser.java:56)
	at org.apache.http.impl.io.AbstractMessageParser.parse(AbstractMessageParser.java:259)
	at org.apache.http.impl.DefaultBHttpClientConnection.receiveResponseHeader(DefaultBHttpClientConnection.java:163)
	at org.apache.http.impl.conn.CPoolProxy.receiveResponseHeader(CPoolProxy.java:165)
	at org.apache.http.protocol.HttpRequestExecutor.doReceiveResponse(HttpRequestExecutor.java:273)
	at org.apache.http.protocol.HttpRequestExecutor.execute(HttpRequestExecutor.java:125)
	at org.apache.http.impl.execchain.MainClientExec.execute(MainClientExec.java:272)
	at org.apache.http.impl.execchain.ProtocolExec.execute(ProtocolExec.java:185)
	at org.apache.http.impl.execchain.RetryExec.execute(RetryExec.java:89)
	at org.apache.http.impl.execchain.RedirectExec.execute(RedirectExec.java:110)
	at org.apache.http.impl.client.InternalHttpClient.doExecute(InternalHttpClient.java:185)
	at org.apache.http.impl.client.CloseableHttpClient.execute(CloseableHttpClient.java:83)
	at org.apache.http.impl.client.CloseableHttpClient.execute(CloseableHttpClient.java:56)
	at org.apache.solr.client.solrj.impl.HttpSolrClient.executeMethod(HttpSolrClient.java:548)
	... 49 more


FAILED:  org.apache.solr.update.PeerSyncWithLeaderTest.test

Error Message:
Unexpected exception type, expected SolrException but got org.apache.solr.client.solrj.SolrServerException: Timeout occurred while waiting response from server at: http://127.0.0.1:34611/wk_r/collection1

Stack Trace:
junit.framework.AssertionFailedError: Unexpected exception type, expected SolrException but got org.apache.solr.client.solrj.SolrServerException: Timeout occurred while waiting response from server at: http://127.0.0.1:34611/wk_r/collection1
	at __randomizedtesting.SeedInfo.seed([C1959AC1FC269610:49C1A51B52DAFBE8]:0)
	at org.apache.lucene.util.LuceneTestCase.expectThrows(LuceneTestCase.java:2700)
	at org.apache.lucene.util.LuceneTestCase.expectThrows(LuceneTestCase.java:2689)
	at org.apache.solr.update.PeerSyncTest.test(PeerSyncTest.java:279)
	at java.base/jdk.internal.reflect.NativeMethodAccessorImpl.invoke0(Native Method)
	at java.base/jdk.internal.reflect.NativeMethodAccessorImpl.invoke(NativeMethodAccessorImpl.java:62)
	at java.base/jdk.internal.reflect.DelegatingMethodAccessorImpl.invoke(DelegatingMethodAccessorImpl.java:43)
	at java.base/java.lang.reflect.Method.invoke(Method.java:567)
	at com.carrotsearch.randomizedtesting.RandomizedRunner.invoke(RandomizedRunner.java:1750)
	at com.carrotsearch.randomizedtesting.RandomizedRunner$8.evaluate(RandomizedRunner.java:938)
	at com.carrotsearch.randomizedtesting.RandomizedRunner$9.evaluate(RandomizedRunner.java:974)
	at com.carrotsearch.randomizedtesting.RandomizedRunner$10.evaluate(RandomizedRunner.java:988)
	at org.apache.solr.BaseDistributedSearchTestCase$ShardsRepeatRule$ShardsFixedStatement.callStatement(BaseDistributedSearchTestCase.java:1082)
	at org.apache.solr.BaseDistributedSearchTestCase$ShardsRepeatRule$ShardsStatement.evaluate(BaseDistributedSearchTestCase.java:1054)
	at com.carrotsearch.randomizedtesting.rules.SystemPropertiesRestoreRule$1.evaluate(SystemPropertiesRestoreRule.java:57)
	at org.apache.lucene.util.TestRuleSetupTeardownChained$1.evaluate(TestRuleSetupTeardownChained.java:49)
	at org.apache.lucene.util.AbstractBeforeAfterRule$1.evaluate(AbstractBeforeAfterRule.java:45)
	at org.apache.lucene.util.TestRuleThreadAndTestName$1.evaluate(TestRuleThreadAndTestName.java:48)
	at org.apache.lucene.util.TestRuleIgnoreAfterMaxFailures$1.evaluate(TestRuleIgnoreAfterMaxFailures.java:64)
	at org.apache.lucene.util.TestRuleMarkFailure$1.evaluate(TestRuleMarkFailure.java:47)
	at com.carrotsearch.randomizedtesting.rules.StatementAdapter.evaluate(StatementAdapter.java:36)
	at com.carrotsearch.randomizedtesting.ThreadLeakControl$StatementRunner.run(ThreadLeakControl.java:368)
	at com.carrotsearch.randomizedtesting.ThreadLeakControl.forkTimeoutingTask(ThreadLeakControl.java:817)
	at com.carrotsearch.randomizedtesting.ThreadLeakControl$3.evaluate(ThreadLeakControl.java:468)
	at com.carrotsearch.randomizedtesting.RandomizedRunner.runSingleTest(RandomizedRunner.java:947)
	at com.carrotsearch.randomizedtesting.RandomizedRunner$5.evaluate(RandomizedRunner.java:832)
	at com.carrotsearch.randomizedtesting.RandomizedRunner$6.evaluate(RandomizedRunner.java:883)
	at com.carrotsearch.randomizedtesting.RandomizedRunner$7.evaluate(RandomizedRunner.java:894)
	at com.carrotsearch.randomizedtesting.rules.StatementAdapter.evaluate(StatementAdapter.java:36)
	at com.carrotsearch.randomizedtesting.rules.SystemPropertiesRestoreRule$1.evaluate(SystemPropertiesRestoreRule.java:57)
	at org.apache.lucene.util.AbstractBeforeAfterRule$1.evaluate(AbstractBeforeAfterRule.java:45)
	at com.carrotsearch.randomizedtesting.rules.StatementAdapter.evaluate(StatementAdapter.java:36)
	at org.apache.lucene.util.TestRuleStoreClassName$1.evaluate(TestRuleStoreClassName.java:41)
	at com.carrotsearch.randomizedtesting.rules.NoShadowingOrOverridesOnMethodsRule$1.evaluate(NoShadowingOrOverridesOnMethodsRule.java:40)
	at com.carrotsearch.randomizedtesting.rules.NoShadowingOrOverridesOnMethodsRule$1.evaluate(NoShadowingOrOverridesOnMethodsRule.java:40)
	at com.carrotsearch.randomizedtesting.rules.StatementAdapter.evaluate(StatementAdapter.java:36)
	at com.carrotsearch.randomizedtesting.rules.StatementAdapter.evaluate(StatementAdapter.java:36)
	at org.apache.lucene.util.TestRuleAssertionsRequired$1.evaluate(TestRuleAssertionsRequired.java:53)
	at org.apache.lucene.util.TestRuleMarkFailure$1.evaluate(TestRuleMarkFailure.java:47)
	at org.apache.lucene.util.TestRuleIgnoreAfterMaxFailures$1.evaluate(TestRuleIgnoreAfterMaxFailures.java:64)
	at org.apache.lucene.util.TestRuleIgnoreTestSuites$1.evaluate(TestRuleIgnoreTestSuites.java:54)
	at com.carrotsearch.randomizedtesting.rules.StatementAdapter.evaluate(StatementAdapter.java:36)
	at com.carrotsearch.randomizedtesting.ThreadLeakControl$StatementRunner.run(ThreadLeakControl.java:368)
	at java.base/java.lang.Thread.run(Thread.java:835)
Caused by: org.apache.solr.client.solrj.SolrServerException: Timeout occurred while waiting response from server at: http://127.0.0.1:34611/wk_r/collection1
	at org.apache.solr.client.solrj.impl.HttpSolrClient.executeMethod(HttpSolrClient.java:660)
	at org.apache.solr.client.solrj.impl.HttpSolrClient.request(HttpSolrClient.java:255)
	at org.apache.solr.client.solrj.impl.HttpSolrClient.request(HttpSolrClient.java:244)
	at org.apache.solr.client.solrj.SolrRequest.process(SolrRequest.java:207)
	at org.apache.solr.client.solrj.SolrRequest.process(SolrRequest.java:224)
	at org.apache.solr.BaseDistributedSearchTestCase.add(BaseDistributedSearchTestCase.java:576)
	at org.apache.solr.update.PeerSyncTest.lambda$test$0(PeerSyncTest.java:281)
	at org.apache.lucene.util.LuceneTestCase.expectThrows(LuceneTestCase.java:2695)
	... 42 more
Caused by: java.net.SocketTimeoutException: Read timed out
	at java.base/java.net.SocketInputStream.socketRead0(Native Method)
	at java.base/java.net.SocketInputStream.socketRead(SocketInputStream.java:115)
	at java.base/java.net.SocketInputStream.read(SocketInputStream.java:168)
	at java.base/java.net.SocketInputStream.read(SocketInputStream.java:140)
	at java.base/java.net.Socket$SocketInputStream.read(Socket.java:972)
	at org.apache.http.impl.io.SessionInputBufferImpl.streamRead(SessionInputBufferImpl.java:137)
	at org.apache.http.impl.io.SessionInputBufferImpl.fillBuffer(SessionInputBufferImpl.java:153)
	at org.apache.http.impl.io.SessionInputBufferImpl.readLine(SessionInputBufferImpl.java:282)
	at org.apache.http.impl.conn.DefaultHttpResponseParser.parseHead(DefaultHttpResponseParser.java:138)
	at org.apache.http.impl.conn.DefaultHttpResponseParser.parseHead(DefaultHttpResponseParser.java:56)
	at org.apache.http.impl.io.AbstractMessageParser.parse(AbstractMessageParser.java:259)
	at org.apache.http.impl.DefaultBHttpClientConnection.receiveResponseHeader(DefaultBHttpClientConnection.java:163)
	at org.apache.http.impl.conn.CPoolProxy.receiveResponseHeader(CPoolProxy.java:165)
	at org.apache.http.protocol.HttpRequestExecutor.doReceiveResponse(HttpRequestExecutor.java:273)
	at org.apache.http.protocol.HttpRequestExecutor.execute(HttpRequestExecutor.java:125)
	at org.apache.http.impl.execchain.MainClientExec.execute(MainClientExec.java:272)
	at org.apache.http.impl.execchain.ProtocolExec.execute(ProtocolExec.java:185)
	at org.apache.http.impl.execchain.RetryExec.execute(RetryExec.java:89)
	at org.apache.http.impl.execchain.RedirectExec.execute(RedirectExec.java:110)
	at org.apache.http.impl.client.InternalHttpClient.doExecute(InternalHttpClient.java:185)
	at org.apache.http.impl.client.CloseableHttpClient.execute(CloseableHttpClient.java:83)
	at org.apache.http.impl.client.CloseableHttpClient.execute(CloseableHttpClient.java:56)
	at org.apache.solr.client.solrj.impl.HttpSolrClient.executeMethod(HttpSolrClient.java:548)
	... 49 more




Build Log:
[...truncated 13845 lines...]
   [junit4] Suite: org.apache.solr.update.TestInPlaceUpdatesDistrib
   [junit4]   2> Creating dataDir: /home/jenkins/workspace/Lucene-Solr-8.x-Linux/solr/build/solr-core/test/J1/temp/solr.update.TestInPlaceUpdatesDistrib_C1959AC1FC269610-001/init-core-data-001
   [junit4]   2> 684113 WARN  (SUITE-TestInPlaceUpdatesDistrib-seed#[C1959AC1FC269610]-worker) [    ] o.a.s.SolrTestCaseJ4 startTrackingSearchers: numOpens=36 numCloses=36
   [junit4]   2> 684113 INFO  (SUITE-TestInPlaceUpdatesDistrib-seed#[C1959AC1FC269610]-worker) [    ] o.a.s.SolrTestCaseJ4 Using PointFields (NUMERIC_POINTS_SYSPROP=true) w/NUMERIC_DOCVALUES_SYSPROP=true
   [junit4]   2> 684114 INFO  (SUITE-TestInPlaceUpdatesDistrib-seed#[C1959AC1FC269610]-worker) [    ] o.a.s.SolrTestCaseJ4 Randomized ssl (false) and clientAuth (true) via: @org.apache.solr.util.RandomizeSSL(reason="", value=0.0/0.0, ssl=0.0/0.0, clientAuth=0.0/0.0)
   [junit4]   2> 684114 INFO  (SUITE-TestInPlaceUpdatesDistrib-seed#[C1959AC1FC269610]-worker) [    ] o.a.s.SolrTestCaseJ4 SecureRandom sanity checks: test.solr.allowed.securerandom=null & java.security.egd=file:/dev/./urandom
   [junit4]   2> 684114 INFO  (SUITE-TestInPlaceUpdatesDistrib-seed#[C1959AC1FC269610]-worker) [    ] o.a.s.BaseDistributedSearchTestCase Setting hostContext system property: /_yq/
   [junit4]   2> 684114 INFO  (SUITE-TestInPlaceUpdatesDistrib-seed#[C1959AC1FC269610]-worker) [    ] o.a.s.SolrTestCaseJ4 updateLog impl=solr.UpdateLog
   [junit4]   2> 684114 INFO  (SUITE-TestInPlaceUpdatesDistrib-seed#[C1959AC1FC269610]-worker) [    ] o.a.s.SolrTestCaseJ4 ####initCore
   [junit4]   2> 684114 INFO  (SUITE-TestInPlaceUpdatesDistrib-seed#[C1959AC1FC269610]-worker) [    ] o.a.s.c.SolrResourceLoader [null] Added 2 libs to classloader, from paths: [/home/jenkins/workspace/Lucene-Solr-8.x-Linux/solr/core/src/test-files/solr/collection1/lib, /home/jenkins/workspace/Lucene-Solr-8.x-Linux/solr/core/src/test-files/solr/collection1/lib/classes]
   [junit4]   2> 684124 INFO  (SUITE-TestInPlaceUpdatesDistrib-seed#[C1959AC1FC269610]-worker) [    ] o.a.s.c.SolrConfig Using Lucene MatchVersion: 8.2.0
   [junit4]   2> 684133 INFO  (SUITE-TestInPlaceUpdatesDistrib-seed#[C1959AC1FC269610]-worker) [    ] o.a.s.s.IndexSchema [null] Schema name=inplace-updates
   [junit4]   2> 684135 INFO  (SUITE-TestInPlaceUpdatesDistrib-seed#[C1959AC1FC269610]-worker) [    ] o.a.s.s.IndexSchema Loaded schema inplace-updates/1.6 with uniqueid field id
   [junit4]   2> 684224 INFO  (SUITE-TestInPlaceUpdatesDistrib-seed#[C1959AC1FC269610]-worker) [    ] o.a.s.h.c.HttpShardHandlerFactory Host whitelist initialized: WhitelistHostChecker [whitelistHosts=null, whitelistHostCheckingEnabled=false]
   [junit4]   2> 684225 WARN  (SUITE-TestInPlaceUpdatesDistrib-seed#[C1959AC1FC269610]-worker) [    ] o.e.j.u.s.S.config No Client EndPointIdentificationAlgorithm configured for SslContextFactory@4d0328ce[provider=null,keyStore=null,trustStore=null]
   [junit4]   2> 684227 WARN  (SUITE-TestInPlaceUpdatesDistrib-seed#[C1959AC1FC269610]-worker) [    ] o.e.j.u.s.S.config No Client EndPointIdentificationAlgorithm configured for SslContextFactory@55f73e67[provider=null,keyStore=null,trustStore=null]
   [junit4]   2> 684235 INFO  (SUITE-TestInPlaceUpdatesDistrib-seed#[C1959AC1FC269610]-worker) [    ] o.a.s.c.TransientSolrCoreCacheDefault Allocating transient cache for 2147483647 transient cores
   [junit4]   2> 684235 INFO  (SUITE-TestInPlaceUpdatesDistrib-seed#[C1959AC1FC269610]-worker) [    ] o.a.s.h.a.MetricsHistoryHandler No .system collection, keeping metrics history in memory.
   [junit4]   2> 684248 INFO  (SUITE-TestInPlaceUpdatesDistrib-seed#[C1959AC1FC269610]-worker) [    ] o.a.s.m.r.SolrJmxReporter JMX monitoring for 'solr.node' (registry 'solr.node') enabled at server: com.sun.jmx.mbeanserver.JmxMBeanServer@5a904e72
   [junit4]   2> 684253 INFO  (SUITE-TestInPlaceUpdatesDistrib-seed#[C1959AC1FC269610]-worker) [    ] o.a.s.m.r.SolrJmxReporter JMX monitoring for 'solr.jvm' (registry 'solr.jvm') enabled at server: com.sun.jmx.mbeanserver.JmxMBeanServer@5a904e72
   [junit4]   2> 684253 INFO  (SUITE-TestInPlaceUpdatesDistrib-seed#[C1959AC1FC269610]-worker) [    ] o.a.s.m.r.SolrJmxReporter JMX monitoring for 'solr.jetty' (registry 'solr.jetty') enabled at server: com.sun.jmx.mbeanserver.JmxMBeanServer@5a904e72
   [junit4]   2> 684255 INFO  (coreLoadExecutor-3806-thread-1) [    x:collection1] o.a.s.c.SolrResourceLoader [null] Added 2 libs to classloader, from paths: [/home/jenkins/workspace/Lucene-Solr-8.x-Linux/solr/core/src/test-files/solr/collection1/lib, /home/jenkins/workspace/Lucene-Solr-8.x-Linux/solr/core/src/test-files/solr/collection1/lib/classes]
   [junit4]   2> 684264 INFO  (coreLoadExecutor-3806-thread-1) [    x:collection1] o.a.s.c.SolrConfig Using Lucene MatchVersion: 8.2.0
   [junit4]   2> 684274 INFO  (coreLoadExecutor-3806-thread-1) [    x:collection1] o.a.s.s.IndexSchema [collection1] Schema name=inplace-updates
   [junit4]   2> 684276 INFO  (coreLoadExecutor-3806-thread-1) [    x:collection1] o.a.s.s.IndexSchema Loaded schema inplace-updates/1.6 with uniqueid field id
   [junit4]   2> 684276 INFO  (coreLoadExecutor-3806-thread-1) [    x:collection1] o.a.s.c.CoreContainer Creating SolrCore 'collection1' using configuration from instancedir /home/jenkins/workspace/Lucene-Solr-8.x-Linux/solr/core/src/test-files/solr/collection1, trusted=true
   [junit4]   2> 684276 INFO  (coreLoadExecutor-3806-thread-1) [    x:collection1] o.a.s.m.r.SolrJmxReporter JMX monitoring for 'solr.core.collection1' (registry 'solr.core.collection1') enabled at server: com.sun.jmx.mbeanserver.JmxMBeanServer@5a904e72
   [junit4]   2> 684277 INFO  (coreLoadExecutor-3806-thread-1) [    x:collection1] o.a.s.c.SolrCore [[collection1] ] Opening new SolrCore at [/home/jenkins/workspace/Lucene-Solr-8.x-Linux/solr/core/src/test-files/solr/collection1], dataDir=[/home/jenkins/workspace/Lucene-Solr-8.x-Linux/solr/build/solr-core/test/J1/temp/solr.update.TestInPlaceUpdatesDistrib_C1959AC1FC269610-001/init-core-data-001/]
   [junit4]   2> 684279 WARN  (coreLoadExecutor-3806-thread-1) [    x:collection1] o.a.s.c.RequestHandlers INVALID paramSet a in requestHandler {type = requestHandler,name = /dump,class = DumpRequestHandler,attributes = {initParams=a, name=/dump, class=DumpRequestHandler},args = {defaults={a=A,b=B}}}
   [junit4]   2> 684303 INFO  (coreLoadExecutor-3806-thread-1) [    x:collection1] o.a.s.u.UpdateHandler Using UpdateLog implementation: org.apache.solr.update.UpdateLog
   [junit4]   2> 684303 INFO  (coreLoadExecutor-3806-thread-1) [    x:collection1] o.a.s.u.UpdateLog Initializing UpdateLog: dataDir= defaultSyncLevel=FLUSH numRecordsToKeep=100 maxNumLogsToKeep=10 numVersionBuckets=65536
   [junit4]   2> 684310 INFO  (coreLoadExecutor-3806-thread-1) [    x:collection1] o.a.s.u.CommitTracker Hard AutoCommit: disabled
   [junit4]   2> 684310 INFO  (coreLoadExecutor-3806-thread-1) [    x:collection1] o.a.s.u.CommitTracker Soft AutoCommit: disabled
   [junit4]   2> 684311 INFO  (coreLoadExecutor-3806-thread-1) [    x:collection1] o.a.s.s.SolrIndexSearcher Opening [Searcher@11916756[collection1] main]
   [junit4]   2> 684311 WARN  (coreLoadExecutor-3806-thread-1) [    x:collection1] o.a.s.r.ManagedResourceStorage Cannot write to config directory /home/jenkins/workspace/Lucene-Solr-8.x-Linux/solr/core/src/test-files/solr/collection1/conf; switching to use InMemory storage instead.
   [junit4]   2> 684311 INFO  (coreLoadExecutor-3806-thread-1) [    x:collection1] o.a.s.h.ReplicationHandler Commits will be reserved for 10000ms.
   [junit4]   2> 684311 INFO  (coreLoadExecutor-3806-thread-1) [    x:collection1] o.a.s.u.UpdateLog Could not find max version in index or recent updates, using new clock 1632421502186946560
   [junit4]   2> 684313 INFO  (searcherExecutor-3807-thread-1-processing-x:collection1) [    x:collection1] o.a.s.c.SolrCore [collection1] Registered new searcher Searcher@11916756[collection1] main{ExitableDirectoryReader(UninvertingDirectoryReader())}
   [junit4]   2> 684318 INFO  (SUITE-TestInPlaceUpdatesDistrib-seed#[C1959AC1FC269610]-worker) [    ] o.a.s.SolrTestCaseJ4 ####initCore end
   [junit4]   2> 684322 INFO  (TEST-TestInPlaceUpdatesDistrib.test-seed#[C1959AC1FC269610]) [    ] o.a.s.c.ZkTestServer STARTING ZK TEST SERVER
   [junit4]   2> 684322 INFO  (ZkTestServer Run Thread) [    ] o.a.s.c.ZkTestServer client port:0.0.0.0/0.0.0.0:0
   [junit4]   2> 684322 INFO  (ZkTestServer Run Thread) [    ] o.a.s.c.ZkTestServer Starting server
   [junit4]   2> 684422 INFO  (TEST-TestInPlaceUpdatesDistrib.test-seed#[C1959AC1FC269610]) [    ] o.a.s.c.ZkTestServer start zk server on port:46727
   [junit4]   2> 684422 INFO  (TEST-TestInPlaceUpdatesDistrib.test-seed#[C1959AC1FC269610]) [    ] o.a.s.c.ZkTestServer parse host and port list: 127.0.0.1:46727
   [junit4]   2> 684422 INFO  (TEST-TestInPlaceUpdatesDistrib.test-seed#[C1959AC1FC269610]) [    ] o.a.s.c.ZkTestServer connecting to 127.0.0.1 46727
   [junit4]   2> 684425 INFO  (zkConnectionManagerCallback-7495-thread-1) [    ] o.a.s.c.c.ConnectionManager zkClient has connected
   [junit4]   2> 684426 INFO  (zkConnectionManagerCallback-7497-thread-1) [    ] o.a.s.c.c.ConnectionManager zkClient has connected
   [junit4]   2> 684427 INFO  (TEST-TestInPlaceUpdatesDistrib.test-seed#[C1959AC1FC269610]) [    ] o.a.s.c.ZkTestServer put /home/jenkins/workspace/Lucene-Solr-8.x-Linux/solr/core/src/test-files/solr/collection1/conf/solrconfig-tlog.xml to /configs/conf1/solrconfig.xml
   [junit4]   2> 684427 INFO  (TEST-TestInPlaceUpdatesDistrib.test-seed#[C1959AC1FC269610]) [    ] o.a.s.c.ZkTestServer put /home/jenkins/workspace/Lucene-Solr-8.x-Linux/solr/core/src/test-files/solr/collection1/conf/schema-inplace-updates.xml to /configs/conf1/schema.xml
   [junit4]   2> 684428 INFO  (TEST-TestInPlaceUpdatesDistrib.test-seed#[C1959AC1FC269610]) [    ] o.a.s.c.ZkTestServer put /home/jenkins/workspace/Lucene-Solr-8.x-Linux/solr/core/src/test-files/solr/collection1/conf/solrconfig.snippet.randomindexconfig.xml to /configs/conf1/solrconfig.snippet.randomindexconfig.xml
   [junit4]   2> 684428 INFO  (TEST-TestInPlaceUpdatesDistrib.test-seed#[C1959AC1FC269610]) [    ] o.a.s.c.ZkTestServer put /home/jenkins/workspace/Lucene-Solr-8.x-Linux/solr/core/src/test-files/solr/collection1/conf/stopwords.txt to /configs/conf1/stopwords.txt
   [junit4]   2> 684429 INFO  (TEST-TestInPlaceUpdatesDistrib.test-seed#[C1959AC1FC269610]) [    ] o.a.s.c.ZkTestServer put /home/jenkins/workspace/Lucene-Solr-8.x-Linux/solr/core/src/test-files/solr/collection1/conf/protwords.txt to /configs/conf1/protwords.txt
   [junit4]   2> 684429 INFO  (TEST-TestInPlaceUpdatesDistrib.test-seed#[C1959AC1FC269610]) [    ] o.a.s.c.ZkTestServer put /home/jenkins/workspace/Lucene-Solr-8.x-Linux/solr/core/src/test-files/solr/collection1/conf/currency.xml to /configs/conf1/currency.xml
   [junit4]   2> 684429 INFO  (TEST-TestInPlaceUpdatesDistrib.test-seed#[C1959AC1FC269610]) [    ] o.a.s.c.ZkTestServer put /home/jenkins/workspace/Lucene-Solr-8.x-Linux/solr/core/src/test-files/solr/collection1/conf/enumsConfig.xml to /configs/conf1/enumsConfig.xml
   [junit4]   2> 684430 INFO  (TEST-TestInPlaceUpdatesDistrib.test-seed#[C1959AC1FC269610]) [    ] o.a.s.c.ZkTestServer put /home/jenkins/workspace/Lucene-Solr-8.x-Linux/solr/core/src/test-files/solr/collection1/conf/open-exchange-rates.json to /configs/conf1/open-exchange-rates.json
   [junit4]   2> 684430 INFO  (TEST-TestInPlaceUpdatesDistrib.test-seed#[C1959AC1FC269610]) [    ] o.a.s.c.ZkTestServer put /home/jenkins/workspace/Lucene-Solr-8.x-Linux/solr/core/src/test-files/solr/collection1/conf/mapping-ISOLatin1Accent.txt to /configs/conf1/mapping-ISOLatin1Accent.txt
   [junit4]   2> 684430 INFO  (TEST-TestInPlaceUpdatesDistrib.test-seed#[C1959AC1FC269610]) [    ] o.a.s.c.ZkTestServer put /home/jenkins/workspace/Lucene-Solr-8.x-Linux/solr/core/src/test-files/solr/collection1/conf/old_synonyms.txt to /configs/conf1/old_synonyms.txt
   [junit4]   2> 684431 INFO  (TEST-TestInPlaceUpdatesDistrib.test-seed#[C1959AC1FC269610]) [    ] o.a.s.c.ZkTestServer put /home/jenkins/workspace/Lucene-Solr-8.x-Linux/solr/core/src/test-files/solr/collection1/conf/synonyms.txt to /configs/conf1/synonyms.txt
   [junit4]   2> 684431 INFO  (TEST-TestInPlaceUpdatesDistrib.test-seed#[C1959AC1FC269610]) [    ] o.a.s.c.AbstractFullDistribZkTestBase Will use NRT replicas unless explicitly asked otherwise
   [junit4]   2> 684504 WARN  (TEST-TestInPlaceUpdatesDistrib.test-seed#[C1959AC1FC269610]) [    ] o.e.j.s.AbstractConnector Ignoring deprecated socket close linger time
   [junit4]   2> 684504 INFO  (TEST-TestInPlaceUpdatesDistrib.test-seed#[C1959AC1FC269610]) [    ] o.a.s.c.s.e.JettySolrRunner Start Jetty (original configured port=0)
   [junit4]   2> 684504 INFO  (TEST-TestInPlaceUpdatesDistrib.test-seed#[C1959AC1FC269610]) [    ] o.a.s.c.s.e.JettySolrRunner Trying to start Jetty on port 0 try number 1 ...
   [junit4]   2> 684504 INFO  (TEST-TestInPlaceUpdatesDistrib.test-seed#[C1959AC1FC269610]) [    ] o.e.j.s.Server jetty-9.4.14.v20181114; built: 2018-11-14T21:20:31.478Z; git: c4550056e785fb5665914545889f21dc136ad9e6; jvm 13-ea+18
   [junit4]   2> 684505 INFO  (TEST-TestInPlaceUpdatesDistrib.test-seed#[C1959AC1FC269610]) [    ] o.e.j.s.session DefaultSessionIdManager workerName=node0
   [junit4]   2> 684505 INFO  (TEST-TestInPlaceUpdatesDistrib.test-seed#[C1959AC1FC269610]) [    ] o.e.j.s.session No SessionScavenger set, using defaults
   [junit4]   2> 684505 INFO  (TEST-TestInPlaceUpdatesDistrib.test-seed#[C1959AC1FC269610]) [    ] o.e.j.s.session node0 Scavenging every 600000ms
   [junit4]   2> 684506 INFO  (TEST-TestInPlaceUpdatesDistrib.test-seed#[C1959AC1FC269610]) [    ] o.e.j.s.h.ContextHandler Started o.e.j.s.ServletContextHandler@ff3da06{/_yq,null,AVAILABLE}
   [junit4]   2> 684506 INFO  (TEST-TestInPlaceUpdatesDistrib.test-seed#[C1959AC1FC269610]) [    ] o.e.j.s.AbstractConnector Started ServerConnector@36fe6479{HTTP/1.1,[http/1.1, h2c]}{127.0.0.1:33425}
   [junit4]   2> 684506 INFO  (TEST-TestInPlaceUpdatesDistrib.test-seed#[C1959AC1FC269610]) [    ] o.e.j.s.Server Started @684538ms
   [junit4]   2> 684506 INFO  (TEST-TestInPlaceUpdatesDistrib.test-seed#[C1959AC1FC269610]) [    ] o.a.s.c.s.e.JettySolrRunner Jetty properties: {hostContext=/_yq, solr.data.dir=/home/jenkins/workspace/Lucene-Solr-8.x-Linux/solr/build/solr-core/test/J1/temp/solr.update.TestInPlaceUpdatesDistrib_C1959AC1FC269610-001/tempDir-001/control/data, hostPort=33425, coreRootDirectory=/home/jenkins/workspace/Lucene-Solr-8.x-Linux/solr/build/solr-core/test/J1/../../../../../../../../../home/jenkins/workspace/Lucene-Solr-8.x-Linux/solr/build/solr-core/test/J1/temp/solr.update.TestInPlaceUpdatesDistrib_C1959AC1FC269610-001/control-001/cores, replicaType=NRT}
   [junit4]   2> 684506 ERROR (TEST-TestInPlaceUpdatesDistrib.test-seed#[C1959AC1FC269610]) [    ] o.a.s.u.StartupLoggingUtils Missing Java Option solr.log.dir. Logging may be missing or incomplete.
   [junit4]   2> 684506 INFO  (TEST-TestInPlaceUpdatesDistrib.test-seed#[C1959AC1FC269610]) [    ] o.a.s.s.SolrDispatchFilter Using logger factory org.apache.logging.slf4j.Log4jLoggerFactory
   [junit4]   2> 684507 INFO  (TEST-TestInPlaceUpdatesDistrib.test-seed#[C1959AC1FC269610]) [    ] o.a.s.s.SolrDispatchFilter  ___      _       Welcome to Apache Solr™ version 8.2.0
   [junit4]   2> 684507 INFO  (TEST-TestInPlaceUpdatesDistrib.test-seed#[C1959AC1FC269610]) [    ] o.a.s.s.SolrDispatchFilter / __| ___| |_ _   Starting in cloud mode on port null
   [junit4]   2> 684507 INFO  (TEST-TestInPlaceUpdatesDistrib.test-seed#[C1959AC1FC269610]) [    ] o.a.s.s.SolrDispatchFilter \__ \/ _ \ | '_|  Install dir: null
   [junit4]   2> 684507 INFO  (TEST-TestInPlaceUpdatesDistrib.test-seed#[C1959AC1FC269610]) [    ] o.a.s.s.SolrDispatchFilter |___/\___/_|_|    Start time: 2019-05-02T12:01:00.381062Z
   [junit4]   2> 684509 INFO  (zkConnectionManagerCallback-7499-thread-1) [    ] o.a.s.c.c.ConnectionManager zkClient has connected
   [junit4]   2> 684510 INFO  (TEST-TestInPlaceUpdatesDistrib.test-seed#[C1959AC1FC269610]) [    ] o.a.s.s.SolrDispatchFilter Loading solr.xml from SolrHome (not found in ZooKeeper)
   [junit4]   2> 684510 INFO  (TEST-TestInPlaceUpdatesDistrib.test-seed#[C1959AC1FC269610]) [    ] o.a.s.c.SolrXmlConfig Loading container configuration from /home/jenkins/workspace/Lucene-Solr-8.x-Linux/solr/build/solr-core/test/J1/temp/solr.update.TestInPlaceUpdatesDistrib_C1959AC1FC269610-001/control-001/solr.xml
   [junit4]   2> 684512 INFO  (TEST-TestInPlaceUpdatesDistrib.test-seed#[C1959AC1FC269610]) [    ] o.a.s.c.SolrXmlConfig Configuration parameter autoReplicaFailoverWorkLoopDelay is ignored
   [junit4]   2> 684512 INFO  (TEST-TestInPlaceUpdatesDistrib.test-seed#[C1959AC1FC269610]) [    ] o.a.s.c.SolrXmlConfig Configuration parameter autoReplicaFailoverBadNodeExpiration is ignored
   [junit4]   2> 684513 INFO  (TEST-TestInPlaceUpdatesDistrib.test-seed#[C1959AC1FC269610]) [    ] o.a.s.c.SolrXmlConfig MBean server found: com.sun.jmx.mbeanserver.JmxMBeanServer@5a904e72, but no JMX reporters were configured - adding default JMX reporter.
   [junit4]   2> 684599 INFO  (TEST-TestInPlaceUpdatesDistrib.test-seed#[C1959AC1FC269610]) [    ] o.a.s.h.c.HttpShardHandlerFactory Host whitelist initialized: WhitelistHostChecker [whitelistHosts=null, whitelistHostCheckingEnabled=false]
   [junit4]   2> 684600 WARN  (TEST-TestInPlaceUpdatesDistrib.test-seed#[C1959AC1FC269610]) [    ] o.e.j.u.s.S.config No Client EndPointIdentificationAlgorithm configured for SslContextFactory@bd7f848[provider=null,keyStore=null,trustStore=null]
   [junit4]   2> 684602 WARN  (TEST-TestInPlaceUpdatesDistrib.test-seed#[C1959AC1FC269610]) [    ] o.e.j.u.s.S.config No Client EndPointIdentificationAlgorithm configured for SslContextFactory@1b758261[provider=null,keyStore=null,trustStore=null]
   [junit4]   2> 684603 INFO  (TEST-TestInPlaceUpdatesDistrib.test-seed#[C1959AC1FC269610]) [    ] o.a.s.c.ZkContainer Zookeeper client=127.0.0.1:46727/solr
   [junit4]   2> 684603 INFO  (zkConnectionManagerCallback-7506-thread-1) [    ] o.a.s.c.c.ConnectionManager zkClient has connected
   [junit4]   2> 684605 INFO  (zkConnectionManagerCallback-7508-thread-1) [    ] o.a.s.c.c.ConnectionManager zkClient has connected
   [junit4]   2> 684631 INFO  (TEST-TestInPlaceUpdatesDistrib.test-seed#[C1959AC1FC269610]) [    ] o.a.s.c.OverseerElectionContext I am going to be the leader 127.0.0.1:33425__yq
   [junit4]   2> 684631 INFO  (TEST-TestInPlaceUpdatesDistrib.test-seed#[C1959AC1FC269610]) [    ] o.a.s.c.Overseer Overseer (id=72181705817522180-127.0.0.1:33425__yq-n_0000000000) starting
   [junit4]   2> 684633 INFO  (zkConnectionManagerCallback-7515-thread-1) [    ] o.a.s.c.c.ConnectionManager zkClient has connected
   [junit4]   2> 684634 INFO  (TEST-TestInPlaceUpdatesDistrib.test-seed#[C1959AC1FC269610]) [    ] o.a.s.c.s.i.ZkClientClusterStateProvider Cluster at 127.0.0.1:46727/solr ready
   [junit4]   2> 684634 INFO  (OverseerStateUpdate-72181705817522180-127.0.0.1:33425__yq-n_0000000000) [n:127.0.0.1:33425__yq    ] o.a.s.c.Overseer Starting to work on the main queue : 127.0.0.1:33425__yq
   [junit4]   2> 684635 INFO  (TEST-TestInPlaceUpdatesDistrib.test-seed#[C1959AC1FC269610]) [    ] o.a.s.c.ZkController Register node as live in ZooKeeper:/live_nodes/127.0.0.1:33425__yq
   [junit4]   2> 684635 INFO  (OverseerStateUpdate-72181705817522180-127.0.0.1:33425__yq-n_0000000000) [n:127.0.0.1:33425__yq    ] o.a.s.c.c.ZkStateReader Updated live nodes from ZooKeeper... (0) -> (1)
   [junit4]   2> 684635 INFO  (zkCallback-7514-thread-1) [    ] o.a.s.c.c.ZkStateReader Updated live nodes from ZooKeeper... (0) -> (1)
   [junit4]   2> 684643 INFO  (TEST-TestInPlaceUpdatesDistrib.test-seed#[C1959AC1FC269610]) [    ] o.a.s.h.a.MetricsHistoryHandler No .system collection, keeping metrics history in memory.
   [junit4]   2> 684661 INFO  (TEST-TestInPlaceUpdatesDistrib.test-seed#[C1959AC1FC269610]) [    ] o.a.s.m.r.SolrJmxReporter JMX monitoring for 'solr.node' (registry 'solr.node') enabled at server: com.sun.jmx.mbeanserver.JmxMBeanServer@5a904e72
   [junit4]   2> 684668 INFO  (TEST-TestInPlaceUpdatesDistrib.test-seed#[C1959AC1FC269610]) [    ] o.a.s.m.r.SolrJmxReporter JMX monitoring for 'solr.jvm' (registry 'solr.jvm') enabled at server: com.sun.jmx.mbeanserver.JmxMBeanServer@5a904e72
   [junit4]   2> 684668 INFO  (TEST-TestInPlaceUpdatesDistrib.test-seed#[C1959AC1FC269610]) [    ] o.a.s.m.r.SolrJmxReporter JMX monitoring for 'solr.jetty' (registry 'solr.jetty') enabled at server: com.sun.jmx.mbeanserver.JmxMBeanServer@5a904e72
   [junit4]   2> 684669 INFO  (TEST-TestInPlaceUpdatesDistrib.test-seed#[C1959AC1FC269610]) [    ] o.a.s.c.CorePropertiesLocator Found 0 core definitions underneath /home/jenkins/workspace/Lucene-Solr-8.x-Linux/solr/build/solr-core/test/J1/../../../../../../../../../home/jenkins/workspace/Lucene-Solr-8.x-Linux/solr/build/solr-core/test/J1/temp/solr.update.TestInPlaceUpdatesDistrib_C1959AC1FC269610-001/control-001/cores
   [junit4]   2> 684695 INFO  (zkConnectionManagerCallback-7521-thread-1) [    ] o.a.s.c.c.ConnectionManager zkClient has connected
   [junit4]   2> 684696 INFO  (TEST-TestInPlaceUpdatesDistrib.test-seed#[C1959AC1FC269610]) [    ] o.a.s.c.c.ZkStateReader Updated live nodes from ZooKeeper... (0) -> (1)
   [junit4]   2> 684696 INFO  (TEST-TestInPlaceUpdatesDistrib.test-seed#[C1959AC1FC269610]) [    ] o.a.s.c.s.i.ZkClientClusterStateProvider Cluster at 127.0.0.1:46727/solr ready
   [junit4]   2> 684698 INFO  (qtp1825165948-13882) [n:127.0.0.1:33425__yq    ] o.a.s.h.a.CollectionsHandler Invoked Collection Action :create with params collection.configName=conf1&name=control_collection&nrtReplicas=1&action=CREATE&numShards=1&createNodeSet=127.0.0.1:33425__yq&wt=javabin&version=2 and sendToOCPQueue=true
   [junit4]   2> 684699 INFO  (OverseerThreadFactory-3821-thread-1) [    ] o.a.s.c.a.c.CreateCollectionCmd Create collection control_collection
   [junit4]   2> 684802 INFO  (qtp1825165948-13881) [n:127.0.0.1:33425__yq    x:control_collection_shard1_replica_n1] o.a.s.h.a.CoreAdminOperation core create command qt=/admin/cores&collection.configName=conf1&newCollection=true&name=control_collection_shard1_replica_n1&action=CREATE&numShards=1&collection=control_collection&shard=shard1&wt=javabin&version=2&replicaType=NRT
   [junit4]   2> 684802 INFO  (qtp1825165948-13881) [n:127.0.0.1:33425__yq    x:control_collection_shard1_replica_n1] o.a.s.c.TransientSolrCoreCacheDefault Allocating transient cache for 4 transient cores
   [junit4]   2> 685809 INFO  (qtp1825165948-13881) [n:127.0.0.1:33425__yq c:control_collection s:shard1  x:control_collection_shard1_replica_n1] o.a.s.c.SolrConfig Using Lucene MatchVersion: 8.2.0
   [junit4]   2> 685819 INFO  (qtp1825165948-13881) [n:127.0.0.1:33425__yq c:control_collection s:shard1  x:control_collection_shard1_replica_n1] o.a.s.s.IndexSchema [control_collection_shard1_replica_n1] Schema name=inplace-updates
   [junit4]   2> 685821 INFO  (qtp1825165948-13881) [n:127.0.0.1:33425__yq c:control_collection s:shard1  x:control_collection_shard1_replica_n1] o.a.s.s.IndexSchema Loaded schema inplace-updates/1.6 with uniqueid field id
   [junit4]   2> 685821 INFO  (qtp1825165948-13881) [n:127.0.0.1:33425__yq c:control_collection s:shard1  x:control_collection_shard1_replica_n1] o.a.s.c.CoreContainer Creating SolrCore 'control_collection_shard1_replica_n1' using configuration from collection control_collection, trusted=true
   [junit4]   2> 685821 INFO  (qtp1825165948-13881) [n:127.0.0.1:33425__yq c:control_collection s:shard1  x:control_collection_shard1_replica_n1] o.a.s.m.r.SolrJmxReporter JMX monitoring for 'solr.core.control_collection.shard1.replica_n1' (registry 'solr.core.control_collection.shard1.replica_n1') enabled at server: com.sun.jmx.mbeanserver.JmxMBeanServer@5a904e72
   [junit4]   2> 685821 INFO  (qtp1825165948-13881) [n:127.0.0.1:33425__yq c:control_collection s:shard1  x:control_collection_shard1_replica_n1] o.a.s.c.SolrCore [[control_collection_shard1_replica_n1] ] Opening new SolrCore at [/home/jenkins/workspace/Lucene-Solr-8.x-Linux/solr/build/solr-core/test/J1/temp/solr.update.TestInPlaceUpdatesDistrib_C1959AC1FC269610-001/control-001/cores/control_collection_shard1_replica_n1], dataDir=[/home/jenkins/workspace/Lucene-Solr-8.x-Linux/solr/build/solr-core/test/J1/../../../../../../../../../home/jenkins/workspace/Lucene-Solr-8.x-Linux/solr/build/solr-core/test/J1/temp/solr.update.TestInPlaceUpdatesDistrib_C1959AC1FC269610-001/control-001/cores/control_collection_shard1_replica_n1/data/]
   [junit4]   2> 685823 WARN  (qtp1825165948-13881) [n:127.0.0.1:33425__yq c:control_collection s:shard1  x:control_collection_shard1_replica_n1] o.a.s.c.RequestHandlers INVALID paramSet a in requestHandler {type = requestHandler,name = /dump,class = DumpRequestHandler,attributes = {initParams=a, name=/dump, class=DumpRequestHandler},args = {defaults={a=A,b=B}}}
   [junit4]   2> 685848 INFO  (qtp1825165948-13881) [n:127.0.0.1:33425__yq c:control_collection s:shard1  x:control_collection_shard1_replica_n1] o.a.s.u.UpdateHandler Using UpdateLog implementation: org.apache.solr.update.UpdateLog
   [junit4]   2> 685848 INFO  (qtp1825165948-13881) [n:127.0.0.1:33425__yq c:control_collection s:shard1  x:control_collection_shard1_replica_n1] o.a.s.u.UpdateLog Initializing UpdateLog: dataDir= defaultSyncLevel=FLUSH numRecordsToKeep=100 maxNumLogsToKeep=10 numVersionBuckets=65536
   [junit4]   2> 685853 INFO  (qtp1825165948-13881) [n:127.0.0.1:33425__yq c:control_collection s:shard1  x:control_collection_shard1_replica_n1] o.a.s.u.CommitTracker Hard AutoCommit: disabled
   [junit4]   2> 685853 INFO  (qtp1825165948-13881) [n:127.0.0.1:33425__yq c:control_collection s:shard1  x:control_collection_shard1_replica_n1] o.a.s.u.CommitTracker Soft AutoCommit: disabled
   [junit4]   2> 685854 INFO  (qtp1825165948-13881) [n:127.0.0.1:33425__yq c:control_collection s:shard1  x:control_collection_shard1_replica_n1] o.a.s.s.SolrIndexSearcher Opening [Searcher@1279f45b[control_collection_shard1_replica_n1] main]
   [junit4]   2> 685855 INFO  (qtp1825165948-13881) [n:127.0.0.1:33425__yq c:control_collection s:shard1  x:control_collection_shard1_replica_n1] o.a.s.r.ManagedResourceStorage Configured ZooKeeperStorageIO with znodeBase: /configs/conf1
   [junit4]   2> 685855 INFO  (qtp1825165948-13881) [n:127.0.0.1:33425__yq c:control_collection s:shard1  x:control_collection_shard1_replica_n1] o.a.s.r.ManagedResourceStorage Loaded null at path _rest_managed.json using ZooKeeperStorageIO:path=/configs/conf1
   [junit4]   2> 685855 INFO  (qtp1825165948-13881) [n:127.0.0.1:33425__yq c:control_collection s:shard1  x:control_collection_shard1_replica_n1] o.a.s.h.ReplicationHandler Commits will be reserved for 10000ms.
   [junit4]   2> 685855 INFO  (qtp1825165948-13881) [n:127.0.0.1:33425__yq c:control_collection s:shard1  x:control_collection_shard1_replica_n1] o.a.s.u.UpdateLog Could not find max version in index or recent updates, using new clock 1632421503805947904
   [junit4]   2> 685857 INFO  (searcherExecutor-3826-thread-1-processing-n:127.0.0.1:33425__yq x:control_collection_shard1_replica_n1 c:control_collection s:shard1) [n:127.0.0.1:33425__yq c:control_collection s:shard1  x:control_collection_shard1_replica_n1] o.a.s.c.SolrCore [control_collection_shard1_replica_n1] Registered new searcher Searcher@1279f45b[control_collection_shard1_replica_n1] main{ExitableDirectoryReader(UninvertingDirectoryReader())}
   [junit4]   2> 685866 INFO  (qtp1825165948-13881) [n:127.0.0.1:33425__yq c:control_collection s:shard1  x:control_collection_shard1_replica_n1] o.a.s.c.ZkShardTerms Successful update of terms at /collections/control_collection/terms/shard1 to Terms{values={core_node2=0}, version=0}
   [junit4]   2> 685867 INFO  (qtp1825165948-13881) [n:127.0.0.1:33425__yq c:control_collection s:shard1  x:control_collection_shard1_replica_n1] o.a.s.c.ShardLeaderElectionContextBase make sure parent is created /collections/control_collection/leaders/shard1
   [junit4]   2> 685868 INFO  (qtp1825165948-13881) [n:127.0.0.1:33425__yq c:control_collection s:shard1  x:control_collection_shard1_replica_n1] o.a.s.c.ShardLeaderElectionContext Enough replicas found to continue.
   [junit4]   2> 685868 INFO  (qtp1825165948-13881) [n:127.0.0.1:33425__yq c:control_collection s:shard1  x:control_collection_shard1_replica_n1] o.a.s.c.ShardLeaderElectionContext I may be the new leader - try and sync
   [junit4]   2> 685868 INFO  (qtp1825165948-13881) [n:127.0.0.1:33425__yq c:control_collection s:shard1  x:control_collection_shard1_replica_n1] o.a.s.c.SyncStrategy Sync replicas to http://127.0.0.1:33425/_yq/control_collection_shard1_replica_n1/
   [junit4]   2> 685868 INFO  (qtp1825165948-13881) [n:127.0.0.1:33425__yq c:control_collection s:shard1  x:control_collection_shard1_replica_n1] o.a.s.c.SyncStrategy Sync Success - now sync replicas to me
   [junit4]   2> 685868 INFO  (qtp1825165948-13881) [n:127.0.0.1:33425__yq c:control_collection s:shard1  x:control_collection_shard1_replica_n1] o.a.s.c.SyncStrategy http://127.0.0.1:33425/_yq/control_collection_shard1_replica_n1/ has no replicas
   [junit4]   2> 685868 INFO  (qtp1825165948-13881) [n:127.0.0.1:33425__yq c:control_collection s:shard1  x:control_collection_shard1_replica_n1] o.a.s.c.ShardLeaderElectionContextBase Creating leader registration node /collections/control_collection/leaders/shard1/leader after winning as /collections/control_collection/leader_elect/shard1/election/72181705817522180-core_node2-n_0000000000
   [junit4]   2> 685869 INFO  (qtp1825165948-13881) [n:127.0.0.1:33425__yq c:control_collection s:shard1  x:control_collection_shard1_replica_n1] o.a.s.c.ShardLeaderElectionContext I am the new leader: http://127.0.0.1:33425/_yq/control_collection_shard1_replica_n1/ shard1
   [junit4]   2> 685970 INFO  (zkCallback-7507-thread-1) [    ] o.a.s.c.c.ZkStateReader A cluster state change: [WatchedEvent state:SyncConnected type:NodeDataChanged path:/collections/control_collection/state.json] for collection [control_collection] has occurred - updating... (live nodes size: [1])
   [junit4]   2> 685970 INFO  (zkCallback-7507-thread-2) [    ] o.a.s.c.c.ZkStateReader A cluster state change: [WatchedEvent state:SyncConnected type:NodeDataChanged path:/collections/control_collection/state.json] for collection [control_collection] has occurred - updating... (live nodes size: [1])
   [junit4]   2> 685970 INFO  (qtp1825165948-13881) [n:127.0.0.1:33425__yq c:control_collection s:shard1  x:control_collection_shard1_replica_n1] o.a.s.c.ZkController I am the leader, no recovery necessary
   [junit4]   2> 685971 INFO  (qtp1825165948-13881) [n:127.0.0.1:33425__yq c:control_collection s:shard1  x:control_collection_shard1_replica_n1] o.a.s.s.HttpSolrCall [admin] webapp=null path=/admin/cores params={qt=/admin/cores&collection.configName=conf1&newCollection=true&name=control_collection_shard1_replica_n1&action=CREATE&numShards=1&collection=control_collection&shard=shard1&wt=javabin&version=2&replicaType=NRT} status=0 QTime=1168
   [junit4]   2> 685972 INFO  (qtp1825165948-13882) [n:127.0.0.1:33425__yq    ] o.a.s.h.a.CollectionsHandler Wait for new collection to be active for at most 45 seconds. Check all shard replicas
   [junit4]   2> 686071 INFO  (zkCallback-7507-thread-2) [    ] o.a.s.c.c.ZkStateReader A cluster state change: [WatchedEvent state:SyncConnected type:NodeDataChanged path:/collections/control_collection/state.json] for collection [control_collection] has occurred - updating... (live nodes size: [1])
   [junit4]   2> 686071 INFO  (zkCallback-7507-thread-1) [    ] o.a.s.c.c.ZkStateReader A cluster state change: [WatchedEvent state:SyncConnected type:NodeDataChanged path:/collections/control_collection/state.json] for collection [control_collection] has occurred - updating... (live nodes size: [1])
   [junit4]   2> 686071 INFO  (zkCallback-7507-thread-3) [    ] o.a.s.c.c.ZkStateReader A cluster state change: [WatchedEvent state:SyncConnected type:NodeDataChanged path:/collections/control_collection/state.json] for collection [control_collection] has occurred - updating... (live nodes size: [1])
   [junit4]   2> 686072 INFO  (qtp1825165948-13882) [n:127.0.0.1:33425__yq    ] o.a.s.s.HttpSolrCall [admin] webapp=null path=/admin/collections params={collection.configName=conf1&name=control_collection&nrtReplicas=1&action=CREATE&numShards=1&createNodeSet=127.0.0.1:33425__yq&wt=javabin&version=2} status=0 QTime=1374
   [junit4]   2> 686074 INFO  (zkConnectionManagerCallback-7527-thread-1) [    ] o.a.s.c.c.ConnectionManager zkClient has connected
   [junit4]   2> 686075 INFO  (TEST-TestInPlaceUpdatesDistrib.test-seed#[C1959AC1FC269610]) [    ] o.a.s.c.c.ZkStateReader Updated live nodes from ZooKeeper... (0) -> (1)
   [junit4]   2> 686075 INFO  (TEST-TestInPlaceUpdatesDistrib.test-seed#[C1959AC1FC269610]) [    ] o.a.s.c.s.i.ZkClientClusterStateProvider Cluster at 127.0.0.1:46727/solr ready
   [junit4]   2> 686075 INFO  (TEST-TestInPlaceUpdatesDistrib.test-seed#[C1959AC1FC269610]) [    ] o.a.s.c.ChaosMonkey monkey: init - expire sessions:false cause connection loss:false
   [junit4]   2> 686076 INFO  (qtp1825165948-13881) [n:127.0.0.1:33425__yq    ] o.a.s.h.a.CollectionsHandler Invoked Collection Action :create with params collection.configName=conf1&name=collection1&nrtReplicas=1&action=CREATE&numShards=1&createNodeSet=&stateFormat=1&wt=javabin&version=2 and sendToOCPQueue=true
   [junit4]   2> 686076 INFO  (OverseerThreadFactory-3821-thread-2) [    ] o.a.s.c.a.c.CreateCollectionCmd Create collection collection1
   [junit4]   2> 686077 INFO  (OverseerCollectionConfigSetProcessor-72181705817522180-127.0.0.1:33425__yq-n_0000000000) [    ] o.a.s.c.OverseerTaskQueue Response ZK path: /overseer/collection-queue-work/qnr-0000000000 doesn't exist.  Requestor may have disconnected from ZooKeeper
   [junit4]   2> 686278 WARN  (OverseerThreadFactory-3821-thread-2) [    ] o.a.s.c.a.c.CreateCollectionCmd It is unusual to create a collection (collection1) without cores.
   [junit4]   2> 686279 INFO  (qtp1825165948-13881) [n:127.0.0.1:33425__yq    ] o.a.s.h.a.CollectionsHandler Wait for new collection to be active for at most 45 seconds. Check all shard replicas
   [junit4]   2> 686279 INFO  (qtp1825165948-13881) [n:127.0.0.1:33425__yq    ] o.a.s.s.HttpSolrCall [admin] webapp=null path=/admin/collections params={collection.configName=conf1&name=collection1&nrtReplicas=1&action=CREATE&numShards=1&createNodeSet=&stateFormat=1&wt=javabin&version=2} status=0 QTime=203
   [junit4]   2> 686280 INFO  (TEST-TestInPlaceUpdatesDistrib.test-seed#[C1959AC1FC269610]) [    ] o.a.s.c.AbstractFullDistribZkTestBase Creating jetty instances pullReplicaCount=0 numOtherReplicas=3
   [junit4]   2> 686354 INFO  (TEST-TestInPlaceUpdatesDistrib.test-seed#[C1959AC1FC269610]) [    ] o.a.s.c.AbstractFullDistribZkTestBase create jetty 1 in directory /home/jenkins/workspace/Lucene-Solr-8.x-Linux/solr/build/solr-core/test/J1/temp/solr.update.TestInPlaceUpdatesDistrib_C1959AC1FC269610-001/shard-1-001 of type NRT
   [junit4]   2> 686354 WARN  (closeThreadPool-7528-thread-1) [    ] o.e.j.s.AbstractConnector Ignoring deprecated socket close linger time
   [junit4]   2> 686355 INFO  (closeThreadPool-7528-thread-1) [    ] o.a.s.c.s.e.JettySolrRunner Start Jetty (original configured port=0)
   [junit4]   2> 686355 INFO  (closeThreadPool-7528-thread-1) [    ] o.a.s.c.s.e.JettySolrRunner Trying to start Jetty on port 0 try number 1 ...
   [junit4]   2> 686355 INFO  (closeThreadPool-7528-thread-1) [    ] o.e.j.s.Server jetty-9.4.14.v20181114; built: 2018-11-14T21:20:31.478Z; git: c4550056e785fb5665914545889f21dc136ad9e6; jvm 13-ea+18
   [junit4]   2> 686355 INFO  (closeThreadPool-7528-thread-1) [    ] o.e.j.s.session DefaultSessionIdManager workerName=node0
   [junit4]   2> 686355 INFO  (closeThreadPool-7528-thread-1) [    ] o.e.j.s.session No SessionScavenger set, using defaults
   [junit4]   2> 686355 INFO  (closeThreadPool-7528-thread-1) [    ] o.e.j.s.session node0 Scavenging every 600000ms
   [junit4]   2> 686355 INFO  (closeThreadPool-7528-thread-1) [    ] o.e.j.s.h.ContextHandler Started o.e.j.s.ServletContextHandler@60f53a24{/_yq,null,AVAILABLE}
   [junit4]   2> 686356 INFO  (closeThreadPool-7528-thread-1) [    ] o.e.j.s.AbstractConnector Started ServerConnector@262338b9{HTTP/1.1,[http/1.1, h2c]}{127.0.0.1:38171}
   [junit4]   2> 686356 INFO  (closeThreadPool-7528-thread-1) [    ] o.e.j.s.Server Started @686387ms
   [junit4]   2> 686356 INFO  (closeThreadPool-7528-thread-1) [    ] o.a.s.c.s.e.JettySolrRunner Jetty properties: {hostContext=/_yq, solrconfig=solrconfig.xml, solr.data.dir=/home/jenkins/workspace/Lucene-Solr-8.x-Linux/solr/build/solr-core/test/J1/temp/solr.update.TestInPlaceUpdatesDistrib_C1959AC1FC269610-001/tempDir-001/jetty1, hostPort=38171, coreRootDirectory=/home/jenkins/workspace/Lucene-Solr-8.x-Linux/solr/build/solr-core/test/J1/temp/solr.update.TestInPlaceUpdatesDistrib_C1959AC1FC269610-001/shard-1-001/cores}
   [junit4]   2> 686356 ERROR (closeThreadPool-7528-thread-1) [    ] o.a.s.u.StartupLoggingUtils Missing Java Option solr.log.dir. Logging may be missing or incomplete.
   [junit4]   2> 686356 INFO  (closeThreadPool-7528-thread-1) [    ] o.a.s.s.SolrDispatchFilter Using logger factory org.apache.logging.slf4j.Log4jLoggerFactory
   [junit4]   2> 686356 INFO  (closeThreadPool-7528-thread-1) [    ] o.a.s.s.SolrDispatchFilter  ___      _       Welcome to Apache Solr™ version 8.2.0
   [junit4]   2> 686356 INFO  (closeThreadPool-7528-thread-1) [    ] o.a.s.s.SolrDispatchFilter / __| ___| |_ _   Starting in cloud mode on port null
   [junit4]   2> 686356 INFO  (closeThreadPool-7528-thread-1) [    ] o.a.s.s.SolrDispatchFilter \__ \/ _ \ | '_|  Install dir: null
   [junit4]   2> 686356 INFO  (closeThreadPool-7528-thread-1) [    ] o.a.s.s.SolrDispatchFilter |___/\___/_|_|    Start time: 2019-05-02T12:01:02.230361Z
   [junit4]   2> 686357 INFO  (zkConnectionManagerCallback-7530-thread-1) [    ] o.a.s.c.c.ConnectionManager zkClient has connected
   [junit4]   2> 686357 INFO  (closeThreadPool-7528-thread-1) [    ] o.a.s.s.SolrDispatchFilter Loading solr.xml from SolrHome (not found in ZooKeeper)
   [junit4]   2> 686357 INFO  (closeThreadPool-7528-thread-1) [    ] o.a.s.c.SolrXmlConfig Loading container configuration from /home/jenkins/workspace/Lucene-Solr-8.x-Linux/solr/build/solr-core/test/J1/temp/solr.update.TestInPlaceUpdatesDistrib_C1959AC1FC269610-001/shard-1-001/solr.xml
   [junit4]   2> 686359 INFO  (closeThreadPool-7528-thread-1) [    ] o.a.s.c.SolrXmlConfig Configuration parameter autoReplicaFailoverWorkLoopDelay is ignored
   [junit4]   2> 686359 INFO  (closeThreadPool-7528-thread-1) [    ] o.a.s.c.SolrXmlConfig Configuration parameter autoReplicaFailoverBadNodeExpiration is ignored
   [junit4]   2> 686360 INFO  (closeThreadPool-7528-thread-1) [    ] o.a.s.c.SolrXmlConfig MBean server found: com.sun.jmx.mbeanserver.JmxMBeanServer@5a904e72, but no JMX reporters were configured - adding default JMX reporter.
   [junit4]   2> 686429 INFO  (TEST-TestInPlaceUpdatesDistrib.test-seed#[C1959AC1FC269610]) [    ] o.a.s.c.AbstractFullDistribZkTestBase create jetty 2 in directory /home/jenkins/workspace/Lucene-Solr-8.x-Linux/solr/build/solr-core/test/J1/temp/solr.update.TestInPlaceUpdatesDistrib_C1959AC1FC269610-001/shard-2-001 of type NRT
   [junit4]   2> 686429 WARN  (closeThreadPool-7528-thread-2) [    ] o.e.j.s.AbstractConnector Ignoring deprecated socket close linger time
   [junit4]   2> 686429 INFO  (closeThreadPool-7528-thread-2) [    ] o.a.s.c.s.e.JettySolrRunner Start Jetty (original configured port=0)
   [junit4]   2> 686429 INFO  (closeThreadPool-7528-thread-2) [    ] o.a.s.c.s.e.JettySolrRunner Trying to start Jetty on port 0 try number 1 ...
   [junit4]   2> 686429 INFO  (closeThreadPool-7528-thread-2) [    ] o.e.j.s.Server jetty-9.4.14.v20181114; built: 2018-11-14T21:20:31.478Z; git: c4550056e785fb5665914545889f21dc136ad9e6; jvm 13-ea+18
   [junit4]   2> 686430 INFO  (closeThreadPool-7528-thread-2) [    ] o.e.j.s.session DefaultSessionIdManager workerName=node0
   [junit4]   2> 686430 INFO  (closeThreadPool-7528-thread-2) [    ] o.e.j.s.session No SessionScavenger set, using defaults
   [junit4]   2> 686430 INFO  (closeThreadPool-7528-thread-2) [    ] o.e.j.s.session node0 Scavenging every 660000ms
   [junit4]   2> 686430 INFO  (closeThreadPool-7528-thread-2) [    ] o.e.j.s.h.ContextHandler Started o.e.j.s.ServletContextHandler@27a6c478{/_yq,null,AVAILABLE}
   [junit4]   2> 686430 INFO  (closeThreadPool-7528-thread-2) [    ] o.e.j.s.AbstractConnector Started ServerConnector@3078a360{HTTP/1.1,[http/1.1, h2c]}{127.0.0.1:44507}
   [junit4]   2> 686430 INFO  (closeThreadPool-7528-thread-2) [    ] o.e.j.s.Server Started @686462ms
   [junit4]   2> 686430 INFO  (closeThreadPool-7528-thread-2) [    ] o.a.s.c.s.e.JettySolrRunner Jetty properties: {hostContext=/_yq, solrconfig=solrconfig.xml, solr.data.dir=/home/jenkins/workspace/Lucene-Solr-8.x-Linux/solr/build/solr-core/test/J1/temp/solr.update.TestInPlaceUpdatesDistrib_C1959AC1FC269610-001/tempDir-001/jetty2, hostPort=44507, coreRootDirectory=/home/jenkins/workspace/Lucene-Solr-8.x-Linux/solr/build/solr-core/test/J1/temp/solr.update.TestInPlaceUpdatesDistrib_C1959AC1FC269610-001/shard-2-001/cores}
   [junit4]   2> 686430 ERROR (closeThreadPool-7528-thread-2) [    ] o.a.s.u.StartupLoggingUtils Missing Java Option solr.log.dir. Logging may be missing or incomplete.
   [junit4]   2> 686430 INFO  (closeThreadPool-7528-thread-2) [    ] o.a.s.s.SolrDispatchFilter Using logger factory org.apache.logging.slf4j.Log4jLoggerFactory
   [junit4]   2> 686431 INFO  (closeThreadPool-7528-thread-2) [    ] o.a.s.s.SolrDispatchFilter  ___      _       Welcome to Apache Solr™ version 8.2.0
   [junit4]   2> 686431 INFO  (closeThreadPool-7528-thread-2) [    ] o.a.s.s.SolrDispatchFilter / __| ___| |_ _   Starting in cloud mode on port null
   [junit4]   2> 686431 INFO  (closeThreadPool-7528-thread-2) [    ] o.a.s.s.SolrDispatchFilter \__ \/ _ \ | '_|  Install dir: null
   [junit4]   2> 686431 INFO  (closeThreadPool-7528-thread-2) [    ] o.a.s.s.SolrDispatchFilter |___/\___/_|_|    Start time: 2019-05-02T12:01:02.305033Z
   [junit4]   2> 686431 INFO  (zkConnectionManagerCallback-7533-thread-1) [    ] o.a.s.c.c.ConnectionManager zkClient has connected
   [junit4]   2> 686432 INFO  (closeThreadPool-7528-thread-2) [    ] o.a.s.s.SolrDispatchFilter Loading solr.xml from SolrHome (not found in ZooKeeper)
   [junit4]   2> 686432 INFO  (closeThreadPool-7528-thread-2) [    ] o.a.s.c.SolrXmlConfig Loading container configuration from /home/jenkins/workspace/Lucene-Solr-8.x-Linux/solr/build/solr-core/test/J1/temp/solr.update.TestInPlaceUpdatesDistrib_C1959AC1FC269610-001/shard-2-001/solr.xml
   [junit4]   2> 686434 INFO  (closeThreadPool-7528-thread-2) [    ] o.a.s.c.SolrXmlConfig Configuration parameter autoReplicaFailoverWorkLoopDelay is ignored
   [junit4]   2> 686434 INFO  (closeThreadPool-7528-thread-2) [    ] o.a.s.c.SolrXmlConfig Configuration parameter autoReplicaFailoverBadNodeExpiration is ignored
   [junit4]   2> 686435 INFO  (closeThreadPool-7528-thread-2) [    ] o.a.s.c.SolrXmlConfig MBean server found: com.sun.jmx.mbeanserver.JmxMBeanServer@5a904e72, but no JMX reporters were configured - adding default JMX reporter.
   [junit4]   2> 686470 INFO  (closeThreadPool-7528-thread-1) [    ] o.a.s.h.c.HttpShardHandlerFactory Host whitelist initialized: WhitelistHostChecker [whitelistHosts=null, whitelistHostCheckingEnabled=false]
   [junit4]   2> 686470 WARN  (closeThreadPool-7528-thread-1) [    ] o.e.j.u.s.S.config No Client EndPointIdentificationAlgorithm configured for SslContextFactory@d9bf230[provider=null,keyStore=null,trustStore=null]
   [junit4]   2> 686472 WARN  (closeThreadPool-7528-thread-1) [    ] o.e.j.u.s.S.config No Client EndPointIdentificationAlgorithm configured for SslContextFactory@5b35f7f5[provider=null,keyStore=null,trustStore=null]
   [junit4]   2> 686472 INFO  (closeThreadPool-7528-thread-1) [    ] o.a.s.c.ZkContainer Zookeeper client=127.0.0.1:46727/solr
   [junit4]   2> 686478 INFO  (zkConnectionManagerCallback-7540-thread-1) [    ] o.a.s.c.c.ConnectionManager zkClient has connected
   [junit4]   2> 686479 INFO  (zkConnectionManagerCallback-7542-thread-1) [    ] o.a.s.c.c.ConnectionManager zkClient has connected
   [junit4]   2> 686481 INFO  (closeThreadPool-7528-thread-1) [n:127.0.0.1:38171__yq    ] o.a.s.c.c.ZkStateReader Updated live nodes from ZooKeeper... (0) -> (1)
   [junit4]   2> 686482 INFO  (closeThreadPool-7528-thread-1) [n:127.0.0.1:38171__yq    ] o.a.s.c.ZkController Publish node=127.0.0.1:38171__yq as DOWN
   [junit4]   2> 686482 INFO  (closeThreadPool-7528-thread-1) [n:127.0.0.1:38171__yq    ] o.a.s.c.TransientSolrCoreCacheDefault Allocating transient cache for 4 transient cores
   [junit4]   2> 686482 INFO  (closeThreadPool-7528-thread-1) [n:127.0.0.1:38171__yq    ] o.a.s.c.ZkController Register node as live in ZooKeeper:/live_nodes/127.0.0.1:38171__yq
   [junit4]   2> 686483 INFO  (zkCallback-7514-thread-1) [    ] o.a.s.c.c.ZkStateReader Updated live nodes from ZooKeeper... (1) -> (2)
   [junit4]   2> 686483 INFO  (zkCallback-7526-thread-1) [    ] o.a.s.c.c.ZkStateReader Updated live nodes from ZooKeeper... (1) -> (2)
   [junit4]   2> 686483 INFO  (zkCallback-7507-thread-1) [    ] o.a.s.c.c.ZkStateReader Updated live nodes from ZooKeeper... (1) -> (2)
   [junit4]   2> 686483 INFO  (zkCallback-7541-thread-1) [    ] o.a.s.c.c.ZkStateReader Updated live nodes from ZooKeeper... (1) -> (2)
   [junit4]   2> 686495 INFO  (zkConnectionManagerCallback-7549-thread-1) [    ] o.a.s.c.c.ConnectionManager zkClient has connected
   [junit4]   2> 686495 INFO  (closeThreadPool-7528-thread-1) [n:127.0.0.1:38171__yq    ] o.a.s.c.c.ZkStateReader Updated live nodes from ZooKeeper... (0) -> (2)
   [junit4]   2> 686495 INFO  (closeThreadPool-7528-thread-2) [    ] o.a.s.h.c.HttpShardHandlerFactory Host whitelist initialized: WhitelistHostChecker [whitelistHosts=null, whitelistHostCheckingEnabled=false]
   [junit4]   2> 686496 INFO  (closeThreadPool-7528-thread-1) [n:127.0.0.1:38171__yq    ] o.a.s.c.s.i.ZkClientClusterStateProvider Cluster at 127.0.0.1:46727/solr ready
   [junit4]   2> 686496 WARN  (closeThreadPool-7528-thread-2) [    ] o.e.j.u.s.S.config No Client EndPointIdentificationAlgorithm configured for SslContextFactory@28494e9f[provider=null,keyStore=null,trustStore=null]
   [junit4]   2> 686500 INFO  (closeThreadPool-7528-thread-1) [n:127.0.0.1:38171__yq    ] o.a.s.h.a.MetricsHistoryHandler No .system collection, keeping metrics history in memory.
   [junit4]   2> 686515 WARN  (closeThreadPool-7528-thread-2) [    ] o.e.j.u.s.S.config No Client EndPointIdentificationAlgorithm configured for SslContextFactory@7119f7c[provider=null,keyStore=null,trustStore=null]
   [junit4]   2> 686516 INFO  (closeThreadPool-7528-thread-2) [    ] o.a.s.c.ZkContainer Zookeeper client=127.0.0.1:46727/solr
   [junit4]   2> 686517 INFO  (zkConnectionManagerCallback-7556-thread-1) [    ] o.a.s.c.c.ConnectionManager zkClient has connected
   [junit4]   2> 686519 INFO  (TEST-TestInPlaceUpdatesDistrib.test-seed#[C1959AC1FC269610]) [    ] o.a.s.c.AbstractFullDistribZkTestBase create jetty 3 in directory /home/jenkins/workspace/Lucene-Solr-8.x-Linux/solr/build/solr-core/test/J1/temp/solr.update.TestInPlaceUpdatesDistrib_C1959AC1FC269610-001/shard-3-001 of type NRT
   [junit4]   2> 686519 WARN  (closeThreadPool-7528-thread-3) [    ] o.e.j.s.AbstractConnector Ignoring deprecated socket close linger time
   [junit4]   2> 686519 INFO  (closeThreadPool-7528-thread-3) [    ] o.a.s.c.s.e.JettySolrRunner Start Jetty (original configured port=0)
   [junit4]   2> 686519 INFO  (closeThreadPool-7528-thread-3) [    ] o.a.s.c.s.e.JettySolrRunner Trying to start Jetty on port 0 try number 1 ...
   [junit4]   2> 686519 INFO  (closeThreadPool-7528-thread-3) [    ] o.e.j.s.Server jetty-9.4.14.v20181114; built: 2018-11-14T21:20:31.478Z; git: c4550056e785fb5665914545889f21dc136ad9e6; jvm 13-ea+18
   [junit4]   2> 686519 INFO  (zkConnectionManagerCallback-7558-thread-1) [    ] o.a.s.c.c.ConnectionManager zkClient has connected
   [junit4]   2> 686520 INFO  (closeThreadPool-7528-thread-1) [n:127.0.0.1:38171__yq    ] o.a.s.m.r.SolrJmxReporter JMX monitoring for 'solr.node' (registry 'solr.node') enabled at server: com.sun.jmx.mbeanserver.JmxMBeanServer@5a904e72
   [junit4]   2> 686521 INFO  (closeThreadPool-7528-thread-2) [n:127.0.0.1:44507__yq    ] o.a.s.c.c.ZkStateReader Updated live nodes from ZooKeeper... (0) -> (2)
   [junit4]   2> 686522 INFO  (closeThreadPool-7528-thread-2) [n:127.0.0.1:44507__yq    ] o.a.s.c.ZkController Publish node=127.0.0.1:44507__yq as DOWN
   [junit4]   2> 686523 INFO  (closeThreadPool-7528-thread-2) [n:127.0.0.1:44507__yq    ] o.a.s.c.TransientSolrCoreCacheDefault Allocating transient cache for 4 transient cores
   [junit4]   2> 686523 INFO  (closeThreadPool-7528-thread-2) [n:127.0.0.1:44507__yq    ] o.a.s.c.ZkController Register node as live in ZooKeeper:/live_nodes/127.0.0.1:44507__yq
   [junit4]   2> 686523 INFO  (zkCallback-7541-thread-1) [    ] o.a.s.c.c.ZkStateReader Updated live nodes from ZooKeeper... (2) -> (3)
   [junit4]   2> 686523 INFO  (zkCallback-7526-thread-1) [    ] o.a.s.c.c.ZkStateReader Updated live nodes from ZooKeeper... (2) -> (3)
   [junit4]   2> 686523 INFO  (zkCallback-7507-thread-1) [    ] o.a.s.c.c.ZkStateReader Updated live nodes from ZooKeeper... (2) -> (3)
   [junit4]   2> 686523 INFO  (zkCallback-7514-thread-1) [    ] o.a.s.c.c.ZkStateReader Updated live nodes from ZooKeeper... (2) -> (3)
   [junit4]   2> 686529 INFO  (closeThreadPool-7528-thread-1) [n:127.0.0.1:38171__yq    ] o.a.s.m.r.SolrJmxReporter JMX monitoring for 'solr.jvm' (registry 'solr.jvm') enabled at server: com.sun.jmx.mbeanserver.JmxMBeanServer@5a904e72
   [junit4]   2> 686529 INFO  (closeThreadPool-7528-thread-1) [n:127.0.0.1:38171__yq    ] o.a.s.m.r.SolrJmxReporter JMX monitoring for 'solr.jetty' (registry 'solr.jetty') enabled at server: com.sun.jmx.mbeanserver.JmxMBeanServer@5a904e72
   [junit4]   2> 686531 INFO  (closeThreadPool-7528-thread-1) [n:127.0.0.1:38171__yq    ] o.a.s.c.CorePropertiesLocator Found 0 core definitions underneath /home/jenkins/workspace/Lucene-Solr-8.x-Linux/solr/build/solr-core/test/J1/temp/solr.update.TestInPlaceUpdatesDistrib_C1959AC1FC269610-001/shard-1-001/cores
   [junit4]   2> 686533 INFO  (zkCallback-7548-thread-1) [    ] o.a.s.c.c.ZkStateReader Updated live nodes from ZooKeeper... (2) -> (3)
   [junit4]   2> 686536 INFO  (zkCallback-7557-thread-1) [    ] o.a.s.c.c.ZkStateReader Updated live nodes from ZooKeeper... (2) -> (3)
   [junit4]   2> 686538 INFO  (closeThreadPool-7528-thread-3) [    ] o.e.j.s.session DefaultSessionIdManager workerName=node0
   [junit4]   2> 686538 INFO  (closeThreadPool-7528-thread-3) [    ] o.e.j.s.session No SessionScavenger set, using defaults
   [junit4]   2> 686538 INFO  (closeThreadPool-7528-thread-3) [    ] o.e.j.s.session node0 Scavenging every 660000ms
   [junit4]   2> 686538 INFO  (closeThreadPool-7528-thread-3) [    ] o.e.j.s.h.ContextHandler Started o.e.j.s.ServletContextHandler@5a7fcaea{/_yq,null,AVAILABLE}
   [junit4]   2> 686538 INFO  (closeThreadPool-7528-thread-3) [    ] o.e.j.s.AbstractConnector Started ServerConnector@2a954f9d{HTTP/1.1,[http/1.1, h2c]}{127.0.0.1:40819}
   [junit4]   2> 686538 INFO  (closeThreadPool-7528-thread-3) [    ] o.e.j.s.Server Started @686569ms
   [junit4]   2> 686538 INFO  (closeThreadPool-7528-thread-3) [    ] o.a.s.c.s.e.JettySolrRunner Jetty properties: {hostContext=/_yq, solrconfig=solrconfig.xml, solr.data.dir=/home/jenkins/workspace/Lucene-Solr-8.x-Linux/solr/build/solr-core/test/J1/temp/solr.update.TestInPlaceUpdatesDistrib_C1959AC1FC269610-001/tempDir-001/jetty3, hostPort=40819, coreRootDirectory=/home/jenkins/workspace/Lucene-Solr-8.x-Linux/solr/build/solr-core/test/J1/temp/solr.update.TestInPlaceUpdatesDistrib_C1959AC1FC269610-001/shard-3-001/cores}
   [junit4]   2> 686538 ERROR (closeThreadPool-7528-thread-3) [    ] o.a.s.u.StartupLoggingUtils Missing Java Option solr.log.dir. Logging may be missing or incomplete.
   [junit4]   2> 686538 INFO  (closeThreadPool-7528-thread-3) [    ] o.a.s.s.SolrDispatchFilter Using logger factory org.apache.logging.slf4j.Log4jLoggerFactory
   [junit4]   2> 686538 INFO  (closeThreadPool-7528-thread-3) [    ] o.a.s.s.SolrDispatchFilter  ___      _       Welcome to Apache Solr™ version 8.2.0
   [junit4]   2> 686538 INFO  (closeThreadPool-7528-thread-3) [    ] o.a.s.s.SolrDispatchFilter / __| ___| |_ _   Starting in cloud mode on port null
   [junit4]   2> 686538 INFO  (closeThreadPool-7528-thread-3) [    ] o.a.s.s.SolrDispatchFilter \__ \/ _ \ | '_|  Install dir: null
   [junit4]   2> 686538 INFO  (closeThreadPool-7528-thread-3) [    ] o.a.s.s.SolrDispatchFilter |___/\___/_|_|    Start time: 2019-05-02T12:01:02.412792Z
   [junit4]   2> 686541 INFO  (zkConnectionManagerCallback-7565-thread-1) [    ] o.a.s.c.c.ConnectionManager zkClient has connected
   [junit4]   2> 686542 INFO  (closeThreadPool-7528-thread-2) [n:127.0.0.1:44507__yq    ] o.a.s.c.c.ZkStateReader Updated live nodes from ZooKeeper... (0) -> (3)
   [junit4]   2> 686542 INFO  (closeThreadPool-7528-thread-2) [n:127.0.0.1:44507__yq    ] o.a.s.c.s.i.ZkClientClusterStateProvider Cluster at 127.0.0.1:46727/solr ready
   [junit4]   2> 686550 INFO  (closeThreadPool-7528-thread-2) [n:127.0.0.1:44507__yq    ] o.a.s.h.a.MetricsHistoryHandler No .system collection, keeping metrics history in memory.
   [junit4]   2> 686580 INFO  (closeThreadPool-7528-thread-2) [n:127.0.0.1:44507__yq    ] o.a.s.m.r.SolrJmxReporter JMX monitoring for 'solr.node' (registry 'solr.node') enabled at server: com.sun.jmx.mbeanserver.JmxMBeanServer@5a904e72
   [junit4]   2> 686588 INFO  (closeThreadPool-7528-thread-2) [n:127.0.0.1:44507__yq    ] o.a.s.m.r.SolrJmxReporter JMX monitoring for 'solr.jvm' (registry 'solr.jvm') enabled at server: com.sun.jmx.mbeanserver.JmxMBeanServer@5a904e72
   [junit4]   2> 686588 INFO  (closeThreadPool-7528-thread-2) [n:127.0.0.1:44507__yq    ] o.a.s.m.r.SolrJmxReporter JMX monitoring for 'solr.jetty' (registry 'solr.jetty') enabled at server: com.sun.jmx.mbeanserver.JmxMBeanServer@5a904e72
   [junit4]   2> 686589 INFO  (closeThreadPool-7528-thread-2) [n:127.0.0.1:44507__yq    ] o.a.s.c.CorePropertiesLocator Found 0 core definitions underneath /home/jenkins/workspace/Lucene-Solr-8.x-Linux/solr/build/solr-core/test/J1/temp/solr.update.TestInPlaceUpdatesDistrib_C1959AC1FC269610-001/shard-2-001/cores
   [junit4]   2> 686589 INFO  (zkConnectionManagerCallback-7567-thread-1) [    ] o.a.s.c.c.ConnectionManager zkClient has connected
   [junit4]   2> 686590 INFO  (closeThreadPool-7528-thread-3) [    ] o.a.s.s.SolrDispatchFilter Loading solr.xml from SolrHome (not found in ZooKeeper)
   [junit4]   2> 686590 INFO  (closeThreadPool-7528-thread-3) [    ] o.a.s.c.SolrXmlConfig Loading container configuration from /home/jenkins/workspace/Lucene-Solr-8.x-Linux/solr/build/solr-core/test/J1/temp/solr.update.TestInPlaceUpdatesDistrib_C1959AC1FC269610-001/shard-3-001/solr.xml
   [junit4]   2> 686592 INFO  (closeThreadPool-7528-thread-3) [    ] o.a.s.c.SolrXmlConfig Configuration parameter autoReplicaFailoverWorkLoopDelay is ignored
   [junit4]   2> 686592 INFO  (closeThreadPool-7528-thread-3) [    ] o.a.s.c.SolrXmlConfig Configuration parameter autoReplicaFailoverBadNodeExpiration is ignored
   [junit4]   2> 686593 INFO  (closeThreadPool-7528-thread-3) [    ] o.a.s.c.SolrXmlConfig MBean server found: com.sun.jmx.mbeanserver.JmxMBeanServer@5a904e72, but no JMX reporters were configured - adding default JMX reporter.
   [junit4]   2> 686638 INFO  (closeThreadPool-7528-thread-3) [    ] o.a.s.h.c.HttpShardHandlerFactory Host whitelist initialized: WhitelistHostChecker [whitelistHosts=null, whitelistHostCheckingEnabled=false]
   [junit4]   2> 686639 WARN  (closeThreadPool-7528-thread-3) [    ] o.e.j.u.s.S.config No Client EndPointIdentificationAlgorithm configured for SslContextFactory@2bf981d1[provider=null,keyStore=null,trustStore=null]
   [junit4]   2> 686641 WARN  (closeThreadPool-7528-thread-3) [    ] o.e.j.u.s.S.config No Client EndPointIdentificationAlgorithm configured for SslContextFactory@46f60e5e[provider=null,keyStore=null,trustStore=null]
   [junit4]   2> 686641 INFO  (closeThreadPool-7528-thread-3) [    ] o.a.s.c.ZkContainer Zookeeper client=127.0.0.1:46727/solr
   [junit4]   2> 686642 INFO  (zkConnectionManagerCallback-7575-thread-1) [    ] o.a.s.c.c.ConnectionManager zkClient has connected
   [junit4]   2> 686645 INFO  (zkConnectionManagerCallback-7577-thread-1) [    ] o.a.s.c.c.ConnectionManager zkClient has connected
   [junit4]   2> 686647 INFO  (closeThreadPool-7528-thread-3) [n:127.0.0.1:40819__yq    ] o.a.s.c.c.ZkStateReader Updated live nodes from ZooKeeper... (0) -> (3)
   [junit4]   2> 686648 INFO  (closeThreadPool-7528-thread-3) [n:127.0.0.1:40819__yq    ] o.a.s.c.ZkController Publish node=127.0.0.1:40819__yq as DOWN
   [junit4]   2> 686648 INFO  (closeThreadPool-7528-thread-3) [n:127.0.0.1:40819__yq    ] o.a.s.c.TransientSolrCoreCacheDefault Allocating transient cache for 4 transient cores
   [junit4]   2> 686648 INFO  (closeThreadPool-7528-thread-3) [n:127.0.0.1:40819__yq    ] o.a.s.c.ZkController Register node as live in ZooKeeper:/live_nodes/127.0.0.1:40819__yq
   [junit4]   2> 686649 INFO  (zkCallback-7541-thread-1) [    ] o.a.s.c.c.ZkStateReader Updated live nodes from ZooKeeper... (3) -> (4)
   [junit4]   2> 686649 INFO  (zkCallback-7557-thread-1) [    ] o.a.s.c.c.ZkStateReader Updated live nodes from ZooKeeper... (3) -> (4)
   [junit4]   2> 686649 INFO  (zkCallback-7514-thread-1) [    ] o.a.s.c.c.ZkStateReader Updated live nodes from ZooKeeper... (3) -> (4)
   [junit4]   2> 686649 INFO  (zkCallback-7507-thread-1) [    ] o.a.s.c.c.ZkStateReader Updated live nodes from ZooKeeper... (3) -> (4)
   [junit4]   2> 686649 INFO  (zkCallback-7526-thread-1) [    ] o.a.s.c.c.ZkStateReader Updated live nodes from ZooKeeper... (3) -> (4)
   [junit4]   2> 686649 INFO  (zkCallback-7548-thread-1) [    ] o.a.s.c.c.ZkStateReader Updated live nodes from ZooKeeper... (3) -> (4)
   [junit4]   2> 686649 INFO  (zkCallback-7576-thread-1) [    ] o.a.s.c.c.ZkStateReader Updated live nodes from ZooKeeper... (3) -> (4)
   [junit4]   2> 686658 INFO  (zkCallback-7564-thread-1) [    ] o.a.s.c.c.ZkStateReader Updated live nodes from ZooKeeper... (3) -> (4)
   [junit4]   2> 686659 INFO  (zkConnectionManagerCallback-7584-thread-1) [    ] o.a.s.c.c.ConnectionManager zkClient has connected
   [junit4]   2> 686659 INFO  (closeThreadPool-7528-thread-3) [n:127.0.0.1:40819__yq    ] o.a.s.c.c.ZkStateReader Updated live nodes from ZooKeeper... (0) -> (4)
   [junit4]   2> 686660 INFO  (closeThreadPool-7528-thread-3) [n:127.0.0.1:40819__yq    ] o.a.s.c.s.i.ZkClientClusterStateProvider Cluster at 127.0.0.1:46727/solr ready
   [junit4]   2> 686660 INFO  (closeThreadPool-7528-thread-3) [n:127.0.0.1:40819__yq    ] o.a.s.h.a.MetricsHistoryHandler No .system collection, keeping metrics history in memory.
   [junit4]   2> 686675 INFO  (closeThreadPool-7528-thread-3) [n:127.0.0.1:40819__yq    ] o.a.s.m.r.SolrJmxReporter JMX monitoring for 'solr.node' (registry 'solr.node') enabled at server: com.sun.jmx.mbeanserver.JmxMBeanServer@5a904e72
   [junit4]   2> 686684 INFO  (closeThreadPool-7528-thread-3) [n:127.0.0.1:40819__yq    ] o.a.s.m.r.SolrJmxReporter JMX monitoring for 'solr.jvm' (registry 'solr.jvm') enabled at server: com.sun.jmx.mbeanserver.JmxMBeanServer@5a904e72
   [junit4]   2> 686684 INFO  (closeThreadPool-7528-thread-3) [n:127.0.0.1:40819__yq    ] o.a.s.m.r.SolrJmxReporter JMX monitoring for 'solr.jetty' (registry 'solr.jetty') enabled at server: com.sun.jmx.mbeanserver.JmxMBeanServer@5a904e72
   [junit4]   2> 686685 INFO  (closeThreadPool-7528-thread-3) [n:127.0.0.1:40819__yq    ] o.a.s.c.CorePropertiesLocator Found 0 core definitions underneath /home/jenkins/workspace/Lucene-Solr-8.x-Linux/solr/build/solr-core/test/J1/temp/solr.update.TestInPlaceUpdatesDistrib_C1959AC1FC269610-001/shard-3-001/cores
   [junit4]   2> 686729 INFO  (qtp1825165948-13883) [n:127.0.0.1:33425__yq    ] o.a.s.h.a.CollectionsHandler Invoked Collection Action :addreplica with params node=127.0.0.1:44507__yq&action=ADDREPLICA&collection=collection1&shard=shard1&type=NRT&wt=javabin&version=2 and sendToOCPQueue=true
   [junit4]   2> 686730 INFO  (qtp1825165948-13882) [n:127.0.0.1:33425__yq    ] o.a.s.h.a.CollectionsHandler Invoked Collection Action :addreplica with params node=127.0.0.1:40819__yq&action=ADDREPLICA&collection=collection1&shard=shard1&type=NRT&wt=javabin&version=2 and sendToOCPQueue=true
   [junit4]   2> 686730 INFO  (qtp1825165948-14042) [n:127.0.0.1:33425__yq    ] o.a.s.h.a.CollectionsHandler Invoked Collection Action :addreplica with params node=127.0.0.1:38171__yq&action=ADDREPLICA&collection=collection1&shard=shard1&type=NRT&wt=javabin&version=2 and sendToOCPQueue=true
   [junit4]   2> 686734 INFO  (OverseerCollectionConfigSetProcessor-72181705817522180-127.0.0.1:33425__yq-n_0000000000) [    ] o.a.s.c.OverseerTaskQueue Response ZK path: /overseer/collection-queue-work/qnr-0000000002 doesn't exist.  Requestor may have disconnected from ZooKeeper
   [junit4]   2> 686734 INFO  (OverseerThreadFactory-3821-thread-3) [ c:collection1 s:shard1  ] o.a.s.c.a.c.AddReplicaCmd Node Identified 127.0.0.1:44507__yq for creating new replica of shard shard1 for collection collection1
   [junit4]   2> 686735 INFO  (OverseerThreadFactory-3821-thread-3) [ c:collection1 s:shard1  ] o.a.s.c.a.c.AddReplicaCmd Returning CreateReplica command.
   [junit4]   2> 686737 INFO  (qtp167583096-13959) [n:127.0.0.1:44507__yq    x:collection1_shard1_replica_n1] o.a.s.h.a.CoreAdminOperation core create command qt=/admin/cores&collection.configName=conf1&name=collection1_shard1_replica_n1&action=CREATE&collection=collection1&shard=shard1&wt=javabin&version=2&replicaType=NRT
   [junit4]   2> 687744 INFO  (qtp167583096-13959) [n:127.0.0.1:44507__yq c:collection1 s:shard1  x:collection1_shard1_replica_n1] o.a.s.c.SolrConfig Using Lucene MatchVersion: 8.2.0
   [junit4]   2> 687760 INFO  (qtp167583096-13959) [n:127.0.0.1:44507__yq c:collection1 s:shard1  x:collection1_shard1_replica_n1] o.a.s.s.IndexSchema [collection1_shard1_replica_n1] Schema name=inplace-updates
   [junit4]   2> 687761 INFO  (qtp167583096-13959) [n:127.0.0.1:44507__yq c:collection1 s:shard1  x:collection1_shard1_replica_n1] o.a.s.s.IndexSchema Loaded schema inplace-updates/1.6 with uniqueid field id
   [junit4]   2> 687761 INFO  (qtp167583096-13959) [n:127.0.0.1:44507__yq c:collection1 s:shard1  x:collection1_shard1_replica_n1] o.a.s.c.CoreContainer Creating SolrCore 'collection1_shard1_replica_n1' using configuration from collection collection1, trusted=true
   [junit4]   2> 687762 INFO  (qtp167583096-13959) [n:127.0.0.1:44507__yq c:collection1 s:shard1  x:collection1_shard1_replica_n1] o.a.s.m.r.SolrJmxReporter JMX monitoring for 'solr.core.collection1.shard1.replica_n1' (registry 'solr.core.collection1.shard1.replica_n1') enabled at server: com.sun.jmx.mbeanserver.JmxMBeanServer@5a904e72
   [junit4]   2> 687762 INFO  (qtp167583096-13959) [n:127.0.0.1:44507__yq c:collection1 s:shard1  x:collection1_shard1_replica_n1] o.a.s.c.SolrCore [[collection1_shard1_replica_n1] ] Opening new SolrCore at [/home/jenkins/workspace/Lucene-Solr-8.x-Linux/solr/build/solr-core/test/J1/temp/solr.update.TestInPlaceUpdatesDistrib_C1959AC1FC269610-001/shard-2-001/cores/collection1_shard1_replica_n1], dataDir=[/home/jenkins/workspace/Lucene-Solr-8.x-Linux/solr/build/solr-core/test/J1/temp/solr.update.TestInPlaceUpdatesDistrib_C1959AC1FC269610-001/shard-2-001/cores/collection1_shard1_replica_n1/data/]
   [junit4]   2> 687764 WARN  (qtp167583096-13959) [n:127.0.0.1:44507__yq c:collection1 s:shard1  x:collection1_shard1_replica_n1] o.a.s.c.RequestHandlers INVALID paramSet a in requestHandler {type = requestHandler,name = /dump,class = DumpRequestHandler,attributes = {initParams=a, name=/dump, class=DumpRequestHandler},args = {defaults={a=A,b=B}}}
   [junit4]   2> 687789 INFO  (qtp167583096-13959) [n:127.0.0.1:44507__yq c:collection1 s:shard1  x:collection1_shard1_replica_n1] o.a.s.u.UpdateHandler Using UpdateLog implementation: org.apache.solr.update.UpdateLog
   [junit4]   2> 687789 INFO  (qtp167583096-13959) [n:127.0.0.1:44507__yq c:collection1 s:shard1  x:collection1_shard1_replica_n1] o.a.s.u.UpdateLog Initializing UpdateLog: dataDir= defaultSyncLevel=FLUSH numRecordsToKeep=100 maxNumLogsToKeep=10 numVersionBuckets=65536
   [junit4]   2> 687796 INFO  (qtp167583096-13959) [n:127.0.0.1:44507__yq c:collection1 s:shard1  x:collection1_shard1_replica_n1] o.a.s.u.CommitTracker Hard AutoCommit: disabled
   [junit4]   2> 687796 INFO  (qtp167583096-13959) [n:127.0.0.1:44507__yq c:collection1 s:shard1  x:collection1_shard1_replica_n1] o.a.s.u.CommitTracker Soft AutoCommit: disabled
   [junit4]   2> 687797 INFO  (qtp167583096-13959) [n:127.0.0.1:44507__yq c:collection1 s:shard1  x:collection1_shard1_replica_n1] o.a.s.s.SolrIndexSearcher Opening [Searcher@79b1714c[collection1_shard1_replica_n1] main]
   [junit4]   2> 687798 INFO  (qtp167583096-13959) [n:127.0.0.1:44507__yq c:collection1 s:shard1  x:collection1_shard1_replica_n1] o.a.s.r.ManagedResourceStorage Configured ZooKeeperStorageIO with znodeBase: /configs/conf1
   [junit4]   2> 687798 INFO  (qtp167583096-13959) [n:127.0.0.1:44507__yq c:collection1 s:shard1  x:collection1_shard1_replica_n1] o.a.s.r.ManagedResourceStorage Loaded null at path _rest_managed.json using ZooKeeperStorageIO:path=/configs/conf1
   [junit4]   2> 687799 INFO  (qtp167583096-13959) [n:127.0.0.1:44507__yq c:collection1 s:shard1  x:collection1_shard1_replica_n1] o.a.s.h.ReplicationHandler Commits will be reserved for 10000ms.
   [junit4]   2> 687799 INFO  (qtp167583096-13959) [n:127.0.0.1:44507__yq c:collection1 s:shard1  x:collection1_shard1_replica_n1] o.a.s.u.UpdateLog Could not find max version in index or recent updates, using new clock 1632421505844379648
   [junit4]   2> 687801 INFO  (searcherExecutor-3858-thread-1-processing-n:127.0.0.1:44507__yq x:collection1_shard1_replica_n1 c:collection1 s:shard1) [n:127.0.0.1:44507__yq c:collection1 s:shard1  x:collection1_shard1_replica_n1] o.a.s.c.SolrCore [collection1_shard1_replica_n1] Registered new searcher Searcher@79b1714c[collection1_shard1_replica_n1] main{ExitableDirectoryReader(UninvertingDirectoryReader())}
   [junit4]   2> 687802 INFO  (qtp167583096-13959) [n:127.0.0.1:44507__yq c:collection1 s:shard1  x:collection1_shard1_replica_n1] o.a.s.c.ZkShardTerms Successful update of terms at /collections/collection1/terms/shard1 to Terms{values={core_node2=0}, version=0}
   [junit4]   2> 687802 INFO  (qtp167583096-13959) [n:127.0.0.1:44507__yq c:collection1 s:shard1  x:collection1_shard1_replica_n1] o.a.s.c.ShardLeaderElectionContextBase make sure parent is created /collections/collection1/leaders/shard1
   [junit4]   2> 687803 INFO  (qtp167583096-13959) [n:127.0.0.1:44507__yq c:collection1 s:shard1  x:collection1_shard1_replica_n1] o.a.s.c.ShardLeaderElectionContext Enough replicas found to continue.
   [junit4]   2> 687803 INFO  (qtp167583096-13959) [n:127.0.0.1:44507__yq c:collection1 s:shard1  x:collection1_shard1_replica_n1] o.a.s.c.ShardLeaderElectionContext I may be the new leader - try and sync
   [junit4]   2> 687803 INFO  (qtp167583096-13959) [n:127.0.0.1:44507__yq c:collection1 s:shard1  x:collection1_shard1_replica_n1] o.a.s.c.SyncStrategy Sync replicas to http://127.0.0.1:44507/_yq/collection1_shard1_replica_n1/
   [junit4]   2> 687803 INFO  (qtp167583096-13959) [n:127.0.0.1:44507__yq c:collection1 s:shard1  x:collection1_shard1_replica_n1] o.a.s.c.SyncStrategy Sync Success - now sync replicas to me
   [junit4]   2> 687803 INFO  (qtp167583096-13959) [n:127.0.0.1:44507__yq c:collection1 s:shard1  x:collection1_shard1_replica_n1] o.a.s.c.SyncStrategy http://127.0.0.1:44507/_yq/collection1_shard1_replica_n1/ has no replicas
   [junit4]   2> 687803 INFO  (qtp167583096-13959) [n:127.0.0.1:44507__yq c:collection1 s:shard1  x:collection1_shard1_replica_n1] o.a.s.c.ShardLeaderElectionContextBase Creating leader registration node /collections/collection1/leaders/shard1/leader after winning as /collections/collection1/leader_elect/shard1/election/72181705817522190-core_node2-n_0000000000
   [junit4]   2> 687804 INFO  (qtp167583096-13959) [n:127.0.0.1:44507__yq c:collection1 s:shard1  x:collection1_shard1_replica_n1] o.a.s.c.ShardLeaderElectionContext I am the new leader: http://127.0.0.1:44507/_yq/collection1_shard1_replica_n1/ shard1
   [junit4]   2> 687905 INFO  (qtp167583096-13959) [n:127.0.0.1:44507__yq c:collection1 s:shard1  x:collection1_shard1_replica_n1] o.a.s.c.ZkController I am the leader, no recovery necessary
   [junit4]   2> 687906 INFO  (qtp167583096-13959) [n:127.0.0.1:44507__yq c:collection1 s:shard1  x:collection1_shard1_replica_n1] o.a.s.s.HttpSolrCall [admin] webapp=null path=/admin/cores params={qt=/admin/cores&collection.configName=conf1&name=collection1_shard1_replica_n1&action=CREATE&collection=collection1&shard=shard1&wt=javabin&version=2&replicaType=NRT} status=0 QTime=1169
   [junit

[...truncated too long message...]

 = null, agent id = null] for registry solr.jetty / com.codahale.metrics.MetricRegistry@6bfd108b
   [junit4]   2> NOTE: leaving temporary files on disk at: /home/jenkins/workspace/Lucene-Solr-8.x-Linux/solr/build/solr-core/test/J2/temp/solr.update.PeerSyncWithLeaderTest_C1959AC1FC269610-001
   [junit4]   2> NOTE: test params are: codec=Asserting(Lucene80): {title_stringNoNorms=Lucene50(blocksize=128), title_stemmed=PostingsFormat(name=LuceneVarGapDocFreqInterval), multiDefault=Lucene50(blocksize=128), _root_=PostingsFormat(name=LuceneVarGapDocFreqInterval), id=PostingsFormat(name=Direct), text=BlockTreeOrds(blocksize=128), title=PostingsFormat(name=LuceneVarGapDocFreqInterval), title_lettertok=PostingsFormat(name=Direct)}, docValues:{range_facet_l_dv=DocValuesFormat(name=Lucene80), _version_=DocValuesFormat(name=Lucene80), val_i_dvo=DocValuesFormat(name=Asserting), range_facet_i_dv=DocValuesFormat(name=Direct), intDvoDefault=DocValuesFormat(name=Lucene80), timestamp=DocValuesFormat(name=Direct)}, maxPointsInLeafNode=818, maxMBSortInHeap=6.620243339426104, sim=Asserting(org.apache.lucene.search.similarities.AssertingSimilarity@272fa3b8), locale=ig, timezone=Australia/Canberra
   [junit4]   2> NOTE: Linux 4.18.0-17-generic amd64/Oracle Corporation 13-ea (64-bit)/cpus=8,threads=1,free=120436888,total=536870912
   [junit4]   2> NOTE: All tests run in this JVM: [SolrCloudExampleTest, TestNumericRangeQuery32, DebugComponentTest, AutoscalingHistoryHandlerTest, HDFSCollectionsAPITest, TestSystemIdResolver, TestSchemaResource, SolrCmdDistributorTest, DistributedIntervalFacetingTest, NodeAddedTriggerTest, AsyncCallRequestStatusResponseTest, PhrasesIdentificationComponentTest, SearchHandlerTest, TestExpandComponent, TestFieldCacheSortRandom, RestartWhileUpdatingTest, ForceLeaderTest, TestCloudConsistency, TestCharFilters, TestRecovery, TestImplicitCoreProperties, TestSimExtremeIndexing, TestCollationFieldDocValues, TestSerializedLuceneMatchVersion, TestManagedResource, BadComponentTest, TestCloudJSONFacetSKG, SolrJmxReporterTest, TestSolrCloudWithSecureImpersonation, TestTrie, TestDocumentBuilder, TestIBSimilarityFactory, UnloadDistributedZkTest, AssignBackwardCompatibilityTest, DistributedFacetPivotSmallAdvancedTest, HdfsUnloadDistributedZkTest, NodeMarkersRegistrationTest, TestTolerantUpdateProcessorRandomCloud, TestZkAclsWithHadoopAuth, TestSlowCompositeReaderWrapper, SolrRequestParserTest, MetricTriggerIntegrationTest, URLClassifyProcessorTest, FastVectorHighlighterTest, BasicZkTest, ReplaceNodeNoTargetTest, SolrMetricsIntegrationTest, CdcrBootstrapTest, TestRebalanceLeaders, DistributedQueryElevationComponentTest, DocumentBuilderTest, RankQueryTest, TestAnalyzeInfixSuggestions, DistributedQueueTest, CloudMLTQParserTest, BlockJoinFacetDistribTest, CdcrRequestHandlerTest, TestSolr4Spatial2, RAMDirectoryFactoryTest, SolrTestCaseJ4Test, SpellCheckCollatorWithCollapseTest, HealthCheckHandlerTest, CollectionsAPISolrJTest, TestConfigSetsAPIZkFailure, TestDelegationWithHadoopAuth, TestSimDistribStateManager, MoveReplicaTest, HdfsChaosMonkeyNothingIsSafeTest, CustomCollectionTest, ZkShardTermsTest, UUIDFieldTest, TestSuggestSpellingConverter, TestSortByMinMaxFunction, UpdateLogTest, TestReloadDeadlock, TestSQLHandlerNonCloud, RecoveryZkTest, TestManagedSynonymFilterFactory, CoreSorterTest, FieldAnalysisRequestHandlerTest, DateRangeFieldTest, BitVectorTest, DistributedTermsComponentTest, TestConfigSetProperties, TriggerSetPropertiesIntegrationTest, TestSolrQueryResponse, TestSimTriggerIntegration, AtomicUpdatesTest, TestHighFrequencyDictionaryFactory, TestBulkSchemaAPI, AddSchemaFieldsUpdateProcessorFactoryTest, TriggerCooldownIntegrationTest, TestInPlaceUpdatesRequiredField, TestDefaultStatsCache, TestSegmentSorting, TestConfigReload, TestLegacyNumericUtils, TestFastOutputStream, OverseerRolesTest, TestPayloadScoreQParserPlugin, TestFunctionQuery, CoreAdminOperationTest, TestUninvertingReader, LeaderElectionTest, ConvertedLegacyTest, TimeZoneUtilsTest, OverseerTest, AlternateDirectoryTest, SearchRateTriggerTest, TestFoldingMultitermQuery, LeaderTragicEventTest, HttpSolrCallGetCoreTest, TestLeaderElectionZkExpiry, TestSurroundQueryParser, TestSortableTextField, PingRequestHandlerTest, TemplateUpdateProcessorTest, TestLuceneIndexBackCompat, TestRequestStatusCollectionAPI, TestFieldTypeCollectionResource, TestStreamBody, SystemInfoHandlerTest, SortSpecParsingTest, DistributedMLTComponentTest, TestJavabinTupleStreamParser, PrimUtilsTest, TestLegacyBM25SimilarityFactory, TestPointFields, CollectionsAPIAsyncDistributedZkTest, SimpleCollectionCreateDeleteTest, TestRawResponseWriter, TestJmxIntegration, SOLR749Test, TestHdfsCloudBackupRestore, RangeFacetCloudTest, BlockDirectoryTest, RegexBoostProcessorTest, MetricsHistoryIntegrationTest, ZkControllerTest, SynonymTokenizerTest, ConnectionManagerTest, EchoParamsTest, MinimalSchemaTest, OutputWriterTest, TestCrossCoreJoin, TestCursorMarkWithoutUniqueKey, TestDistributedGrouping, TestGroupingSearch, TestHighlightDedupGrouping, TestJoin, TestRandomDVFaceting, TestRandomFaceting, TestSimpleTrackingShardHandler, TestDeprecatedFilters, TestLuceneMatchVersion, TestReversedWildcardFilterFactory, TestEmbeddedSolrServerAdminHandler, TestEmbeddedSolrServerConstructors, TestEmbeddedSolrServerSchemaAPI, TestJettySolrRunner, ConnectionReuseTest, ActionThrottleTest, ChaosMonkeyNothingIsSafeTest, ChaosMonkeyNothingIsSafeWithPullReplicasTest, ChaosMonkeySafeLeaderTest, ChaosMonkeySafeLeaderWithPullReplicasTest, ClusterStateTest, ClusterStateUpdateTest, CreateCollectionCleanupTest, DeleteInactiveReplicaTest, DeleteNodeTest, DeleteStatusTest, HttpPartitionOnCommitTest, HttpPartitionWithTlogReplicasTest, RollingRestartTest, SyncSliceTest, TestClusterProperties, TestCryptoKeys, TestDistributedMap, TestDownShardTolerantSearch, TestLockTree, TestMiniSolrCloudClusterSSL, TestPrepRecovery, TestSizeLimitedDistributedMap, TestSkipOverseerOperations, TestStressLiveNodes, TestWithCollection, HdfsAutoAddReplicasIntegrationTest, RestoreTriggerStateTest, TestSimGenericDistributedQueue, TestSimNodeAddedTrigger, HdfsChaosMonkeySafeLeaderTest, HdfsRecoverLeaseTest, HdfsSyncSliceTest, StressHdfsTest, ZkStateReaderTest, ImplicitSnitchTest, BlobRepositoryCloudTest, SolrCoreCheckLockOnStartupTest, SolrCoreTest, TestBadConfig, TestConfigSets, TestCoreDiscovery, TestCustomStream, TestMergePolicyConfig, TestQuerySenderListener, TestReloadAndDeleteDocs, TestSolrDeletionPolicy1, TestSolrDeletionPolicy2, TestSolrIndexConfig, TestSolrXml, TestXIncludeConfig, TestSolrCloudSnapshots, TestReplicationHandlerBackup, TestReplicationHandlerDiskOverFlow, TestReqParamsAPI, TestSolrConfigHandlerConcurrent, TestSystemCollAutoCreate, V2StandaloneTest, XmlUpdateRequestHandlerTest, CoreMergeIndexesAdminHandlerTest, DaemonStreamApiTest, MetricsHistoryHandlerTest, ReplicaListTransformerTest, ResponseLogComponentTest, SearchHandlerTest, SuggestComponentContextFilterQueryTest, SuggestComponentTest, TestExportWriter, Tagger2Test, HighlighterConfigTest, UninvertDocValuesMergePolicyTest, TestNumericRangeQuery64, SolrCloudReportersTest, SolrRrdBackendFactoryTest, ChangedSchemaMergeTest, DocValuesMissingTest, ExternalFileFieldSortTest, IndexSchemaRuntimeFieldTest, ManagedSchemaRoundRobinCloudTest, PreAnalyzedFieldTest, RequiredFieldsTest, SchemaVersionSpecificBehaviorTest, TestBulkSchemaConcurrent, AnalyticsMergeStrategyTest, LargeFieldTest, MergeStrategyTest, TestDocSet, TestExtendedDismaxParser, TestInitQParser, TestLFUCache, TestStressLucene, TestTrieFacet, TestValueSourceCache, TestJsonFacetRefinement, TestCloudNestedDocsSort, SimpleMLTQParserTest, TestBM25SimilarityFactory, TestClassicSimilarityFactory, TestNonDefinedSimilarityFactory, TestPerFieldSimilarity, TestPerFieldSimilarityWithDefaultOverride, TestDistribIDF, TestLRUStatsCache, AuditLoggerPluginTest, BasicAuthIntegrationTest, JWTAuthPluginTest, MultiDestinationAuditLoggerTest, PKIAuthenticationIntegrationTest, SolrLogAuditLoggerPluginTest, TestPKIAuthenticationPlugin, ConjunctionSolrSpellCheckerTest, DirectSolrSpellCheckerTest, FileBasedSpellCheckerTest, WordBreakSolrSpellCheckerTest, SuggesterFSTTest, SuggesterTSTTest, TestAnalyzedSuggestions, TestFileDictionaryLookup, HdfsLockFactoryTest, TestDocTermOrds, TestDocTermOrdsUninvertLimit, TestFieldCache, TestFieldCacheVsDocValues, TestFieldCacheWithThreads, TestLegacyFieldCache, AddBlockUpdateTest, AnalysisErrorHandlingTest, CdcrUpdateLogTest, MaxSizeAutoCommitTest, PeerSyncWithBufferUpdatesTest, PeerSyncWithIndexFingerprintCachingTest, PeerSyncWithLeaderAndIndexFingerprintCachingTest, PeerSyncWithLeaderTest]
   [junit4] Completed [818/855 (3!)] on J2 in 137.58s, 1 test, 1 failure <<< FAILURES!

[...truncated 9125 lines...]
BUILD FAILED
/home/jenkins/workspace/Lucene-Solr-8.x-Linux/build.xml:634: The following error occurred while executing this line:
/home/jenkins/workspace/Lucene-Solr-8.x-Linux/build.xml:128: Found 1 violations in source files (File uses Mockito but has no assumeWorkingMockito() call).

Total time: 71 minutes 38 seconds
Build step 'Invoke Ant' marked build as failure
Archiving artifacts
Setting ANT_1_8_2_HOME=/home/jenkins/tools/hudson.tasks.Ant_AntInstallation/ANT_1.8.2
[WARNINGS] Skipping publisher since build result is FAILURE
Recording test results
Setting ANT_1_8_2_HOME=/home/jenkins/tools/hudson.tasks.Ant_AntInstallation/ANT_1.8.2
Email was triggered for: Failure - Any
Sending email for trigger: Failure - Any
Setting ANT_1_8_2_HOME=/home/jenkins/tools/hudson.tasks.Ant_AntInstallation/ANT_1.8.2
Setting ANT_1_8_2_HOME=/home/jenkins/tools/hudson.tasks.Ant_AntInstallation/ANT_1.8.2
Setting ANT_1_8_2_HOME=/home/jenkins/tools/hudson.tasks.Ant_AntInstallation/ANT_1.8.2
Setting ANT_1_8_2_HOME=/home/jenkins/tools/hudson.tasks.Ant_AntInstallation/ANT_1.8.2
Setting ANT_1_8_2_HOME=/home/jenkins/tools/hudson.tasks.Ant_AntInstallation/ANT_1.8.2
Setting ANT_1_8_2_HOME=/home/jenkins/tools/hudson.tasks.Ant_AntInstallation/ANT_1.8.2

Mime
View raw message