lucene-dev mailing list archives

Site index · List index
Message view « Date » · « Thread »
Top « Date » · « Thread »
From Apache Jenkins Server <jenk...@builds.apache.org>
Subject [JENKINS] Lucene-Solr-NightlyTests-7.6 - Build # 19 - Still Failing
Date Wed, 05 Dec 2018 13:18:55 GMT
Build: https://builds.apache.org/job/Lucene-Solr-NightlyTests-7.6/19/

2 tests failed.
FAILED:  org.apache.solr.cloud.FullSolrCloudDistribCmdsTest.test

Error Message:
Test abandoned because suite timeout was reached.

Stack Trace:
java.lang.Exception: Test abandoned because suite timeout was reached.
	at __randomizedtesting.SeedInfo.seed([3E071D1F411644D8]:0)


FAILED:  junit.framework.TestSuite.org.apache.solr.cloud.FullSolrCloudDistribCmdsTest

Error Message:
Suite timeout exceeded (>= 7200000 msec).

Stack Trace:
java.lang.Exception: Suite timeout exceeded (>= 7200000 msec).
	at __randomizedtesting.SeedInfo.seed([3E071D1F411644D8]:0)




Build Log:
[...truncated 10 lines...]
ERROR: Error cloning remote repo 'origin'
hudson.plugins.git.GitException: Command "git fetch --tags --progress git://git.apache.org/lucene-solr.git +refs/heads/*:refs/remotes/origin/*" returned status code 128:
stdout: 
stderr: remote: Counting objects: 141049           
remote: Counting objects: 288419           
remote: Counting objects: 440659           
remote: Counting objects: 553622           
remote: Counting objects: 674986           
remote: Counting objects: 825560           
remote: Counting objects: 994551           
remote: Counting objects: 1008930, done.        
remote: Compressing objects:   0% (1/195911)           
remote: Compressing objects:   1% (1960/195911)           
remote: Compressing objects:   2% (3919/195911)           
remote: Compressing objects:   3% (5878/195911)           
remote: Compressing objects:   4% (7837/195911)           
remote: Compressing objects:   5% (9796/195911)           
remote: Compressing objects:   6% (11755/195911)           
remote: Compressing objects:   7% (13714/195911)           
remote: Compressing objects:   8% (15673/195911)           
remote: Compressing objects:   9% (17632/195911)           
remote: Compressing objects:  10% (19592/195911)           
remote: Compressing objects:  11% (21551/195911)           
remote: Compressing objects:  12% (23510/195911)           
remote: Compressing objects:  13% (25469/195911)           
remote: Compressing objects:  14% (27428/195911)           
remote: Compressing objects:  15% (29387/195911)           
remote: Compressing objects:  16% (31346/195911)           
remote: Compressing objects:  17% (33305/195911)           
remote: Compressing objects:  18% (35264/195911)           
remote: Compressing objects:  19% (37224/195911)           
remote: Compressing objects:  20% (39183/195911)           
remote: Compressing objects:  21% (41142/195911)           
remote: Compressing objects:  22% (43101/195911)           
remote: Compressing objects:  23% (45060/195911)           
remote: Compressing objects:  24% (47019/195911)           
remote: Compressing objects:  25% (48978/195911)           
remote: Compressing objects:  26% (50937/195911)           
remote: Compressing objects:  27% (52896/195911)           
remote: Compressing objects:  28% (54856/195911)           
remote: Compressing objects:  29% (56815/195911)           
remote: Compressing objects:  30% (58774/195911)           
remote: Compressing objects:  31% (60733/195911)           
remote: Compressing objects:  32% (62692/195911)           
remote: Compressing objects:  33% (64651/195911)           
remote: Compressing objects:  34% (66610/195911)           
remote: Compressing objects:  35% (68569/195911)           
remote: Compressing objects:  36% (70528/195911)           
remote: Compressing objects:  37% (72488/195911)           
remote: Compressing objects:  38% (74447/195911)           
remote: Compressing objects:  39% (76406/195911)           
remote: Compressing objects:  40% (78365/195911)           
remote: Compressing objects:  41% (80324/195911)           
remote: Compressing objects:  42% (82283/195911)           
remote: Compressing objects:  43% (84242/195911)           
remote: Compressing objects:  44% (86201/195911)           
remote: Compressing objects:  45% (88160/195911)           
remote: Compressing objects:  46% (90120/195911)           
remote: Compressing objects:  47% (92079/195911)           
remote: Compressing objects:  48% (94038/195911)           
remote: Compressing objects:  49% (95997/195911)           
remote: Compressing objects:  50% (97956/195911)           
remote: Compressing objects:  51% (99915/195911)           
remote: Compressing objects:  52% (101874/195911)           
remote: Compressing objects:  53% (103833/195911)           
remote: Compressing objects:  54% (105792/195911)           
remote: Compressing objects:  55% (107752/195911)           
remote: Compressing objects:  56% (109711/195911)           
remote: Compressing objects:  57% (111670/195911)           
remote: Compressing objects:  58% (113629/195911)           
remote: Compressing objects:  59% (115588/195911)           
remote: Compressing objects:  60% (117547/195911)           
remote: Compressing objects:  61% (119506/195911)           
remote: Compressing objects:  62% (121465/195911)           
remote: Compressing objects:  63% (123424/195911)           
remote: Compressing objects:  64% (125384/195911)           
remote: Compressing objects:  65% (127343/195911)           
remote: Compressing objects:  66% (129302/195911)           
remote: Compressing objects:  67% (131261/195911)           
remote: Compressing objects:  68% (133220/195911)           
remote: Compressing objects:  69% (135179/195911)           
remote: Compressing objects:  70% (137138/195911)           
remote: Compressing objects:  71% (139097/195911)           
remote: Compressing objects:  72% (141056/195911)           
remote: Compressing objects:  73% (143016/195911)           
remote: Compressing objects:  74% (144975/195911)           
remote: Compressing objects:  75% (146934/195911)           
remote: Compressing objects:  76% (148893/195911)           
remote: Compressing objects:  77% (150852/195911)           
remote: Compressing objects:  78% (152811/195911)           
remote: Compressing objects:  79% (154770/195911)           
remote: Compressing objects:  80% (156729/195911)           
remote: Compressing objects:  81% (158688/195911)           
remote: Compressing objects:  82% (160648/195911)           
remote: Compressing objects:  83% (162607/195911)           
remote: Compressing objects:  84% (164566/195911)           
remote: Compressing objects:  85% (166525/195911)           
remote: Compressing objects:  86% (168484/195911)           
remote: Compressing objects:  87% (170443/195911)           
remote: Compressing objects:  88% (172402/195911)           
remote: Compressing objects:  89% (174361/195911)           
remote: Compressing objects:  90% (176320/195911)           
remote: Compressing objects:  91% (178280/195911)           
remote: Compressing objects:  92% (180239/195911)           
remote: Compressing objects:  93% (182198/195911)           
remote: Compressing objects:  94% (184157/195911)           
remote: Compressing objects:  95% (186116/195911)           
remote: Compressing objects:  96% (188075/195911)           
remote: Compressing objects:  97% (190034/195911)           
remote: Compressing objects:  97% (190535/195911)           
remote: Compressing objects:  98% (191993/195911)           
remote: Compressing objects:  99% (193952/195911)           
remote: Compressing objects: 100% (195911/195911)           
remote: Compressing objects: 100% (195911/195911), done.        
Receiving objects:   0% (1/1008930)   
Receiving objects:   1% (10090/1008930), 1.85 MiB | 3.69 MiB/s   
Receiving objects:   2% (20179/1008930), 1.85 MiB | 3.69 MiB/s   
Receiving objects:   2% (29748/1008930), 1.85 MiB | 3.69 MiB/s   
Receiving objects:   3% (30268/1008930), 6.68 MiB | 6.67 MiB/s   
Receiving objects:   4% (40358/1008930), 6.68 MiB | 6.67 MiB/s   
Receiving objects:   5% (50447/1008930), 11.60 MiB | 7.72 MiB/s   
Receiving objects:   6% (60536/1008930), 11.60 MiB | 7.72 MiB/s   
Receiving objects:   7% (70626/1008930), 11.60 MiB | 7.72 MiB/s   
Receiving objects:   7% (79050/1008930), 11.60 MiB | 7.72 MiB/s   
Receiving objects:   8% (80715/1008930), 14.87 MiB | 7.42 MiB/s   
Receiving objects:   9% (90804/1008930), 14.87 MiB | 7.42 MiB/s   
Receiving objects:  10% (100893/1008930), 14.87 MiB | 7.42 MiB/s   
Receiving objects:  11% (110983/1008930), 14.87 MiB | 7.42 MiB/s   
Receiving objects:  12% (121072/1008930), 17.12 MiB | 6.83 MiB/s   
Receiving objects:  13% (131161/1008930), 17.12 MiB | 6.83 MiB/s   
Receiving objects:  13% (133316/1008930), 17.12 MiB | 6.83 MiB/s   
Receiving objects:  14% (141251/1008930), 18.41 MiB | 6.12 MiB/s   
Receiving objects:  15% (151340/1008930), 19.41 MiB | 5.53 MiB/s   
Receiving objects:  15% (159117/1008930), 19.41 MiB | 5.53 MiB/s   
Receiving objects:  16% (161429/1008930), 20.26 MiB | 5.05 MiB/s   
Receiving objects:  17% (171519/1008930), 20.92 MiB | 4.63 MiB/s   
Receiving objects:  17% (177379/1008930), 21.35 MiB | 4.32 MiB/s   
Receiving objects:  18% (181608/1008930), 21.35 MiB | 4.32 MiB/s   
Receiving objects:  18% (186574/1008930), 21.62 MiB | 3.31 MiB/s   
Receiving objects:  19% (191697/1008930), 22.21 MiB | 1.62 MiB/s   
Receiving objects:  19% (196501/1008930), 22.21 MiB | 1.62 MiB/s   
Receiving objects:  20% (201786/1008930), 22.51 MiB | 1.19 MiB/s   
Receiving objects:  20% (207499/1008930), 22.85 MiB | 1003.00 KiB/s   
Receiving objects:  21% (211876/1008930), 23.20 MiB | 855.00 KiB/s   
Receiving objects:  21% (219960/1008930), 23.57 MiB | 746.00 KiB/s   
Receiving objects:  22% (221965/1008930), 23.96 MiB | 688.00 KiB/s   
Receiving objects:  22% (231972/1008930), 24.37 MiB | 682.00 KiB/s   
Receiving objects:  23% (232054/1008930), 24.37 MiB | 682.00 KiB/s   
Receiving objects:  24% (242144/1008930), 25.14 MiB | 724.00 KiB/s   
Receiving objects:  24% (242218/1008930), 25.14 MiB | 724.00 KiB/s   
Receiving objects:  24% (250719/1008930), 25.71 MiB | 713.00 KiB/s   
Receiving objects:  25% (252233/1008930), 25.95 MiB | 691.00 KiB/s   
Receiving objects:  25% (259631/1008930), 26.21 MiB | 670.00 KiB/s   
Receiving objects:  26% (262322/1008930), 26.51 MiB | 654.00 KiB/s   
Receiving objects:  26% (269322/1008930), 26.80 MiB | 626.00 KiB/s   
Receiving objects:  27% (272412/1008930), 27.11 MiB | 607.00 KiB/s   
Receiving objects:  27% (279092/1008930), 27.43 MiB | 577.00 KiB/s   
Receiving objects:  28% (282501/1008930), 27.76 MiB | 581.00 KiB/s   
Receiving objects:  28% (288792/1008930), 28.09 MiB | 592.00 KiB/s   
Receiving objects:  29% (292590/1008930), 28.38 MiB | 593.00 KiB/s   
Receiving objects:  29% (297803/1008930), 28.72 MiB | 612.00 KiB/s   
Receiving objects:  30% (302679/1008930), 29.09 MiB | 639.00 KiB/s   
Receiving objects:  30% (307125/1008930), 29.39 MiB | 635.00 KiB/s   
Receiving objects:  31% (312769/1008930), 29.72 MiB | 642.00 KiB/s   
Receiving objects:  31% (316760/1008930), 30.04 MiB | 638.00 KiB/s   
Receiving objects:  32% (322858/1008930), 30.34 MiB | 632.00 KiB/s   
Receiving objects:  32% (324731/1008930), 30.61 MiB | 613.00 KiB/s   
Receiving objects:  32% (332420/1008930), 31.16 MiB | 597.00 KiB/s   
Receiving objects:  33% (332947/1008930), 31.16 MiB | 597.00 KiB/s   
Receiving objects:  33% (340927/1008930), 31.74 MiB | 568.00 KiB/s   
Receiving objects:  34% (343037/1008930), 31.74 MiB | 568.00 KiB/s   
Receiving objects:  34% (348771/1008930), 32.00 MiB | 559.00 KiB/s   
Receiving objects:  35% (353126/1008930), 32.28 MiB | 553.00 KiB/s   
Receiving objects:  35% (357643/1008930), 32.57 MiB | 549.00 KiB/s   
Receiving objects:  36% (363215/1008930), 33.09 MiB | 544.00 KiB/s   
Receiving objects:  36% (365201/1008930), 33.09 MiB | 544.00 KiB/s   
Receiving objects:  36% (372428/1008930), 33.55 MiB | 525.00 KiB/s   
Receiving objects:  37% (373305/1008930), 33.55 MiB | 525.00 KiB/s   
Receiving objects:  37% (380974/1008930), 34.04 MiB | 505.00 KiB/s   
Receiving objects:  38% (383394/1008930), 34.32 MiB | 516.00 KiB/s   
Receiving objects:  38% (390969/1008930), 34.61 MiB | 515.00 KiB/s   
Receiving objects:  39% (393483/1008930), 34.94 MiB | 525.00 KiB/s   
Receiving objects:  39% (400393/1008930), 35.26 MiB | 536.00 KiB/s   
Receiving objects:  40% (403572/1008930), 35.56 MiB | 542.00 KiB/s   
Receiving objects:  40% (405581/1008930), 35.80 MiB | 540.00 KiB/s   
Receiving objects:  40% (409944/1008930), 36.34 MiB | 548.00 KiB/s   
Receiving objects:  40% (412289/1008930), 36.93 MiB | 556.00 KiB/s   
Receiving objects:  41% (413662/1008930), 37.25 MiB | 563.00 KiB/s   
Receiving objects:  41% (414187/1008930), 37.58 MiB | 562.00 KiB/s   
Receiving objects:  41% (416622/1008930), 37.93 MiB | 572.00 KiB/s   
Receiving objects:  41% (417602/1008930), 38.61 MiB | 602.00 KiB/s   
Receiving objects:  41% (420759/1008930), 39.36 MiB | 654.00 KiB/s   
Receiving objects:  41% (420835/1008930), 40.03 MiB | 678.00 KiB/s   
Receiving objects:  41% (421293/1008930), 40.74 MiB | 691.00 KiB/s   
Receiving objects:  41% (422939/1008930), 41.35 MiB | 670.00 KiB/s   
Receiving objects:  41% (423030/1008930), 42.00 MiB | 581.00 KiB/s   
Receiving objects:  41% (423289/1008930), 42.32 MiB | 504.00 KiB/s   
Receiving objects:  41% (423289/1008930), 42.69 MiB | 428.00 KiB/s   
Receiving objects:  41% (423289/1008930), 43.04 MiB | 371.00 KiB/s   
Receiving objects:  41% (423289/1008930), 43.45 MiB | 366.00 KiB/s   
Receiving objects:  41% (423289/1008930), 43.90 MiB | 381.00 KiB/s   
Receiving objects:  41% (423289/1008930), 44.15 MiB | 396.00 KiB/s   
Receiving objects:  41% (423289/1008930), 44.58 MiB | 410.00 KiB/s   
Receiving objects:  41% (423289/1008930), 45.04 MiB | 434.00 KiB/s   
Receiving objects:  41% (423289/1008930), 45.35 MiB | 412.00 KiB/s   
Receiving objects:  41% (423454/1008930), 45.49 MiB | 396.00 KiB/s   
Receiving objects:  42% (423751/1008930), 45.82 MiB | 367.00 KiB/s   
Receiving objects:  42% (424012/1008930), 45.82 MiB | 367.00 KiB/s   
fatal: The remote end hung up unexpectedly
fatal: early EOF
fatal: index-pack failed

	at org.jenkinsci.plugins.gitclient.CliGitAPIImpl.launchCommandIn(CliGitAPIImpl.java:2002)
	at org.jenkinsci.plugins.gitclient.CliGitAPIImpl.launchCommandWithCredentials(CliGitAPIImpl.java:1721)
	at org.jenkinsci.plugins.gitclient.CliGitAPIImpl.access$300(CliGitAPIImpl.java:72)
	at org.jenkinsci.plugins.gitclient.CliGitAPIImpl$1.execute(CliGitAPIImpl.java:405)
	at org.jenkinsci.plugins.gitclient.CliGitAPIImpl$2.execute(CliGitAPIImpl.java:614)
	at org.jenkinsci.plugins.gitclient.RemoteGitImpl$CommandInvocationHandler$1.call(RemoteGitImpl.java:153)
	at org.jenkinsci.plugins.gitclient.RemoteGitImpl$CommandInvocationHandler$1.call(RemoteGitImpl.java:146)
	at hudson.remoting.UserRequest.perform(UserRequest.java:212)
	at hudson.remoting.UserRequest.perform(UserRequest.java:54)
	at hudson.remoting.Request$2.run(Request.java:369)
	at hudson.remoting.InterceptingExecutorService$1.call(InterceptingExecutorService.java:72)
	at java.util.concurrent.FutureTask.run(FutureTask.java:266)
	at java.util.concurrent.ThreadPoolExecutor.runWorker(ThreadPoolExecutor.java:1142)
	at java.util.concurrent.ThreadPoolExecutor$Worker.run(ThreadPoolExecutor.java:617)
	at java.lang.Thread.run(Thread.java:748)
	Suppressed: hudson.remoting.Channel$CallSiteStackTrace: Remote call to lucene
		at hudson.remoting.Channel.attachCallSiteStackTrace(Channel.java:1741)
		at hudson.remoting.UserRequest$ExceptionResponse.retrieve(UserRequest.java:357)
		at hudson.remoting.Channel.call(Channel.java:955)
		at org.jenkinsci.plugins.gitclient.RemoteGitImpl$CommandInvocationHandler.execute(RemoteGitImpl.java:146)
		at sun.reflect.GeneratedMethodAccessor1641.invoke(Unknown Source)
		at sun.reflect.DelegatingMethodAccessorImpl.invoke(DelegatingMethodAccessorImpl.java:43)
		at java.lang.reflect.Method.invoke(Method.java:498)
		at org.jenkinsci.plugins.gitclient.RemoteGitImpl$CommandInvocationHandler.invoke(RemoteGitImpl.java:132)
		at com.sun.proxy.$Proxy118.execute(Unknown Source)
		at hudson.plugins.git.GitSCM.retrieveChanges(GitSCM.java:1146)
		at hudson.plugins.git.GitSCM.checkout(GitSCM.java:1186)
		at org.jenkinsci.plugins.multiplescms.MultiSCM.checkout(MultiSCM.java:143)
		at hudson.scm.SCM.checkout(SCM.java:504)
		at hudson.model.AbstractProject.checkout(AbstractProject.java:1208)
		at hudson.model.AbstractBuild$AbstractBuildExecution.defaultCheckout(AbstractBuild.java:574)
		at jenkins.scm.SCMCheckoutStrategy.checkout(SCMCheckoutStrategy.java:86)
		at hudson.model.AbstractBuild$AbstractBuildExecution.run(AbstractBuild.java:499)
		at hudson.model.Run.execute(Run.java:1794)
		at hudson.model.FreeStyleBuild.run(FreeStyleBuild.java:43)
		at hudson.model.ResourceController.execute(ResourceController.java:97)
		at hudson.model.Executor.run(Executor.java:429)
ERROR: Error cloning remote repo 'origin'
Retrying after 10 seconds
 > git rev-parse --is-inside-work-tree # timeout=10
Fetching changes from the remote Git repository
 > git config remote.origin.url git://git.apache.org/lucene-solr.git # timeout=10
Fetching upstream changes from git://git.apache.org/lucene-solr.git
 > git --version # timeout=10
 > git fetch --tags --progress git://git.apache.org/lucene-solr.git +refs/heads/*:refs/remotes/origin/*
 > git rev-parse refs/remotes/origin/branch_7_6^{commit} # timeout=10
 > git rev-parse refs/remotes/origin/origin/branch_7_6^{commit} # timeout=10
Checking out Revision d764aa2223b229f6522037b6997d642ba031c79c (refs/remotes/origin/branch_7_6)
 > git config core.sparsecheckout # timeout=10
 > git checkout -f d764aa2223b229f6522037b6997d642ba031c79c
Commit message: "LUCENE-8589: Fix MultiPhraseQuery to not duplicate terms when building the phrase's weight"
 > git rev-list --no-walk d30d6b89f3152df3fd671aaae5f18919346dd106 # timeout=10
Cleaning workspace
 > git rev-parse --verify HEAD # timeout=10
Resetting working tree
 > git reset --hard # timeout=10
 > git clean -fdx # timeout=10
Checking out a fresh workspace because /x1/jenkins/jenkins-slave/workspace/Lucene-Solr-NightlyTests-7.6/test-data doesn't exist
Cleaning local Directory test-data
Checking out http://svn.apache.org/repos/asf/lucene/test-data at revision '2018-12-05T05:09:11.698 +0000'
A         README.txt
A         enwiki.random.lines.txt
At revision 1848185

No emails were triggered.
[checkout] $ /home/jenkins/tools/ant/apache-ant-1.8.4/bin/ant -file build.xml -Dtests.multiplier=2 -Dtests.linedocsfile=/home/jenkins/jenkins-slave/workspace/Lucene-Solr-NightlyTests-7.6/test-data/enwiki.random.lines.txt jenkins-nightly
Buildfile: /x1/jenkins/jenkins-slave/workspace/Lucene-Solr-NightlyTests-7.6/checkout/build.xml

jenkins-nightly:

-print-java-info:
[java-info] java version "1.8.0_191"
[java-info] Java(TM) SE Runtime Environment (1.8.0_191-b12, Oracle Corporation)
[java-info] Java HotSpot(TM) 64-Bit Server VM (25.191-b12, Oracle Corporation)
[java-info] Test args: []

clean:

clean:

clean:

ivy-availability-check:
[loadresource] Do not set property disallowed.ivy.jars.list as its length is 0.

-ivy-fail-disallowed-ivy-version:

ivy-fail:

ivy-configure:
[ivy:configure] :: Apache Ivy 2.4.0 - 20141213170938 :: http://ant.apache.org/ivy/ ::
[ivy:configure] :: loading settings :: file = /x1/jenkins/jenkins-slave/workspace/Lucene-Solr-NightlyTests-7.6/checkout/lucene/top-level-ivy-settings.xml

resolve-groovy:
[ivy:cachepath] :: resolving dependencies :: org.codehaus.groovy#groovy-all-caller;working
[ivy:cachepath] 	confs: [default]
[ivy:cachepath] 	found org.codehaus.groovy#groovy-all;2.4.15 in public
[ivy:cachepath] :: resolution report :: resolve 177ms :: artifacts dl 7ms
	---------------------------------------------------------------------
	|                  |            modules            ||   artifacts   |
	|       conf       | number| search|dwnlded|evicted|| number|dwnlded|
	---------------------------------------------------------------------
	|      default     |   1   |   0   |   0   |   0   ||   1   |   0   |
	---------------------------------------------------------------------

-test-with-heapdumps-enabled:
     [echo] Java HotSpot(TM) 64-Bit Server VM: Enabling heap dumps on OutOfMemoryError to dir '/x1/jenkins/jenkins-slave/workspace/Lucene-Solr-NightlyTests-7.6/checkout/heapdumps'.
    [mkdir] Created dir: /x1/jenkins/jenkins-slave/workspace/Lucene-Solr-NightlyTests-7.6/checkout/heapdumps

ivy-availability-check:
[loadresource] Do not set property disallowed.ivy.jars.list as its length is 0.

-ivy-fail-disallowed-ivy-version:

ivy-fail:

ivy-configure:
[ivy:configure] :: loading settings :: file = /x1/jenkins/jenkins-slave/workspace/Lucene-Solr-NightlyTests-7.6/checkout/lucene/top-level-ivy-settings.xml

resolve-groovy:

test:

ivy-availability-check:
[loadresource] Do not set property disallowed.ivy.jars.list as its length is 0.

-ivy-fail-disallowed-ivy-version:

ivy-fail:

ivy-configure:
[ivy:configure] :: loading settings :: file = /x1/jenkins/jenkins-slave/workspace/Lucene-Solr-NightlyTests-7.6/checkout/lucene/top-level-ivy-settings.xml

-clover.load:

resolve-groovy:

-init-totals:

test-core:

-clover.disable:

ivy-availability-check:
[loadresource] Do not set property disallowed.ivy.jars.list as its length is 0.

-ivy-fail-disallowed-ivy-version:

ivy-fail:

ivy-configure:
[ivy:configure] :: loading settings :: file = /x1/jenkins/jenkins-slave/workspace/Lucene-Solr-NightlyTests-7.6/checkout/lucene/top-level-ivy-settings.xml

-clover.load:

-clover.classpath:

-clover.setup:

clover:

-check-git-state:

-git-cleanroot:

-copy-git-state:
     [copy] Copying 1 file to /x1/jenkins/jenkins-slave/workspace/Lucene-Solr-NightlyTests-7.6/checkout/lucene/build

git-autoclean:

resolve:

init:

compile-core:
    [mkdir] Created dir: /x1/jenkins/jenkins-slave/workspace/Lucene-Solr-NightlyTests-7.6/checkout/lucene/build/core/classes/java
    [javac] Compiling 858 source files to /x1/jenkins/jenkins-slave/workspace/Lucene-Solr-NightlyTests-7.6/checkout/lucene/build/core/classes/java
    [javac] Note: Some input files use or override a deprecated API.
    [javac] Note: Recompile with -Xlint:deprecation for details.
    [javac] Creating empty /x1/jenkins/jenkins-slave/workspace/Lucene-Solr-NightlyTests-7.6/checkout/lucene/build/core/classes/java/org/apache/lucene/util/graph/package-info.class
    [javac] Creating empty /x1/jenkins/jenkins-slave/workspace/Lucene-Solr-NightlyTests-7.6/checkout/lucene/build/core/classes/java/org/apache/lucene/document/package-info.class
    [javac] Creating empty /x1/jenkins/jenkins-slave/workspace/Lucene-Solr-NightlyTests-7.6/checkout/lucene/build/core/classes/java/org/apache/lucene/package-info.class
    [javac] Creating empty /x1/jenkins/jenkins-slave/workspace/Lucene-Solr-NightlyTests-7.6/checkout/lucene/build/core/classes/java/org/apache/lucene/util/bkd/package-info.class
    [javac] Creating empty /x1/jenkins/jenkins-slave/workspace/Lucene-Solr-NightlyTests-7.6/checkout/lucene/build/core/classes/java/org/apache/lucene/codecs/compressing/package-info.class
    [javac] Creating empty /x1/jenkins/jenkins-slave/workspace/Lucene-Solr-NightlyTests-7.6/checkout/lucene/build/core/classes/java/org/apache/lucene/codecs/lucene60/package-info.class
    [javac] Creating empty /x1/jenkins/jenkins-slave/workspace/Lucene-Solr-NightlyTests-7.6/checkout/lucene/build/core/classes/java/org/apache/lucene/codecs/package-info.class
    [javac] Creating empty /x1/jenkins/jenkins-slave/workspace/Lucene-Solr-NightlyTests-7.6/checkout/lucene/build/core/classes/java/org/apache/lucene/util/package-info.class
    [javac] Creating empty /x1/jenkins/jenkins-slave/workspace/Lucene-Solr-NightlyTests-7.6/checkout/lucene/build/core/classes/java/org/apache/lucene/index/package-info.class
    [javac] Creating empty /x1/jenkins/jenkins-slave/workspace/Lucene-Solr-NightlyTests-7.6/checkout/lucene/build/core/classes/java/org/apache/lucene/util/fst/package-info.class
    [javac] Creating empty /x1/jenkins/jenkins-slave/workspace/Lucene-Solr-NightlyTests-7.6/checkout/lucene/build/core/classes/java/org/apache/lucene/analysis/tokenattributes/package-info.class
    [javac] Creating empty /x1/jenkins/jenkins-slave/workspace/Lucene-Solr-NightlyTests-7.6/checkout/lucene/build/core/classes/java/org/apache/lucene/search/package-info.class
    [javac] Creating empty /x1/jenkins/jenkins-slave/workspace/Lucene-Solr-NightlyTests-7.6/checkout/lucene/build/core/classes/java/org/apache/lucene/codecs/lucene62/package-info.class
    [javac] Creating empty /x1/jenkins/jenkins-slave/workspace/Lucene-Solr-NightlyTests-7.6/checkout/lucene/build/core/classes/java/org/apache/lucene/util/packed/package-info.class
    [javac] Creating empty /x1/jenkins/jenkins-slave/workspace/Lucene-Solr-NightlyTests-7.6/checkout/lucene/build/core/classes/java/org/apache/lucene/util/mutable/package-info.class
    [javac] Creating empty /x1/jenkins/jenkins-slave/workspace/Lucene-Solr-NightlyTests-7.6/checkout/lucene/build/core/classes/java/org/apache/lucene/codecs/lucene70/package-info.class
    [javac] Creating empty /x1/jenkins/jenkins-slave/workspace/Lucene-Solr-NightlyTests-7.6/checkout/lucene/build/core/classes/java/org/apache/lucene/codecs/perfield/package-info.class
    [javac] Creating empty /x1/jenkins/jenkins-slave/workspace/Lucene-Solr-NightlyTests-7.6/checkout/lucene/build/core/classes/java/org/apache/lucene/analysis/package-info.class
    [javac] Creating empty /x1/jenkins/jenkins-slave/workspace/Lucene-Solr-NightlyTests-7.6/checkout/lucene/build/core/classes/java/org/apache/lucene/analysis/standard/package-info.class
    [javac] Creating empty /x1/jenkins/jenkins-slave/workspace/Lucene-Solr-NightlyTests-7.6/checkout/lucene/build/core/classes/java/org/apache/lucene/store/package-info.class
    [javac] Creating empty /x1/jenkins/jenkins-slave/workspace/Lucene-Solr-NightlyTests-7.6/checkout/lucene/build/core/classes/java/org/apache/lucene/codecs/blocktree/package-info.class
    [javac] Creating empty /x1/jenkins/jenkins-slave/workspace/Lucene-Solr-NightlyTests-7.6/checkout/lucene/build/core/classes/java/org/apache/lucene/search/spans/package-info.class
    [javac] Creating empty /x1/jenkins/jenkins-slave/workspace/Lucene-Solr-NightlyTests-7.6/checkout/lucene/build/core/classes/java/org/apache/lucene/search/similarities/package-info.class
    [javac] Creating empty /x1/jenkins/jenkins-slave/workspace/Lucene-Solr-NightlyTests-7.6/checkout/lucene/build/core/classes/java/org/apache/lucene/util/automaton/package-info.class
    [javac] Creating empty /x1/jenkins/jenkins-slave/workspace/Lucene-Solr-NightlyTests-7.6/checkout/lucene/build/core/classes/java/org/apache/lucene/codecs/lucene50/package-info.class
    [javac] Creating empty /x1/jenkins/jenkins-slave/workspace/Lucene-Solr-NightlyTests-7.6/checkout/lucene/build/core/classes/java/org/apache/lucene/geo/package-info.class
     [copy] Copying 3 files to /x1/jenkins/jenkins-slave/workspace/Lucene-Solr-NightlyTests-7.6/checkout/lucene/build/core/classes/java

compile-test-framework:

-check-git-state:

-git-cleanroot:

-copy-git-state:

git-autoclean:

ivy-availability-check:
[loadresource] Do not set property disallowed.ivy.jars.list as its length is 0.

-ivy-fail-disallowed-ivy-version:

ivy-fail:

ivy-configure:
[ivy:configure] :: loading settings :: file = /x1/jenkins/jenkins-slave/workspace/Lucene-Solr-NightlyTests-7.6/checkout/lucene/top-level-ivy-settings.xml

resolve:

init:

compile-lucene-core:

-check-git-state:

-git-cleanroot:

-copy-git-state:

git-autoclean:

ivy-availability-check:
[loadresource] Do not set property disallowed.ivy.jars.list as its length is 0.

-ivy-fail-disallowed-ivy-version:

ivy-fail:

ivy-configure:
[ivy:configure] :: loading settings :: file = /x1/jenkins/jenkins-slave/workspace/Lucene-Solr-NightlyTests-7.6/checkout/lucene/top-level-ivy-settings.xml

resolve:

init:

-clover.disable:

-clover.load:

-clover.classpath:

-clover.setup:

clover:

compile-core:

compile-codecs:

-check-git-state:

-git-cleanroot:

-copy-git-state:

git-autoclean:

ivy-availability-check:
[loadresource] Do not set property disallowed.ivy.jars.list as its length is 0.

-ivy-fail-disallowed-ivy-version:

ivy-fail:

ivy-configure:
[ivy:configure] :: loading settings :: file = /x1/jenkins/jenkins-slave/workspace/Lucene-Solr-NightlyTests-7.6/checkout/lucene/top-level-ivy-settings.xml

resolve:

common.init:

compile-lucene-core:

init:

-clover.disable:

-clover.load:

-clover.classpath:

-clover.setup:

clover:

compile-core:
    [mkdir] Created dir: /x1/jenkins/jenkins-slave/workspace/Lucene-Solr-NightlyTests-7.6/checkout/lucene/build/codecs/classes/java
    [javac] Compiling 67 source files to /x1/jenkins/jenkins-slave/workspace/Lucene-Solr-NightlyTests-7.6/checkout/lucene/build/codecs/classes/java
    [javac] Note: Some input files use or override a deprecated API.
    [javac] Note: Recompile with -Xlint:deprecation for details.
    [javac] Creating empty /x1/jenkins/jenkins-slave/workspace/Lucene-Solr-NightlyTests-7.6/checkout/lucene/build/codecs/classes/java/org/apache/lucene/codecs/bloom/package-info.class
    [javac] Creating empty /x1/jenkins/jenkins-slave/workspace/Lucene-Solr-NightlyTests-7.6/checkout/lucene/build/codecs/classes/java/org/apache/lucene/codecs/memory/package-info.class
    [javac] Creating empty /x1/jenkins/jenkins-slave/workspace/Lucene-Solr-NightlyTests-7.6/checkout/lucene/build/codecs/classes/java/org/apache/lucene/codecs/simpletext/package-info.class
    [javac] Creating empty /x1/jenkins/jenkins-slave/workspace/Lucene-Solr-NightlyTests-7.6/checkout/lucene/build/codecs/classes/java/org/apache/lucene/codecs/blockterms/package-info.class
    [javac] Creating empty /x1/jenkins/jenkins-slave/workspace/Lucene-Solr-NightlyTests-7.6/checkout/lucene/build/codecs/classes/java/org/apache/lucene/codecs/blocktreeords/package-info.class
     [copy] Copying 3 files to /x1/jenkins/jenkins-slave/workspace/Lucene-Solr-NightlyTests-7.6/checkout/lucene/build/codecs/classes/java

-clover.disable:

-clover.load:

-clover.classpath:

-clover.setup:

clover:

common.compile-core:
    [mkdir] Created dir: /x1/jenkins/jenkins-slave/workspace/Lucene-Solr-NightlyTests-7.6/checkout/lucene/build/test-framework/classes/java
    [javac] Compiling 191 source files to /x1/jenkins/jenkins-slave/workspace/Lucene-Solr-NightlyTests-7.6/checkout/lucene/build/test-framework/classes/java
    [javac] /x1/jenkins/jenkins-slave/workspace/Lucene-Solr-NightlyTests-7.6/checkout/lucene/test-framework/src/java/org/apache/lucene/store/BaseDirectoryTestCase.java:416: warning: [try] auto-closeable resource output is never referenced in body of corresponding try statement
    [javac]             try (IndexOutput output = dir.createOutput(fileName, newIOContext(random()))) {
    [javac]                              ^
    [javac] /x1/jenkins/jenkins-slave/workspace/Lucene-Solr-NightlyTests-7.6/checkout/lucene/test-framework/src/java/org/apache/lucene/store/BaseDirectoryTestCase.java:440: warning: [try] auto-closeable resource input is never referenced in body of corresponding try statement
    [javac]                 try (IndexInput input = dir.openInput(file, newIOContext(random()))) {
    [javac]                                 ^
    [javac] /x1/jenkins/jenkins-slave/workspace/Lucene-Solr-NightlyTests-7.6/checkout/lucene/test-framework/src/java/org/apache/lucene/store/BaseDirectoryTestCase.java:1043: warning: [try] auto-closeable resource out is never referenced in body of corresponding try statement
    [javac]       try (IndexOutput out = dir.createOutput(name, IOContext.DEFAULT)) {
    [javac]                        ^
    [javac] /x1/jenkins/jenkins-slave/workspace/Lucene-Solr-NightlyTests-7.6/checkout/lucene/test-framework/src/java/org/apache/lucene/store/BaseDirectoryTestCase.java:1048: warning: [try] auto-closeable resource out is never referenced in body of corresponding try statement
    [javac]         try (IndexOutput out = dir.createOutput(name, IOContext.DEFAULT)) {
    [javac]                          ^
    [javac] Note: Some input files use or override a deprecated API.
    [javac] Note: Recompile with -Xlint:deprecation for details.
    [javac] 4 warnings
    [javac] Creating empty /x1/jenkins/jenkins-slave/workspace/Lucene-Solr-NightlyTests-7.6/checkout/lucene/build/test-framework/classes/java/org/apache/lucene/codecs/asserting/package-info.class
    [javac] Creating empty /x1/jenkins/jenkins-slave/workspace/Lucene-Solr-NightlyTests-7.6/checkout/lucene/build/test-framework/classes/java/org/apache/lucene/codecs/ramonly/package-info.class
    [javac] Creating empty /x1/jenkins/jenkins-slave/workspace/Lucene-Solr-NightlyTests-7.6/checkout/lucene/build/test-framework/classes/java/org/apache/lucene/mockfile/package-info.class
    [javac] Creating empty /x1/jenkins/jenkins-slave/workspace/Lucene-Solr-NightlyTests-7.6/checkout/lucene/build/test-framework/classes/java/org/apache/lucene/codecs/cheapbastard/package-info.class
    [javac] Creating empty /x1/jenkins/jenkins-slave/workspace/Lucene-Solr-NightlyTests-7.6/checkout/lucene/build/test-framework/classes/java/org/apache/lucene/codecs/mockrandom/package-info.class
    [javac] Creating empty /x1/jenkins/jenkins-slave/workspace/Lucene-Solr-NightlyTests-7.6/checkout/lucene/build/test-framework/classes/java/org/apache/lucene/codecs/cranky/package-info.class
    [javac] Creating empty /x1/jenkins/jenkins-slave/workspace/Lucene-Solr-NightlyTests-7.6/checkout/lucene/build/test-framework/classes/java/org/apache/lucene/codecs/compressing/dummy/package-info.class
     [copy] Copying 4 files to /x1/jenkins/jenkins-slave/workspace/Lucene-Solr-NightlyTests-7.6/checkout/lucene/build/test-framework/classes/java

compile-core:

compile-test:
    [mkdir] Created dir: /x1/jenkins/jenkins-slave/workspace/Lucene-Solr-NightlyTests-7.6/checkout/lucene/build/core/classes/test
    [javac] Compiling 494 source files to /x1/jenkins/jenkins-slave/workspace/Lucene-Solr-NightlyTests-7.6/checkout/lucene/build/core/classes/test
    [javac] /x1/jenkins/jenkins-slave/workspace/Lucene-Solr-NightlyTests-7.6/checkout/lucene/core/src/test/org/apache/lucene/index/TestIndexWriter.java:2687: warning: [try] auto-closeable resource closeable is never referenced in body of corresponding try statement
    [javac]          Closeable closeable = () -> IOUtils.close(toClose)) {
    [javac]                    ^
    [javac] Note: Some input files use or override a deprecated API.
    [javac] Note: Recompile with -Xlint:deprecation for details.
    [javac] 1 warning
     [copy] Copying 3 files to /x1/jenkins/jenkins-slave/workspace/Lucene-Solr-NightlyTests-7.6/checkout/lucene/build/core/classes/test

-mrjar-classes-uptodate:

resolve-groovy:

patch-mrjar-classes:
[patch-cls] Remapped: org/apache/lucene/analysis/tokenattributes/CharTermAttributeImpl
[patch-cls] Remapped: org/apache/lucene/codecs/compressing/LZ4
[patch-cls] Remapped: org/apache/lucene/document/BinaryPoint$2
[patch-cls] Remapped: org/apache/lucene/document/DoubleRange
[patch-cls] Remapped: org/apache/lucene/document/FloatRange
[patch-cls] Remapped: org/apache/lucene/document/IntRange
[patch-cls] Remapped: org/apache/lucene/document/LatLonPointDistanceQuery$1$2
[patch-cls] Remapped: org/apache/lucene/document/LatLonPointDistanceQuery$1$3
[patch-cls] Remapped: org/apache/lucene/document/LatLonPointInPolygonQuery$1$1
[patch-cls] Remapped: org/apache/lucene/document/LongRange
[patch-cls] Remapped: org/apache/lucene/document/RangeFieldQuery$QueryType$1
[patch-cls] Remapped: org/apache/lucene/document/RangeFieldQuery$QueryType$2
[patch-cls] Remapped: org/apache/lucene/document/RangeFieldQuery$QueryType$3
[patch-cls] Remapped: org/apache/lucene/index/BitsSlice
[patch-cls] Remapped: org/apache/lucene/index/CheckIndex$VerifyPointsVisitor
[patch-cls] Remapped: org/apache/lucene/index/CodecReader
[patch-cls] Remapped: org/apache/lucene/index/MergeReaderWrapper
[patch-cls] Remapped: org/apache/lucene/index/PointValues
[patch-cls] Remapped: org/apache/lucene/search/BooleanScorer$TailPriorityQueue
[patch-cls] Remapped: org/apache/lucene/search/PointInSetQuery$SinglePointVisitor
[patch-cls] Remapped: org/apache/lucene/search/PointRangeQuery$1$1
[patch-cls] Remapped: org/apache/lucene/search/PointRangeQuery$1$2
[patch-cls] Remapped: org/apache/lucene/search/PointRangeQuery$1
[patch-cls] Remapped: org/apache/lucene/util/BytesRef
[patch-cls] Remapped: org/apache/lucene/util/BytesRefArray
[patch-cls] Remapped: org/apache/lucene/util/CharsRef$UTF16SortedAsUTF8Comparator
[patch-cls] Remapped: org/apache/lucene/util/CharsRef
[patch-cls] Remapped: org/apache/lucene/util/IntsRef
[patch-cls] Remapped: org/apache/lucene/util/LongsRef
[patch-cls] Remapped: org/apache/lucene/util/StringHelper
[patch-cls] Remapped: org/apache/lucene/util/automaton/Automaton$Builder
[patch-cls] Remapped: org/apache/lucene/util/automaton/Automaton
[patch-cls] Remapped: org/apache/lucene/util/bkd/BKDReader
[patch-cls] Remapped: org/apache/lucene/util/bkd/BKDWriter$BKDMergeQueue
[patch-cls] Remapped: org/apache/lucene/util/bkd/BKDWriter
[patch-cls] Remapped: org/apache/lucene/util/bkd/MutablePointsReaderUtils$1$1
[patch-cls] Remapped: org/apache/lucene/util/bkd/MutablePointsReaderUtils$2
[patch-cls] Remapped: org/apache/lucene/util/bkd/MutablePointsReaderUtils$3$1
[patch-cls] Remapped 38 class files for Java 9 to: /x1/jenkins/jenkins-slave/workspace/Lucene-Solr-NightlyTests-7.6/checkout/lucene/build/core/classes/java9
    [touch] Creating /x1/jenkins/jenkins-slave/workspace/Lucene-Solr-NightlyTests-7.6/checkout/lucene/build/core/patch-mrjar.stamp

install-junit4-taskdef:

validate:

-init-totals:

-test:
    [mkdir] Created dir: /x1/jenkins/jenkins-slave/workspace/Lucene-Solr-NightlyTests-7.6/checkout/lucene/build/core/test
    [mkdir] Created dir: /x1/jenkins/jenkins-slave/workspace/Lucene-Solr-NightlyTests-7.6/checkout/lucene/build/core/test/temp
    [mkdir] Created dir: /x1/jenkins/jenkins-slave/workspace/Lucene-Solr-NightlyTests-7.6/checkout/.caches/test-stats/core
   [junit4] <JUnit4> says Привет! Master seed: 1FC65E9475CB346A
   [junit4] Executing 486 suites with 3 JVMs.
   [junit4] 
   [junit4] Started J1 PID(30587@localhost).
   [junit4] Started J2 PID(30593@localhost).
   [junit4] Started J0 PID(30589@localhost).
   [junit4] Suite: org.apache.lucene.index.TestDocValuesFieldUpdates
   [junit4] Completed [1/486] on J0 in 0.91s, 1 test
   [junit4] 
   [junit4] Suite: org.apache.lucene.index.TestDocValuesIndexing
   [junit4] Completed [2/486] on J1 in 4.27s, 34 tests
   [junit4] 
   [junit4] Suite: org.apache.lucene.index.TestDocsAndPositions
   [junit4] Completed [3/486] on J2 in 7.72s, 6 tests
   [junit4] 
   [junit4] Suite: org.apache.lucene.index.TestMultiLevelSkipList
   [junit4] Completed [4/486] on J2 in 0.73s, 1 test
   [junit4] 
   [junit4] Suite: org.apache.lucene.index.TestMultiFields
   [junit4] Completed [5/486] on J1 in 7.25s, 3 tests
   [junit4] 
   [junit4] Suite: org.apache.lucene.index.TestCrash
   [junit4] Completed [6/486] on J2 in 3.08s, 5 tests
   [junit4] 
   [junit4] Suite: org.apache.lucene.index.Test2BPoints
   [junit4] IGNOR/A 0.04s J2 | Test2BPoints.test1D
   [junit4]    > Assumption #1: 'monster' test group is disabled (@Monster(value=takes at least 4 hours and consumes many GB of temp disk space))
   [junit4] IGNOR/A 0.00s J2 | Test2BPoints.test2D
   [junit4]    > Assumption #1: 'monster' test group is disabled (@Monster(value=takes at least 4 hours and consumes many GB of temp disk space))
   [junit4] Completed [7/486] on J2 in 0.08s, 2 tests, 2 skipped
   [junit4] 
   [junit4] Suite: org.apache.lucene.search.spans.TestSpanExplanations
   [junit4] Completed [8/486] on J2 in 4.61s, 30 tests
   [junit4] 
   [junit4] Suite: org.apache.lucene.index.Test2BPostingsBytes
   [junit4] IGNOR/A 0.00s J2 | Test2BPostingsBytes.test
   [junit4]    > Assumption #1: 'monster' test group is disabled (@Monster(value=takes ~20GB-30GB of space and 10 minutes))
   [junit4] Completed [9/486] on J2 in 0.03s, 1 test, 1 skipped
   [junit4] 
   [junit4] Suite: org.apache.lucene.index.TestMultiDocValues
   [junit4] Completed [10/486] on J0 in 17.00s, 7 tests
   [junit4] 
   [junit4] Suite: org.apache.lucene.search.TestSimpleExplanations
   [junit4] Completed [11/486] on J2 in 4.05s, 70 tests
   [junit4] 
   [junit4] Suite: org.apache.lucene.index.TestConsistentFieldNumbers
   [junit4] Completed [12/486] on J1 in 9.21s, 4 tests
   [junit4] 
   [junit4] Suite: org.apache.lucene.index.Test2BNumericDocValues
   [junit4] IGNOR/A 0.02s J1 | Test2BNumericDocValues.testNumerics
   [junit4]    > Assumption #1: 'monster' test group is disabled (@Monster(value=takes ~ 2 hours if the heap is 5gb))
   [junit4] Completed [13/486] on J1 in 0.03s, 1 test, 1 skipped
   [junit4] 
   [junit4] Suite: org.apache.lucene.search.spans.TestSpanContainQuery
   [junit4] Completed [14/486] on J1 in 0.30s, 4 tests
   [junit4] 
   [junit4] Suite: org.apache.lucene.index.TestTerms
   [junit4] Completed [15/486] on J2 in 0.98s, 2 tests
   [junit4] 
   [junit4] Suite: org.apache.lucene.util.TestMSBRadixSorter
   [junit4] Completed [16/486] on J2 in 6.95s, 8 tests
   [junit4] 
   [junit4] Suite: org.apache.lucene.index.TestConcurrentMergeScheduler
   [junit4] Completed [17/486] on J0 in 27.35s, 16 tests
   [junit4] 
   [junit4] Suite: org.apache.lucene.index.Test2BDocs
   [junit4] IGNOR/A 0.01s J0 | Test2BDocs.test2BDocs
   [junit4]    > Assumption #1: 'monster' test group is disabled (@Monster(value=Takes ~30min))
   [junit4] Completed [18/486] on J0 in 0.01s, 1 test, 1 skipped
   [junit4] 
   [junit4] Suite: org.apache.lucene.search.spans.TestSpanCollection
   [junit4] Completed [19/486] on J0 in 0.13s, 3 tests
   [junit4] 
   [junit4] Suite: org.apache.lucene.index.Test2BPositions
   [junit4] IGNOR/A 0.00s J0 | Test2BPositions.test
   [junit4]    > Assumption #1: 'monster' test group is disabled (@Monster(value=uses lots of space and takes a few minutes))
   [junit4] Completed [20/486] on J0 in 0.01s, 1 test, 1 skipped
   [junit4] 
   [junit4] Suite: org.apache.lucene.search.TestSimilarity
   [junit4] Completed [21/486] on J0 in 0.15s, 1 test
   [junit4] 
   [junit4] Suite: org.apache.lucene.index.TestTermVectorsWriter
   [junit4] Completed [22/486] on J0 in 0.69s, 15 tests
   [junit4] 
   [junit4] Suite: org.apache.lucene.store.TestMultiMMap
   [junit4] Completed [23/486] on J2 in 19.58s, 53 tests
   [junit4] 
   [junit4] Suite: org.apache.lucene.store.TestHugeRamFile
   [junit4] Completed [24/486] on J2 in 3.06s, 1 test
   [junit4] 
   [junit4] Suite: org.apache.lucene.util.TestFrequencyTrackingRingBuffer
   [junit4] Completed [25/486] on J2 in 0.36s, 2 tests
   [junit4] 
   [junit4] Suite: org.apache.lucene.util.TestQueryBuilder
   [junit4] Completed [26/486] on J2 in 0.23s, 25 tests
   [junit4] 
   [junit4] Suite: org.apache.lucene.index.TestByteSlices
   [junit4] Completed [27/486] on J2 in 6.42s, 1 test
   [junit4] 
   [junit4] Suite: org.apache.lucene.util.TestLongBitSet
   [junit4] Completed [28/486] on J0 in 11.89s, 11 tests
   [junit4] 
   [junit4] Suite: org.apache.lucene.store.TestLockFactory
   [junit4] Completed [29/486] on J0 in 0.05s, 2 tests
   [junit4] 
   [junit4] Suite: org.apache.lucene.store.TestFilterDirectory
   [junit4] IGNOR/A 0.00s J0 | TestFilterDirectory.testPendingDeletions
   [junit4]    > Assumption #1: we can only install VirusCheckingFS on an FSDirectory
   [junit4] IGNOR/A 0.00s J0 | TestFilterDirectory.testFsyncDoesntCreateNewFiles
   [junit4]    > Assumption #1: test only works for FSDirectory subclasses
   [junit4] Completed [30/486] on J0 in 2.47s, 43 tests, 2 skipped
   [junit4] 
   [junit4] Suite: org.apache.lucene.geo.TestGeoUtils
   [junit4] Completed [31/486] on J2 in 19.79s, 7 tests
   [junit4] 
   [junit4] Suite: org.apache.lucene.util.TestFixedBitSet
   [junit4] Completed [32/486] on J0 in 19.67s, 21 tests
   [junit4] 
   [junit4] HEARTBEAT J1 PID(30587@localhost): 2018-12-05T05:23:44, stalled for 61.6s at: Test2BPostings.test
   [junit4] Suite: org.apache.lucene.util.TestPagedBytes
   [junit4] Completed [33/486] on J0 in 13.71s, 4 tests, 1 skipped
   [junit4] 
   [junit4] Suite: org.apache.lucene.search.TestFieldValueQuery
   [junit4] Completed [34/486] on J2 in 38.12s, 6 tests
   [junit4] 
   [junit4] Suite: org.apache.lucene.search.TestFuzzyQuery
   [junit4] Completed [35/486] on J2 in 13.01s, 11 tests
   [junit4] 
   [junit4] Suite: org.apache.lucene.search.TestEarlyTermination
   [junit4] Completed [36/486] on J2 in 0.42s, 1 test
   [junit4] 
   [junit4] Suite: org.apache.lucene.util.TestLSBRadixSorter
   [junit4] Completed [37/486] on J2 in 0.20s, 6 tests
   [junit4] 
   [junit4] Suite: org.apache.lucene.index.TestSameTokenSamePosition
   [junit4] Completed [38/486] on J2 in 0.07s, 2 tests
   [junit4] 
   [junit4] Suite: org.apache.lucene.search.spans.TestSpans
   [junit4] Completed [39/486] on J2 in 1.25s, 26 tests
   [junit4] 
   [junit4] HEARTBEAT J1 PID(30587@localhost): 2018-12-05T05:24:44, stalled for  122s at: Test2BPostings.test
   [junit4] Suite: org.apache.lucene.index.TestBinaryDocValuesUpdates
   [junit4] Completed [40/486] on J0 in 80.46s, 29 tests
   [junit4] 
   [junit4] Suite: org.apache.lucene.document.TestLongRange
   [junit4] Completed [41/486] on J0 in 0.05s, 1 test
   [junit4] 
   [junit4] Suite: org.apache.lucene.search.TestElevationComparator
   [junit4] Completed [42/486] on J0 in 0.06s, 1 test
   [junit4] 
   [junit4] Suite: org.apache.lucene.search.TestFilterWeight
   [junit4] Completed [43/486] on J0 in 0.01s, 1 test
   [junit4] 
   [junit4] Suite: org.apache.lucene.search.TestDoubleValuesSource
   [junit4] Completed [44/486] on J0 in 13.65s, 6 tests
   [junit4] 
   [junit4] Suite: org.apache.lucene.util.TestIntroSorter
   [junit4] Completed [45/486] on J0 in 0.41s, 9 tests
   [junit4] 
   [junit4] Suite: org.apache.lucene.index.TestRollback
   [junit4] Completed [46/486] on J0 in 0.08s, 1 test
   [junit4] 
   [junit4] HEARTBEAT J1 PID(30587@localhost): 2018-12-05T05:25:44, stalled for  182s at: Test2BPostings.test
   [junit4] Suite: org.apache.lucene.search.TestLatLonPointQueries
   [junit4] IGNOR/A 0.00s J2 | TestLatLonPointQueries.testRandomBig
   [junit4]    > Assumption #1: Memory codec can OOME on this test
   [junit4] Completed [47/486] on J2 in 106.32s, 41 tests, 1 skipped
   [junit4] 
   [junit4] Suite: org.apache.lucene.search.TestNGramPhraseQuery
   [junit4] Completed [48/486] on J2 in 0.02s, 1 test
   [junit4] 
   [junit4] Suite: org.apache.lucene.search.spans.TestSpanSearchEquivalence
   [junit4] Completed [49/486] on J0 in 50.25s, 33 tests
   [junit4] 
   [junit4] HEARTBEAT J1 PID(30587@localhost): 2018-12-05T05:26:44, stalled for  242s at: Test2BPostings.test
   [junit4] Suite: org.apache.lucene.search.TestLRUQueryCache
   [junit4] Completed [50/486] on J0 in 49.08s, 23 tests
   [junit4] 
   [junit4] Suite: org.apache.lucene.search.TestMultiThreadTermVectors
   [junit4] Completed [51/486] on J0 in 4.79s, 1 test
   [junit4] 
   [junit4] Suite: org.apache.lucene.codecs.lucene50.TestLucene50TermVectorsFormat
   [junit4] Completed [52/486] on J2 in 58.82s, 17 tests
   [junit4] 
   [junit4] Suite: org.apache.lucene.analysis.tokenattributes.TestPackedTokenAttributeImpl
   [junit4] Completed [53/486] on J2 in 0.05s, 4 tests
   [junit4] 
   [junit4] Suite: org.apache.lucene.codecs.lucene70.TestIndexedDISI
   [junit4] Completed [54/486] on J2 in 5.16s, 10 tests
   [junit4] 
   [junit4] Suite: org.apache.lucene.index.Test2BBinaryDocValues
   [junit4] IGNOR/A 0.00s J2 | Test2BBinaryDocValues.testFixedBinary
   [junit4]    > Assumption #1: 'monster' test group is disabled (@Monster(value=takes ~ 6 hours if the heap is 5gb))
   [junit4] IGNOR/A 0.00s J2 | Test2BBinaryDocValues.testVariableBinary
   [junit4]    > Assumption #1: 'monster' test group is disabled (@Monster(value=takes ~ 6 hours if the heap is 5gb))
   [junit4] Completed [55/486] on J2 in 0.00s, 2 tests, 2 skipped
   [junit4] 
   [junit4] Suite: org.apache.lucene.codecs.TestCodecUtil
   [junit4] Completed [56/486] on J2 in 0.10s, 16 tests
   [junit4] 
   [junit4] Suite: org.apache.lucene.codecs.lucene50.TestLucene50StoredFieldsFormat
   [junit4] Completed [57/486] on J0 in 13.75s, 17 tests
   [junit4] 
   [junit4] Suite: org.apache.lucene.analysis.tokenattributes.TestBytesRefAttImpl
   [junit4] Completed [58/486] on J0 in 0.02s, 1 test
   [junit4] 
   [junit4] Suite: org.apache.lucene.codecs.lucene50.TestLucene60FieldInfoFormat
   [junit4] Completed [59/486] on J0 in 0.81s, 11 tests
   [junit4] 
   [junit4] Suite: org.apache.lucene.geo.TestPolygon
   [junit4] Completed [60/486] on J0 in 0.10s, 15 tests
   [junit4] 
   [junit4] Suite: org.apache.lucene.analysis.tokenattributes.TestSimpleAttributeImpl
   [junit4] Completed [61/486] on J0 in 0.04s, 1 test
   [junit4] 
   [junit4] Suite: org.apache.lucene.search.TestDocValuesRewriteMethod
   [junit4] Completed [62/486] on J0 in 8.91s, 2 tests
   [junit4] 
   [junit4] Suite: org.apache.lucene.index.TestSortedSetDocValues
   [junit4] Completed [63/486] on J0 in 0.06s, 1 test
   [junit4] 
   [junit4] Suite: org.apache.lucene.util.automaton.TestOperations
   [junit4] Completed [64/486] on J0 in 2.03s, 7 tests
   [junit4] 
   [junit4] Suite: org.apache.lucene.search.TestLiveFieldValues
   [junit4] Completed [65/486] on J0 in 0.97s, 1 test
   [junit4] 
   [junit4] Suite: org.apache.lucene.TestMergeSchedulerExternal
   [junit4] Completed [66/486] on J0 in 0.72s, 2 tests
   [junit4] 
   [junit4] Suite: org.apache.lucene.search.spans.TestSpanNearQuery
   [junit4] Completed [67/486] on J0 in 0.06s, 4 tests
   [junit4] 
   [junit4] Suite: org.apache.lucene.analysis.TestCharFilter
   [junit4] Completed [68/486] on J0 in 0.01s, 4 tests
   [junit4] 
   [junit4] Suite: org.apache.lucene.index.TestCrashCausesCorruptIndex
   [junit4] Completed [69/486] on J0 in 0.17s, 1 test
   [junit4] 
   [junit4] Suite: org.apache.lucene.index.TestOrdinalMap
   [junit4] Completed [70/486] on J0 in 1.51s, 1 test
   [junit4] 
   [junit4] HEARTBEAT J1 PID(30587@localhost): 2018-12-05T05:27:44, stalled for  302s at: Test2BPostings.test
   [junit4] Suite: org.apache.lucene.search.TestScorerPerf
   [junit4] Completed [71/486] on J0 in 10.24s, 1 test
   [junit4] 
   [junit4] Suite: org.apache.lucene.index.TestInfoStream
   [junit4] Completed [72/486] on J0 in 0.02s, 2 tests
   [junit4] 
   [junit4] Suite: org.apache.lucene.util.TestBytesRefArray
   [junit4] Completed [73/486] on J0 in 0.28s, 2 tests
   [junit4] 
   [junit4] Suite: org.apache.lucene.codecs.lucene50.TestForUtil
   [junit4] Completed [74/486] on J0 in 0.03s, 1 test
   [junit4] 
   [junit4] Suite: org.apache.lucene.index.TestUniqueTermCount
   [junit4] Completed [75/486] on J0 in 0.14s, 1 test
   [junit4] 
   [junit4] Suite: org.apache.lucene.search.TestSortedSetSelector
   [junit4] Completed [76/486] on J0 in 0.25s, 15 tests
   [junit4] 
   [junit4] Suite: org.apache.lucene.codecs.lucene50.TestBlockPostingsFormat
   [junit4] Completed [77/486] on J0 in 22.62s, 27 tests
   [junit4] 
   [junit4] Suite: org.apache.lucene.util.TestDocIdSetBuilder
   [junit4] Completed [78/486] on J0 in 1.48s, 7 tests
   [junit4] 
   [junit4] Suite: org.apache.lucene.index.TestPerSegmentDeletes
   [junit4] Completed [79/486] on J0 in 0.04s, 1 test
   [junit4] 
   [junit4] Suite: org.apache.lucene.search.TestDoubleRangeFieldQueries
   [junit4] Completed [80/486] on J2 in 57.08s, 5 tests
   [junit4] 
   [junit4] Suite: org.apache.lucene.index.TestStressDeletes
   [junit4] Completed [81/486] on J2 in 1.47s, 1 test
   [junit4] 
   [junit4] Suite: org.apache.lucene.util.automaton.TestDeterminizeLexicon
   [junit4] Completed [82/486] on J0 in 3.41s, 1 test
   [junit4] 
   [junit4] Suite: org.apache.lucene.store.TestByteArrayDataInput
   [junit4] Completed [83/486] on J0 in 0.04s, 1 test
   [junit4] 
   [junit4] Suite: org.apache.lucene.document.TestLatLonDocValuesField
   [junit4] Completed [84/486] on J0 in 0.07s, 1 test
   [junit4] 
   [junit4] Suite: org.apache.lucene.analysis.TestCachingTokenFilter
   [junit4] Completed [85/486] on J0 in 0.07s, 2 tests
   [junit4] 
   [junit4] Suite: org.apache.lucene.store.TestNIOFSDirectory
   [junit4] Completed [86/486] on J0 in 3.76s, 41 tests
   [junit4] 
   [junit4] Suite: org.apache.lucene.index.TestDirectoryReaderReopen
   [junit4] Completed [87/486] on J0 in 3.76s, 15 tests
   [junit4] 
   [junit4] Suite: org.apache.lucene.index.TestMergeRateLimiter
   [junit4] Completed [88/486] on J0 in 0.04s, 1 test
   [junit4] 
   [junit4] Suite: org.apache.lucene.util.automaton.TestUTF32ToUTF8
   [junit4] Completed [89/486] on J2 in 10.58s, 6 tests
   [junit4] 
   [junit4] Suite: org.apache.lucene.index.TestStressIndexing
   [junit4] Completed [90/486] on J0 in 4.73s, 1 test
   [junit4] 
   [junit4] Suite: org.apache.lucene.search.TestLongValuesSource
   [junit4] Completed [91/486] on J2 in 7.42s, 4 tests
   [junit4] 
   [junit4] Suite: org.apache.lucene.TestSearchForDuplicates
   [junit4] Completed [92/486] on J2 in 0.30s, 1 test
   [junit4] 
   [junit4] Suite: org.apache.lucene.search.spans.TestSpanOrQuery
   [junit4] Completed [93/486] on J2 in 0.05s, 3 tests
   [junit4] 
   [junit4] Suite: org.apache.lucene.analysis.TestDelegatingAnalyzerWrapper
   [junit4] Completed [94/486] on J2 in 0.08s, 3 tests
   [junit4] 
   [junit4] Suite: org.apache.lucene.index.TestCustomTermFreq
   [junit4] Completed [95/486] on J2 in 0.23s, 12 tests
   [junit4] 
   [junit4] Suite: org.apache.lucene.index.TestParallelLeafReader
   [junit4] Completed [96/486] on J2 in 0.56s, 10 tests
   [junit4] 
   [junit4] HEARTBEAT J1 PID(30587@localhost): 2018-12-05T05:28:44, stalled for  362s at: Test2BPostings.test
   [junit4] Suite: org.apache.lucene.index.TestNorms
   [junit4] Completed [97/486] on J0 in 9.58s, 2 tests
   [junit4] 
   [junit4] Suite: org.apache.lucene.TestAssertions
   [junit4] Completed [98/486] on J0 in 0.02s, 1 test
   [junit4] 
   [junit4] Suite: org.apache.lucene.search.TestMatchAllDocsQuery
   [junit4] Completed [99/486] on J0 in 0.31s, 2 tests
   [junit4] 
   [junit4] Suite: org.apache.lucene.util.TestMathUtil
   [junit4] Completed [100/486] on J0 in 0.05s, 5 tests
   [junit4] 
   [junit4] Suite: org.apache.lucene.search.spans.TestSpansEnum
   [junit4] Completed [101/486] on J0 in 0.22s, 7 tests
   [junit4] 
   [junit4] Suite: org.apache.lucene.document.TestFieldType
   [junit4] Completed [102/486] on J0 in 0.27s, 3 tests
   [junit4] 
   [junit4] Suite: org.apache.lucene.index.TestAllFilesDetectTruncation
   [junit4] Completed [103/486] on J0 in 9.73s, 1 test
   [junit4] 
   [junit4] Suite: org.apache.lucene.search.TestDisjunctionMaxQuery
   [junit4] Completed [104/486] on J0 in 0.60s, 13 tests
   [junit4] 
   [junit4] Suite: org.apache.lucene.search.TestBooleanOr
   [junit4] Completed [105/486] on J0 in 3.25s, 7 tests
   [junit4] 
   [junit4] Suite: org.apache.lucene.search.TestSortRandom
   [junit4] Completed [106/486] on J0 in 1.57s, 2 tests
   [junit4] 
   [junit4] Suite: org.apache.lucene.search.similarities.TestSimilarityBase
   [junit4] Completed [107/486] on J0 in 0.56s, 31 tests
   [junit4] 
   [junit4] Suite: org.apache.lucene.search.TestSearchWithThreads
   [junit4] Completed [108/486] on J2 in 23.98s, 1 test
   [junit4] 
   [junit4] Suite: org.apache.lucene.index.TestIsCurrent
   [junit4] Completed [109/486] on J2 in 0.07s, 2 tests
   [junit4] 
   [junit4] Suite: org.apache.lucene.util.TestCharsRef
   [junit4] Completed [110/486] on J2 in 0.29s, 6 tests
   [junit4] 
   [junit4] Suite: org.apache.lucene.codecs.lucene50.TestLucene50LiveDocsFormat
   [junit4] IGNOR/A 0.00s J2 | TestLucene50LiveDocsFormat.testOverflow
   [junit4]    > Assumption #1: 'monster' test group is disabled (@Monster(value=Uses lots of memory))
   [junit4] Completed [111/486] on J2 in 0.03s, 4 tests, 1 skipped
   [junit4] 
   [junit4] Suite: org.apache.lucene.search.FuzzyTermOnShortTermsTest
   [junit4] Completed [112/486] on J2 in 0.16s, 1 test
   [junit4] 
   [junit4] Suite: org.apache.lucene.search.TestSubScorerFreqs
   [junit4] Completed [113/486] on J2 in 0.18s, 3 tests
   [junit4] 
   [junit4] Suite: org.apache.lucene.index.TestIndexWriterDelete
   [junit4] IGNOR/A 0.00s J0 | TestIndexWriterDelete.testIndexingThenDeleting
   [junit4]    > Assumption #1: This test cannot run with Direct codec
   [junit4] Completed [114/486] on J0 in 7.48s, 26 tests, 2 skipped
   [junit4] 
   [junit4] Suite: org.apache.lucene.index.TestExceedMaxTermLength
   [junit4] Completed [115/486] on J0 in 0.06s, 1 test
   [junit4] 
   [junit4] Suite: org.apache.lucene.codecs.lucene50.TestBlockPostingsFormat3
   [junit4] Completed [116/486] on J2 in 15.78s, 1 test
   [junit4] 
   [junit4] Suite: org.apache.lucene.util.TestFixedBitDocIdSet
   [junit4] Completed [117/486] on J2 in 1.42s, 5 tests
   [junit4] 
   [junit4] Suite: org.apache.lucene.search.TestTopDocsMerge
   [junit4] Completed [118/486] on J0 in 27.31s, 4 tests
   [junit4] 
   [junit4] Suite: org.apache.lucene.search.TestNeedsScores
   [junit4] Completed [119/486] on J0 in 0.06s, 4 tests
   [junit4] 
   [junit4] Suite: org.apache.lucene.search.TestTotalHitCountCollector
   [junit4] Completed [120/486] on J0 in 0.04s, 1 test
   [junit4] 
   [junit4] Suite: org.apache.lucene.index.TestPostingsOffsets
   [junit4] Completed [121/486] on J0 in 4.61s, 13 tests
   [junit4] 
   [junit4] HEARTBEAT J1 PID(30587@localhost): 2018-12-05T05:29:44, stalled for  422s at: Test2BPostings.test
   [junit4] Suite: org.apache.lucene.index.TestIndexWriterOnJRECrash
   [junit4] Completed [122/486] on J0 in 5.71s, 1 test
   [junit4] 
   [junit4] Suite: org.apache.lucene.index.TestDocsWithFieldSet
   [junit4] Completed [123/486] on J0 in 0.01s, 3 tests
   [junit4] 
   [junit4] Suite: org.apache.lucene.index.TestSegmentTermDocs
   [junit4] Completed [124/486] on J0 in 0.39s, 4 tests
   [junit4] 
   [junit4] Suite: org.apache.lucene.index.TestIndexWriterExceptions2
   [junit4] Completed [125/486] on J0 in 17.53s, 1 test
   [junit4] 
   [junit4] HEARTBEAT J2 PID(30593@localhost): 2018-12-05T05:30:32, stalled for 68.9s at: TestPointValues.testTieBreakByDocID
   [junit4] HEARTBEAT J1 PID(30587@localhost): 2018-12-05T05:30:44, stalled for  482s at: Test2BPostings.test
   [junit4] Suite: org.apache.lucene.util.fst.TestFSTs
   [junit4] Completed [126/486] on J0 in 83.87s, 20 tests
   [junit4] 
   [junit4] Suite: org.apache.lucene.index.TestFilterCodecReader
   [junit4] Completed [127/486] on J0 in 0.03s, 2 tests
   [junit4] 
   [junit4] Suite: org.apache.lucene.search.TestMultiPhraseQuery
   [junit4] Completed [128/486] on J0 in 0.22s, 17 tests, 1 skipped
   [junit4] 
   [junit4] Suite: org.apache.lucene.index.Test2BSortedDocValuesFixedSorted
   [junit4] IGNOR/A 0.00s J0 | Test2BSortedDocValuesFixedSorted.testFixedSorted
   [junit4]    > Assumption #1: 'monster' test group is disabled (@Monster(value=Takes ~ 6 hours if the heap is 5gb))
   [junit4] Completed [129/486] on J0 in 0.00s, 1 test, 1 skipped
   [junit4] 
   [junit4] Suite: org.apache.lucene.index.TestDocIDMerger
   [junit4] Completed [130/486] on J0 in 0.06s, 2 tests
   [junit4] 
   [junit4] Suite: org.apache.lucene.index.TestOmitPositions
   [junit4] Completed [131/486] on J0 in 0.48s, 4 tests
   [junit4] 
   [junit4] HEARTBEAT J2 PID(30593@localhost): 2018-12-05T05:31:32, stalled for  129s at: TestPointValues.testTieBreakByDocID
   [junit4] Suite: org.apache.lucene.analysis.TestGraphTokenizers
   [junit4] Completed [132/486] on J0 in 3.51s, 23 tests
   [junit4] 
   [junit4] Suite: org.apache.lucene.analysis.TestReusableStringReader
   [junit4] Completed [133/486] on J0 in 0.04s, 1 test
   [junit4] 
   [junit4] Suite: org.apache.lucene.analysis.TestStopFilter
   [junit4] Completed [134/486] on J0 in 0.02s, 4 tests
   [junit4] 
   [junit4] Suite: org.apache.lucene.analysis.TestToken
   [junit4] Completed [135/486] on J0 in 0.02s, 5 tests
   [junit4] 
   [junit4] Suite: org.apache.lucene.analysis.TestWordlistLoader
   [junit4] Completed [136/486] on J0 in 0.06s, 3 tests
   [junit4] 
   [junit4] HEARTBEAT J1 PID(30587@localhost): 2018-12-05T05:31:44, stalled for  542s at: Test2BPostings.test
   [junit4] Suite: org.apache.lucene.index.Test2BPostings
   [junit4] Completed [137/486] on J1 in 566.66s, 1 test
   [junit4] 
   [junit4] Suite: org.apache.lucene.search.TestSimilarityProvider
   [junit4] Completed [138/486] on J1 in 0.09s, 1 test
   [junit4] 
   [junit4] Suite: org.apache.lucene.index.TestTermdocPerf
   [junit4] Completed [139/486] on J1 in 0.09s, 1 test
   [junit4] 
   [junit4] Suite: org.apache.lucene.util.TestLongsRef
   [junit4] Completed [140/486] on J1 in 0.05s, 3 tests
   [junit4] 
   [junit4] Suite: org.apache.lucene.store.TestMmapDirectory
   [junit4] Completed [141/486] on J1 in 3.23s, 42 tests, 1 skipped
   [junit4] 
   [junit4] Suite: org.apache.lucene.analysis.standard.TestStandardAnalyzer
   [junit4] Completed [142/486] on J0 in 43.64s, 36 tests
   [junit4] 
   [junit4] Suite: org.apache.lucene.codecs.compressing.TestFastCompressionMode
   [junit4] Completed [143/486] on J0 in 1.33s, 11 tests
   [junit4] 
   [junit4] Suite: org.apache.lucene.codecs.compressing.TestFastDecompressionMode
   [junit4] Completed [144/486] on J0 in 3.32s, 11 tests
   [junit4] 
   [junit4] Suite: org.apache.lucene.codecs.compressing.TestHighCompressionMode
   [junit4] Completed [145/486] on J0 in 1.78s, 7 tests
   [junit4] 
   [junit4] Suite: org.apache.lucene.store.TestGrowableByteArrayDataOutput
   [junit4] Completed [146/486] on J1 in 15.55s, 2 tests
   [junit4] 
   [junit4] Suite: org.apache.lucene.util.TestFixedLengthBytesRefArray
   [junit4] Completed [147/486] on J1 in 0.21s, 2 tests
   [junit4] 
   [junit4] Suite: org.apache.lucene.util.TestPriorityQueue
   [junit4] Completed [148/486] on J1 in 0.49s, 10 tests
   [junit4] 
   [junit4] Suite: org.apache.lucene.index.TestBinaryTerms
   [junit4] Completed [149/486] on J1 in 0.15s, 2 tests
   [junit4] 
   [junit4] Suite: org.apache.lucene.geo.TestGeoEncodingUtils
   [junit4] Completed [150/486] on J1 in 0.82s, 3 tests
   [junit4] 
   [junit4] HEARTBEAT J2 PID(30593@localhost): 2018-12-05T05:32:32, stalled for  189s at: TestPointValues.testTieBreakByDocID
   [junit4] Suite: org.apache.lucene.search.TestFieldCacheRewriteMethod
   [junit4] Completed [151/486] on J1 in 7.18s, 2 tests
   [junit4] 
   [junit4] Suite: org.apache.lucene.search.TestFloatRangeFieldQueries
   [junit4] Completed [152/486] on J1 in 50.43s, 5 tests
   [junit4] 
   [junit4] HEARTBEAT J0 PID(30589@localhost): 2018-12-05T05:33:32, stalled for 63.0s at: TestLucene70DocValuesFormat.testSortedVariableLengthBigVsStoredFields
   [junit4] HEARTBEAT J2 PID(30593@localhost): 2018-12-05T05:33:32, stalled for  249s at: TestPointValues.testTieBreakByDocID
   [junit4] HEARTBEAT J2 PID(30593@localhost): 2018-12-05T05:34:32, stalled for  309s at: TestPointValues.testTieBreakByDocID
   [junit4] Suite: org.apache.lucene.search.TestEarlyTerminatingSortingCollector
   [junit4] Completed [153/486] on J1 in 68.96s, 4 tests
   [junit4] 
   [junit4] Suite: org.apache.lucene.util.TestIntsRef
   [junit4] Completed [154/486] on J1 in 0.04s, 3 tests
   [junit4] 
   [junit4] Suite: org.apache.lucene.index.TestRollingUpdates
   [junit4] Completed [155/486] on J1 in 36.11s, 2 tests
   [junit4] 
   [junit4] Suite: org.apache.lucene.search.spans.TestSpanTermQuery
   [junit4] Completed [156/486] on J1 in 0.03s, 2 tests
   [junit4] 
   [junit4] HEARTBEAT J2 PID(30593@localhost): 2018-12-05T05:35:32, stalled for  369s at: TestPointValues.testTieBreakByDocID
   [junit4] HEARTBEAT J2 PID(30593@localhost): 2018-12-05T05:36:32, stalled for  429s at: TestPointValues.testTieBreakByDocID
   [junit4] HEARTBEAT J0 PID(30589@localhost): 2018-12-05T05:37:08, stalled for 62.4s at: TestLucene70DocValuesFormat.testTermsEnumLongSharedPrefixes
   [junit4] HEARTBEAT J1 PID(30587@localhost): 2018-12-05T05:37:20, stalled for 65.4s at: TestLatLonDocValuesQueries.testRandomBig
   [junit4] HEARTBEAT J2 PID(30593@localhost): 2018-12-05T05:37:32, stalled for  489s at: TestPointValues.testTieBreakByDocID
   [junit4] Suite: org.apache.lucene.search.TestLatLonDocValuesQueries
   [junit4] IGNOR/A 0.00s J1 | TestLatLonDocValuesQueries.testPolygonNullField
   [junit4]    > Assumption #1: Impl does not support polygons
   [junit4] IGNOR/A 0.00s J1 | TestLatLonDocValuesQueries.testMultiPolygonBasics
   [junit4]    > Assumption #1: Impl does not support polygons
   [junit4] IGNOR/A 0.00s J1 | TestLatLonDocValuesQueries.testPolygonHole
   [junit4]    > Assumption #1: Impl does not support polygons
   [junit4] IGNOR/A 0.00s J1 | TestLatLonDocValuesQueries.testSmallSetPolyWholeMap
   [junit4]    > Assumption #1: Impl does not support polygons
   [junit4] IGNOR/A 0.00s J1 | TestLatLonDocValuesQueries.testPolygonBasics
   [junit4]    > Assumption #1: Impl does not support polygons
   [junit4] IGNOR/A 0.00s J1 | TestLatLonDocValuesQueries.testSmallSetPoly
   [junit4]    > Assumption #1: Impl does not support polygons
   [junit4] IGNOR/A 0.01s J1 | TestLatLonDocValuesQueries.testPolygonHoleExcludes
   [junit4]    > Assumption #1: Impl does not support polygons
   [junit4] Completed [157/486] on J1 in 162.92s, 40 tests, 7 skipped
   [junit4] 
   [junit4] Suite: org.apache.lucene.search.TestMultiset
   [junit4] Completed [158/486] on J1 in 0.03s, 2 tests
   [junit4] 
   [junit4] Suite: org.apache.lucene.codecs.lucene50.TestLucene50StoredFieldsFormatHighCompression
   [junit4] Completed [159/486] on J1 in 23.71s, 19 tests
   [junit4] 
   [junit4] Suite: org.apache.lucene.analysis.tokenattributes.TestCharTermAttributeImpl
   [junit4] Completed [160/486] on J1 in 0.44s, 13 tests
   [junit4] 
   [junit4] HEARTBEAT J2 PID(30593@localhost): 2018-12-05T05:38:32, stalled for  549s at: TestPointValues.testTieBreakByDocID
   [junit4] Suite: org.apache.lucene.codecs.lucene60.TestLucene60PointsFormat
   [junit4] IGNOR/A 0.00s J1 | TestLucene60PointsFormat.testMergeStability
   [junit4]    > Assumption #1: TODO: mess with the parameters and test gets angry!
   [junit4] Completed [161/486] on J1 in 28.03s, 20 tests, 1 skipped
   [junit4] 
   [junit4] HEARTBEAT J0 PID(30589@localhost): 2018-12-05T05:38:56, stalled for 68.9s at: TestLucene70DocValuesFormat.testSparseSortedNumericBlocksOfVariousBitsPerValue
   [junit4] Suite: org.apache.lucene.geo.TestPolygon2D
   [junit4] Completed [162/486] on J1 in 10.85s, 12 tests
   [junit4] 
   [junit4] Suite: org.apache.lucene.codecs.TestCodecLoadingDeadlock
   [junit4] Completed [163/486] on J1 in 0.71s, 1 test
   [junit4] 
   [junit4] Suite: org.apache.lucene.search.TestDocValuesScoring
   [junit4] Completed [164/486] on J1 in 0.22s, 1 test
   [junit4] 
   [junit4] Suite: org.apache.lucene.index.TestStressAdvance
   [junit4] Completed [165/486] on J1 in 23.56s, 1 test
   [junit4] 
   [junit4] Suite: org.apache.lucene.util.automaton.TestRegExp
   [junit4] Completed [166/486] on J1 in 0.09s, 6 tests
   [junit4] 
   [junit4] HEARTBEAT J2 PID(30593@localhost): 2018-12-05T05:39:32, stalled for  609s at: TestPointValues.testTieBreakByDocID
   [junit4] Suite: org.apache.lucene.search.TestLongRangeFieldQueries
   [junit4] Completed [167/486] on J1 in 42.20s, 5 tests
   [junit4] 
   [junit4] Suite: org.apache.lucene.TestSearch
   [junit4] Completed [168/486] on J1 in 0.05s, 2 tests
   [junit4] 
   [junit4] Suite: org.apache.lucene.search.spans.TestSpanNotQuery
   [junit4] Completed [169/486] on J1 in 0.03s, 3 tests
   [junit4] 
   [junit4] Suite: org.apache.lucene.analysis.TestCharacterUtils
   [junit4] Completed [170/486] on J1 in 0.02s, 4 tests
   [junit4] 
   [junit4] Suite: org.apache.lucene.index.TestCustomNorms
   [junit4] Completed [171/486] on J1 in 3.54s, 1 test
   [junit4] 
   [junit4] Suite: org.apache.lucene.index.TestParallelCompositeReader
   [junit4] Completed [172/486] on J1 in 1.03s, 11 tests
   [junit4] 
   [junit4] Suite: org.apache.lucene.search.TestSearchAfter
   [junit4] Completed [173/486] on J1 in 1.42s, 1 test
   [junit4] 
   [junit4] Suite: org.apache.lucene.index.TestIntBlockPool
   [junit4] Completed [174/486] on J1 in 0.93s, 2 tests
   [junit4] 
   [junit4] Suite: org.apache.lucene.util.TestBytesRefHash
   [junit4] Completed [175/486] on J1 in 2.50s, 8 tests
   [junit4] 
   [junit4] Suite: org.apache.lucene.codecs.lucene50.TestLucene50CompoundFormat
   [junit4] Completed [176/486] on J1 in 4.67s, 26 tests
   [junit4] 
   [junit4] Suite: org.apache.lucene.index.TestUpgradeIndexMergePolicy
   [junit4] IGNOR/A 0.00s J1 | TestUpgradeIndexMergePolicy.testForceMergeNotNeeded
   [junit4]    > Assumption #1: this test cannot tolerate random forceMerges
   [junit4] Completed [177/486] on J1 in 2.22s, 4 tests, 1 skipped
   [junit4] 
   [junit4] Suite: org.apache.lucene.search.TestSortedSetSortField
   [junit4] Completed [178/486] on J1 in 0.05s, 7 tests
   [junit4] 
   [junit4] Suite: org.apache.lucene.index.TestPointValues
   [junit4] Completed [179/486] on J2 in 660.14s, 32 tests
   [junit4] 
   [junit4] Suite: org.apache.lucene.codecs.lucene50.TestBlockPostingsFormat2
   [junit4] Completed [180/486] on J1 in 6.54s, 4 tests
   [junit4] 
   [junit4] Suite: org.apache.lucene.util.TestFilterIterator
   [junit4] Completed [181/486] on J1 in 0.06s, 8 tests
   [junit4] 
   [junit4] Suite: org.apache.lucene.util.automaton.TestMinimize
   [junit4] Completed [182/486] on J2 in 5.66s, 3 tests
   [junit4] 
   [junit4] Suite: org.apache.lucene.store.TestByteBuffersDataOutput
   [junit4] Completed [183/486] on J2 in 2.45s, 8 tests
   [junit4] 
   [junit4] Suite: org.apache.lucene.index.TestPersistentSnapshotDeletionPolicy
   [junit4] Completed [184/486] on J1 in 2.40s, 13 tests
   [junit4] 
   [junit4] Suite: org.apache.lucene.util.automaton.TestLevenshteinAutomata
   [junit4] Completed [185/486] on J1 in 2.99s, 4 tests
   [junit4] 
   [junit4] Suite: org.apache.lucene.store.TestByteBuffersDataInput
   [junit4] Completed [186/486] on J1 in 7.78s, 7 tests
   [junit4] 
   [junit4] Suite: org.apache.lucene.document.TestLatLonPoint
   [junit4] Completed [187/486] on J1 in 0.13s, 1 test
   [junit4] 
   [junit4] Suite: org.apache.lucene.analysis.TestCharArrayMap
   [junit4] Completed [188/486] on J1 in 0.18s, 4 tests
   [junit4] 
   [junit4] Suite: org.apache.lucene.store.TestNRTCachingDirectory
   [junit4] IGNOR/A 0.01s J1 | TestNRTCachingDirectory.testPendingDeletions
   [junit4]    > Assumption #1: we can only install VirusCheckingFS on an FSDirectory
   [junit4] IGNOR/A 0.01s J1 | TestNRTCachingDirectory.testFsyncDoesntCreateNewFiles
   [junit4]    > Assumption #1: test only works for FSDirectory subclasses
   [junit4] Completed [189/486] on J1 in 3.61s, 43 tests, 2 skipped
   [junit4] 
   [junit4] Suite: org.apache.lucene.index.TestDoc
   [junit4] Completed [190/486] on J1 in 0.46s, 1 test
   [junit4] 
   [junit4] Suite: org.apache.lucene.document.TestLatLonPointDistanceSort
   [junit4] Completed [191/486] on J2 in 19.31s, 4 tests
   [junit4] 
   [junit4] Suite: org.apache.lucene.analysis.TestCharArraySet
   [junit4] Completed [192/486] on J2 in 0.05s, 15 tests
   [junit4] 
   [junit4] Suite: org.apache.lucene.index.TestMixedCodecs
   [junit4] Completed [193/486] on J1 in 5.31s, 1 test
   [junit4] 
   [junit4] Suite: org.apache.lucene.index.TestStressIndexing2
   [junit4] Completed [194/486] on J1 in 2.64s, 3 tests
   [junit4] 
   [junit4] HEARTBEAT J0 PID(30589@localhost): 2018-12-05T05:40:56, stalled for 67.1s at: TestLucene70DocValuesFormat.testSortedSetVariableLengthBigVsStoredFields
   [junit4] Suite: org.apache.lucene.store.TestNativeFSLockFactory
   [junit4] Completed [195/486] on J2 in 16.93s, 11 tests
   [junit4] 
   [junit4] Suite: org.apache.lucene.index.TestDocCount
   [junit4] Completed [196/486] on J2 in 0.08s, 1 test
   [junit4] 
   [junit4] Suite: org.apache.lucene.index.TestNumericDocValuesUpdates
   [junit4] Completed [197/486] on J1 in 55.47s, 32 tests
   [junit4] 
   [junit4] Suite: org.apache.lucene.TestDemo
   [junit4] Completed [198/486] on J1 in 0.10s, 1 test
   [junit4] 
   [junit4] Suite: org.apache.lucene.search.TestMatchNoDocsQuery
   [junit4] Completed [199/486] on J1 in 0.08s, 3 tests
   [junit4] 
   [junit4] Suite: org.apache.lucene.util.TestMergedIterator
   [junit4] Completed [200/486] on J1 in 0.61s, 25 tests
   [junit4] 
   [junit4] Suite: org.apache.lucene.store.TestBufferedChecksum
   [junit4] Completed [201/486] on J1 in 0.15s, 2 tests
   [junit4] 
   [junit4] Suite: org.apache.lucene.document.TestFloatRange
   [junit4] Completed [202/486] on J1 in 0.02s, 1 test
   [junit4] 
   [junit4] Suite: org.apache.lucene.index.TestAllFilesHaveChecksumFooter
   [junit4] Completed [203/486] on J1 in 0.84s, 1 test
   [junit4] 
   [junit4] Suite: org.apache.lucene.search.TestDocIdSetIterator
   [junit4] Completed [204/486] on J1 in 0.05s, 5 tests
   [junit4] 
   [junit4] Suite: org.apache.lucene.search.TestBooleanQuery
   [junit4] Completed [205/486] on J1 in 0.94s, 22 tests
   [junit4] 
   [junit4] HEARTBEAT J0 PID(30589@localhost): 2018-12-05T05:41:56, stalled for  127s at: TestLucene70DocValuesFormat.testSortedSetVariableLengthBigVsStoredFields
   [junit4] Suite: org.apache.lucene.search.TestSortRescorer
   [junit4] Completed [206/486] on J1 in 8.11s, 3 tests
   [junit4] 
   [junit4] Suite: org.apache.lucene.search.spans.TestBasics
   [junit4] Completed [207/486] on J1 in 5.27s, 27 tests
   [junit4] 
   [junit4] Suite: org.apache.lucene.index.TestIndexWriterDeleteByQuery
   [junit4] Completed [208/486] on J1 in 0.11s, 1 test
   [junit4] 
   [junit4] Suite: org.apache.lucene.index.TestExitableDirectoryReader
   [junit4] Completed [209/486] on J1 in 0.00s, 1 test, 1 skipped
   [junit4] 
   [junit4] Suite: org.apache.lucene.search.TestTopFieldCollector
   [junit4] Completed [210/486] on J1 in 0.23s, 8 tests
   [junit4] 
   [junit4] Suite: org.apache.lucene.search.TestNormsFieldExistsQuery
   [junit4] Completed [211/486] on J1 in 7.87s, 6 tests
   [junit4] 
   [junit4] Suite: org.apache.lucene.search.TestUsageTrackingFilterCachingPolicy
   [junit4] Completed [212/486] on J1 in 0.02s, 4 tests
   [junit4] 
   [junit4] Suite: org.apache.lucene.index.TestPrefixCodedTerms
   [junit4] Completed [213/486] on J1 in 0.19s, 3 tests
   [junit4] 
   [junit4] Suite: org.apache.lucene.index.TestMixedDocValuesUpdates
   [junit4] Completed [214/486] on J2 in 68.77s, 10 tests
   [junit4] 
   [junit4] Suite: org.apache.lucene.index.TestStressNRT
   [junit4] Completed [215/486] on J2 in 11.71s, 1 test
   [junit4] 
   [junit4] Suite: org.apache.lucene.index.TestOmitNorms
   [junit4] Completed [216/486] on J2 in 4.22s, 5 tests
   [junit4] 
   [junit4] Suite: org.apache.lucene.TestExternalCodecs
   [junit4] Completed [217/486] on J2 in 1.24s, 1 test
   [junit4] 
   [junit4] Suite: org.apache.lucene.index.TestIndexWriterOnVMError
   [junit4] IGNOR/A 0.00s J1 | TestIndexWriterOnVMError.testCheckpoint
   [junit4]    > Assumption #1: 'badapple' test group is disabled (@BadApple(bugUrl=https://issues.apache.org/jira/browse/SOLR-12028))
   [junit4] Completed [218/486] on J1 in 20.05s, 3 tests, 1 skipped
   [junit4] 
   [junit4] Suite: org.apache.lucene.search.TestMatchesIterator
   [junit4] Completed [219/486] on J2 in 0.85s, 25 tests
   [junit4] 
   [junit4] Suite: org.apache.lucene.util.TestNamedSPILoader
   [junit4] Completed [220/486] on J2 in 0.02s, 3 tests
   [junit4] 
   [junit4] Suite: org.apache.lucene.index.TestDocumentWriter
   [junit4] Completed [221/486] on J1 in 0.21s, 6 tests
   [junit4] 
   [junit4] Suite: org.apache.lucene.index.TestSegmentTermEnum
   [junit4] Completed [222/486] on J1 in 0.08s, 2 tests
   [junit4] 
   [junit4] Suite: org.apache.lucene.store.TestBufferedIndexInput
   [junit4] Completed [223/486] on J2 in 0.54s, 4 tests
   [junit4] 
   [junit4] Suite: org.apache.lucene.document.TestIntRange
   [junit4] Completed [224/486] on J2 in 0.01s, 1 test
   [junit4] 
   [junit4] Suite: org.apache.lucene.index.TestAllFilesHaveCodecHeader
   [junit4] Completed [225/486] on J2 in 0.95s, 1 test
   [junit4] 
   [junit4] Suite: org.apache.lucene.index.TestIndexWriterForceMerge
   [junit4] Completed [226/486] on J1 in 7.64s, 4 tests
   [junit4] 
   [junit4] Suite: org.apache.lucene.util.graph.TestGraphTokenStreamFiniteStrings
   [junit4] Completed [227/486] on J1 in 0.05s, 12 tests
   [junit4] 
   [junit4] Suite: org.apache.lucene.index.TestFilterDirectoryReader
   [junit4] Completed [228/486] on J1 in 0.02s, 1 test
   [junit4] 
   [junit4] Suite: org.apache.lucene.search.TestMultiTermConstantScore
   [junit4] Completed [229/486] on J1 in 5.31s, 7 tests
   [junit4] 
   [junit4] Suite: org.apache.lucene.index.Test2BSortedDocValuesOrds
   [junit4] IGNOR/A 0.00s J1 | Test2BSortedDocValuesOrds.test2BOrds
   [junit4]    > Assumption #1: 'monster' test group is disabled (@Monster(value=Takes ~ 6 hours if the heap is 5gb))
   [junit4] Completed [230/486] on J1 in 0.01s, 1 test, 1 skipped
   [junit4] 
   [junit4] Suite: org.apache.lucene.index.TestDocInverterPerFieldErrorInfo
   [junit4] Completed [231/486] on J1 in 0.05s, 2 tests
   [junit4] 
   [junit4] Suite: org.apache.lucene.index.TestOmitTf
   [junit4] Completed [232/486] on J1 in 0.52s, 6 tests
   [junit4] 
   [junit4] Suite: org.apache.lucene.search.TestDocValuesQueries
   [junit4] Completed [233/486] on J2 in 18.90s, 10 tests
   [junit4] 
   [junit4] Suite: org.apache.lucene.search.TestBooleanQueryVisitSubscorers
   [junit4] Completed [234/486] on J2 in 0.10s, 7 tests
   [junit4] 
   [junit4] Suite: org.apache.lucene.search.TestSortedNumericSortField
   [junit4] Completed [235/486] on J2 in 0.07s, 9 tests
   [junit4] 
   [junit4] Suite: org.apache.lucene.search.spans.TestFieldMaskingSpanQuery
   [junit4] IGNOR/A 0.00s J2 | TestFieldMaskingSpanQuery.testSpans2
   [junit4]    > Assumption #1: Broken scoring: LUCENE-3723
   [junit4] IGNOR/A 0.00s J2 | TestFieldMaskingSpanQuery.testSimple2
   [junit4]    > Assumption #1: Broken scoring: LUCENE-3723
   [junit4] Completed [236/486] on J2 in 0.16s, 11 tests, 2 skipped
   [junit4] 
   [junit4] HEARTBEAT J1 PID(30587@localhost): 2018-12-05T05:44:09, stalled for 63.2s at: TestLucene70NormsFormat.testSparseNCommonBig
   [junit4] HEARTBEAT J2 PID(30593@localhost): 2018-12-05T05:44:21, stalled for 64.4s at: TestIndexWriterExceptions.testTooManyTokens
   [junit4] HEARTBEAT J0 PID(30589@localhost): 2018-12-05T05:44:33, stalled for 65.4s at: TestLucene70DocValuesFormat.testTermsEnumRandomMany
   [junit4] HEARTBEAT J1 PID(30587@localhost): 2018-12-05T05:45:09, stalled for  123s at: TestLucene70NormsFormat.testSparseNCommonBig
   [junit4] HEARTBEAT J2 PID(30593@localhost): 2018-12-05T05:45:21, stalled for  124s at: TestIndexWriterExceptions.testTooManyTokens
   [junit4] Suite: org.apache.lucene.codecs.lucene70.TestLucene70DocValuesFormat
   [junit4] Completed [237/486] on J0 in 782.43s, 126 tests
   [junit4] 
   [junit4] Suite: org.apache.lucene.codecs.lucene70.TestLucene70SegmentInfoFormat
   [junit4] Completed [238/486] on J0 in 0.42s, 16 tests
   [junit4] 
   [junit4] HEARTBEAT J2 PID(30593@localhost): 2018-12-05T05:46:21, stalled for  184s at: TestIndexWriterExceptions.testTooManyTokens
   [junit4] HEARTBEAT J2 PID(30593@localhost): 2018-12-05T05:47:21, stalled for  244s at: TestIndexWriterExceptions.testTooManyTokens
   [junit4] HEARTBEAT J0 PID(30589@localhost): 2018-12-05T05:47:45, stalled for 67.5s at: TestPerFieldDocValuesFormat.testRandomAdvanceBinary
   [junit4] HEARTBEAT J1 PID(30587@localhost): 2018-12-05T05:47:57, stalled for 62.1s at: TestLucene70NormsFormat.testNCommonBig
   [junit4] Suite: org.apache.lucene.index.TestIndexWriterExceptions
   [junit4] Completed [239/486] on J2 in 312.56s, 35 tests
   [junit4] 
   [junit4] Suite: org.apache.lucene.index.TestFieldInfos
   [junit4] Completed [240/486] on J2 in 0.02s, 1 test
   [junit4] 
   [junit4] HEARTBEAT J1 PID(30587@localhost): 2018-12-05T05:48:57, stalled for  122s at: TestLucene70NormsFormat.testNCommonBig
   [junit4] Suite: org.apache.lucene.codecs.perfield.TestPerFieldDocValuesFormat
   [junit4] Completed [241/486] on J0 in 212.94s, 110 tests
   [junit4] 
   [junit4] Suite: org.apache.lucene.search.TestTopFieldCollectorEarlyTermination
   [junit4] Completed [242/486] on J2 in 56.46s, 3 tests
   [junit4] 
   [junit4] Suite: org.apache.lucene.search.TestNot
   [junit4] Completed [243/486] on J2 in 0.03s, 1 test
   [junit4] 
   [junit4] Suite: org.apache.lucene.search.TestWildcard
   [junit4] Completed [244/486] on J2 in 0.24s, 8 tests
   [junit4] 
   [junit4] Suite: org.apache.lucene.index.TestReadOnlyIndex
   [junit4] Completed [245/486] on J2 in 0.13s, 1 test
   [junit4] 
   [junit4] Suite: org.apache.lucene.index.TestIndexWriterOutOfFileDescriptors
   [junit4] Completed [246/486] on J2 in 10.15s, 1 test
   [junit4] 
   [junit4] Suite: org.apache.lucene.index.TestDocumentsWriterDeleteQueue
   [junit4] Completed [247/486] on J2 in 0.16s, 5 tests
   [junit4] 
   [junit4] Suite: org.apache.lucene.index.TestSizeBoundedForceMerge
   [junit4] Completed [248/486] on J2 in 0.10s, 11 tests
   [junit4] 
   [junit4] Suite: org.apache.lucene.index.TestIndexWriterFromReader
   [junit4] Completed [249/486] on J2 in 1.70s, 12 tests
   [junit4] 
   [junit4] Suite: org.apache.lucene.util.mutable.TestMutableValues
   [junit4] Completed [250/486] on J2 in 0.04s, 6 tests
   [junit4] 
   [junit4] Suite: org.apache.lucene.index.TestFilterLeafReader
   [junit4] Completed [251/486] on J2 in 0.06s, 3 tests
   [junit4] 
   [junit4] Suite: org.apache.lucene.search.TestMultiTermQueryRewrites
   [junit4] Completed [252/486] on J2 in 0.03s, 3 tests
   [junit4] 
   [junit4] Suite: org.apache.lucene.index.Test2BTerms
   [junit4] IGNOR/A 0.00s J2 | Test2BTerms.test2BTerms
   [junit4]    > Assumption #1: 'monster' test group is disabled (@Monster(value=very slow, use 5g minimum heap))
   [junit4] Completed [253/486] on J2 in 0.00s, 1 test, 1 skipped
   [junit4] 
   [junit4] Suite: org.apache.lucene.index.TestDocValues
   [junit4] Completed [254/486] on J2 in 0.12s, 8 tests
   [junit4] 
   [junit4] Suite: org.apache.lucene.index.TestOneMergeWrappingMergePolicy
   [junit4] Completed [255/486] on J2 in 0.04s, 1 test
   [junit4] 
   [junit4] Suite: org.apache.lucene.codecs.perfield.TestPerFieldPostingsFormat
   [junit4] IGNOR/A 0.00s J0 | TestPerFieldPostingsFormat.testMergeStability
   [junit4]    > Assumption #1: The MockRandom PF randomizes content on the fly, so we can't check it
   [junit4] IGNOR/A 0.00s J0 | TestPerFieldPostingsFormat.testPostingsEnumReuse
   [junit4]    > Assumption #1: The MockRandom PF randomizes content on the fly, so we can't check it
   [junit4] Completed [256/486] on J0 in 17.89s, 25 tests, 2 skipped
   [junit4] 
   [junit4] Suite: org.apache.lucene.document.TestBinaryDocument
   [junit4] Completed [257/486] on J0 in 0.04s, 1 test
   [junit4] 
   [junit4] Suite: org.apache.lucene.document.TestDateTools
   [junit4] Completed [258/486] on J0 in 0.05s, 5 tests
   [junit4] 
   [junit4] Suite: org.apache.lucene.document.TestDocument
   [junit4] Completed [259/486] on J0 in 0.06s, 12 tests
   [junit4] 
   [junit4] Suite: org.apache.lucene.document.TestDoubleRange
   [junit4] Completed [260/486] on J0 in 0.01s, 1 test
   [junit4] 
   [junit4] Suite: org.apache.lucene.document.TestFeatureField
   [junit4] Completed [261/486] on J0 in 0.17s, 8 tests
   [junit4] 
   [junit4] Suite: org.apache.lucene.document.TestField
   [junit4] Completed [262/486] on J0 in 0.05s, 23 tests
   [junit4] 
   [junit4] Suite: org.apache.lucene.codecs.perfield.TestPerFieldPostingsFormat2
   [junit4] Completed [263/486] on J2 in 6.09s, 6 tests
   [junit4] 
   [junit4] Suite: org.apache.lucene.index.TestAddIndexes
   [junit4] Completed [264/486] on J2 in 7.19s, 28 tests
   [junit4] 
   [junit4] Suite: org.apache.lucene.index.TestAllFilesCheckIndexHeader
   [junit4] Completed [265/486] on J2 in 9.62s, 1 test
   [junit4] 
   [junit4] Suite: org.apache.lucene.index.TestAtomicUpdate
   [junit4] Completed [266/486] on J2 in 6.19s, 1 test
   [junit4] 
   [junit4] HEARTBEAT J0 PID(30589@localhost): 2018-12-05T05:50:21, stalled for 60.1s at: Test4GBStoredFields.test
   [junit4] Suite: org.apache.lucene.index.TestBagOfPositions
   [junit4] Completed [267/486] on J2 in 44.45s, 1 test
   [junit4] 
   [junit4] Suite: org.apache.lucene.index.TestBagOfPostings
   [junit4] Completed [268/486] on J2 in 21.46s, 1 test
   [junit4] 
   [junit4] Suite: org.apache.lucene.index.TestCheckIndex
   [junit4] Completed [269/486] on J2 in 2.11s, 4 tests
   [junit4] 
   [junit4] Suite: org.apache.lucene.index.TestCodecHoldsOpenFiles
   [junit4] Completed [270/486] on J2 in 0.19s, 1 test
   [junit4] 
   [junit4] Suite: org.apache.lucene.index.TestCodecs
   [junit4] Completed [271/486] on J2 in 0.52s, 3 tests
   [junit4] 
   [junit4] Suite: org.apache.lucene.index.TestDeletionPolicy
   [junit4] Completed [272/486] on J2 in 5.37s, 6 tests
   [junit4] 
   [junit4] Suite: org.apache.lucene.index.Test4GBStoredFields
   [junit4] Completed [273/486] on J0 in 101.31s, 1 test
   [junit4] 
   [junit4] Suite: org.apache.lucene.index.TestDirectoryReader
   [junit4] Completed [274/486] on J0 in 2.08s, 24 tests
   [junit4] 
   [junit4] Suite: org.apache.lucene.codecs.lucene70.TestLucene70NormsFormat
   [junit4] IGNOR/A 0.00s J1 | TestLucene70NormsFormat.testMergeStability
   [junit4]    > Assumption #1: The MockRandom PF randomizes content on the fly, so we can't check it
   [junit4] Completed [275/486] on J1 in 512.43s, 29 tests, 1 skipped
   [junit4] 
   [junit4] Suite: org.apache.lucene.index.TestDuelingCodecs
   [junit4] Completed [276/486] on J1 in 24.70s, 2 tests
   [junit4] 
   [junit4] HEARTBEAT J0 PID(30589@localhost): 2018-12-05T05:52:09, stalled for 64.3s at: TestDocumentsWriterStallControl.testAccquireReleaseRace
   [junit4] HEARTBEAT J2 PID(30593@localhost): 2018-12-05T05:52:09, stalled for 67.0s at: TestDemoParallelLeafReader.testRandom
   [junit4] HEARTBEAT J1 PID(30587@localhost): 2018-12-05T05:52:57, stalled for 62.4s at: TestDuelingCodecsAtNight.testBigEquals
   [junit4] HEARTBEAT J0 PID(30589@localhost): 2018-12-05T05:53:09, stalled for  124s at: TestDocumentsWriterStallControl.testAccquireReleaseRace
   [junit4] HEARTBEAT J2 PID(30593@localhost): 2018-12-05T05:53:09, stalled for  127s at: TestDemoParallelLeafReader.testRandom
   [junit4] HEARTBEAT J1 PID(30587@localhost): 2018-12-05T05:53:57, stalled for  122s at: TestDuelingCodecsAtNight.testBigEquals
   [junit4] HEARTBEAT J0 PID(30589@localhost): 2018-12-05T05:54:09, stalled for  184s at: TestDocumentsWriterStallControl.testAccquireReleaseRace
   [junit4] HEARTBEAT J2 PID(30593@localhost): 2018-12-05T05:54:09, stalled for  187s at: TestDemoParallelLeafReader.testRandom
   [junit4] HEARTBEAT J1 PID(30587@localhost): 2018-12-05T05:54:57, stalled for  183s at: TestDuelingCodecsAtNight.testBigEquals
   [junit4] HEARTBEAT J0 PID(30589@localhost): 2018-12-05T05:55:09, stalled for  245s at: TestDocumentsWriterStallControl.testAccquireReleaseRace
   [junit4] HEARTBEAT J2 PID(30593@localhost): 2018-12-05T05:55:09, stalled for  247s at: TestDemoParallelLeafReader.testRandom
   [junit4] HEARTBEAT J1 PID(30587@localhost): 2018-12-05T05:55:57, stalled for  243s at: TestDuelingCodecsAtNight.testBigEquals
   [junit4] HEARTBEAT J0 PID(30589@localhost): 2018-12-05T05:56:09, stalled for  305s at: TestDocumentsWriterStallControl.testAccquireReleaseRace
   [junit4] HEARTBEAT J2 PID(30593@localhost): 2018-12-05T05:56:09, stalled for  307s at: TestDemoParallelLeafReader.testRandom
   [junit4] HEARTBEAT J1 PID(30587@localhost): 2018-12-05T05:56:57, stalled for  303s at: TestDuelingCodecsAtNight.testBigEquals
   [junit4] HEARTBEAT J0 PID(30589@localhost): 2018-12-05T05:57:09, stalled for  365s at: TestDocumentsWriterStallControl.testAccquireReleaseRace
   [junit4] HEARTBEAT J2 PID(30593@localhost): 2018-12-05T05:57:09, stalled for  367s at: TestDemoParallelLeafReader.testRandom
   [junit4] Suite: org.apache.lucene.index.TestDocumentsWriterStallControl
   [junit4] Completed [277/486] on J0 in 376.31s, 3 tests
   [junit4] 
   [junit4] Suite: org.apache.lucene.index.TestFieldInvertState
   [junit4] Completed [278/486] on J0 in 0.10s, 2 tests
   [junit4] 
   [junit4] Suite: org.apache.lucene.index.TestFieldReuse
   [junit4] Completed [279/486] on J0 in 0.02s, 2 tests
   [junit4] 
   [junit4] Suite: org.apache.lucene.index.TestFieldsReader
   [junit4] Completed [280/486] on J0 in 0.29s, 2 tests
   [junit4] 
   [junit4] Suite: org.apache.lucene.index.TestFilterMergePolicy
   [junit4] Completed [281/486] on J0 in 0.02s, 1 test
   [junit4] 
   [junit4] Suite: org.apache.lucene.index.TestFlex
   [junit4] Completed [282/486] on J0 in 0.33s, 2 tests
   [junit4] 
   [junit4] Suite: org.apache.lucene.index.TestFlushByRamOrCountsPolicy
   [junit4] Completed [283/486] on J0 in 3.44s, 5 tests
   [junit4] 
   [junit4] Suite: org.apache.lucene.index.TestForTooMuchCloning
   [junit4] Completed [284/486] on J0 in 0.47s, 1 test
   [junit4] 
   [junit4] Suite: org.apache.lucene.index.TestForceMergeForever
   [junit4] Completed [285/486] on J0 in 1.13s, 1 test
   [junit4] 
   [junit4] Suite: org.apache.lucene.index.TestIndexCommit
   [junit4] Completed [286/486] on J0 in 0.01s, 1 test
   [junit4] 
   [junit4] Suite: org.apache.lucene.index.TestIndexFileDeleter
   [junit4] Completed [287/486] on J0 in 0.99s, 10 tests
   [junit4] 
   [junit4] Suite: org.apache.lucene.index.TestIndexInput
   [junit4] Completed [288/486] on J0 in 0.79s, 2 tests
   [junit4] 
   [junit4] Suite: org.apache.lucene.index.TestIndexManyDocuments
   [junit4] Completed [289/486] on J0 in 5.97s, 1 test
   [junit4] 
   [junit4] Suite: org.apache.lucene.index.TestIndexReaderClose
   [junit4] Completed [290/486] on J0 in 0.92s, 3 tests
   [junit4] 
   [junit4] HEARTBEAT J1 PID(30587@localhost): 2018-12-05T05:57:57, stalled for  363s at:

[...truncated too long message...]

vy-settings.xml

resolve-groovy:

check-lucene-core-uptodate:

jar-lucene-core:

check-backward-codecs-uptodate:

jar-backward-codecs:

check-analyzers-phonetic-uptodate:

jar-analyzers-phonetic:

check-analyzers-kuromoji-uptodate:

jar-analyzers-kuromoji:

check-analyzers-nori-uptodate:

jar-analyzers-nori:

check-codecs-uptodate:

jar-codecs:

check-expressions-uptodate:

jar-expressions:

check-suggest-uptodate:

jar-suggest:

check-highlighter-uptodate:

jar-highlighter:

check-memory-uptodate:

jar-memory:

check-misc-uptodate:

jar-misc:

check-spatial-extras-uptodate:

jar-spatial-extras:

check-spatial3d-uptodate:

jar-spatial3d:

check-grouping-uptodate:

jar-grouping:

check-queries-uptodate:

jar-queries:

check-queryparser-uptodate:

jar-queryparser:

check-join-uptodate:

jar-join:

check-sandbox-uptodate:

jar-sandbox:

check-classification-uptodate:

jar-classification:

prep-lucene-jars:

resolve-example:

ivy-availability-check:
[loadresource] Do not set property disallowed.ivy.jars.list as its length is 0.

-ivy-fail-disallowed-ivy-version:

ivy-fail:

ivy-configure:
[ivy:configure] :: loading settings :: file = /x1/jenkins/jenkins-slave/workspace/Lucene-Solr-NightlyTests-7.6/checkout/lucene/top-level-ivy-settings.xml

resolve:

resolve-server:

ivy-availability-check:
[loadresource] Do not set property disallowed.ivy.jars.list as its length is 0.

-ivy-fail-disallowed-ivy-version:

ivy-fail:

ivy-fail:

ivy-configure:
[ivy:configure] :: loading settings :: file = /x1/jenkins/jenkins-slave/workspace/Lucene-Solr-NightlyTests-7.6/checkout/lucene/top-level-ivy-settings.xml

resolve:

-check-git-state:

-git-cleanroot:

-copy-git-state:

git-autoclean:

ivy-fail:

resolve:

common.init:

compile-lucene-core:

-check-git-state:

-git-cleanroot:

-copy-git-state:

git-autoclean:

ivy-availability-check:
[loadresource] Do not set property disallowed.ivy.jars.list as its length is 0.

-ivy-fail-disallowed-ivy-version:

ivy-fail:

ivy-configure:
[ivy:configure] :: loading settings :: file = /x1/jenkins/jenkins-slave/workspace/Lucene-Solr-NightlyTests-7.6/checkout/lucene/top-level-ivy-settings.xml

resolve:

init:

-clover.disable:

-clover.load:

-clover.classpath:

-clover.setup:

clover:

compile-core:

init:

-clover.disable:

-clover.load:

-clover.classpath:

-clover.setup:

clover:

common.compile-core:

compile-core:

resolve-groovy:

check-lucene-core-uptodate:

jar-lucene-core:

check-backward-codecs-uptodate:

jar-backward-codecs:

check-analyzers-phonetic-uptodate:

jar-analyzers-phonetic:

check-analyzers-kuromoji-uptodate:

jar-analyzers-kuromoji:

check-analyzers-nori-uptodate:

jar-analyzers-nori:

check-codecs-uptodate:

jar-codecs:

check-expressions-uptodate:

jar-expressions:

check-suggest-uptodate:

jar-suggest:

check-highlighter-uptodate:

jar-highlighter:

check-memory-uptodate:

jar-memory:

check-misc-uptodate:

jar-misc:

check-spatial-extras-uptodate:

jar-spatial-extras:

check-spatial3d-uptodate:

jar-spatial3d:

check-grouping-uptodate:

jar-grouping:

check-queries-uptodate:

jar-queries:

check-queryparser-uptodate:

jar-queryparser:

check-join-uptodate:

jar-join:

check-sandbox-uptodate:

jar-sandbox:

check-classification-uptodate:

jar-classification:

prep-lucene-jars:

resolve-example:

ivy-availability-check:
[loadresource] Do not set property disallowed.ivy.jars.list as its length is 0.

-ivy-fail-disallowed-ivy-version:

ivy-fail:

ivy-configure:
[ivy:configure] :: loading settings :: file = /x1/jenkins/jenkins-slave/workspace/Lucene-Solr-NightlyTests-7.6/checkout/lucene/top-level-ivy-settings.xml

resolve:

resolve-server:

ivy-availability-check:
[loadresource] Do not set property disallowed.ivy.jars.list as its length is 0.

-ivy-fail-disallowed-ivy-version:

ivy-fail:

ivy-fail:

ivy-configure:
[ivy:configure] :: loading settings :: file = /x1/jenkins/jenkins-slave/workspace/Lucene-Solr-NightlyTests-7.6/checkout/lucene/top-level-ivy-settings.xml

resolve:

-check-git-state:

-git-cleanroot:

-copy-git-state:

git-autoclean:

ivy-fail:

resolve:

common.init:

compile-lucene-core:

-check-git-state:

-git-cleanroot:

-copy-git-state:

git-autoclean:

ivy-availability-check:
[loadresource] Do not set property disallowed.ivy.jars.list as its length is 0.

-ivy-fail-disallowed-ivy-version:

ivy-fail:

ivy-configure:
[ivy:configure] :: loading settings :: file = /x1/jenkins/jenkins-slave/workspace/Lucene-Solr-NightlyTests-7.6/checkout/lucene/top-level-ivy-settings.xml

resolve:

init:

-clover.disable:

-clover.load:

-clover.classpath:

-clover.setup:

clover:

compile-core:

init:

common.compile-core:
    [mkdir] Created dir: /x1/jenkins/jenkins-slave/workspace/Lucene-Solr-NightlyTests-7.6/checkout/solr/build/contrib/solr-velocity/classes/java
    [javac] Compiling 5 source files to /x1/jenkins/jenkins-slave/workspace/Lucene-Solr-NightlyTests-7.6/checkout/solr/build/contrib/solr-velocity/classes/java
    [javac] Note: /x1/jenkins/jenkins-slave/workspace/Lucene-Solr-NightlyTests-7.6/checkout/solr/contrib/velocity/src/java/org/apache/solr/response/VelocityResponseWriter.java uses or overrides a deprecated API.
    [javac] Note: Recompile with -Xlint:deprecation for details.
    [javac] Note: /x1/jenkins/jenkins-slave/workspace/Lucene-Solr-NightlyTests-7.6/checkout/solr/contrib/velocity/src/java/org/apache/solr/response/VelocityResponseWriter.java uses unchecked or unsafe operations.
    [javac] Note: Recompile with -Xlint:unchecked for details.
     [copy] Copying 13 files to /x1/jenkins/jenkins-slave/workspace/Lucene-Solr-NightlyTests-7.6/checkout/solr/build/contrib/solr-velocity/classes/java

common-solr.compile-core:

compile-core:

compile-test-framework:

-check-git-state:

-git-cleanroot:

-copy-git-state:

git-autoclean:

ivy-availability-check:
[loadresource] Do not set property disallowed.ivy.jars.list as its length is 0.

-ivy-fail-disallowed-ivy-version:

ivy-fail:

ivy-configure:
[ivy:configure] :: loading settings :: file = /x1/jenkins/jenkins-slave/workspace/Lucene-Solr-NightlyTests-7.6/checkout/lucene/top-level-ivy-settings.xml

resolve:

init:

compile-lucene-core:

compile-codecs:

-check-git-state:

-git-cleanroot:

-copy-git-state:

git-autoclean:

ivy-availability-check:
[loadresource] Do not set property disallowed.ivy.jars.list as its length is 0.

-ivy-fail-disallowed-ivy-version:

ivy-fail:

ivy-configure:
[ivy:configure] :: loading settings :: file = /x1/jenkins/jenkins-slave/workspace/Lucene-Solr-NightlyTests-7.6/checkout/lucene/top-level-ivy-settings.xml

resolve:

common.init:

compile-lucene-core:

init:

-clover.disable:

-clover.load:

-clover.classpath:

-clover.setup:

clover:

compile-core:

-clover.disable:

-clover.load:

-clover.classpath:

-clover.setup:

clover:

common.compile-core:

compile-core:

common.compile-test:
    [mkdir] Created dir: /x1/jenkins/jenkins-slave/workspace/Lucene-Solr-NightlyTests-7.6/checkout/solr/build/contrib/solr-velocity/classes/test
    [javac] Compiling 2 source files to /x1/jenkins/jenkins-slave/workspace/Lucene-Solr-NightlyTests-7.6/checkout/solr/build/contrib/solr-velocity/classes/test
     [copy] Copying 2 files to /x1/jenkins/jenkins-slave/workspace/Lucene-Solr-NightlyTests-7.6/checkout/solr/build/contrib/solr-velocity/classes/test

compile-test:

patch-mrjar-classes:

install-junit4-taskdef:

compile-tools:

-check-git-state:

-git-cleanroot:

-copy-git-state:

git-autoclean:

ivy-availability-check:
[loadresource] Do not set property disallowed.ivy.jars.list as its length is 0.

-ivy-fail-disallowed-ivy-version:

ivy-fail:

ivy-configure:
[ivy:configure] :: loading settings :: file = /x1/jenkins/jenkins-slave/workspace/Lucene-Solr-NightlyTests-7.6/checkout/lucene/top-level-ivy-settings.xml

resolve:

init:

compile-core:

validate:

-init-totals:

-test:
    [mkdir] Created dir: /x1/jenkins/jenkins-slave/workspace/Lucene-Solr-NightlyTests-7.6/checkout/solr/build/contrib/solr-velocity/test
    [mkdir] Created dir: /x1/jenkins/jenkins-slave/workspace/Lucene-Solr-NightlyTests-7.6/checkout/solr/build/contrib/solr-velocity/test/temp
    [mkdir] Created dir: /x1/jenkins/jenkins-slave/workspace/Lucene-Solr-NightlyTests-7.6/checkout/.caches/test-stats/solr-velocity
   [junit4] <JUnit4> says مرحبا! Master seed: 1AC4E19A2D2473
   [junit4] Executing 1 suite with 1 JVM.
   [junit4] 
   [junit4] Started J0 PID(12937@lucene1-us-west).
   [junit4] Suite: org.apache.solr.velocity.VelocityResponseWriterTest
   [junit4] Completed [1/1] in 6.99s, 13 tests
   [junit4] 
   [junit4] JVM J0:     0.56 ..     8.48 =     7.92s
   [junit4] Execution time total: 8.49 sec.
   [junit4] Tests summary: 1 suite, 13 tests
   [junit4] Could not remove temporary path: /x1/jenkins/jenkins-slave/workspace/Lucene-Solr-NightlyTests-7.6/checkout/solr/build/contrib/solr-velocity/test/J0 (java.nio.file.DirectoryNotEmptyException: Remaining files: [/x1/jenkins/jenkins-slave/workspace/Lucene-Solr-NightlyTests-7.6/checkout/solr/build/contrib/solr-velocity/test/J0/temp])
     [echo] 5 slowest tests:
[junit4:tophints]   6.99s | org.apache.solr.velocity.VelocityResponseWriterTest

-check-totals:

common.test:

-check-totals:

test:

ivy-availability-check:

ivy-configure:
[ivy:configure] :: loading settings :: file = /x1/jenkins/jenkins-slave/workspace/Lucene-Solr-NightlyTests-7.6/checkout/lucene/top-level-ivy-settings.xml

resolve-groovy:

-check-totals:

BUILD FAILED
/x1/jenkins/jenkins-slave/workspace/Lucene-Solr-NightlyTests-7.6/checkout/build.xml:651: The following error occurred while executing this line:
/x1/jenkins/jenkins-slave/workspace/Lucene-Solr-NightlyTests-7.6/checkout/build.xml:585: Some of the tests produced a heap dump, but did not fail. Maybe a suppressed OutOfMemoryError? Dumps created:
* java_pid15944.hprof

Total time: 476 minutes 50 seconds
Build step 'Invoke Ant' marked build as failure
Archiving artifacts
Recording test results
Email was triggered for: Failure - Any
Sending email for trigger: Failure - Any

Mime
View raw message