lucene-dev mailing list archives

Site index · List index
Message view « Date » · « Thread »
Top « Date » · « Thread »
From Policeman Jenkins Server <jenk...@thetaphi.de>
Subject [JENKINS] Lucene-Solr-master-Linux (64bit/jdk1.8.0_172) - Build # 23167 - Still Unstable!
Date Wed, 07 Nov 2018 09:11:42 GMT
Build: https://jenkins.thetaphi.de/job/Lucene-Solr-master-Linux/23167/
Java: 64bit/jdk1.8.0_172 -XX:+UseCompressedOops -XX:+UseSerialGC

8 tests failed.
FAILED:  org.apache.solr.client.solrj.impl.CloudSolrClientTest.testCollectionDoesntExist

Error Message:
Tried fetching cluster state using the node names we knew of, i.e. [127.0.0.1:36397_solr, 127.0.0.1:35387_solr, 127.0.0.1:36539_solr]. However, succeeded in obtaining the cluster state from none of them.If you think your Solr cluster is up and is accessible, you could try re-creating a new CloudSolrClient using working solrUrl(s) or zkHost(s).

Stack Trace:
java.lang.RuntimeException: Tried fetching cluster state using the node names we knew of, i.e. [127.0.0.1:36397_solr, 127.0.0.1:35387_solr, 127.0.0.1:36539_solr]. However, succeeded in obtaining the cluster state from none of them.If you think your Solr cluster is up and is accessible, you could try re-creating a new CloudSolrClient using working solrUrl(s) or zkHost(s).
	at __randomizedtesting.SeedInfo.seed([25650571238FCE6:60F54EF910BA98F6]:0)
	at org.apache.solr.client.solrj.impl.HttpClusterStateProvider.getState(HttpClusterStateProvider.java:108)
	at org.apache.solr.client.solrj.impl.CloudSolrClient.resolveAliases(CloudSolrClient.java:1115)
	at org.apache.solr.client.solrj.impl.CloudSolrClient.requestWithRetryOnStaleState(CloudSolrClient.java:844)
	at org.apache.solr.client.solrj.impl.CloudSolrClient.request(CloudSolrClient.java:817)
	at org.apache.solr.client.solrj.SolrRequest.process(SolrRequest.java:194)
	at org.apache.solr.client.solrj.SolrClient.add(SolrClient.java:177)
	at org.apache.solr.client.solrj.SolrClient.add(SolrClient.java:138)
	at org.apache.solr.client.solrj.impl.CloudSolrClientTest.testCollectionDoesntExist(CloudSolrClientTest.java:779)
	at sun.reflect.NativeMethodAccessorImpl.invoke0(Native Method)
	at sun.reflect.NativeMethodAccessorImpl.invoke(NativeMethodAccessorImpl.java:62)
	at sun.reflect.DelegatingMethodAccessorImpl.invoke(DelegatingMethodAccessorImpl.java:43)
	at java.lang.reflect.Method.invoke(Method.java:498)
	at com.carrotsearch.randomizedtesting.RandomizedRunner.invoke(RandomizedRunner.java:1742)
	at com.carrotsearch.randomizedtesting.RandomizedRunner$8.evaluate(RandomizedRunner.java:935)
	at com.carrotsearch.randomizedtesting.RandomizedRunner$9.evaluate(RandomizedRunner.java:971)
	at com.carrotsearch.randomizedtesting.RandomizedRunner$10.evaluate(RandomizedRunner.java:985)
	at org.junit.rules.ExpectedException$ExpectedExceptionStatement.evaluate(ExpectedException.java:110)
	at com.carrotsearch.randomizedtesting.rules.SystemPropertiesRestoreRule$1.evaluate(SystemPropertiesRestoreRule.java:57)
	at org.apache.lucene.util.TestRuleSetupTeardownChained$1.evaluate(TestRuleSetupTeardownChained.java:49)
	at org.apache.lucene.util.AbstractBeforeAfterRule$1.evaluate(AbstractBeforeAfterRule.java:45)
	at org.apache.lucene.util.TestRuleThreadAndTestName$1.evaluate(TestRuleThreadAndTestName.java:48)
	at org.apache.lucene.util.TestRuleIgnoreAfterMaxFailures$1.evaluate(TestRuleIgnoreAfterMaxFailures.java:64)
	at org.apache.lucene.util.TestRuleMarkFailure$1.evaluate(TestRuleMarkFailure.java:47)
	at com.carrotsearch.randomizedtesting.rules.StatementAdapter.evaluate(StatementAdapter.java:36)
	at com.carrotsearch.randomizedtesting.ThreadLeakControl$StatementRunner.run(ThreadLeakControl.java:368)
	at com.carrotsearch.randomizedtesting.ThreadLeakControl.forkTimeoutingTask(ThreadLeakControl.java:817)
	at com.carrotsearch.randomizedtesting.ThreadLeakControl$3.evaluate(ThreadLeakControl.java:468)
	at com.carrotsearch.randomizedtesting.RandomizedRunner.runSingleTest(RandomizedRunner.java:944)
	at com.carrotsearch.randomizedtesting.RandomizedRunner$5.evaluate(RandomizedRunner.java:830)
	at com.carrotsearch.randomizedtesting.RandomizedRunner$6.evaluate(RandomizedRunner.java:880)
	at com.carrotsearch.randomizedtesting.RandomizedRunner$7.evaluate(RandomizedRunner.java:891)
	at com.carrotsearch.randomizedtesting.rules.StatementAdapter.evaluate(StatementAdapter.java:36)
	at com.carrotsearch.randomizedtesting.rules.SystemPropertiesRestoreRule$1.evaluate(SystemPropertiesRestoreRule.java:57)
	at org.apache.lucene.util.AbstractBeforeAfterRule$1.evaluate(AbstractBeforeAfterRule.java:45)
	at com.carrotsearch.randomizedtesting.rules.StatementAdapter.evaluate(StatementAdapter.java:36)
	at org.apache.lucene.util.TestRuleStoreClassName$1.evaluate(TestRuleStoreClassName.java:41)
	at com.carrotsearch.randomizedtesting.rules.NoShadowingOrOverridesOnMethodsRule$1.evaluate(NoShadowingOrOverridesOnMethodsRule.java:40)
	at com.carrotsearch.randomizedtesting.rules.NoShadowingOrOverridesOnMethodsRule$1.evaluate(NoShadowingOrOverridesOnMethodsRule.java:40)
	at com.carrotsearch.randomizedtesting.rules.StatementAdapter.evaluate(StatementAdapter.java:36)
	at com.carrotsearch.randomizedtesting.rules.StatementAdapter.evaluate(StatementAdapter.java:36)
	at com.carrotsearch.randomizedtesting.rules.StatementAdapter.evaluate(StatementAdapter.java:36)
	at org.apache.lucene.util.TestRuleAssertionsRequired$1.evaluate(TestRuleAssertionsRequired.java:53)
	at org.apache.lucene.util.TestRuleMarkFailure$1.evaluate(TestRuleMarkFailure.java:47)
	at org.apache.lucene.util.TestRuleIgnoreAfterMaxFailures$1.evaluate(TestRuleIgnoreAfterMaxFailures.java:64)
	at org.apache.lucene.util.TestRuleIgnoreTestSuites$1.evaluate(TestRuleIgnoreTestSuites.java:54)
	at com.carrotsearch.randomizedtesting.rules.StatementAdapter.evaluate(StatementAdapter.java:36)
	at com.carrotsearch.randomizedtesting.ThreadLeakControl$StatementRunner.run(ThreadLeakControl.java:368)
	at java.lang.Thread.run(Thread.java:748)


FAILED:  org.apache.solr.client.solrj.impl.CloudSolrClientTest.testCollectionDoesntExist

Error Message:
Tried fetching cluster state using the node names we knew of, i.e. [127.0.0.1:38571_solr, 127.0.0.1:42459_solr, 127.0.0.1:45209_solr]. However, succeeded in obtaining the cluster state from none of them.If you think your Solr cluster is up and is accessible, you could try re-creating a new CloudSolrClient using working solrUrl(s) or zkHost(s).

Stack Trace:
java.lang.RuntimeException: Tried fetching cluster state using the node names we knew of, i.e. [127.0.0.1:38571_solr, 127.0.0.1:42459_solr, 127.0.0.1:45209_solr]. However, succeeded in obtaining the cluster state from none of them.If you think your Solr cluster is up and is accessible, you could try re-creating a new CloudSolrClient using working solrUrl(s) or zkHost(s).
	at __randomizedtesting.SeedInfo.seed([25650571238FCE6:60F54EF910BA98F6]:0)
	at org.apache.solr.client.solrj.impl.HttpClusterStateProvider.getState(HttpClusterStateProvider.java:108)
	at org.apache.solr.client.solrj.impl.CloudSolrClient.resolveAliases(CloudSolrClient.java:1115)
	at org.apache.solr.client.solrj.impl.CloudSolrClient.requestWithRetryOnStaleState(CloudSolrClient.java:844)
	at org.apache.solr.client.solrj.impl.CloudSolrClient.request(CloudSolrClient.java:817)
	at org.apache.solr.client.solrj.SolrRequest.process(SolrRequest.java:194)
	at org.apache.solr.client.solrj.SolrClient.add(SolrClient.java:177)
	at org.apache.solr.client.solrj.SolrClient.add(SolrClient.java:138)
	at org.apache.solr.client.solrj.impl.CloudSolrClientTest.testCollectionDoesntExist(CloudSolrClientTest.java:779)
	at sun.reflect.NativeMethodAccessorImpl.invoke0(Native Method)
	at sun.reflect.NativeMethodAccessorImpl.invoke(NativeMethodAccessorImpl.java:62)
	at sun.reflect.DelegatingMethodAccessorImpl.invoke(DelegatingMethodAccessorImpl.java:43)
	at java.lang.reflect.Method.invoke(Method.java:498)
	at com.carrotsearch.randomizedtesting.RandomizedRunner.invoke(RandomizedRunner.java:1742)
	at com.carrotsearch.randomizedtesting.RandomizedRunner$8.evaluate(RandomizedRunner.java:935)
	at com.carrotsearch.randomizedtesting.RandomizedRunner$9.evaluate(RandomizedRunner.java:971)
	at com.carrotsearch.randomizedtesting.RandomizedRunner$10.evaluate(RandomizedRunner.java:985)
	at org.junit.rules.ExpectedException$ExpectedExceptionStatement.evaluate(ExpectedException.java:110)
	at com.carrotsearch.randomizedtesting.rules.SystemPropertiesRestoreRule$1.evaluate(SystemPropertiesRestoreRule.java:57)
	at org.apache.lucene.util.TestRuleSetupTeardownChained$1.evaluate(TestRuleSetupTeardownChained.java:49)
	at org.apache.lucene.util.AbstractBeforeAfterRule$1.evaluate(AbstractBeforeAfterRule.java:45)
	at org.apache.lucene.util.TestRuleThreadAndTestName$1.evaluate(TestRuleThreadAndTestName.java:48)
	at org.apache.lucene.util.TestRuleIgnoreAfterMaxFailures$1.evaluate(TestRuleIgnoreAfterMaxFailures.java:64)
	at org.apache.lucene.util.TestRuleMarkFailure$1.evaluate(TestRuleMarkFailure.java:47)
	at com.carrotsearch.randomizedtesting.rules.StatementAdapter.evaluate(StatementAdapter.java:36)
	at com.carrotsearch.randomizedtesting.ThreadLeakControl$StatementRunner.run(ThreadLeakControl.java:368)
	at com.carrotsearch.randomizedtesting.ThreadLeakControl.forkTimeoutingTask(ThreadLeakControl.java:817)
	at com.carrotsearch.randomizedtesting.ThreadLeakControl$3.evaluate(ThreadLeakControl.java:468)
	at com.carrotsearch.randomizedtesting.RandomizedRunner.runSingleTest(RandomizedRunner.java:944)
	at com.carrotsearch.randomizedtesting.RandomizedRunner$5.evaluate(RandomizedRunner.java:830)
	at com.carrotsearch.randomizedtesting.RandomizedRunner$6.evaluate(RandomizedRunner.java:880)
	at com.carrotsearch.randomizedtesting.RandomizedRunner$7.evaluate(RandomizedRunner.java:891)
	at com.carrotsearch.randomizedtesting.rules.StatementAdapter.evaluate(StatementAdapter.java:36)
	at com.carrotsearch.randomizedtesting.rules.SystemPropertiesRestoreRule$1.evaluate(SystemPropertiesRestoreRule.java:57)
	at org.apache.lucene.util.AbstractBeforeAfterRule$1.evaluate(AbstractBeforeAfterRule.java:45)
	at com.carrotsearch.randomizedtesting.rules.StatementAdapter.evaluate(StatementAdapter.java:36)
	at org.apache.lucene.util.TestRuleStoreClassName$1.evaluate(TestRuleStoreClassName.java:41)
	at com.carrotsearch.randomizedtesting.rules.NoShadowingOrOverridesOnMethodsRule$1.evaluate(NoShadowingOrOverridesOnMethodsRule.java:40)
	at com.carrotsearch.randomizedtesting.rules.NoShadowingOrOverridesOnMethodsRule$1.evaluate(NoShadowingOrOverridesOnMethodsRule.java:40)
	at com.carrotsearch.randomizedtesting.rules.StatementAdapter.evaluate(StatementAdapter.java:36)
	at com.carrotsearch.randomizedtesting.rules.StatementAdapter.evaluate(StatementAdapter.java:36)
	at com.carrotsearch.randomizedtesting.rules.StatementAdapter.evaluate(StatementAdapter.java:36)
	at org.apache.lucene.util.TestRuleAssertionsRequired$1.evaluate(TestRuleAssertionsRequired.java:53)
	at org.apache.lucene.util.TestRuleMarkFailure$1.evaluate(TestRuleMarkFailure.java:47)
	at org.apache.lucene.util.TestRuleIgnoreAfterMaxFailures$1.evaluate(TestRuleIgnoreAfterMaxFailures.java:64)
	at org.apache.lucene.util.TestRuleIgnoreTestSuites$1.evaluate(TestRuleIgnoreTestSuites.java:54)
	at com.carrotsearch.randomizedtesting.rules.StatementAdapter.evaluate(StatementAdapter.java:36)
	at com.carrotsearch.randomizedtesting.ThreadLeakControl$StatementRunner.run(ThreadLeakControl.java:368)
	at java.lang.Thread.run(Thread.java:748)


FAILED:  org.apache.solr.client.solrj.impl.CloudSolrClientTest.testCollectionDoesntExist

Error Message:
Tried fetching cluster state using the node names we knew of, i.e. [127.0.0.1:40263_solr, 127.0.0.1:33647_solr, 127.0.0.1:41435_solr]. However, succeeded in obtaining the cluster state from none of them.If you think your Solr cluster is up and is accessible, you could try re-creating a new CloudSolrClient using working solrUrl(s) or zkHost(s).

Stack Trace:
java.lang.RuntimeException: Tried fetching cluster state using the node names we knew of, i.e. [127.0.0.1:40263_solr, 127.0.0.1:33647_solr, 127.0.0.1:41435_solr]. However, succeeded in obtaining the cluster state from none of them.If you think your Solr cluster is up and is accessible, you could try re-creating a new CloudSolrClient using working solrUrl(s) or zkHost(s).
	at __randomizedtesting.SeedInfo.seed([25650571238FCE6:60F54EF910BA98F6]:0)
	at org.apache.solr.client.solrj.impl.HttpClusterStateProvider.getState(HttpClusterStateProvider.java:108)
	at org.apache.solr.client.solrj.impl.CloudSolrClient.resolveAliases(CloudSolrClient.java:1115)
	at org.apache.solr.client.solrj.impl.CloudSolrClient.requestWithRetryOnStaleState(CloudSolrClient.java:844)
	at org.apache.solr.client.solrj.impl.CloudSolrClient.request(CloudSolrClient.java:817)
	at org.apache.solr.client.solrj.SolrRequest.process(SolrRequest.java:194)
	at org.apache.solr.client.solrj.SolrClient.add(SolrClient.java:177)
	at org.apache.solr.client.solrj.SolrClient.add(SolrClient.java:138)
	at org.apache.solr.client.solrj.impl.CloudSolrClientTest.testCollectionDoesntExist(CloudSolrClientTest.java:779)
	at sun.reflect.NativeMethodAccessorImpl.invoke0(Native Method)
	at sun.reflect.NativeMethodAccessorImpl.invoke(NativeMethodAccessorImpl.java:62)
	at sun.reflect.DelegatingMethodAccessorImpl.invoke(DelegatingMethodAccessorImpl.java:43)
	at java.lang.reflect.Method.invoke(Method.java:498)
	at com.carrotsearch.randomizedtesting.RandomizedRunner.invoke(RandomizedRunner.java:1742)
	at com.carrotsearch.randomizedtesting.RandomizedRunner$8.evaluate(RandomizedRunner.java:935)
	at com.carrotsearch.randomizedtesting.RandomizedRunner$9.evaluate(RandomizedRunner.java:971)
	at com.carrotsearch.randomizedtesting.RandomizedRunner$10.evaluate(RandomizedRunner.java:985)
	at org.junit.rules.ExpectedException$ExpectedExceptionStatement.evaluate(ExpectedException.java:110)
	at com.carrotsearch.randomizedtesting.rules.SystemPropertiesRestoreRule$1.evaluate(SystemPropertiesRestoreRule.java:57)
	at org.apache.lucene.util.TestRuleSetupTeardownChained$1.evaluate(TestRuleSetupTeardownChained.java:49)
	at org.apache.lucene.util.AbstractBeforeAfterRule$1.evaluate(AbstractBeforeAfterRule.java:45)
	at org.apache.lucene.util.TestRuleThreadAndTestName$1.evaluate(TestRuleThreadAndTestName.java:48)
	at org.apache.lucene.util.TestRuleIgnoreAfterMaxFailures$1.evaluate(TestRuleIgnoreAfterMaxFailures.java:64)
	at org.apache.lucene.util.TestRuleMarkFailure$1.evaluate(TestRuleMarkFailure.java:47)
	at com.carrotsearch.randomizedtesting.rules.StatementAdapter.evaluate(StatementAdapter.java:36)
	at com.carrotsearch.randomizedtesting.ThreadLeakControl$StatementRunner.run(ThreadLeakControl.java:368)
	at com.carrotsearch.randomizedtesting.ThreadLeakControl.forkTimeoutingTask(ThreadLeakControl.java:817)
	at com.carrotsearch.randomizedtesting.ThreadLeakControl$3.evaluate(ThreadLeakControl.java:468)
	at com.carrotsearch.randomizedtesting.RandomizedRunner.runSingleTest(RandomizedRunner.java:944)
	at com.carrotsearch.randomizedtesting.RandomizedRunner$5.evaluate(RandomizedRunner.java:830)
	at com.carrotsearch.randomizedtesting.RandomizedRunner$6.evaluate(RandomizedRunner.java:880)
	at com.carrotsearch.randomizedtesting.RandomizedRunner$7.evaluate(RandomizedRunner.java:891)
	at com.carrotsearch.randomizedtesting.rules.StatementAdapter.evaluate(StatementAdapter.java:36)
	at com.carrotsearch.randomizedtesting.rules.SystemPropertiesRestoreRule$1.evaluate(SystemPropertiesRestoreRule.java:57)
	at org.apache.lucene.util.AbstractBeforeAfterRule$1.evaluate(AbstractBeforeAfterRule.java:45)
	at com.carrotsearch.randomizedtesting.rules.StatementAdapter.evaluate(StatementAdapter.java:36)
	at org.apache.lucene.util.TestRuleStoreClassName$1.evaluate(TestRuleStoreClassName.java:41)
	at com.carrotsearch.randomizedtesting.rules.NoShadowingOrOverridesOnMethodsRule$1.evaluate(NoShadowingOrOverridesOnMethodsRule.java:40)
	at com.carrotsearch.randomizedtesting.rules.NoShadowingOrOverridesOnMethodsRule$1.evaluate(NoShadowingOrOverridesOnMethodsRule.java:40)
	at com.carrotsearch.randomizedtesting.rules.StatementAdapter.evaluate(StatementAdapter.java:36)
	at com.carrotsearch.randomizedtesting.rules.StatementAdapter.evaluate(StatementAdapter.java:36)
	at com.carrotsearch.randomizedtesting.rules.StatementAdapter.evaluate(StatementAdapter.java:36)
	at org.apache.lucene.util.TestRuleAssertionsRequired$1.evaluate(TestRuleAssertionsRequired.java:53)
	at org.apache.lucene.util.TestRuleMarkFailure$1.evaluate(TestRuleMarkFailure.java:47)
	at org.apache.lucene.util.TestRuleIgnoreAfterMaxFailures$1.evaluate(TestRuleIgnoreAfterMaxFailures.java:64)
	at org.apache.lucene.util.TestRuleIgnoreTestSuites$1.evaluate(TestRuleIgnoreTestSuites.java:54)
	at com.carrotsearch.randomizedtesting.rules.StatementAdapter.evaluate(StatementAdapter.java:36)
	at com.carrotsearch.randomizedtesting.ThreadLeakControl$StatementRunner.run(ThreadLeakControl.java:368)
	at java.lang.Thread.run(Thread.java:748)


FAILED:  org.apache.solr.client.solrj.impl.CloudSolrClientTest.testCollectionDoesntExist

Error Message:
Tried fetching cluster state using the node names we knew of, i.e. [127.0.0.1:33161_solr, 127.0.0.1:45813_solr, 127.0.0.1:43509_solr]. However, succeeded in obtaining the cluster state from none of them.If you think your Solr cluster is up and is accessible, you could try re-creating a new CloudSolrClient using working solrUrl(s) or zkHost(s).

Stack Trace:
java.lang.RuntimeException: Tried fetching cluster state using the node names we knew of, i.e. [127.0.0.1:33161_solr, 127.0.0.1:45813_solr, 127.0.0.1:43509_solr]. However, succeeded in obtaining the cluster state from none of them.If you think your Solr cluster is up and is accessible, you could try re-creating a new CloudSolrClient using working solrUrl(s) or zkHost(s).
	at __randomizedtesting.SeedInfo.seed([25650571238FCE6:60F54EF910BA98F6]:0)
	at org.apache.solr.client.solrj.impl.HttpClusterStateProvider.getState(HttpClusterStateProvider.java:108)
	at org.apache.solr.client.solrj.impl.CloudSolrClient.resolveAliases(CloudSolrClient.java:1115)
	at org.apache.solr.client.solrj.impl.CloudSolrClient.requestWithRetryOnStaleState(CloudSolrClient.java:844)
	at org.apache.solr.client.solrj.impl.CloudSolrClient.request(CloudSolrClient.java:817)
	at org.apache.solr.client.solrj.SolrRequest.process(SolrRequest.java:194)
	at org.apache.solr.client.solrj.SolrClient.add(SolrClient.java:177)
	at org.apache.solr.client.solrj.SolrClient.add(SolrClient.java:138)
	at org.apache.solr.client.solrj.impl.CloudSolrClientTest.testCollectionDoesntExist(CloudSolrClientTest.java:779)
	at sun.reflect.NativeMethodAccessorImpl.invoke0(Native Method)
	at sun.reflect.NativeMethodAccessorImpl.invoke(NativeMethodAccessorImpl.java:62)
	at sun.reflect.DelegatingMethodAccessorImpl.invoke(DelegatingMethodAccessorImpl.java:43)
	at java.lang.reflect.Method.invoke(Method.java:498)
	at com.carrotsearch.randomizedtesting.RandomizedRunner.invoke(RandomizedRunner.java:1742)
	at com.carrotsearch.randomizedtesting.RandomizedRunner$8.evaluate(RandomizedRunner.java:935)
	at com.carrotsearch.randomizedtesting.RandomizedRunner$9.evaluate(RandomizedRunner.java:971)
	at com.carrotsearch.randomizedtesting.RandomizedRunner$10.evaluate(RandomizedRunner.java:985)
	at org.junit.rules.ExpectedException$ExpectedExceptionStatement.evaluate(ExpectedException.java:110)
	at com.carrotsearch.randomizedtesting.rules.SystemPropertiesRestoreRule$1.evaluate(SystemPropertiesRestoreRule.java:57)
	at org.apache.lucene.util.TestRuleSetupTeardownChained$1.evaluate(TestRuleSetupTeardownChained.java:49)
	at org.apache.lucene.util.AbstractBeforeAfterRule$1.evaluate(AbstractBeforeAfterRule.java:45)
	at org.apache.lucene.util.TestRuleThreadAndTestName$1.evaluate(TestRuleThreadAndTestName.java:48)
	at org.apache.lucene.util.TestRuleIgnoreAfterMaxFailures$1.evaluate(TestRuleIgnoreAfterMaxFailures.java:64)
	at org.apache.lucene.util.TestRuleMarkFailure$1.evaluate(TestRuleMarkFailure.java:47)
	at com.carrotsearch.randomizedtesting.rules.StatementAdapter.evaluate(StatementAdapter.java:36)
	at com.carrotsearch.randomizedtesting.ThreadLeakControl$StatementRunner.run(ThreadLeakControl.java:368)
	at com.carrotsearch.randomizedtesting.ThreadLeakControl.forkTimeoutingTask(ThreadLeakControl.java:817)
	at com.carrotsearch.randomizedtesting.ThreadLeakControl$3.evaluate(ThreadLeakControl.java:468)
	at com.carrotsearch.randomizedtesting.RandomizedRunner.runSingleTest(RandomizedRunner.java:944)
	at com.carrotsearch.randomizedtesting.RandomizedRunner$5.evaluate(RandomizedRunner.java:830)
	at com.carrotsearch.randomizedtesting.RandomizedRunner$6.evaluate(RandomizedRunner.java:880)
	at com.carrotsearch.randomizedtesting.RandomizedRunner$7.evaluate(RandomizedRunner.java:891)
	at com.carrotsearch.randomizedtesting.rules.StatementAdapter.evaluate(StatementAdapter.java:36)
	at com.carrotsearch.randomizedtesting.rules.SystemPropertiesRestoreRule$1.evaluate(SystemPropertiesRestoreRule.java:57)
	at org.apache.lucene.util.AbstractBeforeAfterRule$1.evaluate(AbstractBeforeAfterRule.java:45)
	at com.carrotsearch.randomizedtesting.rules.StatementAdapter.evaluate(StatementAdapter.java:36)
	at org.apache.lucene.util.TestRuleStoreClassName$1.evaluate(TestRuleStoreClassName.java:41)
	at com.carrotsearch.randomizedtesting.rules.NoShadowingOrOverridesOnMethodsRule$1.evaluate(NoShadowingOrOverridesOnMethodsRule.java:40)
	at com.carrotsearch.randomizedtesting.rules.NoShadowingOrOverridesOnMethodsRule$1.evaluate(NoShadowingOrOverridesOnMethodsRule.java:40)
	at com.carrotsearch.randomizedtesting.rules.StatementAdapter.evaluate(StatementAdapter.java:36)
	at com.carrotsearch.randomizedtesting.rules.StatementAdapter.evaluate(StatementAdapter.java:36)
	at com.carrotsearch.randomizedtesting.rules.StatementAdapter.evaluate(StatementAdapter.java:36)
	at org.apache.lucene.util.TestRuleAssertionsRequired$1.evaluate(TestRuleAssertionsRequired.java:53)
	at org.apache.lucene.util.TestRuleMarkFailure$1.evaluate(TestRuleMarkFailure.java:47)
	at org.apache.lucene.util.TestRuleIgnoreAfterMaxFailures$1.evaluate(TestRuleIgnoreAfterMaxFailures.java:64)
	at org.apache.lucene.util.TestRuleIgnoreTestSuites$1.evaluate(TestRuleIgnoreTestSuites.java:54)
	at com.carrotsearch.randomizedtesting.rules.StatementAdapter.evaluate(StatementAdapter.java:36)
	at com.carrotsearch.randomizedtesting.ThreadLeakControl$StatementRunner.run(ThreadLeakControl.java:368)
	at java.lang.Thread.run(Thread.java:748)


FAILED:  org.apache.solr.cloud.RecoveryAfterSoftCommitTest.test

Error Message:
Timeout occured while waiting response from server at: http://127.0.0.1:32959/collection1

Stack Trace:
org.apache.solr.client.solrj.SolrServerException: Timeout occured while waiting response from server at: http://127.0.0.1:32959/collection1
	at __randomizedtesting.SeedInfo.seed([99EF1701BBE3E4E0:11BB28DB151F8918]:0)
	at org.apache.solr.client.solrj.impl.HttpSolrClient.executeMethod(HttpSolrClient.java:654)
	at org.apache.solr.client.solrj.impl.HttpSolrClient.request(HttpSolrClient.java:255)
	at org.apache.solr.client.solrj.impl.HttpSolrClient.request(HttpSolrClient.java:244)
	at org.apache.solr.client.solrj.impl.LBHttpSolrClient.doRequest(LBHttpSolrClient.java:483)
	at org.apache.solr.client.solrj.impl.LBHttpSolrClient.request(LBHttpSolrClient.java:413)
	at org.apache.solr.client.solrj.impl.CloudSolrClient.sendRequest(CloudSolrClient.java:1107)
	at org.apache.solr.client.solrj.impl.CloudSolrClient.requestWithRetryOnStaleState(CloudSolrClient.java:884)
	at org.apache.solr.client.solrj.impl.CloudSolrClient.request(CloudSolrClient.java:817)
	at org.apache.solr.client.solrj.SolrClient.request(SolrClient.java:1260)
	at org.apache.solr.cloud.RecoveryAfterSoftCommitTest.test(RecoveryAfterSoftCommitTest.java:87)
	at sun.reflect.NativeMethodAccessorImpl.invoke0(Native Method)
	at sun.reflect.NativeMethodAccessorImpl.invoke(NativeMethodAccessorImpl.java:62)
	at sun.reflect.DelegatingMethodAccessorImpl.invoke(DelegatingMethodAccessorImpl.java:43)
	at java.lang.reflect.Method.invoke(Method.java:498)
	at com.carrotsearch.randomizedtesting.RandomizedRunner.invoke(RandomizedRunner.java:1742)
	at com.carrotsearch.randomizedtesting.RandomizedRunner$8.evaluate(RandomizedRunner.java:935)
	at com.carrotsearch.randomizedtesting.RandomizedRunner$9.evaluate(RandomizedRunner.java:971)
	at com.carrotsearch.randomizedtesting.RandomizedRunner$10.evaluate(RandomizedRunner.java:985)
	at org.apache.solr.BaseDistributedSearchTestCase$ShardsRepeatRule$ShardsFixedStatement.callStatement(BaseDistributedSearchTestCase.java:1010)
	at org.apache.solr.BaseDistributedSearchTestCase$ShardsRepeatRule$ShardsStatement.evaluate(BaseDistributedSearchTestCase.java:985)
	at com.carrotsearch.randomizedtesting.rules.SystemPropertiesRestoreRule$1.evaluate(SystemPropertiesRestoreRule.java:57)
	at org.apache.lucene.util.TestRuleSetupTeardownChained$1.evaluate(TestRuleSetupTeardownChained.java:49)
	at org.apache.lucene.util.AbstractBeforeAfterRule$1.evaluate(AbstractBeforeAfterRule.java:45)
	at org.apache.lucene.util.TestRuleThreadAndTestName$1.evaluate(TestRuleThreadAndTestName.java:48)
	at org.apache.lucene.util.TestRuleIgnoreAfterMaxFailures$1.evaluate(TestRuleIgnoreAfterMaxFailures.java:64)
	at org.apache.lucene.util.TestRuleMarkFailure$1.evaluate(TestRuleMarkFailure.java:47)
	at com.carrotsearch.randomizedtesting.rules.StatementAdapter.evaluate(StatementAdapter.java:36)
	at com.carrotsearch.randomizedtesting.ThreadLeakControl$StatementRunner.run(ThreadLeakControl.java:368)
	at com.carrotsearch.randomizedtesting.ThreadLeakControl.forkTimeoutingTask(ThreadLeakControl.java:817)
	at com.carrotsearch.randomizedtesting.ThreadLeakControl$3.evaluate(ThreadLeakControl.java:468)
	at com.carrotsearch.randomizedtesting.RandomizedRunner.runSingleTest(RandomizedRunner.java:944)
	at com.carrotsearch.randomizedtesting.RandomizedRunner$5.evaluate(RandomizedRunner.java:830)
	at com.carrotsearch.randomizedtesting.RandomizedRunner$6.evaluate(RandomizedRunner.java:880)
	at com.carrotsearch.randomizedtesting.RandomizedRunner$7.evaluate(RandomizedRunner.java:891)
	at com.carrotsearch.randomizedtesting.rules.StatementAdapter.evaluate(StatementAdapter.java:36)
	at com.carrotsearch.randomizedtesting.rules.SystemPropertiesRestoreRule$1.evaluate(SystemPropertiesRestoreRule.java:57)
	at org.apache.lucene.util.AbstractBeforeAfterRule$1.evaluate(AbstractBeforeAfterRule.java:45)
	at com.carrotsearch.randomizedtesting.rules.StatementAdapter.evaluate(StatementAdapter.java:36)
	at org.apache.lucene.util.TestRuleStoreClassName$1.evaluate(TestRuleStoreClassName.java:41)
	at com.carrotsearch.randomizedtesting.rules.NoShadowingOrOverridesOnMethodsRule$1.evaluate(NoShadowingOrOverridesOnMethodsRule.java:40)
	at com.carrotsearch.randomizedtesting.rules.NoShadowingOrOverridesOnMethodsRule$1.evaluate(NoShadowingOrOverridesOnMethodsRule.java:40)
	at com.carrotsearch.randomizedtesting.rules.StatementAdapter.evaluate(StatementAdapter.java:36)
	at com.carrotsearch.randomizedtesting.rules.StatementAdapter.evaluate(StatementAdapter.java:36)
	at com.carrotsearch.randomizedtesting.rules.StatementAdapter.evaluate(StatementAdapter.java:36)
	at org.apache.lucene.util.TestRuleAssertionsRequired$1.evaluate(TestRuleAssertionsRequired.java:53)
	at org.apache.lucene.util.TestRuleMarkFailure$1.evaluate(TestRuleMarkFailure.java:47)
	at org.apache.lucene.util.TestRuleIgnoreAfterMaxFailures$1.evaluate(TestRuleIgnoreAfterMaxFailures.java:64)
	at org.apache.lucene.util.TestRuleIgnoreTestSuites$1.evaluate(TestRuleIgnoreTestSuites.java:54)
	at com.carrotsearch.randomizedtesting.rules.StatementAdapter.evaluate(StatementAdapter.java:36)
	at com.carrotsearch.randomizedtesting.ThreadLeakControl$StatementRunner.run(ThreadLeakControl.java:368)
	at java.lang.Thread.run(Thread.java:748)
Caused by: java.net.SocketTimeoutException: Read timed out
	at java.net.SocketInputStream.socketRead0(Native Method)
	at java.net.SocketInputStream.socketRead(SocketInputStream.java:116)
	at java.net.SocketInputStream.read(SocketInputStream.java:171)
	at java.net.SocketInputStream.read(SocketInputStream.java:141)
	at org.apache.http.impl.io.SessionInputBufferImpl.streamRead(SessionInputBufferImpl.java:137)
	at org.apache.http.impl.io.SessionInputBufferImpl.fillBuffer(SessionInputBufferImpl.java:153)
	at org.apache.http.impl.io.SessionInputBufferImpl.readLine(SessionInputBufferImpl.java:282)
	at org.apache.http.impl.conn.DefaultHttpResponseParser.parseHead(DefaultHttpResponseParser.java:138)
	at org.apache.http.impl.conn.DefaultHttpResponseParser.parseHead(DefaultHttpResponseParser.java:56)
	at org.apache.http.impl.io.AbstractMessageParser.parse(AbstractMessageParser.java:259)
	at org.apache.http.impl.DefaultBHttpClientConnection.receiveResponseHeader(DefaultBHttpClientConnection.java:163)
	at org.apache.http.impl.conn.CPoolProxy.receiveResponseHeader(CPoolProxy.java:165)
	at org.apache.http.protocol.HttpRequestExecutor.doReceiveResponse(HttpRequestExecutor.java:273)
	at org.apache.http.protocol.HttpRequestExecutor.execute(HttpRequestExecutor.java:125)
	at org.apache.http.impl.execchain.MainClientExec.execute(MainClientExec.java:272)
	at org.apache.http.impl.execchain.ProtocolExec.execute(ProtocolExec.java:185)
	at org.apache.http.impl.execchain.RetryExec.execute(RetryExec.java:89)
	at org.apache.http.impl.execchain.RedirectExec.execute(RedirectExec.java:111)
	at org.apache.http.impl.client.InternalHttpClient.doExecute(InternalHttpClient.java:185)
	at org.apache.http.impl.client.CloseableHttpClient.execute(CloseableHttpClient.java:83)
	at org.apache.http.impl.client.CloseableHttpClient.execute(CloseableHttpClient.java:56)
	at org.apache.solr.client.solrj.impl.HttpSolrClient.executeMethod(HttpSolrClient.java:542)
	... 50 more


FAILED:  org.apache.solr.cloud.RecoveryAfterSoftCommitTest.test

Error Message:
Timeout occured while waiting response from server at: http://127.0.0.1:40637/collection1

Stack Trace:
org.apache.solr.client.solrj.SolrServerException: Timeout occured while waiting response from server at: http://127.0.0.1:40637/collection1
	at __randomizedtesting.SeedInfo.seed([99EF1701BBE3E4E0:11BB28DB151F8918]:0)
	at org.apache.solr.client.solrj.impl.HttpSolrClient.executeMethod(HttpSolrClient.java:654)
	at org.apache.solr.client.solrj.impl.HttpSolrClient.request(HttpSolrClient.java:255)
	at org.apache.solr.client.solrj.impl.HttpSolrClient.request(HttpSolrClient.java:244)
	at org.apache.solr.client.solrj.impl.LBHttpSolrClient.doRequest(LBHttpSolrClient.java:483)
	at org.apache.solr.client.solrj.impl.LBHttpSolrClient.request(LBHttpSolrClient.java:413)
	at org.apache.solr.client.solrj.impl.CloudSolrClient.sendRequest(CloudSolrClient.java:1107)
	at org.apache.solr.client.solrj.impl.CloudSolrClient.requestWithRetryOnStaleState(CloudSolrClient.java:884)
	at org.apache.solr.client.solrj.impl.CloudSolrClient.request(CloudSolrClient.java:817)
	at org.apache.solr.client.solrj.SolrClient.request(SolrClient.java:1260)
	at org.apache.solr.cloud.RecoveryAfterSoftCommitTest.test(RecoveryAfterSoftCommitTest.java:87)
	at sun.reflect.NativeMethodAccessorImpl.invoke0(Native Method)
	at sun.reflect.NativeMethodAccessorImpl.invoke(NativeMethodAccessorImpl.java:62)
	at sun.reflect.DelegatingMethodAccessorImpl.invoke(DelegatingMethodAccessorImpl.java:43)
	at java.lang.reflect.Method.invoke(Method.java:498)
	at com.carrotsearch.randomizedtesting.RandomizedRunner.invoke(RandomizedRunner.java:1742)
	at com.carrotsearch.randomizedtesting.RandomizedRunner$8.evaluate(RandomizedRunner.java:935)
	at com.carrotsearch.randomizedtesting.RandomizedRunner$9.evaluate(RandomizedRunner.java:971)
	at com.carrotsearch.randomizedtesting.RandomizedRunner$10.evaluate(RandomizedRunner.java:985)
	at org.apache.solr.BaseDistributedSearchTestCase$ShardsRepeatRule$ShardsFixedStatement.callStatement(BaseDistributedSearchTestCase.java:1010)
	at org.apache.solr.BaseDistributedSearchTestCase$ShardsRepeatRule$ShardsStatement.evaluate(BaseDistributedSearchTestCase.java:985)
	at com.carrotsearch.randomizedtesting.rules.SystemPropertiesRestoreRule$1.evaluate(SystemPropertiesRestoreRule.java:57)
	at org.apache.lucene.util.TestRuleSetupTeardownChained$1.evaluate(TestRuleSetupTeardownChained.java:49)
	at org.apache.lucene.util.AbstractBeforeAfterRule$1.evaluate(AbstractBeforeAfterRule.java:45)
	at org.apache.lucene.util.TestRuleThreadAndTestName$1.evaluate(TestRuleThreadAndTestName.java:48)
	at org.apache.lucene.util.TestRuleIgnoreAfterMaxFailures$1.evaluate(TestRuleIgnoreAfterMaxFailures.java:64)
	at org.apache.lucene.util.TestRuleMarkFailure$1.evaluate(TestRuleMarkFailure.java:47)
	at com.carrotsearch.randomizedtesting.rules.StatementAdapter.evaluate(StatementAdapter.java:36)
	at com.carrotsearch.randomizedtesting.ThreadLeakControl$StatementRunner.run(ThreadLeakControl.java:368)
	at com.carrotsearch.randomizedtesting.ThreadLeakControl.forkTimeoutingTask(ThreadLeakControl.java:817)
	at com.carrotsearch.randomizedtesting.ThreadLeakControl$3.evaluate(ThreadLeakControl.java:468)
	at com.carrotsearch.randomizedtesting.RandomizedRunner.runSingleTest(RandomizedRunner.java:944)
	at com.carrotsearch.randomizedtesting.RandomizedRunner$5.evaluate(RandomizedRunner.java:830)
	at com.carrotsearch.randomizedtesting.RandomizedRunner$6.evaluate(RandomizedRunner.java:880)
	at com.carrotsearch.randomizedtesting.RandomizedRunner$7.evaluate(RandomizedRunner.java:891)
	at com.carrotsearch.randomizedtesting.rules.StatementAdapter.evaluate(StatementAdapter.java:36)
	at com.carrotsearch.randomizedtesting.rules.SystemPropertiesRestoreRule$1.evaluate(SystemPropertiesRestoreRule.java:57)
	at org.apache.lucene.util.AbstractBeforeAfterRule$1.evaluate(AbstractBeforeAfterRule.java:45)
	at com.carrotsearch.randomizedtesting.rules.StatementAdapter.evaluate(StatementAdapter.java:36)
	at org.apache.lucene.util.TestRuleStoreClassName$1.evaluate(TestRuleStoreClassName.java:41)
	at com.carrotsearch.randomizedtesting.rules.NoShadowingOrOverridesOnMethodsRule$1.evaluate(NoShadowingOrOverridesOnMethodsRule.java:40)
	at com.carrotsearch.randomizedtesting.rules.NoShadowingOrOverridesOnMethodsRule$1.evaluate(NoShadowingOrOverridesOnMethodsRule.java:40)
	at com.carrotsearch.randomizedtesting.rules.StatementAdapter.evaluate(StatementAdapter.java:36)
	at com.carrotsearch.randomizedtesting.rules.StatementAdapter.evaluate(StatementAdapter.java:36)
	at com.carrotsearch.randomizedtesting.rules.StatementAdapter.evaluate(StatementAdapter.java:36)
	at org.apache.lucene.util.TestRuleAssertionsRequired$1.evaluate(TestRuleAssertionsRequired.java:53)
	at org.apache.lucene.util.TestRuleMarkFailure$1.evaluate(TestRuleMarkFailure.java:47)
	at org.apache.lucene.util.TestRuleIgnoreAfterMaxFailures$1.evaluate(TestRuleIgnoreAfterMaxFailures.java:64)
	at org.apache.lucene.util.TestRuleIgnoreTestSuites$1.evaluate(TestRuleIgnoreTestSuites.java:54)
	at com.carrotsearch.randomizedtesting.rules.StatementAdapter.evaluate(StatementAdapter.java:36)
	at com.carrotsearch.randomizedtesting.ThreadLeakControl$StatementRunner.run(ThreadLeakControl.java:368)
	at java.lang.Thread.run(Thread.java:748)
Caused by: java.net.SocketTimeoutException: Read timed out
	at java.net.SocketInputStream.socketRead0(Native Method)
	at java.net.SocketInputStream.socketRead(SocketInputStream.java:116)
	at java.net.SocketInputStream.read(SocketInputStream.java:171)
	at java.net.SocketInputStream.read(SocketInputStream.java:141)
	at org.apache.http.impl.io.SessionInputBufferImpl.streamRead(SessionInputBufferImpl.java:137)
	at org.apache.http.impl.io.SessionInputBufferImpl.fillBuffer(SessionInputBufferImpl.java:153)
	at org.apache.http.impl.io.SessionInputBufferImpl.readLine(SessionInputBufferImpl.java:282)
	at org.apache.http.impl.conn.DefaultHttpResponseParser.parseHead(DefaultHttpResponseParser.java:138)
	at org.apache.http.impl.conn.DefaultHttpResponseParser.parseHead(DefaultHttpResponseParser.java:56)
	at org.apache.http.impl.io.AbstractMessageParser.parse(AbstractMessageParser.java:259)
	at org.apache.http.impl.DefaultBHttpClientConnection.receiveResponseHeader(DefaultBHttpClientConnection.java:163)
	at org.apache.http.impl.conn.CPoolProxy.receiveResponseHeader(CPoolProxy.java:165)
	at org.apache.http.protocol.HttpRequestExecutor.doReceiveResponse(HttpRequestExecutor.java:273)
	at org.apache.http.protocol.HttpRequestExecutor.execute(HttpRequestExecutor.java:125)
	at org.apache.http.impl.execchain.MainClientExec.execute(MainClientExec.java:272)
	at org.apache.http.impl.execchain.ProtocolExec.execute(ProtocolExec.java:185)
	at org.apache.http.impl.execchain.RetryExec.execute(RetryExec.java:89)
	at org.apache.http.impl.execchain.RedirectExec.execute(RedirectExec.java:111)
	at org.apache.http.impl.client.InternalHttpClient.doExecute(InternalHttpClient.java:185)
	at org.apache.http.impl.client.CloseableHttpClient.execute(CloseableHttpClient.java:83)
	at org.apache.http.impl.client.CloseableHttpClient.execute(CloseableHttpClient.java:56)
	at org.apache.solr.client.solrj.impl.HttpSolrClient.executeMethod(HttpSolrClient.java:542)
	... 50 more


FAILED:  org.apache.solr.cloud.RecoveryAfterSoftCommitTest.test

Error Message:
Timeout occured while waiting response from server at: http://127.0.0.1:33015/collection1

Stack Trace:
org.apache.solr.client.solrj.SolrServerException: Timeout occured while waiting response from server at: http://127.0.0.1:33015/collection1
	at __randomizedtesting.SeedInfo.seed([99EF1701BBE3E4E0:11BB28DB151F8918]:0)
	at org.apache.solr.client.solrj.impl.HttpSolrClient.executeMethod(HttpSolrClient.java:654)
	at org.apache.solr.client.solrj.impl.HttpSolrClient.request(HttpSolrClient.java:255)
	at org.apache.solr.client.solrj.impl.HttpSolrClient.request(HttpSolrClient.java:244)
	at org.apache.solr.client.solrj.impl.LBHttpSolrClient.doRequest(LBHttpSolrClient.java:483)
	at org.apache.solr.client.solrj.impl.LBHttpSolrClient.request(LBHttpSolrClient.java:413)
	at org.apache.solr.client.solrj.impl.CloudSolrClient.sendRequest(CloudSolrClient.java:1107)
	at org.apache.solr.client.solrj.impl.CloudSolrClient.requestWithRetryOnStaleState(CloudSolrClient.java:884)
	at org.apache.solr.client.solrj.impl.CloudSolrClient.request(CloudSolrClient.java:817)
	at org.apache.solr.client.solrj.SolrClient.request(SolrClient.java:1260)
	at org.apache.solr.cloud.RecoveryAfterSoftCommitTest.test(RecoveryAfterSoftCommitTest.java:87)
	at sun.reflect.NativeMethodAccessorImpl.invoke0(Native Method)
	at sun.reflect.NativeMethodAccessorImpl.invoke(NativeMethodAccessorImpl.java:62)
	at sun.reflect.DelegatingMethodAccessorImpl.invoke(DelegatingMethodAccessorImpl.java:43)
	at java.lang.reflect.Method.invoke(Method.java:498)
	at com.carrotsearch.randomizedtesting.RandomizedRunner.invoke(RandomizedRunner.java:1742)
	at com.carrotsearch.randomizedtesting.RandomizedRunner$8.evaluate(RandomizedRunner.java:935)
	at com.carrotsearch.randomizedtesting.RandomizedRunner$9.evaluate(RandomizedRunner.java:971)
	at com.carrotsearch.randomizedtesting.RandomizedRunner$10.evaluate(RandomizedRunner.java:985)
	at org.apache.solr.BaseDistributedSearchTestCase$ShardsRepeatRule$ShardsFixedStatement.callStatement(BaseDistributedSearchTestCase.java:1010)
	at org.apache.solr.BaseDistributedSearchTestCase$ShardsRepeatRule$ShardsStatement.evaluate(BaseDistributedSearchTestCase.java:985)
	at com.carrotsearch.randomizedtesting.rules.SystemPropertiesRestoreRule$1.evaluate(SystemPropertiesRestoreRule.java:57)
	at org.apache.lucene.util.TestRuleSetupTeardownChained$1.evaluate(TestRuleSetupTeardownChained.java:49)
	at org.apache.lucene.util.AbstractBeforeAfterRule$1.evaluate(AbstractBeforeAfterRule.java:45)
	at org.apache.lucene.util.TestRuleThreadAndTestName$1.evaluate(TestRuleThreadAndTestName.java:48)
	at org.apache.lucene.util.TestRuleIgnoreAfterMaxFailures$1.evaluate(TestRuleIgnoreAfterMaxFailures.java:64)
	at org.apache.lucene.util.TestRuleMarkFailure$1.evaluate(TestRuleMarkFailure.java:47)
	at com.carrotsearch.randomizedtesting.rules.StatementAdapter.evaluate(StatementAdapter.java:36)
	at com.carrotsearch.randomizedtesting.ThreadLeakControl$StatementRunner.run(ThreadLeakControl.java:368)
	at com.carrotsearch.randomizedtesting.ThreadLeakControl.forkTimeoutingTask(ThreadLeakControl.java:817)
	at com.carrotsearch.randomizedtesting.ThreadLeakControl$3.evaluate(ThreadLeakControl.java:468)
	at com.carrotsearch.randomizedtesting.RandomizedRunner.runSingleTest(RandomizedRunner.java:944)
	at com.carrotsearch.randomizedtesting.RandomizedRunner$5.evaluate(RandomizedRunner.java:830)
	at com.carrotsearch.randomizedtesting.RandomizedRunner$6.evaluate(RandomizedRunner.java:880)
	at com.carrotsearch.randomizedtesting.RandomizedRunner$7.evaluate(RandomizedRunner.java:891)
	at com.carrotsearch.randomizedtesting.rules.StatementAdapter.evaluate(StatementAdapter.java:36)
	at com.carrotsearch.randomizedtesting.rules.SystemPropertiesRestoreRule$1.evaluate(SystemPropertiesRestoreRule.java:57)
	at org.apache.lucene.util.AbstractBeforeAfterRule$1.evaluate(AbstractBeforeAfterRule.java:45)
	at com.carrotsearch.randomizedtesting.rules.StatementAdapter.evaluate(StatementAdapter.java:36)
	at org.apache.lucene.util.TestRuleStoreClassName$1.evaluate(TestRuleStoreClassName.java:41)
	at com.carrotsearch.randomizedtesting.rules.NoShadowingOrOverridesOnMethodsRule$1.evaluate(NoShadowingOrOverridesOnMethodsRule.java:40)
	at com.carrotsearch.randomizedtesting.rules.NoShadowingOrOverridesOnMethodsRule$1.evaluate(NoShadowingOrOverridesOnMethodsRule.java:40)
	at com.carrotsearch.randomizedtesting.rules.StatementAdapter.evaluate(StatementAdapter.java:36)
	at com.carrotsearch.randomizedtesting.rules.StatementAdapter.evaluate(StatementAdapter.java:36)
	at com.carrotsearch.randomizedtesting.rules.StatementAdapter.evaluate(StatementAdapter.java:36)
	at org.apache.lucene.util.TestRuleAssertionsRequired$1.evaluate(TestRuleAssertionsRequired.java:53)
	at org.apache.lucene.util.TestRuleMarkFailure$1.evaluate(TestRuleMarkFailure.java:47)
	at org.apache.lucene.util.TestRuleIgnoreAfterMaxFailures$1.evaluate(TestRuleIgnoreAfterMaxFailures.java:64)
	at org.apache.lucene.util.TestRuleIgnoreTestSuites$1.evaluate(TestRuleIgnoreTestSuites.java:54)
	at com.carrotsearch.randomizedtesting.rules.StatementAdapter.evaluate(StatementAdapter.java:36)
	at com.carrotsearch.randomizedtesting.ThreadLeakControl$StatementRunner.run(ThreadLeakControl.java:368)
	at java.lang.Thread.run(Thread.java:748)
Caused by: java.net.SocketTimeoutException: Read timed out
	at java.net.SocketInputStream.socketRead0(Native Method)
	at java.net.SocketInputStream.socketRead(SocketInputStream.java:116)
	at java.net.SocketInputStream.read(SocketInputStream.java:171)
	at java.net.SocketInputStream.read(SocketInputStream.java:141)
	at org.apache.http.impl.io.SessionInputBufferImpl.streamRead(SessionInputBufferImpl.java:137)
	at org.apache.http.impl.io.SessionInputBufferImpl.fillBuffer(SessionInputBufferImpl.java:153)
	at org.apache.http.impl.io.SessionInputBufferImpl.readLine(SessionInputBufferImpl.java:282)
	at org.apache.http.impl.conn.DefaultHttpResponseParser.parseHead(DefaultHttpResponseParser.java:138)
	at org.apache.http.impl.conn.DefaultHttpResponseParser.parseHead(DefaultHttpResponseParser.java:56)
	at org.apache.http.impl.io.AbstractMessageParser.parse(AbstractMessageParser.java:259)
	at org.apache.http.impl.DefaultBHttpClientConnection.receiveResponseHeader(DefaultBHttpClientConnection.java:163)
	at org.apache.http.impl.conn.CPoolProxy.receiveResponseHeader(CPoolProxy.java:165)
	at org.apache.http.protocol.HttpRequestExecutor.doReceiveResponse(HttpRequestExecutor.java:273)
	at org.apache.http.protocol.HttpRequestExecutor.execute(HttpRequestExecutor.java:125)
	at org.apache.http.impl.execchain.MainClientExec.execute(MainClientExec.java:272)
	at org.apache.http.impl.execchain.ProtocolExec.execute(ProtocolExec.java:185)
	at org.apache.http.impl.execchain.RetryExec.execute(RetryExec.java:89)
	at org.apache.http.impl.execchain.RedirectExec.execute(RedirectExec.java:111)
	at org.apache.http.impl.client.InternalHttpClient.doExecute(InternalHttpClient.java:185)
	at org.apache.http.impl.client.CloseableHttpClient.execute(CloseableHttpClient.java:83)
	at org.apache.http.impl.client.CloseableHttpClient.execute(CloseableHttpClient.java:56)
	at org.apache.solr.client.solrj.impl.HttpSolrClient.executeMethod(HttpSolrClient.java:542)
	... 50 more


FAILED:  org.apache.solr.cloud.RecoveryAfterSoftCommitTest.test

Error Message:
Timeout occured while waiting response from server at: http://127.0.0.1:33337/collection1

Stack Trace:
org.apache.solr.client.solrj.SolrServerException: Timeout occured while waiting response from server at: http://127.0.0.1:33337/collection1
	at __randomizedtesting.SeedInfo.seed([99EF1701BBE3E4E0:11BB28DB151F8918]:0)
	at org.apache.solr.client.solrj.impl.HttpSolrClient.executeMethod(HttpSolrClient.java:654)
	at org.apache.solr.client.solrj.impl.HttpSolrClient.request(HttpSolrClient.java:255)
	at org.apache.solr.client.solrj.impl.HttpSolrClient.request(HttpSolrClient.java:244)
	at org.apache.solr.client.solrj.impl.LBHttpSolrClient.doRequest(LBHttpSolrClient.java:483)
	at org.apache.solr.client.solrj.impl.LBHttpSolrClient.request(LBHttpSolrClient.java:413)
	at org.apache.solr.client.solrj.impl.CloudSolrClient.sendRequest(CloudSolrClient.java:1107)
	at org.apache.solr.client.solrj.impl.CloudSolrClient.requestWithRetryOnStaleState(CloudSolrClient.java:884)
	at org.apache.solr.client.solrj.impl.CloudSolrClient.request(CloudSolrClient.java:817)
	at org.apache.solr.client.solrj.SolrClient.request(SolrClient.java:1260)
	at org.apache.solr.cloud.RecoveryAfterSoftCommitTest.test(RecoveryAfterSoftCommitTest.java:87)
	at sun.reflect.NativeMethodAccessorImpl.invoke0(Native Method)
	at sun.reflect.NativeMethodAccessorImpl.invoke(NativeMethodAccessorImpl.java:62)
	at sun.reflect.DelegatingMethodAccessorImpl.invoke(DelegatingMethodAccessorImpl.java:43)
	at java.lang.reflect.Method.invoke(Method.java:498)
	at com.carrotsearch.randomizedtesting.RandomizedRunner.invoke(RandomizedRunner.java:1742)
	at com.carrotsearch.randomizedtesting.RandomizedRunner$8.evaluate(RandomizedRunner.java:935)
	at com.carrotsearch.randomizedtesting.RandomizedRunner$9.evaluate(RandomizedRunner.java:971)
	at com.carrotsearch.randomizedtesting.RandomizedRunner$10.evaluate(RandomizedRunner.java:985)
	at org.apache.solr.BaseDistributedSearchTestCase$ShardsRepeatRule$ShardsFixedStatement.callStatement(BaseDistributedSearchTestCase.java:1010)
	at org.apache.solr.BaseDistributedSearchTestCase$ShardsRepeatRule$ShardsStatement.evaluate(BaseDistributedSearchTestCase.java:985)
	at com.carrotsearch.randomizedtesting.rules.SystemPropertiesRestoreRule$1.evaluate(SystemPropertiesRestoreRule.java:57)
	at org.apache.lucene.util.TestRuleSetupTeardownChained$1.evaluate(TestRuleSetupTeardownChained.java:49)
	at org.apache.lucene.util.AbstractBeforeAfterRule$1.evaluate(AbstractBeforeAfterRule.java:45)
	at org.apache.lucene.util.TestRuleThreadAndTestName$1.evaluate(TestRuleThreadAndTestName.java:48)
	at org.apache.lucene.util.TestRuleIgnoreAfterMaxFailures$1.evaluate(TestRuleIgnoreAfterMaxFailures.java:64)
	at org.apache.lucene.util.TestRuleMarkFailure$1.evaluate(TestRuleMarkFailure.java:47)
	at com.carrotsearch.randomizedtesting.rules.StatementAdapter.evaluate(StatementAdapter.java:36)
	at com.carrotsearch.randomizedtesting.ThreadLeakControl$StatementRunner.run(ThreadLeakControl.java:368)
	at com.carrotsearch.randomizedtesting.ThreadLeakControl.forkTimeoutingTask(ThreadLeakControl.java:817)
	at com.carrotsearch.randomizedtesting.ThreadLeakControl$3.evaluate(ThreadLeakControl.java:468)
	at com.carrotsearch.randomizedtesting.RandomizedRunner.runSingleTest(RandomizedRunner.java:944)
	at com.carrotsearch.randomizedtesting.RandomizedRunner$5.evaluate(RandomizedRunner.java:830)
	at com.carrotsearch.randomizedtesting.RandomizedRunner$6.evaluate(RandomizedRunner.java:880)
	at com.carrotsearch.randomizedtesting.RandomizedRunner$7.evaluate(RandomizedRunner.java:891)
	at com.carrotsearch.randomizedtesting.rules.StatementAdapter.evaluate(StatementAdapter.java:36)
	at com.carrotsearch.randomizedtesting.rules.SystemPropertiesRestoreRule$1.evaluate(SystemPropertiesRestoreRule.java:57)
	at org.apache.lucene.util.AbstractBeforeAfterRule$1.evaluate(AbstractBeforeAfterRule.java:45)
	at com.carrotsearch.randomizedtesting.rules.StatementAdapter.evaluate(StatementAdapter.java:36)
	at org.apache.lucene.util.TestRuleStoreClassName$1.evaluate(TestRuleStoreClassName.java:41)
	at com.carrotsearch.randomizedtesting.rules.NoShadowingOrOverridesOnMethodsRule$1.evaluate(NoShadowingOrOverridesOnMethodsRule.java:40)
	at com.carrotsearch.randomizedtesting.rules.NoShadowingOrOverridesOnMethodsRule$1.evaluate(NoShadowingOrOverridesOnMethodsRule.java:40)
	at com.carrotsearch.randomizedtesting.rules.StatementAdapter.evaluate(StatementAdapter.java:36)
	at com.carrotsearch.randomizedtesting.rules.StatementAdapter.evaluate(StatementAdapter.java:36)
	at com.carrotsearch.randomizedtesting.rules.StatementAdapter.evaluate(StatementAdapter.java:36)
	at org.apache.lucene.util.TestRuleAssertionsRequired$1.evaluate(TestRuleAssertionsRequired.java:53)
	at org.apache.lucene.util.TestRuleMarkFailure$1.evaluate(TestRuleMarkFailure.java:47)
	at org.apache.lucene.util.TestRuleIgnoreAfterMaxFailures$1.evaluate(TestRuleIgnoreAfterMaxFailures.java:64)
	at org.apache.lucene.util.TestRuleIgnoreTestSuites$1.evaluate(TestRuleIgnoreTestSuites.java:54)
	at com.carrotsearch.randomizedtesting.rules.StatementAdapter.evaluate(StatementAdapter.java:36)
	at com.carrotsearch.randomizedtesting.ThreadLeakControl$StatementRunner.run(ThreadLeakControl.java:368)
	at java.lang.Thread.run(Thread.java:748)
Caused by: java.net.SocketTimeoutException: Read timed out
	at java.net.SocketInputStream.socketRead0(Native Method)
	at java.net.SocketInputStream.socketRead(SocketInputStream.java:116)
	at java.net.SocketInputStream.read(SocketInputStream.java:171)
	at java.net.SocketInputStream.read(SocketInputStream.java:141)
	at org.apache.http.impl.io.SessionInputBufferImpl.streamRead(SessionInputBufferImpl.java:137)
	at org.apache.http.impl.io.SessionInputBufferImpl.fillBuffer(SessionInputBufferImpl.java:153)
	at org.apache.http.impl.io.SessionInputBufferImpl.readLine(SessionInputBufferImpl.java:282)
	at org.apache.http.impl.conn.DefaultHttpResponseParser.parseHead(DefaultHttpResponseParser.java:138)
	at org.apache.http.impl.conn.DefaultHttpResponseParser.parseHead(DefaultHttpResponseParser.java:56)
	at org.apache.http.impl.io.AbstractMessageParser.parse(AbstractMessageParser.java:259)
	at org.apache.http.impl.DefaultBHttpClientConnection.receiveResponseHeader(DefaultBHttpClientConnection.java:163)
	at org.apache.http.impl.conn.CPoolProxy.receiveResponseHeader(CPoolProxy.java:165)
	at org.apache.http.protocol.HttpRequestExecutor.doReceiveResponse(HttpRequestExecutor.java:273)
	at org.apache.http.protocol.HttpRequestExecutor.execute(HttpRequestExecutor.java:125)
	at org.apache.http.impl.execchain.MainClientExec.execute(MainClientExec.java:272)
	at org.apache.http.impl.execchain.ProtocolExec.execute(ProtocolExec.java:185)
	at org.apache.http.impl.execchain.RetryExec.execute(RetryExec.java:89)
	at org.apache.http.impl.execchain.RedirectExec.execute(RedirectExec.java:111)
	at org.apache.http.impl.client.InternalHttpClient.doExecute(InternalHttpClient.java:185)
	at org.apache.http.impl.client.CloseableHttpClient.execute(CloseableHttpClient.java:83)
	at org.apache.http.impl.client.CloseableHttpClient.execute(CloseableHttpClient.java:56)
	at org.apache.solr.client.solrj.impl.HttpSolrClient.executeMethod(HttpSolrClient.java:542)
	... 50 more




Build Log:
[...truncated 14167 lines...]
   [junit4] Suite: org.apache.solr.cloud.RecoveryAfterSoftCommitTest
   [junit4]   2> Creating dataDir: /home/jenkins/workspace/Lucene-Solr-master-Linux/solr/build/solr-core/test/J1/temp/solr.cloud.RecoveryAfterSoftCommitTest_99EF1701BBE3E4E0-001/init-core-data-001
   [junit4]   2> 1687608 WARN  (SUITE-RecoveryAfterSoftCommitTest-seed#[99EF1701BBE3E4E0]-worker) [    ] o.a.s.SolrTestCaseJ4 startTrackingSearchers: numOpens=6 numCloses=6
   [junit4]   2> 1687608 INFO  (SUITE-RecoveryAfterSoftCommitTest-seed#[99EF1701BBE3E4E0]-worker) [    ] o.a.s.SolrTestCaseJ4 Using PointFields (NUMERIC_POINTS_SYSPROP=true) w/NUMERIC_DOCVALUES_SYSPROP=true
   [junit4]   2> 1687610 INFO  (SUITE-RecoveryAfterSoftCommitTest-seed#[99EF1701BBE3E4E0]-worker) [    ] o.a.s.SolrTestCaseJ4 Randomized ssl (false) and clientAuth (false) via: @org.apache.solr.SolrTestCaseJ4$SuppressSSL(bugUrl=None)
   [junit4]   2> 1687610 INFO  (SUITE-RecoveryAfterSoftCommitTest-seed#[99EF1701BBE3E4E0]-worker) [    ] o.a.s.SolrTestCaseJ4 SecureRandom sanity checks: test.solr.allowed.securerandom=null & java.security.egd=file:/dev/./urandom
   [junit4]   2> 1687610 INFO  (SUITE-RecoveryAfterSoftCommitTest-seed#[99EF1701BBE3E4E0]-worker) [    ] o.a.s.BaseDistributedSearchTestCase Setting hostContext system property: /
   [junit4]   2> 1687612 INFO  (TEST-RecoveryAfterSoftCommitTest.test-seed#[99EF1701BBE3E4E0]) [    ] o.a.s.c.ZkTestServer STARTING ZK TEST SERVER
   [junit4]   2> 1687612 INFO  (Thread-3526) [    ] o.a.s.c.ZkTestServer client port:0.0.0.0/0.0.0.0:0
   [junit4]   2> 1687612 INFO  (Thread-3526) [    ] o.a.s.c.ZkTestServer Starting server
   [junit4]   2> 1687613 ERROR (Thread-3526) [    ] o.a.z.s.ZooKeeperServer ZKShutdownHandler is not registered, so ZooKeeper server won't take any action on ERROR or SHUTDOWN server state changes
   [junit4]   2> 1687712 INFO  (TEST-RecoveryAfterSoftCommitTest.test-seed#[99EF1701BBE3E4E0]) [    ] o.a.s.c.ZkTestServer start zk server on port:39337
   [junit4]   2> 1687714 INFO  (zkConnectionManagerCallback-4266-thread-1) [    ] o.a.s.c.c.ConnectionManager zkClient has connected
   [junit4]   2> 1687716 INFO  (zkConnectionManagerCallback-4268-thread-1) [    ] o.a.s.c.c.ConnectionManager zkClient has connected
   [junit4]   2> 1687719 INFO  (TEST-RecoveryAfterSoftCommitTest.test-seed#[99EF1701BBE3E4E0]) [    ] o.a.s.c.AbstractZkTestCase put /home/jenkins/workspace/Lucene-Solr-master-Linux/solr/core/src/test-files/solr/collection1/conf/solrconfig-tlog.xml to /configs/conf1/solrconfig.xml
   [junit4]   2> 1687719 INFO  (TEST-RecoveryAfterSoftCommitTest.test-seed#[99EF1701BBE3E4E0]) [    ] o.a.s.c.AbstractZkTestCase put /home/jenkins/workspace/Lucene-Solr-master-Linux/solr/core/src/test-files/solr/collection1/conf/schema.xml to /configs/conf1/schema.xml
   [junit4]   2> 1687720 INFO  (TEST-RecoveryAfterSoftCommitTest.test-seed#[99EF1701BBE3E4E0]) [    ] o.a.s.c.AbstractZkTestCase put /home/jenkins/workspace/Lucene-Solr-master-Linux/solr/core/src/test-files/solr/collection1/conf/solrconfig.snippet.randomindexconfig.xml to /configs/conf1/solrconfig.snippet.randomindexconfig.xml
   [junit4]   2> 1687720 INFO  (TEST-RecoveryAfterSoftCommitTest.test-seed#[99EF1701BBE3E4E0]) [    ] o.a.s.c.AbstractZkTestCase put /home/jenkins/workspace/Lucene-Solr-master-Linux/solr/core/src/test-files/solr/collection1/conf/stopwords.txt to /configs/conf1/stopwords.txt
   [junit4]   2> 1687721 INFO  (TEST-RecoveryAfterSoftCommitTest.test-seed#[99EF1701BBE3E4E0]) [    ] o.a.s.c.AbstractZkTestCase put /home/jenkins/workspace/Lucene-Solr-master-Linux/solr/core/src/test-files/solr/collection1/conf/protwords.txt to /configs/conf1/protwords.txt
   [junit4]   2> 1687721 INFO  (TEST-RecoveryAfterSoftCommitTest.test-seed#[99EF1701BBE3E4E0]) [    ] o.a.s.c.AbstractZkTestCase put /home/jenkins/workspace/Lucene-Solr-master-Linux/solr/core/src/test-files/solr/collection1/conf/currency.xml to /configs/conf1/currency.xml
   [junit4]   2> 1687722 INFO  (TEST-RecoveryAfterSoftCommitTest.test-seed#[99EF1701BBE3E4E0]) [    ] o.a.s.c.AbstractZkTestCase put /home/jenkins/workspace/Lucene-Solr-master-Linux/solr/core/src/test-files/solr/collection1/conf/enumsConfig.xml to /configs/conf1/enumsConfig.xml
   [junit4]   2> 1687722 INFO  (TEST-RecoveryAfterSoftCommitTest.test-seed#[99EF1701BBE3E4E0]) [    ] o.a.s.c.AbstractZkTestCase put /home/jenkins/workspace/Lucene-Solr-master-Linux/solr/core/src/test-files/solr/collection1/conf/open-exchange-rates.json to /configs/conf1/open-exchange-rates.json
   [junit4]   2> 1687723 INFO  (TEST-RecoveryAfterSoftCommitTest.test-seed#[99EF1701BBE3E4E0]) [    ] o.a.s.c.AbstractZkTestCase put /home/jenkins/workspace/Lucene-Solr-master-Linux/solr/core/src/test-files/solr/collection1/conf/mapping-ISOLatin1Accent.txt to /configs/conf1/mapping-ISOLatin1Accent.txt
   [junit4]   2> 1687723 INFO  (TEST-RecoveryAfterSoftCommitTest.test-seed#[99EF1701BBE3E4E0]) [    ] o.a.s.c.AbstractZkTestCase put /home/jenkins/workspace/Lucene-Solr-master-Linux/solr/core/src/test-files/solr/collection1/conf/old_synonyms.txt to /configs/conf1/old_synonyms.txt
   [junit4]   2> 1687724 INFO  (TEST-RecoveryAfterSoftCommitTest.test-seed#[99EF1701BBE3E4E0]) [    ] o.a.s.c.AbstractZkTestCase put /home/jenkins/workspace/Lucene-Solr-master-Linux/solr/core/src/test-files/solr/collection1/conf/synonyms.txt to /configs/conf1/synonyms.txt
   [junit4]   2> 1687724 INFO  (TEST-RecoveryAfterSoftCommitTest.test-seed#[99EF1701BBE3E4E0]) [    ] o.a.s.c.AbstractFullDistribZkTestBase Will use TLOG replicas unless explicitly asked otherwise
   [junit4]   2> 1687798 INFO  (TEST-RecoveryAfterSoftCommitTest.test-seed#[99EF1701BBE3E4E0]) [    ] o.e.j.s.Server jetty-9.4.11.v20180605; built: 2018-06-05T18:24:03.829Z; git: d5fc0523cfa96bfebfbda19606cad384d772f04c; jvm 1.8.0_172-b11
   [junit4]   2> 1687802 INFO  (TEST-RecoveryAfterSoftCommitTest.test-seed#[99EF1701BBE3E4E0]) [    ] o.e.j.s.session DefaultSessionIdManager workerName=node0
   [junit4]   2> 1687802 INFO  (TEST-RecoveryAfterSoftCommitTest.test-seed#[99EF1701BBE3E4E0]) [    ] o.e.j.s.session No SessionScavenger set, using defaults
   [junit4]   2> 1687802 INFO  (TEST-RecoveryAfterSoftCommitTest.test-seed#[99EF1701BBE3E4E0]) [    ] o.e.j.s.session node0 Scavenging every 660000ms
   [junit4]   2> 1687802 INFO  (TEST-RecoveryAfterSoftCommitTest.test-seed#[99EF1701BBE3E4E0]) [    ] o.e.j.s.h.ContextHandler Started o.e.j.s.ServletContextHandler@5f2a910b{/,null,AVAILABLE}
   [junit4]   2> 1687804 INFO  (TEST-RecoveryAfterSoftCommitTest.test-seed#[99EF1701BBE3E4E0]) [    ] o.e.j.s.AbstractConnector Started ServerConnector@6a84a442{HTTP/1.1,[http/1.1]}{127.0.0.1:40527}
   [junit4]   2> 1687804 INFO  (TEST-RecoveryAfterSoftCommitTest.test-seed#[99EF1701BBE3E4E0]) [    ] o.e.j.s.Server Started @1687835ms
   [junit4]   2> 1687804 INFO  (TEST-RecoveryAfterSoftCommitTest.test-seed#[99EF1701BBE3E4E0]) [    ] o.a.s.c.s.e.JettySolrRunner Jetty properties: {solr.data.dir=/home/jenkins/workspace/Lucene-Solr-master-Linux/solr/build/solr-core/test/J1/temp/solr.cloud.RecoveryAfterSoftCommitTest_99EF1701BBE3E4E0-001/tempDir-001/control/data, replicaType=NRT, hostContext=/, hostPort=32993, coreRootDirectory=/home/jenkins/workspace/Lucene-Solr-master-Linux/solr/build/solr-core/test/J1/temp/solr.cloud.RecoveryAfterSoftCommitTest_99EF1701BBE3E4E0-001/control-001/cores}
   [junit4]   2> 1687804 ERROR (TEST-RecoveryAfterSoftCommitTest.test-seed#[99EF1701BBE3E4E0]) [    ] o.a.s.u.StartupLoggingUtils Missing Java Option solr.log.dir. Logging may be missing or incomplete.
   [junit4]   2> 1687804 INFO  (TEST-RecoveryAfterSoftCommitTest.test-seed#[99EF1701BBE3E4E0]) [    ] o.a.s.s.SolrDispatchFilter Using logger factory org.apache.logging.slf4j.Log4jLoggerFactory
   [junit4]   2> 1687804 INFO  (TEST-RecoveryAfterSoftCommitTest.test-seed#[99EF1701BBE3E4E0]) [    ] o.a.s.s.SolrDispatchFilter  ___      _       Welcome to Apache Solr? version 8.0.0
   [junit4]   2> 1687804 INFO  (TEST-RecoveryAfterSoftCommitTest.test-seed#[99EF1701BBE3E4E0]) [    ] o.a.s.s.SolrDispatchFilter / __| ___| |_ _   Starting in cloud mode on port null
   [junit4]   2> 1687804 INFO  (TEST-RecoveryAfterSoftCommitTest.test-seed#[99EF1701BBE3E4E0]) [    ] o.a.s.s.SolrDispatchFilter \__ \/ _ \ | '_|  Install dir: null
   [junit4]   2> 1687804 INFO  (TEST-RecoveryAfterSoftCommitTest.test-seed#[99EF1701BBE3E4E0]) [    ] o.a.s.s.SolrDispatchFilter |___/\___/_|_|    Start time: 2018-11-07T08:27:12.976Z
   [junit4]   2> 1687805 INFO  (zkConnectionManagerCallback-4270-thread-1) [    ] o.a.s.c.c.ConnectionManager zkClient has connected
   [junit4]   2> 1687806 INFO  (TEST-RecoveryAfterSoftCommitTest.test-seed#[99EF1701BBE3E4E0]) [    ] o.a.s.s.SolrDispatchFilter Loading solr.xml from SolrHome (not found in ZooKeeper)
   [junit4]   2> 1687806 INFO  (TEST-RecoveryAfterSoftCommitTest.test-seed#[99EF1701BBE3E4E0]) [    ] o.a.s.c.SolrXmlConfig Loading container configuration from /home/jenkins/workspace/Lucene-Solr-master-Linux/solr/build/solr-core/test/J1/temp/solr.cloud.RecoveryAfterSoftCommitTest_99EF1701BBE3E4E0-001/control-001/solr.xml
   [junit4]   2> 1687809 INFO  (TEST-RecoveryAfterSoftCommitTest.test-seed#[99EF1701BBE3E4E0]) [    ] o.a.s.c.SolrXmlConfig Configuration parameter autoReplicaFailoverWorkLoopDelay is ignored
   [junit4]   2> 1687809 INFO  (TEST-RecoveryAfterSoftCommitTest.test-seed#[99EF1701BBE3E4E0]) [    ] o.a.s.c.SolrXmlConfig Configuration parameter autoReplicaFailoverBadNodeExpiration is ignored
   [junit4]   2> 1687810 INFO  (TEST-RecoveryAfterSoftCommitTest.test-seed#[99EF1701BBE3E4E0]) [    ] o.a.s.c.SolrXmlConfig MBean server found: com.sun.jmx.mbeanserver.JmxMBeanServer@11678f60, but no JMX reporters were configured - adding default JMX reporter.
   [junit4]   2> 1688038 INFO  (TEST-RecoveryAfterSoftCommitTest.test-seed#[99EF1701BBE3E4E0]) [    ] o.a.s.c.ZkContainer Zookeeper client=127.0.0.1:39337/solr
   [junit4]   2> 1688039 INFO  (zkConnectionManagerCallback-4274-thread-1) [    ] o.a.s.c.c.ConnectionManager zkClient has connected
   [junit4]   2> 1688041 INFO  (zkConnectionManagerCallback-4276-thread-1) [    ] o.a.s.c.c.ConnectionManager zkClient has connected
   [junit4]   2> 1688072 INFO  (TEST-RecoveryAfterSoftCommitTest.test-seed#[99EF1701BBE3E4E0]) [n:127.0.0.1:32993_    ] o.a.s.c.OverseerElectionContext I am going to be the leader 127.0.0.1:32993_
   [junit4]   2> 1688072 INFO  (TEST-RecoveryAfterSoftCommitTest.test-seed#[99EF1701BBE3E4E0]) [n:127.0.0.1:32993_    ] o.a.s.c.Overseer Overseer (id=72120081639538692-127.0.0.1:32993_-n_0000000000) starting
   [junit4]   2> 1688076 INFO  (zkConnectionManagerCallback-4283-thread-1) [    ] o.a.s.c.c.ConnectionManager zkClient has connected
   [junit4]   2> 1688077 INFO  (TEST-RecoveryAfterSoftCommitTest.test-seed#[99EF1701BBE3E4E0]) [n:127.0.0.1:32993_    ] o.a.s.c.s.i.ZkClientClusterStateProvider Cluster at 127.0.0.1:39337/solr ready
   [junit4]   2> 1688078 INFO  (OverseerStateUpdate-72120081639538692-127.0.0.1:32993_-n_0000000000) [n:127.0.0.1:32993_    ] o.a.s.c.Overseer Starting to work on the main queue : 127.0.0.1:32993_
   [junit4]   2> 1688078 INFO  (TEST-RecoveryAfterSoftCommitTest.test-seed#[99EF1701BBE3E4E0]) [n:127.0.0.1:32993_    ] o.a.s.c.ZkController Register node as live in ZooKeeper:/live_nodes/127.0.0.1:32993_
   [junit4]   2> 1688078 INFO  (OverseerStateUpdate-72120081639538692-127.0.0.1:32993_-n_0000000000) [n:127.0.0.1:32993_    ] o.a.s.c.c.ZkStateReader Updated live nodes from ZooKeeper... (0) -> (1)
   [junit4]   2> 1688080 INFO  (zkCallback-4282-thread-1) [    ] o.a.s.c.c.ZkStateReader Updated live nodes from ZooKeeper... (0) -> (1)
   [junit4]   2> 1688088 INFO  (TEST-RecoveryAfterSoftCommitTest.test-seed#[99EF1701BBE3E4E0]) [n:127.0.0.1:32993_    ] o.a.s.h.a.MetricsHistoryHandler No .system collection, keeping metrics history in memory.
   [junit4]   2> 1688098 INFO  (TEST-RecoveryAfterSoftCommitTest.test-seed#[99EF1701BBE3E4E0]) [n:127.0.0.1:32993_    ] o.a.s.m.r.SolrJmxReporter JMX monitoring for 'solr.node' (registry 'solr.node') enabled at server: com.sun.jmx.mbeanserver.JmxMBeanServer@11678f60
   [junit4]   2> 1688103 INFO  (TEST-RecoveryAfterSoftCommitTest.test-seed#[99EF1701BBE3E4E0]) [n:127.0.0.1:32993_    ] o.a.s.m.r.SolrJmxReporter JMX monitoring for 'solr.jvm' (registry 'solr.jvm') enabled at server: com.sun.jmx.mbeanserver.JmxMBeanServer@11678f60
   [junit4]   2> 1688104 INFO  (TEST-RecoveryAfterSoftCommitTest.test-seed#[99EF1701BBE3E4E0]) [n:127.0.0.1:32993_    ] o.a.s.m.r.SolrJmxReporter JMX monitoring for 'solr.jetty' (registry 'solr.jetty') enabled at server: com.sun.jmx.mbeanserver.JmxMBeanServer@11678f60
   [junit4]   2> 1688104 INFO  (TEST-RecoveryAfterSoftCommitTest.test-seed#[99EF1701BBE3E4E0]) [n:127.0.0.1:32993_    ] o.a.s.c.CorePropertiesLocator Found 0 core definitions underneath /home/jenkins/workspace/Lucene-Solr-master-Linux/solr/build/solr-core/test/J1/temp/solr.cloud.RecoveryAfterSoftCommitTest_99EF1701BBE3E4E0-001/control-001/cores
   [junit4]   2> 1688116 INFO  (zkConnectionManagerCallback-4289-thread-1) [    ] o.a.s.c.c.ConnectionManager zkClient has connected
   [junit4]   2> 1688117 INFO  (TEST-RecoveryAfterSoftCommitTest.test-seed#[99EF1701BBE3E4E0]) [    ] o.a.s.c.c.ZkStateReader Updated live nodes from ZooKeeper... (0) -> (1)
   [junit4]   2> 1688118 INFO  (TEST-RecoveryAfterSoftCommitTest.test-seed#[99EF1701BBE3E4E0]) [    ] o.a.s.c.s.i.ZkClientClusterStateProvider Cluster at 127.0.0.1:39337/solr ready
   [junit4]   2> 1688118 INFO  (SocketProxy-Acceptor-32993) [    ] o.a.s.c.SocketProxy accepted Socket[addr=/127.0.0.1,port=46604,localport=32993], receiveBufferSize:531000
   [junit4]   2> 1688119 INFO  (SocketProxy-Acceptor-32993) [    ] o.a.s.c.SocketProxy proxy connection Socket[addr=/127.0.0.1,port=40527,localport=40376], receiveBufferSize=530904
   [junit4]   2> 1688119 INFO  (qtp117404313-15205) [n:127.0.0.1:32993_    ] o.a.s.h.a.CollectionsHandler Invoked Collection Action :create with params collection.configName=conf1&name=control_collection&nrtReplicas=1&action=CREATE&numShards=1&createNodeSet=127.0.0.1:32993_&wt=javabin&version=2 and sendToOCPQueue=true
   [junit4]   2> 1688120 INFO  (OverseerThreadFactory-6530-thread-1-processing-n:127.0.0.1:32993_) [n:127.0.0.1:32993_    ] o.a.s.c.a.c.CreateCollectionCmd Create collection control_collection
   [junit4]   2> 1688224 INFO  (SocketProxy-Acceptor-32993) [    ] o.a.s.c.SocketProxy accepted Socket[addr=/127.0.0.1,port=46608,localport=32993], receiveBufferSize:531000
   [junit4]   2> 1688224 INFO  (SocketProxy-Acceptor-32993) [    ] o.a.s.c.SocketProxy proxy connection Socket[addr=/127.0.0.1,port=40527,localport=40380], receiveBufferSize=530904
   [junit4]   2> 1688225 INFO  (qtp117404313-15200) [n:127.0.0.1:32993_    ] o.a.s.s.HttpSolrCall [admin] webapp=null path=/admin/metrics params={prefix=CONTAINER.fs.usableSpace,CONTAINER.fs.totalSpace,CORE.coreName&wt=javabin&version=2&group=solr.node,solr.core} status=0 QTime=0
   [junit4]   2> 1688226 INFO  (SocketProxy-Acceptor-32993) [    ] o.a.s.c.SocketProxy accepted Socket[addr=/127.0.0.1,port=46612,localport=32993], receiveBufferSize:531000
   [junit4]   2> 1688227 INFO  (SocketProxy-Acceptor-32993) [    ] o.a.s.c.SocketProxy proxy connection Socket[addr=/127.0.0.1,port=40527,localport=40384], receiveBufferSize=530904
   [junit4]   2> 1688227 INFO  (qtp117404313-15201) [n:127.0.0.1:32993_    x:control_collection_shard1_replica_n1] o.a.s.h.a.CoreAdminOperation core create command qt=/admin/cores&collection.configName=conf1&newCollection=true&name=control_collection_shard1_replica_n1&action=CREATE&numShards=1&collection=control_collection&shard=shard1&wt=javabin&version=2&replicaType=NRT
   [junit4]   2> 1688227 INFO  (qtp117404313-15201) [n:127.0.0.1:32993_    x:control_collection_shard1_replica_n1] o.a.s.c.TransientSolrCoreCacheDefault Allocating transient cache for 4 transient cores
   [junit4]   2> 1689236 INFO  (qtp117404313-15201) [n:127.0.0.1:32993_ c:control_collection s:shard1  x:control_collection_shard1_replica_n1] o.a.s.c.SolrConfig Using Lucene MatchVersion: 8.0.0
   [junit4]   2> 1689246 INFO  (qtp117404313-15201) [n:127.0.0.1:32993_ c:control_collection s:shard1  x:control_collection_shard1_replica_n1] o.a.s.s.IndexSchema [control_collection_shard1_replica_n1] Schema name=test
   [junit4]   2> 1689321 INFO  (qtp117404313-15201) [n:127.0.0.1:32993_ c:control_collection s:shard1  x:control_collection_shard1_replica_n1] o.a.s.s.IndexSchema Loaded schema test/1.0 with uniqueid field id
   [junit4]   2> 1689330 INFO  (qtp117404313-15201) [n:127.0.0.1:32993_ c:control_collection s:shard1  x:control_collection_shard1_replica_n1] o.a.s.c.CoreContainer Creating SolrCore 'control_collection_shard1_replica_n1' using configuration from collection control_collection, trusted=true
   [junit4]   2> 1689330 INFO  (qtp117404313-15201) [n:127.0.0.1:32993_ c:control_collection s:shard1  x:control_collection_shard1_replica_n1] o.a.s.m.r.SolrJmxReporter JMX monitoring for 'solr.core.control_collection.shard1.replica_n1' (registry 'solr.core.control_collection.shard1.replica_n1') enabled at server: com.sun.jmx.mbeanserver.JmxMBeanServer@11678f60
   [junit4]   2> 1689330 INFO  (qtp117404313-15201) [n:127.0.0.1:32993_ c:control_collection s:shard1  x:control_collection_shard1_replica_n1] o.a.s.c.SolrCore [[control_collection_shard1_replica_n1] ] Opening new SolrCore at [/home/jenkins/workspace/Lucene-Solr-master-Linux/solr/build/solr-core/test/J1/temp/solr.cloud.RecoveryAfterSoftCommitTest_99EF1701BBE3E4E0-001/control-001/cores/control_collection_shard1_replica_n1], dataDir=[/home/jenkins/workspace/Lucene-Solr-master-Linux/solr/build/solr-core/test/J1/temp/solr.cloud.RecoveryAfterSoftCommitTest_99EF1701BBE3E4E0-001/control-001/cores/control_collection_shard1_replica_n1/data/]
   [junit4]   2> 1689331 INFO  (qtp117404313-15201) [n:127.0.0.1:32993_ c:control_collection s:shard1  x:control_collection_shard1_replica_n1] o.a.s.u.RandomMergePolicy RandomMergePolicy wrapping class org.apache.lucene.index.LogDocMergePolicy: [LogDocMergePolicy: minMergeSize=1000, mergeFactor=47, maxMergeSize=9223372036854775807, maxMergeSizeForForcedMerge=9223372036854775807, calibrateSizeByDeletes=false, maxMergeDocs=2147483647, maxCFSSegmentSizeMB=8.796093022207999E12, noCFSRatio=1.0]
   [junit4]   2> 1689332 WARN  (qtp117404313-15201) [n:127.0.0.1:32993_ c:control_collection s:shard1  x:control_collection_shard1_replica_n1] o.a.s.c.RequestHandlers INVALID paramSet a in requestHandler {type = requestHandler,name = /dump,class = DumpRequestHandler,attributes = {initParams=a, name=/dump, class=DumpRequestHandler},args = {defaults={a=A,b=B}}}
   [junit4]   2> 1689366 INFO  (qtp117404313-15201) [n:127.0.0.1:32993_ c:control_collection s:shard1  x:control_collection_shard1_replica_n1] o.a.s.u.UpdateHandler Using UpdateLog implementation: org.apache.solr.update.UpdateLog
   [junit4]   2> 1689366 INFO  (qtp117404313-15201) [n:127.0.0.1:32993_ c:control_collection s:shard1  x:control_collection_shard1_replica_n1] o.a.s.u.UpdateLog Initializing UpdateLog: dataDir= defaultSyncLevel=FLUSH numRecordsToKeep=2 maxNumLogsToKeep=10 numVersionBuckets=65536
   [junit4]   2> 1689366 INFO  (qtp117404313-15201) [n:127.0.0.1:32993_ c:control_collection s:shard1  x:control_collection_shard1_replica_n1] o.a.s.u.CommitTracker Hard AutoCommit: disabled
   [junit4]   2> 1689366 INFO  (qtp117404313-15201) [n:127.0.0.1:32993_ c:control_collection s:shard1  x:control_collection_shard1_replica_n1] o.a.s.u.CommitTracker Soft AutoCommit: disabled
   [junit4]   2> 1689367 INFO  (qtp117404313-15201) [n:127.0.0.1:32993_ c:control_collection s:shard1  x:control_collection_shard1_replica_n1] o.a.s.u.RandomMergePolicy RandomMergePolicy wrapping class org.apache.lucene.index.TieredMergePolicy: [TieredMergePolicy: maxMergeAtOnce=39, maxMergeAtOnceExplicit=38, maxMergedSegmentMB=0.193359375, floorSegmentMB=1.3076171875, forceMergeDeletesPctAllowed=10.493936745722603, segmentsPerTier=33.0, maxCFSSegmentSizeMB=8.796093022207999E12, noCFSRatio=0.0, deletesPctAllowed=45.712701483814186
   [junit4]   2> 1689367 INFO  (qtp117404313-15201) [n:127.0.0.1:32993_ c:control_collection s:shard1  x:control_collection_shard1_replica_n1] o.a.s.s.SolrIndexSearcher Opening [Searcher@4167535d[control_collection_shard1_replica_n1] main]
   [junit4]   2> 1689368 INFO  (qtp117404313-15201) [n:127.0.0.1:32993_ c:control_collection s:shard1  x:control_collection_shard1_replica_n1] o.a.s.r.ManagedResourceStorage Configured ZooKeeperStorageIO with znodeBase: /configs/conf1
   [junit4]   2> 1689368 INFO  (qtp117404313-15201) [n:127.0.0.1:32993_ c:control_collection s:shard1  x:control_collection_shard1_replica_n1] o.a.s.r.ManagedResourceStorage Loaded null at path _rest_managed.json using ZooKeeperStorageIO:path=/configs/conf1
   [junit4]   2> 1689368 INFO  (qtp117404313-15201) [n:127.0.0.1:32993_ c:control_collection s:shard1  x:control_collection_shard1_replica_n1] o.a.s.h.ReplicationHandler Commits will be reserved for 10000ms.
   [junit4]   2> 1689368 INFO  (qtp117404313-15201) [n:127.0.0.1:32993_ c:control_collection s:shard1  x:control_collection_shard1_replica_n1] o.a.s.u.UpdateLog Could not find max version in index or recent updates, using new clock 1616462987437015040
   [junit4]   2> 1689369 INFO  (searcherExecutor-6535-thread-1-processing-n:127.0.0.1:32993_ x:control_collection_shard1_replica_n1 c:control_collection s:shard1) [n:127.0.0.1:32993_ c:control_collection s:shard1  x:control_collection_shard1_replica_n1] o.a.s.c.SolrCore [control_collection_shard1_replica_n1] Registered new searcher Searcher@4167535d[control_collection_shard1_replica_n1] main{ExitableDirectoryReader(UninvertingDirectoryReader())}
   [junit4]   2> 1689373 INFO  (qtp117404313-15201) [n:127.0.0.1:32993_ c:control_collection s:shard1  x:control_collection_shard1_replica_n1] o.a.s.c.ZkShardTerms Successful update of terms at /collections/control_collection/terms/shard1 to Terms{values={core_node2=0}, version=0}
   [junit4]   2> 1689374 INFO  (qtp117404313-15201) [n:127.0.0.1:32993_ c:control_collection s:shard1  x:control_collection_shard1_replica_n1] o.a.s.c.ShardLeaderElectionContext Enough replicas found to continue.
   [junit4]   2> 1689374 INFO  (qtp117404313-15201) [n:127.0.0.1:32993_ c:control_collection s:shard1  x:control_collection_shard1_replica_n1] o.a.s.c.ShardLeaderElectionContext I may be the new leader - try and sync
   [junit4]   2> 1689374 INFO  (qtp117404313-15201) [n:127.0.0.1:32993_ c:control_collection s:shard1  x:control_collection_shard1_replica_n1] o.a.s.c.SyncStrategy Sync replicas to http://127.0.0.1:32993/control_collection_shard1_replica_n1/
   [junit4]   2> 1689374 INFO  (qtp117404313-15201) [n:127.0.0.1:32993_ c:control_collection s:shard1  x:control_collection_shard1_replica_n1] o.a.s.c.SyncStrategy Sync Success - now sync replicas to me
   [junit4]   2> 1689374 INFO  (qtp117404313-15201) [n:127.0.0.1:32993_ c:control_collection s:shard1  x:control_collection_shard1_replica_n1] o.a.s.c.SyncStrategy http://127.0.0.1:32993/control_collection_shard1_replica_n1/ has no replicas
   [junit4]   2> 1689375 INFO  (qtp117404313-15201) [n:127.0.0.1:32993_ c:control_collection s:shard1  x:control_collection_shard1_replica_n1] o.a.s.c.ShardLeaderElectionContext I am the new leader: http://127.0.0.1:32993/control_collection_shard1_replica_n1/ shard1
   [junit4]   2> 1689477 INFO  (qtp117404313-15201) [n:127.0.0.1:32993_ c:control_collection s:shard1  x:control_collection_shard1_replica_n1] o.a.s.c.ZkController I am the leader, no recovery necessary
   [junit4]   2> 1689478 INFO  (qtp117404313-15201) [n:127.0.0.1:32993_ c:control_collection s:shard1  x:control_collection_shard1_replica_n1] o.a.s.s.HttpSolrCall [admin] webapp=null path=/admin/cores params={qt=/admin/cores&collection.configName=conf1&newCollection=true&name=control_collection_shard1_replica_n1&action=CREATE&numShards=1&collection=control_collection&shard=shard1&wt=javabin&version=2&replicaType=NRT} status=0 QTime=1251
   [junit4]   2> 1689480 INFO  (qtp117404313-15205) [n:127.0.0.1:32993_    ] o.a.s.h.a.CollectionsHandler Wait for new collection to be active for at most 30 seconds. Check all shard replicas
   [junit4]   2> 1689578 INFO  (zkCallback-4275-thread-1) [    ] o.a.s.c.c.ZkStateReader A cluster state change: [WatchedEvent state:SyncConnected type:NodeDataChanged path:/collections/control_collection/state.json] for collection [control_collection] has occurred - updating... (live nodes size: [1])
   [junit4]   2> 1690122 INFO  (OverseerCollectionConfigSetProcessor-72120081639538692-127.0.0.1:32993_-n_0000000000) [n:127.0.0.1:32993_    ] o.a.s.c.OverseerTaskQueue Response ZK path: /overseer/collection-queue-work/qnr-0000000000 doesn't exist.  Requestor may have disconnected from ZooKeeper
   [junit4]   2> 1690480 INFO  (qtp117404313-15205) [n:127.0.0.1:32993_    ] o.a.s.s.HttpSolrCall [admin] webapp=null path=/admin/collections params={collection.configName=conf1&name=control_collection&nrtReplicas=1&action=CREATE&numShards=1&createNodeSet=127.0.0.1:32993_&wt=javabin&version=2} status=0 QTime=2360
   [junit4]   2> 1690484 INFO  (zkConnectionManagerCallback-4294-thread-1) [    ] o.a.s.c.c.ConnectionManager zkClient has connected
   [junit4]   2> 1690484 INFO  (TEST-RecoveryAfterSoftCommitTest.test-seed#[99EF1701BBE3E4E0]) [    ] o.a.s.c.c.ZkStateReader Updated live nodes from ZooKeeper... (0) -> (1)
   [junit4]   2> 1690485 INFO  (TEST-RecoveryAfterSoftCommitTest.test-seed#[99EF1701BBE3E4E0]) [    ] o.a.s.c.s.i.ZkClientClusterStateProvider Cluster at 127.0.0.1:39337/solr ready
   [junit4]   2> 1690485 INFO  (TEST-RecoveryAfterSoftCommitTest.test-seed#[99EF1701BBE3E4E0]) [    ] o.a.s.c.ChaosMonkey monkey: init - expire sessions:false cause connection loss:false
   [junit4]   2> 1690485 INFO  (SocketProxy-Acceptor-32993) [    ] o.a.s.c.SocketProxy accepted Socket[addr=/127.0.0.1,port=46718,localport=32993], receiveBufferSize:531000
   [junit4]   2> 1690485 INFO  (SocketProxy-Acceptor-32993) [    ] o.a.s.c.SocketProxy proxy connection Socket[addr=/127.0.0.1,port=40527,localport=40490], receiveBufferSize=530904
   [junit4]   2> 1690485 INFO  (qtp117404313-15198) [n:127.0.0.1:32993_    ] o.a.s.h.a.CollectionsHandler Invoked Collection Action :create with params collection.configName=conf1&name=collection1&nrtReplicas=1&action=CREATE&numShards=1&createNodeSet=&stateFormat=2&wt=javabin&version=2 and sendToOCPQueue=true
   [junit4]   2> 1690487 INFO  (OverseerThreadFactory-6530-thread-2-processing-n:127.0.0.1:32993_) [n:127.0.0.1:32993_    ] o.a.s.c.a.c.CreateCollectionCmd Create collection collection1
   [junit4]   2> 1690689 WARN  (OverseerThreadFactory-6530-thread-2-processing-n:127.0.0.1:32993_) [n:127.0.0.1:32993_    ] o.a.s.c.a.c.CreateCollectionCmd It is unusual to create a collection (collection1) without cores.
   [junit4]   2> 1690690 INFO  (qtp117404313-15198) [n:127.0.0.1:32993_    ] o.a.s.h.a.CollectionsHandler Wait for new collection to be active for at most 30 seconds. Check all shard replicas
   [junit4]   2> 1690691 INFO  (qtp117404313-15198) [n:127.0.0.1:32993_    ] o.a.s.s.HttpSolrCall [admin] webapp=null path=/admin/collections params={collection.configName=conf1&name=collection1&nrtReplicas=1&action=CREATE&numShards=1&createNodeSet=&stateFormat=2&wt=javabin&version=2} status=0 QTime=205
   [junit4]   2> 1690751 INFO  (TEST-RecoveryAfterSoftCommitTest.test-seed#[99EF1701BBE3E4E0]) [    ] o.a.s.c.AbstractFullDistribZkTestBase create jetty 1 in directory /home/jenkins/workspace/Lucene-Solr-master-Linux/solr/build/solr-core/test/J1/temp/solr.cloud.RecoveryAfterSoftCommitTest_99EF1701BBE3E4E0-001/shard-1-001 of type TLOG
   [junit4]   2> 1690752 INFO  (TEST-RecoveryAfterSoftCommitTest.test-seed#[99EF1701BBE3E4E0]) [    ] o.e.j.s.Server jetty-9.4.11.v20180605; built: 2018-06-05T18:24:03.829Z; git: d5fc0523cfa96bfebfbda19606cad384d772f04c; jvm 1.8.0_172-b11
   [junit4]   2> 1690752 INFO  (TEST-RecoveryAfterSoftCommitTest.test-seed#[99EF1701BBE3E4E0]) [    ] o.e.j.s.session DefaultSessionIdManager workerName=node0
   [junit4]   2> 1690752 INFO  (TEST-RecoveryAfterSoftCommitTest.test-seed#[99EF1701BBE3E4E0]) [    ] o.e.j.s.session No SessionScavenger set, using defaults
   [junit4]   2> 1690752 INFO  (TEST-RecoveryAfterSoftCommitTest.test-seed#[99EF1701BBE3E4E0]) [    ] o.e.j.s.session node0 Scavenging every 660000ms
   [junit4]   2> 1690752 INFO  (TEST-RecoveryAfterSoftCommitTest.test-seed#[99EF1701BBE3E4E0]) [    ] o.e.j.s.h.ContextHandler Started o.e.j.s.ServletContextHandler@51a5ef12{/,null,AVAILABLE}
   [junit4]   2> 1690753 INFO  (TEST-RecoveryAfterSoftCommitTest.test-seed#[99EF1701BBE3E4E0]) [    ] o.e.j.s.AbstractConnector Started ServerConnector@1e793e9f{HTTP/1.1,[http/1.1]}{127.0.0.1:39693}
   [junit4]   2> 1690753 INFO  (TEST-RecoveryAfterSoftCommitTest.test-seed#[99EF1701BBE3E4E0]) [    ] o.e.j.s.Server Started @1690784ms
   [junit4]   2> 1690753 INFO  (TEST-RecoveryAfterSoftCommitTest.test-seed#[99EF1701BBE3E4E0]) [    ] o.a.s.c.s.e.JettySolrRunner Jetty properties: {solr.data.dir=/home/jenkins/workspace/Lucene-Solr-master-Linux/solr/build/solr-core/test/J1/temp/solr.cloud.RecoveryAfterSoftCommitTest_99EF1701BBE3E4E0-001/tempDir-001/jetty1, replicaType=TLOG, solrconfig=solrconfig.xml, hostContext=/, hostPort=33337, coreRootDirectory=/home/jenkins/workspace/Lucene-Solr-master-Linux/solr/build/solr-core/test/J1/temp/solr.cloud.RecoveryAfterSoftCommitTest_99EF1701BBE3E4E0-001/shard-1-001/cores}
   [junit4]   2> 1690753 ERROR (TEST-RecoveryAfterSoftCommitTest.test-seed#[99EF1701BBE3E4E0]) [    ] o.a.s.u.StartupLoggingUtils Missing Java Option solr.log.dir. Logging may be missing or incomplete.
   [junit4]   2> 1690753 INFO  (TEST-RecoveryAfterSoftCommitTest.test-seed#[99EF1701BBE3E4E0]) [    ] o.a.s.s.SolrDispatchFilter Using logger factory org.apache.logging.slf4j.Log4jLoggerFactory
   [junit4]   2> 1690753 INFO  (TEST-RecoveryAfterSoftCommitTest.test-seed#[99EF1701BBE3E4E0]) [    ] o.a.s.s.SolrDispatchFilter  ___      _       Welcome to Apache Solr? version 8.0.0
   [junit4]   2> 1690753 INFO  (TEST-RecoveryAfterSoftCommitTest.test-seed#[99EF1701BBE3E4E0]) [    ] o.a.s.s.SolrDispatchFilter / __| ___| |_ _   Starting in cloud mode on port null
   [junit4]   2> 1690753 INFO  (TEST-RecoveryAfterSoftCommitTest.test-seed#[99EF1701BBE3E4E0]) [    ] o.a.s.s.SolrDispatchFilter \__ \/ _ \ | '_|  Install dir: null
   [junit4]   2> 1690753 INFO  (TEST-RecoveryAfterSoftCommitTest.test-seed#[99EF1701BBE3E4E0]) [    ] o.a.s.s.SolrDispatchFilter |___/\___/_|_|    Start time: 2018-11-07T08:27:15.925Z
   [junit4]   2> 1690754 INFO  (zkConnectionManagerCallback-4296-thread-1) [    ] o.a.s.c.c.ConnectionManager zkClient has connected
   [junit4]   2> 1690754 INFO  (TEST-RecoveryAfterSoftCommitTest.test-seed#[99EF1701BBE3E4E0]) [    ] o.a.s.s.SolrDispatchFilter Loading solr.xml from SolrHome (not found in ZooKeeper)
   [junit4]   2> 1690754 INFO  (TEST-RecoveryAfterSoftCommitTest.test-seed#[99EF1701BBE3E4E0]) [    ] o.a.s.c.SolrXmlConfig Loading container configuration from /home/jenkins/workspace/Lucene-Solr-master-Linux/solr/build/solr-core/test/J1/temp/solr.cloud.RecoveryAfterSoftCommitTest_99EF1701BBE3E4E0-001/shard-1-001/solr.xml
   [junit4]   2> 1690757 INFO  (TEST-RecoveryAfterSoftCommitTest.test-seed#[99EF1701BBE3E4E0]) [    ] o.a.s.c.SolrXmlConfig Configuration parameter autoReplicaFailoverWorkLoopDelay is ignored
   [junit4]   2> 1690757 INFO  (TEST-RecoveryAfterSoftCommitTest.test-seed#[99EF1701BBE3E4E0]) [    ] o.a.s.c.SolrXmlConfig Configuration parameter autoReplicaFailoverBadNodeExpiration is ignored
   [junit4]   2> 1690758 INFO  (TEST-RecoveryAfterSoftCommitTest.test-seed#[99EF1701BBE3E4E0]) [    ] o.a.s.c.SolrXmlConfig MBean server found: com.sun.jmx.mbeanserver.JmxMBeanServer@11678f60, but no JMX reporters were configured - adding default JMX reporter.
   [junit4]   2> 1690846 INFO  (TEST-RecoveryAfterSoftCommitTest.test-seed#[99EF1701BBE3E4E0]) [    ] o.a.s.c.ZkContainer Zookeeper client=127.0.0.1:39337/solr
   [junit4]   2> 1690847 INFO  (zkConnectionManagerCallback-4300-thread-1) [    ] o.a.s.c.c.ConnectionManager zkClient has connected
   [junit4]   2> 1690848 INFO  (zkConnectionManagerCallback-4302-thread-1) [    ] o.a.s.c.c.ConnectionManager zkClient has connected
   [junit4]   2> 1690851 INFO  (TEST-RecoveryAfterSoftCommitTest.test-seed#[99EF1701BBE3E4E0]) [    ] o.a.s.c.c.ZkStateReader Updated live nodes from ZooKeeper... (0) -> (1)
   [junit4]   2> 1690853 INFO  (TEST-RecoveryAfterSoftCommitTest.test-seed#[99EF1701BBE3E4E0]) [    ] o.a.s.c.TransientSolrCoreCacheDefault Allocating transient cache for 4 transient cores
   [junit4]   2> 1690853 INFO  (TEST-RecoveryAfterSoftCommitTest.test-seed#[99EF1701BBE3E4E0]) [    ] o.a.s.c.ZkController Register node as live in ZooKeeper:/live_nodes/127.0.0.1:33337_
   [junit4]   2> 1690853 INFO  (zkCallback-4275-thread-2) [    ] o.a.s.c.c.ZkStateReader Updated live nodes from ZooKeeper... (1) -> (2)
   [junit4]   2> 1690853 INFO  (zkCallback-4301-thread-1) [    ] o.a.s.c.c.ZkStateReader Updated live nodes from ZooKeeper... (1) -> (2)
   [junit4]   2> 1690853 INFO  (zkCallback-4282-thread-1) [    ] o.a.s.c.c.ZkStateReader Updated live nodes from ZooKeeper... (1) -> (2)
   [junit4]   2> 1690853 INFO  (zkCallback-4293-thread-1) [    ] o.a.s.c.c.ZkStateReader Updated live nodes from ZooKeeper... (1) -> (2)
   [junit4]   2> 1690869 INFO  (zkConnectionManagerCallback-4309-thread-1) [    ] o.a.s.c.c.ConnectionManager zkClient has connected
   [junit4]   2> 1690870 INFO  (TEST-RecoveryAfterSoftCommitTest.test-seed#[99EF1701BBE3E4E0]) [    ] o.a.s.c.c.ZkStateReader Updated live nodes from ZooKeeper... (0) -> (2)
   [junit4]   2> 1690870 INFO  (TEST-RecoveryAfterSoftCommitTest.test-seed#[99EF1701BBE3E4E0]) [    ] o.a.s.c.s.i.ZkClientClusterStateProvider Cluster at 127.0.0.1:39337/solr ready
   [junit4]   2> 1690871 INFO  (TEST-RecoveryAfterSoftCommitTest.test-seed#[99EF1701BBE3E4E0]) [    ] o.a.s.h.a.MetricsHistoryHandler No .system collection, keeping metrics history in memory.
   [junit4]   2> 1690888 INFO  (TEST-RecoveryAfterSoftCommitTest.test-seed#[99EF1701BBE3E4E0]) [    ] o.a.s.m.r.SolrJmxReporter JMX monitoring for 'solr.node' (registry 'solr.node') enabled at server: com.sun.jmx.mbeanserver.JmxMBeanServer@11678f60
   [junit4]   2> 1690900 INFO  (TEST-RecoveryAfterSoftCommitTest.test-seed#[99EF1701BBE3E4E0]) [    ] o.a.s.m.r.SolrJmxReporter JMX monitoring for 'solr.jvm' (registry 'solr.jvm') enabled at server: com.sun.jmx.mbeanserver.JmxMBeanServer@11678f60
   [junit4]   2> 1690900 INFO  (TEST-RecoveryAfterSoftCommitTest.test-seed#[99EF1701BBE3E4E0]) [    ] o.a.s.m.r.SolrJmxReporter JMX monitoring for 'solr.jetty' (registry 'solr.jetty') enabled at server: com.sun.jmx.mbeanserver.JmxMBeanServer@11678f60
   [junit4]   2> 1690902 INFO  (TEST-RecoveryAfterSoftCommitTest.test-seed#[99EF1701BBE3E4E0]) [    ] o.a.s.c.CorePropertiesLocator Found 0 core definitions underneath /home/jenkins/workspace/Lucene-Solr-master-Linux/solr/build/solr-core/test/J1/temp/solr.cloud.RecoveryAfterSoftCommitTest_99EF1701BBE3E4E0-001/shard-1-001/cores
   [junit4]   2> 1690928 INFO  (qtp117404313-15203) [n:127.0.0.1:32993_    ] o.a.s.h.a.CollectionsHandler Invoked Collection Action :addreplica with params node=127.0.0.1:33337_&action=ADDREPLICA&collection=collection1&shard=shard1&type=TLOG&wt=javabin&version=2 and sendToOCPQueue=true
   [junit4]   2> 1690929 INFO  (OverseerCollectionConfigSetProcessor-72120081639538692-127.0.0.1:32993_-n_0000000000) [n:127.0.0.1:32993_    ] o.a.s.c.OverseerTaskQueue Response ZK path: /overseer/collection-queue-work/qnr-0000000002 doesn't exist.  Requestor may have disconnected from ZooKeeper
   [junit4]   2> 1690931 INFO  (qtp117404313-15204) [n:127.0.0.1:32993_    ] o.a.s.s.HttpSolrCall [admin] webapp=null path=/admin/metrics params={wt=javabin&version=2&key=solr.core.control_collection.shard1.replica_n1:INDEX.sizeInBytes} status=0 QTime=0
   [junit4]   2> 1690931 INFO  (qtp117404313-15199) [n:127.0.0.1:32993_    ] o.a.s.s.HttpSolrCall [admin] webapp=null path=/admin/metrics params={prefix=CONTAINER.fs.usableSpace,CONTAINER.fs.totalSpace,CORE.coreName&wt=javabin&version=2&group=solr.node,solr.core} status=0 QTime=0
   [junit4]   2> 1690932 INFO  (SocketProxy-Acceptor-33337) [    ] o.a.s.c.SocketProxy accepted Socket[addr=/127.0.0.1,port=47432,localport=33337], receiveBufferSize:531000
   [junit4]   2> 1690932 INFO  (SocketProxy-Acceptor-33337) [    ] o.a.s.c.SocketProxy proxy connection Socket[addr=/127.0.0.1,port=39693,localport=39404], receiveBufferSize=530904
   [junit4]   2> 1690933 INFO  (qtp641534915-15270) [n:127.0.0.1:33337_    ] o.a.s.s.HttpSolrCall [admin] webapp=null path=/admin/metrics params={prefix=CONTAINER.fs.usableSpace,CONTAINER.fs.totalSpace,CORE.coreName&wt=javabin&version=2&group=solr.node,solr.core} status=0 QTime=0
   [junit4]   2> 1690933 INFO  (OverseerThreadFactory-6530-thread-3-processing-n:127.0.0.1:32993_) [n:127.0.0.1:32993_ c:collection1 s:shard1  ] o.a.s.c.a.c.AddReplicaCmd Node Identified 127.0.0.1:33337_ for creating new replica of shard shard1 for collection collection1
   [junit4]   2> 1690934 INFO  (SocketProxy-Acceptor-33337) [    ] o.a.s.c.SocketProxy accepted Socket[addr=/127.0.0.1,port=47436,localport=33337], receiveBufferSize:531000
   [junit4]   2> 1690935 INFO  (SocketProxy-Acceptor-33337) [    ] o.a.s.c.SocketProxy proxy connection Socket[addr=/127.0.0.1,port=39693,localport=39408], receiveBufferSize=530904
   [junit4]   2> 1690935 INFO  (qtp641534915-15265) [n:127.0.0.1:33337_    x:collection1_shard1_replica_t21] o.a.s.h.a.CoreAdminOperation core create command qt=/admin/cores&collection.configName=conf1&name=collection1_shard1_replica_t21&action=CREATE&collection=collection1&shard=shard1&wt=javabin&version=2&replicaType=TLOG
   [junit4]   2> 1691997 INFO  (qtp641534915-15265) [n:127.0.0.1:33337_ c:collection1 s:shard1  x:collection1_shard1_replica_t21] o.a.s.c.SolrConfig Using Lucene MatchVersion: 8.0.0
   [junit4]   2> 1692004 INFO  (qtp641534915-15265) [n:127.0.0.1:33337_ c:collection1 s:shard1  x:collection1_shard1_replica_t21] o.a.s.s.IndexSchema [collection1_shard1_replica_t21] Schema name=test
   [junit4]   2> 1692077 INFO  (qtp641534915-15265) [n:127.0.0.1:33337_ c:collection1 s:shard1  x:collection1_shard1_replica_t21]

[...truncated too long message...]

mum concurrent data watches above limit:
   [junit4]   2> 
   [junit4]   2> 	8	/solr/clusterstate.json
   [junit4]   2> 	8	/solr/clusterprops.json
   [junit4]   2> 	7	/solr/collections/collection1/state.json
   [junit4]   2> 	3	/solr/autoscaling.json
   [junit4]   2> 
   [junit4]   2> Maximum concurrent children watches above limit:
   [junit4]   2> 
   [junit4]   2> 	8	/solr/live_nodes
   [junit4]   2> 	8	/solr/collections
   [junit4]   2> 	3	/solr/overseer/queue
   [junit4]   2> 	3	/solr/autoscaling/events/.scheduled_maintenance
   [junit4]   2> 	3	/solr/autoscaling/events/.auto_add_replicas
   [junit4]   2> 	3	/solr/overseer/collection-queue-work
   [junit4]   2> 	3	/solr/overseer/queue-work
   [junit4]   2> 
   [junit4]   2> 155393 WARN  (TEST-RecoveryAfterSoftCommitTest.test-seed#[99EF1701BBE3E4E0]) [    ] o.a.s.c.SocketProxy Closing 246 connections to: http://127.0.0.1:33015/, target: http://127.0.0.1:42145/
   [junit4]   2> 155394 WARN  (TEST-RecoveryAfterSoftCommitTest.test-seed#[99EF1701BBE3E4E0]) [    ] o.a.s.c.SocketProxy Closing 3 connections to: http://127.0.0.1:43519/, target: http://127.0.0.1:34147/
   [junit4]   2> 155394 WARN  (TEST-RecoveryAfterSoftCommitTest.test-seed#[99EF1701BBE3E4E0]) [    ] o.a.s.c.SocketProxy Closing 4 connections to: http://127.0.0.1:37739/, target: http://127.0.0.1:42107/
   [junit4]   2> NOTE: reproduce with: ant test  -Dtestcase=RecoveryAfterSoftCommitTest -Dtests.method=test -Dtests.seed=99EF1701BBE3E4E0 -Dtests.multiplier=3 -Dtests.slow=true -Dtests.badapples=true -Dtests.locale=is-IS -Dtests.timezone=Asia/Novokuznetsk -Dtests.asserts=true -Dtests.file.encoding=ISO-8859-1
   [junit4] ERROR   71.1s J0 | RecoveryAfterSoftCommitTest.test <<<
   [junit4]    > Throwable #1: org.apache.solr.client.solrj.SolrServerException: Timeout occured while waiting response from server at: http://127.0.0.1:33015/collection1
   [junit4]    > 	at __randomizedtesting.SeedInfo.seed([99EF1701BBE3E4E0:11BB28DB151F8918]:0)
   [junit4]    > 	at org.apache.solr.client.solrj.impl.HttpSolrClient.executeMethod(HttpSolrClient.java:654)
   [junit4]    > 	at org.apache.solr.client.solrj.impl.HttpSolrClient.request(HttpSolrClient.java:255)
   [junit4]    > 	at org.apache.solr.client.solrj.impl.HttpSolrClient.request(HttpSolrClient.java:244)
   [junit4]    > 	at org.apache.solr.client.solrj.impl.LBHttpSolrClient.doRequest(LBHttpSolrClient.java:483)
   [junit4]    > 	at org.apache.solr.client.solrj.impl.LBHttpSolrClient.request(LBHttpSolrClient.java:413)
   [junit4]    > 	at org.apache.solr.client.solrj.impl.CloudSolrClient.sendRequest(CloudSolrClient.java:1107)
   [junit4]    > 	at org.apache.solr.client.solrj.impl.CloudSolrClient.requestWithRetryOnStaleState(CloudSolrClient.java:884)
   [junit4]    > 	at org.apache.solr.client.solrj.impl.CloudSolrClient.request(CloudSolrClient.java:817)
   [junit4]    > 	at org.apache.solr.client.solrj.SolrClient.request(SolrClient.java:1260)
   [junit4]    > 	at org.apache.solr.cloud.RecoveryAfterSoftCommitTest.test(RecoveryAfterSoftCommitTest.java:87)
   [junit4]    > 	at org.apache.solr.BaseDistributedSearchTestCase$ShardsRepeatRule$ShardsFixedStatement.callStatement(BaseDistributedSearchTestCase.java:1010)
   [junit4]    > 	at org.apache.solr.BaseDistributedSearchTestCase$ShardsRepeatRule$ShardsStatement.evaluate(BaseDistributedSearchTestCase.java:985)
   [junit4]    > 	at java.lang.Thread.run(Thread.java:748)
   [junit4]    > Caused by: java.net.SocketTimeoutException: Read timed out
   [junit4]    > 	at java.net.SocketInputStream.socketRead0(Native Method)
   [junit4]    > 	at java.net.SocketInputStream.socketRead(SocketInputStream.java:116)
   [junit4]    > 	at java.net.SocketInputStream.read(SocketInputStream.java:171)
   [junit4]    > 	at java.net.SocketInputStream.read(SocketInputStream.java:141)
   [junit4]    > 	at org.apache.http.impl.io.SessionInputBufferImpl.streamRead(SessionInputBufferImpl.java:137)
   [junit4]    > 	at org.apache.http.impl.io.SessionInputBufferImpl.fillBuffer(SessionInputBufferImpl.java:153)
   [junit4]    > 	at org.apache.http.impl.io.SessionInputBufferImpl.readLine(SessionInputBufferImpl.java:282)
   [junit4]    > 	at org.apache.http.impl.conn.DefaultHttpResponseParser.parseHead(DefaultHttpResponseParser.java:138)
   [junit4]    > 	at org.apache.http.impl.conn.DefaultHttpResponseParser.parseHead(DefaultHttpResponseParser.java:56)
   [junit4]    > 	at org.apache.http.impl.io.AbstractMessageParser.parse(AbstractMessageParser.java:259)
   [junit4]    > 	at org.apache.http.impl.DefaultBHttpClientConnection.receiveResponseHeader(DefaultBHttpClientConnection.java:163)
   [junit4]    > 	at org.apache.http.impl.conn.CPoolProxy.receiveResponseHeader(CPoolProxy.java:165)
   [junit4]    > 	at org.apache.http.protocol.HttpRequestExecutor.doReceiveResponse(HttpRequestExecutor.java:273)
   [junit4]    > 	at org.apache.http.protocol.HttpRequestExecutor.execute(HttpRequestExecutor.java:125)
   [junit4]    > 	at org.apache.http.impl.execchain.MainClientExec.execute(MainClientExec.java:272)
   [junit4]    > 	at org.apache.http.impl.execchain.ProtocolExec.execute(ProtocolExec.java:185)
   [junit4]    > 	at org.apache.http.impl.execchain.RetryExec.execute(RetryExec.java:89)
   [junit4]    > 	at org.apache.http.impl.execchain.RedirectExec.execute(RedirectExec.java:111)
   [junit4]    > 	at org.apache.http.impl.client.InternalHttpClient.doExecute(InternalHttpClient.java:185)
   [junit4]    > 	at org.apache.http.impl.client.CloseableHttpClient.execute(CloseableHttpClient.java:83)
   [junit4]    > 	at org.apache.http.impl.client.CloseableHttpClient.execute(CloseableHttpClient.java:56)
   [junit4]    > 	at org.apache.solr.client.solrj.impl.HttpSolrClient.executeMethod(HttpSolrClient.java:542)
   [junit4]    > 	... 50 more
   [junit4]   2> NOTE: leaving temporary files on disk at: /home/jenkins/workspace/Lucene-Solr-master-Linux/solr/build/solr-core/test/J0/temp/solr.cloud.RecoveryAfterSoftCommitTest_99EF1701BBE3E4E0-002
   [junit4]   2> Nov 07, 2018 9:02:27 AM com.carrotsearch.randomizedtesting.ThreadLeakControl checkThreadLeaks
   [junit4]   2> WARNING: Will linger awaiting termination of 1 leaked thread(s).
   [junit4]   2> NOTE: test params are: codec=Asserting(Lucene80): {multiDefault=PostingsFormat(name=MockRandom), a_t=PostingsFormat(name=MockRandom), id=FSTOrd50, text=Lucene50(blocksize=128)}, docValues:{range_facet_l_dv=DocValuesFormat(name=Lucene70), _version_=DocValuesFormat(name=Lucene70), intDefault=DocValuesFormat(name=Lucene70), id_i1=DocValuesFormat(name=Lucene70), range_facet_i_dv=DocValuesFormat(name=Direct), intDvoDefault=DocValuesFormat(name=Lucene70), range_facet_l=DocValuesFormat(name=Direct), timestamp=DocValuesFormat(name=Direct)}, maxPointsInLeafNode=1341, maxMBSortInHeap=5.805841098859374, sim=Asserting(org.apache.lucene.search.similarities.AssertingSimilarity@2f5509cd), locale=is-IS, timezone=Asia/Novokuznetsk
   [junit4]   2> NOTE: Linux 4.15.0-38-generic amd64/Oracle Corporation 1.8.0_172 (64-bit)/cpus=8,threads=1,free=423261456,total=518979584
   [junit4]   2> NOTE: All tests run in this JVM: [RecoveryAfterSoftCommitTest, RecoveryAfterSoftCommitTest]
   [junit4] Completed [5/5 (5!)] on J0 in 71.86s, 1 test, 1 error <<< FAILURES!
   [junit4] 
   [junit4] 
   [junit4] Tests with failures [seed: 99EF1701BBE3E4E0]:
   [junit4]   - org.apache.solr.cloud.RecoveryAfterSoftCommitTest.test
   [junit4]   - org.apache.solr.cloud.RecoveryAfterSoftCommitTest.test
   [junit4]   - org.apache.solr.cloud.RecoveryAfterSoftCommitTest.test
   [junit4]   - org.apache.solr.cloud.RecoveryAfterSoftCommitTest.test
   [junit4]   - org.apache.solr.cloud.RecoveryAfterSoftCommitTest.test
   [junit4] 
   [junit4] 
   [junit4] JVM J0:     0.66 ..   156.96 =   156.30s
   [junit4] JVM J1:     0.67 ..    84.87 =    84.21s
   [junit4] JVM J2:     0.83 ..   156.03 =   155.20s
   [junit4] Execution time total: 2 minutes 37 seconds
   [junit4] Tests summary: 5 suites, 5 tests, 5 errors

BUILD FAILED
/home/jenkins/workspace/Lucene-Solr-master-Linux/lucene/common-build.xml:1567: The following error occurred while executing this line:
/home/jenkins/workspace/Lucene-Solr-master-Linux/lucene/common-build.xml:1092: There were test failures: 5 suites, 5 tests, 5 errors [seed: 99EF1701BBE3E4E0]

Total time: 2 minutes 39 seconds

[repro] Setting last failure code to 256

[repro] Failures:
[repro]   5/5 failed: org.apache.solr.client.solrj.impl.CloudSolrClientTest
[repro]   5/5 failed: org.apache.solr.cloud.RecoveryAfterSoftCommitTest
[repro] Exiting with code 256
+ mv lucene/build lucene/build.repro
+ mv solr/build solr/build.repro
+ mv lucene/build.orig lucene/build
+ mv solr/build.orig solr/build
Archiving artifacts
Setting ANT_1_8_2_HOME=/var/lib/jenkins/tools/hudson.tasks.Ant_AntInstallation/ANT_1.8.2
[WARNINGS] Parsing warnings in console log with parser Java Compiler (javac)
Setting ANT_1_8_2_HOME=/var/lib/jenkins/tools/hudson.tasks.Ant_AntInstallation/ANT_1.8.2
Setting ANT_1_8_2_HOME=/var/lib/jenkins/tools/hudson.tasks.Ant_AntInstallation/ANT_1.8.2
<Git Blamer> Using GitBlamer to create author and commit information for all warnings.
<Git Blamer> GIT_COMMIT=9952af099ae65f051056fc8ff55c8e8f4cfb3b93, workspace=/var/lib/jenkins/workspace/Lucene-Solr-master-Linux
[WARNINGS] Computing warning deltas based on reference build #23166
Recording test results
Setting ANT_1_8_2_HOME=/var/lib/jenkins/tools/hudson.tasks.Ant_AntInstallation/ANT_1.8.2
Build step 'Publish JUnit test result report' changed build result to UNSTABLE
Email was triggered for: Unstable (Test Failures)
Sending email for trigger: Unstable (Test Failures)
Setting ANT_1_8_2_HOME=/var/lib/jenkins/tools/hudson.tasks.Ant_AntInstallation/ANT_1.8.2
Setting ANT_1_8_2_HOME=/var/lib/jenkins/tools/hudson.tasks.Ant_AntInstallation/ANT_1.8.2
Setting ANT_1_8_2_HOME=/var/lib/jenkins/tools/hudson.tasks.Ant_AntInstallation/ANT_1.8.2
Setting ANT_1_8_2_HOME=/var/lib/jenkins/tools/hudson.tasks.Ant_AntInstallation/ANT_1.8.2

Mime
View raw message