lucene-dev mailing list archives

Site index · List index
Message view « Date » · « Thread »
Top « Date » · « Thread »
From Policeman Jenkins Server <jenk...@thetaphi.de>
Subject [JENKINS] Lucene-Solr-7.x-Solaris (64bit/jdk1.8.0) - Build # 899 - Still Unstable!
Date Wed, 07 Nov 2018 12:31:46 GMT
Build: https://jenkins.thetaphi.de/job/Lucene-Solr-7.x-Solaris/899/
Java: 64bit/jdk1.8.0 -XX:-UseCompressedOops -XX:+UseConcMarkSweepGC

5 tests failed.
FAILED:  junit.framework.TestSuite.org.apache.solr.handler.extraction.ExtractingRequestHandlerTest

Error Message:
Is some other JVM affected?  Or bad regex? TzDisplayName: ChST

Stack Trace:
java.lang.AssertionError: Is some other JVM affected?  Or bad regex? TzDisplayName: ChST
	at __randomizedtesting.SeedInfo.seed([B4BB8D072ABBC41E]:0)
	at org.junit.Assert.fail(Assert.java:93)
	at org.junit.Assert.assertTrue(Assert.java:43)
	at org.apache.solr.handler.extraction.ExtractingRequestHandlerTest.beforeClass(ExtractingRequestHandlerTest.java:50)
	at sun.reflect.NativeMethodAccessorImpl.invoke0(Native Method)
	at sun.reflect.NativeMethodAccessorImpl.invoke(NativeMethodAccessorImpl.java:62)
	at sun.reflect.DelegatingMethodAccessorImpl.invoke(DelegatingMethodAccessorImpl.java:43)
	at java.lang.reflect.Method.invoke(Method.java:498)
	at com.carrotsearch.randomizedtesting.RandomizedRunner.invoke(RandomizedRunner.java:1742)
	at com.carrotsearch.randomizedtesting.RandomizedRunner$6.evaluate(RandomizedRunner.java:875)
	at com.carrotsearch.randomizedtesting.RandomizedRunner$7.evaluate(RandomizedRunner.java:891)
	at com.carrotsearch.randomizedtesting.rules.StatementAdapter.evaluate(StatementAdapter.java:36)
	at com.carrotsearch.randomizedtesting.rules.SystemPropertiesRestoreRule$1.evaluate(SystemPropertiesRestoreRule.java:57)
	at org.apache.lucene.util.AbstractBeforeAfterRule$1.evaluate(AbstractBeforeAfterRule.java:45)
	at com.carrotsearch.randomizedtesting.rules.StatementAdapter.evaluate(StatementAdapter.java:36)
	at org.apache.lucene.util.TestRuleStoreClassName$1.evaluate(TestRuleStoreClassName.java:41)
	at com.carrotsearch.randomizedtesting.rules.NoShadowingOrOverridesOnMethodsRule$1.evaluate(NoShadowingOrOverridesOnMethodsRule.java:40)
	at com.carrotsearch.randomizedtesting.rules.NoShadowingOrOverridesOnMethodsRule$1.evaluate(NoShadowingOrOverridesOnMethodsRule.java:40)
	at com.carrotsearch.randomizedtesting.rules.StatementAdapter.evaluate(StatementAdapter.java:36)
	at com.carrotsearch.randomizedtesting.rules.StatementAdapter.evaluate(StatementAdapter.java:36)
	at com.carrotsearch.randomizedtesting.rules.StatementAdapter.evaluate(StatementAdapter.java:36)
	at org.apache.lucene.util.TestRuleAssertionsRequired$1.evaluate(TestRuleAssertionsRequired.java:53)
	at org.apache.lucene.util.TestRuleMarkFailure$1.evaluate(TestRuleMarkFailure.java:47)
	at org.apache.lucene.util.TestRuleIgnoreAfterMaxFailures$1.evaluate(TestRuleIgnoreAfterMaxFailures.java:64)
	at org.apache.lucene.util.TestRuleIgnoreTestSuites$1.evaluate(TestRuleIgnoreTestSuites.java:54)
	at com.carrotsearch.randomizedtesting.rules.StatementAdapter.evaluate(StatementAdapter.java:36)
	at com.carrotsearch.randomizedtesting.ThreadLeakControl$StatementRunner.run(ThreadLeakControl.java:368)
	at java.lang.Thread.run(Thread.java:748)


FAILED:  junit.framework.TestSuite.org.apache.solr.handler.extraction.ExtractingRequestHandlerTest

Error Message:
Is some other JVM affected?  Or bad regex? TzDisplayName: ChST

Stack Trace:
java.lang.AssertionError: Is some other JVM affected?  Or bad regex? TzDisplayName: ChST
	at __randomizedtesting.SeedInfo.seed([B4BB8D072ABBC41E]:0)
	at org.junit.Assert.fail(Assert.java:93)
	at org.junit.Assert.assertTrue(Assert.java:43)
	at org.apache.solr.handler.extraction.ExtractingRequestHandlerTest.beforeClass(ExtractingRequestHandlerTest.java:50)
	at sun.reflect.NativeMethodAccessorImpl.invoke0(Native Method)
	at sun.reflect.NativeMethodAccessorImpl.invoke(NativeMethodAccessorImpl.java:62)
	at sun.reflect.DelegatingMethodAccessorImpl.invoke(DelegatingMethodAccessorImpl.java:43)
	at java.lang.reflect.Method.invoke(Method.java:498)
	at com.carrotsearch.randomizedtesting.RandomizedRunner.invoke(RandomizedRunner.java:1742)
	at com.carrotsearch.randomizedtesting.RandomizedRunner$6.evaluate(RandomizedRunner.java:875)
	at com.carrotsearch.randomizedtesting.RandomizedRunner$7.evaluate(RandomizedRunner.java:891)
	at com.carrotsearch.randomizedtesting.rules.StatementAdapter.evaluate(StatementAdapter.java:36)
	at com.carrotsearch.randomizedtesting.rules.SystemPropertiesRestoreRule$1.evaluate(SystemPropertiesRestoreRule.java:57)
	at org.apache.lucene.util.AbstractBeforeAfterRule$1.evaluate(AbstractBeforeAfterRule.java:45)
	at com.carrotsearch.randomizedtesting.rules.StatementAdapter.evaluate(StatementAdapter.java:36)
	at org.apache.lucene.util.TestRuleStoreClassName$1.evaluate(TestRuleStoreClassName.java:41)
	at com.carrotsearch.randomizedtesting.rules.NoShadowingOrOverridesOnMethodsRule$1.evaluate(NoShadowingOrOverridesOnMethodsRule.java:40)
	at com.carrotsearch.randomizedtesting.rules.NoShadowingOrOverridesOnMethodsRule$1.evaluate(NoShadowingOrOverridesOnMethodsRule.java:40)
	at com.carrotsearch.randomizedtesting.rules.StatementAdapter.evaluate(StatementAdapter.java:36)
	at com.carrotsearch.randomizedtesting.rules.StatementAdapter.evaluate(StatementAdapter.java:36)
	at com.carrotsearch.randomizedtesting.rules.StatementAdapter.evaluate(StatementAdapter.java:36)
	at org.apache.lucene.util.TestRuleAssertionsRequired$1.evaluate(TestRuleAssertionsRequired.java:53)
	at org.apache.lucene.util.TestRuleMarkFailure$1.evaluate(TestRuleMarkFailure.java:47)
	at org.apache.lucene.util.TestRuleIgnoreAfterMaxFailures$1.evaluate(TestRuleIgnoreAfterMaxFailures.java:64)
	at org.apache.lucene.util.TestRuleIgnoreTestSuites$1.evaluate(TestRuleIgnoreTestSuites.java:54)
	at com.carrotsearch.randomizedtesting.rules.StatementAdapter.evaluate(StatementAdapter.java:36)
	at com.carrotsearch.randomizedtesting.ThreadLeakControl$StatementRunner.run(ThreadLeakControl.java:368)
	at java.lang.Thread.run(Thread.java:748)


FAILED:  junit.framework.TestSuite.org.apache.solr.handler.extraction.ExtractingRequestHandlerTest

Error Message:
Is some other JVM affected?  Or bad regex? TzDisplayName: ChST

Stack Trace:
java.lang.AssertionError: Is some other JVM affected?  Or bad regex? TzDisplayName: ChST
	at __randomizedtesting.SeedInfo.seed([B4BB8D072ABBC41E]:0)
	at org.junit.Assert.fail(Assert.java:93)
	at org.junit.Assert.assertTrue(Assert.java:43)
	at org.apache.solr.handler.extraction.ExtractingRequestHandlerTest.beforeClass(ExtractingRequestHandlerTest.java:50)
	at sun.reflect.NativeMethodAccessorImpl.invoke0(Native Method)
	at sun.reflect.NativeMethodAccessorImpl.invoke(NativeMethodAccessorImpl.java:62)
	at sun.reflect.DelegatingMethodAccessorImpl.invoke(DelegatingMethodAccessorImpl.java:43)
	at java.lang.reflect.Method.invoke(Method.java:498)
	at com.carrotsearch.randomizedtesting.RandomizedRunner.invoke(RandomizedRunner.java:1742)
	at com.carrotsearch.randomizedtesting.RandomizedRunner$6.evaluate(RandomizedRunner.java:875)
	at com.carrotsearch.randomizedtesting.RandomizedRunner$7.evaluate(RandomizedRunner.java:891)
	at com.carrotsearch.randomizedtesting.rules.StatementAdapter.evaluate(StatementAdapter.java:36)
	at com.carrotsearch.randomizedtesting.rules.SystemPropertiesRestoreRule$1.evaluate(SystemPropertiesRestoreRule.java:57)
	at org.apache.lucene.util.AbstractBeforeAfterRule$1.evaluate(AbstractBeforeAfterRule.java:45)
	at com.carrotsearch.randomizedtesting.rules.StatementAdapter.evaluate(StatementAdapter.java:36)
	at org.apache.lucene.util.TestRuleStoreClassName$1.evaluate(TestRuleStoreClassName.java:41)
	at com.carrotsearch.randomizedtesting.rules.NoShadowingOrOverridesOnMethodsRule$1.evaluate(NoShadowingOrOverridesOnMethodsRule.java:40)
	at com.carrotsearch.randomizedtesting.rules.NoShadowingOrOverridesOnMethodsRule$1.evaluate(NoShadowingOrOverridesOnMethodsRule.java:40)
	at com.carrotsearch.randomizedtesting.rules.StatementAdapter.evaluate(StatementAdapter.java:36)
	at com.carrotsearch.randomizedtesting.rules.StatementAdapter.evaluate(StatementAdapter.java:36)
	at com.carrotsearch.randomizedtesting.rules.StatementAdapter.evaluate(StatementAdapter.java:36)
	at org.apache.lucene.util.TestRuleAssertionsRequired$1.evaluate(TestRuleAssertionsRequired.java:53)
	at org.apache.lucene.util.TestRuleMarkFailure$1.evaluate(TestRuleMarkFailure.java:47)
	at org.apache.lucene.util.TestRuleIgnoreAfterMaxFailures$1.evaluate(TestRuleIgnoreAfterMaxFailures.java:64)
	at org.apache.lucene.util.TestRuleIgnoreTestSuites$1.evaluate(TestRuleIgnoreTestSuites.java:54)
	at com.carrotsearch.randomizedtesting.rules.StatementAdapter.evaluate(StatementAdapter.java:36)
	at com.carrotsearch.randomizedtesting.ThreadLeakControl$StatementRunner.run(ThreadLeakControl.java:368)
	at java.lang.Thread.run(Thread.java:748)


FAILED:  junit.framework.TestSuite.org.apache.solr.handler.extraction.ExtractingRequestHandlerTest

Error Message:
Is some other JVM affected?  Or bad regex? TzDisplayName: ChST

Stack Trace:
java.lang.AssertionError: Is some other JVM affected?  Or bad regex? TzDisplayName: ChST
	at __randomizedtesting.SeedInfo.seed([B4BB8D072ABBC41E]:0)
	at org.junit.Assert.fail(Assert.java:93)
	at org.junit.Assert.assertTrue(Assert.java:43)
	at org.apache.solr.handler.extraction.ExtractingRequestHandlerTest.beforeClass(ExtractingRequestHandlerTest.java:50)
	at sun.reflect.NativeMethodAccessorImpl.invoke0(Native Method)
	at sun.reflect.NativeMethodAccessorImpl.invoke(NativeMethodAccessorImpl.java:62)
	at sun.reflect.DelegatingMethodAccessorImpl.invoke(DelegatingMethodAccessorImpl.java:43)
	at java.lang.reflect.Method.invoke(Method.java:498)
	at com.carrotsearch.randomizedtesting.RandomizedRunner.invoke(RandomizedRunner.java:1742)
	at com.carrotsearch.randomizedtesting.RandomizedRunner$6.evaluate(RandomizedRunner.java:875)
	at com.carrotsearch.randomizedtesting.RandomizedRunner$7.evaluate(RandomizedRunner.java:891)
	at com.carrotsearch.randomizedtesting.rules.StatementAdapter.evaluate(StatementAdapter.java:36)
	at com.carrotsearch.randomizedtesting.rules.SystemPropertiesRestoreRule$1.evaluate(SystemPropertiesRestoreRule.java:57)
	at org.apache.lucene.util.AbstractBeforeAfterRule$1.evaluate(AbstractBeforeAfterRule.java:45)
	at com.carrotsearch.randomizedtesting.rules.StatementAdapter.evaluate(StatementAdapter.java:36)
	at org.apache.lucene.util.TestRuleStoreClassName$1.evaluate(TestRuleStoreClassName.java:41)
	at com.carrotsearch.randomizedtesting.rules.NoShadowingOrOverridesOnMethodsRule$1.evaluate(NoShadowingOrOverridesOnMethodsRule.java:40)
	at com.carrotsearch.randomizedtesting.rules.NoShadowingOrOverridesOnMethodsRule$1.evaluate(NoShadowingOrOverridesOnMethodsRule.java:40)
	at com.carrotsearch.randomizedtesting.rules.StatementAdapter.evaluate(StatementAdapter.java:36)
	at com.carrotsearch.randomizedtesting.rules.StatementAdapter.evaluate(StatementAdapter.java:36)
	at com.carrotsearch.randomizedtesting.rules.StatementAdapter.evaluate(StatementAdapter.java:36)
	at org.apache.lucene.util.TestRuleAssertionsRequired$1.evaluate(TestRuleAssertionsRequired.java:53)
	at org.apache.lucene.util.TestRuleMarkFailure$1.evaluate(TestRuleMarkFailure.java:47)
	at org.apache.lucene.util.TestRuleIgnoreAfterMaxFailures$1.evaluate(TestRuleIgnoreAfterMaxFailures.java:64)
	at org.apache.lucene.util.TestRuleIgnoreTestSuites$1.evaluate(TestRuleIgnoreTestSuites.java:54)
	at com.carrotsearch.randomizedtesting.rules.StatementAdapter.evaluate(StatementAdapter.java:36)
	at com.carrotsearch.randomizedtesting.ThreadLeakControl$StatementRunner.run(ThreadLeakControl.java:368)
	at java.lang.Thread.run(Thread.java:748)


FAILED:  junit.framework.TestSuite.org.apache.solr.handler.extraction.ExtractingRequestHandlerTest

Error Message:
Is some other JVM affected?  Or bad regex? TzDisplayName: ChST

Stack Trace:
java.lang.AssertionError: Is some other JVM affected?  Or bad regex? TzDisplayName: ChST
	at __randomizedtesting.SeedInfo.seed([B4BB8D072ABBC41E]:0)
	at org.junit.Assert.fail(Assert.java:93)
	at org.junit.Assert.assertTrue(Assert.java:43)
	at org.apache.solr.handler.extraction.ExtractingRequestHandlerTest.beforeClass(ExtractingRequestHandlerTest.java:50)
	at sun.reflect.NativeMethodAccessorImpl.invoke0(Native Method)
	at sun.reflect.NativeMethodAccessorImpl.invoke(NativeMethodAccessorImpl.java:62)
	at sun.reflect.DelegatingMethodAccessorImpl.invoke(DelegatingMethodAccessorImpl.java:43)
	at java.lang.reflect.Method.invoke(Method.java:498)
	at com.carrotsearch.randomizedtesting.RandomizedRunner.invoke(RandomizedRunner.java:1742)
	at com.carrotsearch.randomizedtesting.RandomizedRunner$6.evaluate(RandomizedRunner.java:875)
	at com.carrotsearch.randomizedtesting.RandomizedRunner$7.evaluate(RandomizedRunner.java:891)
	at com.carrotsearch.randomizedtesting.rules.StatementAdapter.evaluate(StatementAdapter.java:36)
	at com.carrotsearch.randomizedtesting.rules.SystemPropertiesRestoreRule$1.evaluate(SystemPropertiesRestoreRule.java:57)
	at org.apache.lucene.util.AbstractBeforeAfterRule$1.evaluate(AbstractBeforeAfterRule.java:45)
	at com.carrotsearch.randomizedtesting.rules.StatementAdapter.evaluate(StatementAdapter.java:36)
	at org.apache.lucene.util.TestRuleStoreClassName$1.evaluate(TestRuleStoreClassName.java:41)
	at com.carrotsearch.randomizedtesting.rules.NoShadowingOrOverridesOnMethodsRule$1.evaluate(NoShadowingOrOverridesOnMethodsRule.java:40)
	at com.carrotsearch.randomizedtesting.rules.NoShadowingOrOverridesOnMethodsRule$1.evaluate(NoShadowingOrOverridesOnMethodsRule.java:40)
	at com.carrotsearch.randomizedtesting.rules.StatementAdapter.evaluate(StatementAdapter.java:36)
	at com.carrotsearch.randomizedtesting.rules.StatementAdapter.evaluate(StatementAdapter.java:36)
	at com.carrotsearch.randomizedtesting.rules.StatementAdapter.evaluate(StatementAdapter.java:36)
	at org.apache.lucene.util.TestRuleAssertionsRequired$1.evaluate(TestRuleAssertionsRequired.java:53)
	at org.apache.lucene.util.TestRuleMarkFailure$1.evaluate(TestRuleMarkFailure.java:47)
	at org.apache.lucene.util.TestRuleIgnoreAfterMaxFailures$1.evaluate(TestRuleIgnoreAfterMaxFailures.java:64)
	at org.apache.lucene.util.TestRuleIgnoreTestSuites$1.evaluate(TestRuleIgnoreTestSuites.java:54)
	at com.carrotsearch.randomizedtesting.rules.StatementAdapter.evaluate(StatementAdapter.java:36)
	at com.carrotsearch.randomizedtesting.ThreadLeakControl$StatementRunner.run(ThreadLeakControl.java:368)
	at java.lang.Thread.run(Thread.java:748)




Build Log:
[...truncated 22011 lines...]
   [junit4] Suite: org.apache.solr.handler.extraction.ExtractingRequestHandlerTest
   [junit4]   2> ERROR StatusLogger No Log4j 2 configuration file found. Using default configuration (logging only errors to the console), or user programmatically provided configurations. Set system property 'log4j2.debug' to show Log4j 2 internal initialization logging. See https://logging.apache.org/log4j/2.x/manual/configuration.html for instructions on how to configure Log4j 2
   [junit4]   2> Creating dataDir: /export/home/jenkins/workspace/Lucene-Solr-7.x-Solaris/solr/build/contrib/solr-cell/test/J0/temp/solr.handler.extraction.ExtractingRequestHandlerTest_B4BB8D072ABBC41E-001/init-core-data-001
   [junit4]   2> NOTE: test params are: codec=Asserting(Lucene70): {}, docValues:{}, maxPointsInLeafNode=1995, maxMBSortInHeap=6.255422242273797, sim=RandomSimilarity(queryNorm=false): {}, locale=en-CA, timezone=Pacific/Guam
   [junit4]   2> NOTE: SunOS 5.11 amd64/Oracle Corporation 1.8.0_191 (64-bit)/cpus=3,threads=1,free=70474432,total=97320960
   [junit4]   2> NOTE: All tests run in this JVM: [TestExtractionDateUtil, ExtractingRequestHandlerTest]
   [junit4]   2> NOTE: reproduce with: ant test  -Dtestcase=ExtractingRequestHandlerTest -Dtests.seed=B4BB8D072ABBC41E -Dtests.slow=true -Dtests.locale=en-CA -Dtests.timezone=Pacific/Guam -Dtests.asserts=true -Dtests.file.encoding=UTF-8
   [junit4] ERROR   0.00s J0 | ExtractingRequestHandlerTest (suite) <<<
   [junit4]    > Throwable #1: java.lang.AssertionError: Is some other JVM affected?  Or bad regex? TzDisplayName: ChST
   [junit4]    > 	at __randomizedtesting.SeedInfo.seed([B4BB8D072ABBC41E]:0)
   [junit4]    > 	at org.apache.solr.handler.extraction.ExtractingRequestHandlerTest.beforeClass(ExtractingRequestHandlerTest.java:50)
   [junit4]    > 	at java.lang.Thread.run(Thread.java:748)
   [junit4] Completed [2/4 (1!)] on J0 in 1.34s, 0 tests, 1 failure <<< FAILURES!

[...truncated 42366 lines...]
[asciidoctor:convert] asciidoctor: ERROR: about-this-guide.adoc: line 1: invalid part, must have at least one section (e.g., chapter, appendix, etc.)
[asciidoctor:convert] asciidoctor: ERROR: solr-glossary.adoc: line 1: invalid part, must have at least one section (e.g., chapter, appendix, etc.)
     [java] Processed 2435 links (1987 relative) to 3198 anchors in 247 files
     [echo] Validated Links & Anchors via: /export/home/jenkins/workspace/Lucene-Solr-7.x-Solaris/solr/build/solr-ref-guide/bare-bones-html/

-documentation-lint:
    [jtidy] Checking for broken html (such as invalid tags)...
   [delete] Deleting directory /export/home/jenkins/workspace/Lucene-Solr-7.x-Solaris/lucene/build/jtidy_tmp
     [echo] Checking for broken links...
     [exec] 
     [exec] Crawl/parse...
     [exec] 
     [exec] Verify...
     [echo] Checking for malformed docs...

jar-checksums:

resolve:

ivy-availability-check:
[loadresource] Do not set property disallowed.ivy.jars.list as its length is 0.

-ivy-fail-disallowed-ivy-version:

ivy-fail:

ivy-configure:
[ivy:configure] :: loading settings :: file = /export/home/jenkins/workspace/Lucene-Solr-7.x-Solaris/lucene/top-level-ivy-settings.xml

resolve:

ivy-availability-check:
[loadresource] Do not set property disallowed.ivy.jars.list as its length is 0.

-ivy-fail-disallowed-ivy-version:

ivy-fail:

ivy-configure:
[ivy:configure] :: loading settings :: file = /export/home/jenkins/workspace/Lucene-Solr-7.x-Solaris/lucene/top-level-ivy-settings.xml

resolve:

resolve:

ivy-availability-check:
[loadresource] Do not set property disallowed.ivy.jars.list as its length is 0.

-ivy-fail-disallowed-ivy-version:

ivy-fail:

ivy-configure:
[ivy:configure] :: loading settings :: file = /export/home/jenkins/workspace/Lucene-Solr-7.x-Solaris/lucene/top-level-ivy-settings.xml

resolve:

ivy-availability-check:
[loadresource] Do not set property disallowed.ivy.jars.list as its length is 0.

-ivy-fail-disallowed-ivy-version:

ivy-fail:

ivy-configure:
[ivy:configure] :: loading settings :: file = /export/home/jenkins/workspace/Lucene-Solr-7.x-Solaris/lucene/top-level-ivy-settings.xml

resolve:

ivy-availability-check:
[loadresource] Do not set property disallowed.ivy.jars.list as its length is 0.

-ivy-fail-disallowed-ivy-version:

ivy-fail:

ivy-configure:
[ivy:configure] :: loading settings :: file = /export/home/jenkins/workspace/Lucene-Solr-7.x-Solaris/lucene/top-level-ivy-settings.xml

resolve:

ivy-availability-check:
[loadresource] Do not set property disallowed.ivy.jars.list as its length is 0.

-ivy-fail-disallowed-ivy-version:

ivy-fail:

ivy-configure:
[ivy:configure] :: loading settings :: file = /export/home/jenkins/workspace/Lucene-Solr-7.x-Solaris/lucene/top-level-ivy-settings.xml

resolve:

ivy-availability-check:
[loadresource] Do not set property disallowed.ivy.jars.list as its length is 0.

-ivy-fail-disallowed-ivy-version:

ivy-fail:

ivy-configure:
[ivy:configure] :: loading settings :: file = /export/home/jenkins/workspace/Lucene-Solr-7.x-Solaris/lucene/top-level-ivy-settings.xml

resolve:

ivy-availability-check:
[loadresource] Do not set property disallowed.ivy.jars.list as its length is 0.

-ivy-fail-disallowed-ivy-version:

ivy-fail:

ivy-configure:
[ivy:configure] :: loading settings :: file = /export/home/jenkins/workspace/Lucene-Solr-7.x-Solaris/lucene/top-level-ivy-settings.xml

resolve:

ivy-availability-check:
[loadresource] Do not set property disallowed.ivy.jars.list as its length is 0.

-ivy-fail-disallowed-ivy-version:

ivy-fail:

ivy-configure:
[ivy:configure] :: loading settings :: file = /export/home/jenkins/workspace/Lucene-Solr-7.x-Solaris/lucene/top-level-ivy-settings.xml

resolve:

ivy-availability-check:
[loadresource] Do not set property disallowed.ivy.jars.list as its length is 0.

-ivy-fail-disallowed-ivy-version:

ivy-fail:

ivy-configure:
[ivy:configure] :: loading settings :: file = /export/home/jenkins/workspace/Lucene-Solr-7.x-Solaris/lucene/top-level-ivy-settings.xml

resolve:

ivy-availability-check:
[loadresource] Do not set property disallowed.ivy.jars.list as its length is 0.

-ivy-fail-disallowed-ivy-version:

ivy-fail:

ivy-configure:
[ivy:configure] :: loading settings :: file = /export/home/jenkins/workspace/Lucene-Solr-7.x-Solaris/lucene/top-level-ivy-settings.xml

resolve:

ivy-availability-check:
[loadresource] Do not set property disallowed.ivy.jars.list as its length is 0.

-ivy-fail-disallowed-ivy-version:

ivy-fail:

ivy-configure:
[ivy:configure] :: loading settings :: file = /export/home/jenkins/workspace/Lucene-Solr-7.x-Solaris/lucene/top-level-ivy-settings.xml

resolve:

ivy-availability-check:
[loadresource] Do not set property disallowed.ivy.jars.list as its length is 0.

-ivy-fail-disallowed-ivy-version:

ivy-fail:

ivy-configure:
[ivy:configure] :: loading settings :: file = /export/home/jenkins/workspace/Lucene-Solr-7.x-Solaris/lucene/top-level-ivy-settings.xml

resolve:

ivy-availability-check:
[loadresource] Do not set property disallowed.ivy.jars.list as its length is 0.

-ivy-fail-disallowed-ivy-version:

ivy-fail:

ivy-configure:
[ivy:configure] :: loading settings :: file = /export/home/jenkins/workspace/Lucene-Solr-7.x-Solaris/lucene/top-level-ivy-settings.xml

resolve:

ivy-availability-check:
[loadresource] Do not set property disallowed.ivy.jars.list as its length is 0.

-ivy-fail-disallowed-ivy-version:

ivy-fail:

ivy-configure:
[ivy:configure] :: loading settings :: file = /export/home/jenkins/workspace/Lucene-Solr-7.x-Solaris/lucene/top-level-ivy-settings.xml

resolve:

ivy-availability-check:
[loadresource] Do not set property disallowed.ivy.jars.list as its length is 0.

-ivy-fail-disallowed-ivy-version:

ivy-fail:

ivy-configure:
[ivy:configure] :: loading settings :: file = /export/home/jenkins/workspace/Lucene-Solr-7.x-Solaris/lucene/top-level-ivy-settings.xml

resolve:

ivy-availability-check:
[loadresource] Do not set property disallowed.ivy.jars.list as its length is 0.

-ivy-fail-disallowed-ivy-version:

ivy-fail:

ivy-configure:
[ivy:configure] :: loading settings :: file = /export/home/jenkins/workspace/Lucene-Solr-7.x-Solaris/lucene/top-level-ivy-settings.xml

resolve:

ivy-availability-check:
[loadresource] Do not set property disallowed.ivy.jars.list as its length is 0.

-ivy-fail-disallowed-ivy-version:

ivy-fail:

ivy-configure:
[ivy:configure] :: loading settings :: file = /export/home/jenkins/workspace/Lucene-Solr-7.x-Solaris/lucene/top-level-ivy-settings.xml

resolve:

ivy-availability-check:
[loadresource] Do not set property disallowed.ivy.jars.list as its length is 0.

-ivy-fail-disallowed-ivy-version:

ivy-fail:

ivy-configure:
[ivy:configure] :: loading settings :: file = /export/home/jenkins/workspace/Lucene-Solr-7.x-Solaris/lucene/top-level-ivy-settings.xml

resolve:

ivy-availability-check:
[loadresource] Do not set property disallowed.ivy.jars.list as its length is 0.

-ivy-fail-disallowed-ivy-version:

ivy-fail:

ivy-configure:
[ivy:configure] :: loading settings :: file = /export/home/jenkins/workspace/Lucene-Solr-7.x-Solaris/lucene/top-level-ivy-settings.xml

resolve:

ivy-availability-check:
[loadresource] Do not set property disallowed.ivy.jars.list as its length is 0.

-ivy-fail-disallowed-ivy-version:

ivy-fail:

ivy-configure:
[ivy:configure] :: loading settings :: file = /export/home/jenkins/workspace/Lucene-Solr-7.x-Solaris/lucene/top-level-ivy-settings.xml

resolve:

ivy-availability-check:
[loadresource] Do not set property disallowed.ivy.jars.list as its length is 0.

-ivy-fail-disallowed-ivy-version:

ivy-fail:

ivy-configure:
[ivy:configure] :: loading settings :: file = /export/home/jenkins/workspace/Lucene-Solr-7.x-Solaris/lucene/top-level-ivy-settings.xml

resolve:

ivy-availability-check:
[loadresource] Do not set property disallowed.ivy.jars.list as its length is 0.

-ivy-fail-disallowed-ivy-version:

ivy-fail:

ivy-configure:
[ivy:configure] :: loading settings :: file = /export/home/jenkins/workspace/Lucene-Solr-7.x-Solaris/lucene/top-level-ivy-settings.xml

resolve:

ivy-availability-check:
[loadresource] Do not set property disallowed.ivy.jars.list as its length is 0.

-ivy-fail-disallowed-ivy-version:

ivy-fail:

ivy-configure:
[ivy:configure] :: loading settings :: file = /export/home/jenkins/workspace/Lucene-Solr-7.x-Solaris/lucene/top-level-ivy-settings.xml

resolve:

ivy-availability-check:
[loadresource] Do not set property disallowed.ivy.jars.list as its length is 0.

-ivy-fail-disallowed-ivy-version:

ivy-fail:

ivy-configure:
[ivy:configure] :: loading settings :: file = /export/home/jenkins/workspace/Lucene-Solr-7.x-Solaris/lucene/top-level-ivy-settings.xml

resolve:

ivy-availability-check:
[loadresource] Do not set property disallowed.ivy.jars.list as its length is 0.

-ivy-fail-disallowed-ivy-version:

ivy-fail:

ivy-configure:
[ivy:configure] :: loading settings :: file = /export/home/jenkins/workspace/Lucene-Solr-7.x-Solaris/lucene/top-level-ivy-settings.xml

common.resolve:

resolve:

ivy-availability-check:
[loadresource] Do not set property disallowed.ivy.jars.list as its length is 0.

-ivy-fail-disallowed-ivy-version:

ivy-fail:

ivy-configure:
[ivy:configure] :: loading settings :: file = /export/home/jenkins/workspace/Lucene-Solr-7.x-Solaris/lucene/top-level-ivy-settings.xml

resolve:

ivy-availability-check:
[loadresource] Do not set property disallowed.ivy.jars.list as its length is 0.

-ivy-fail-disallowed-ivy-version:

ivy-fail:

ivy-configure:
[ivy:configure] :: loading settings :: file = /export/home/jenkins/workspace/Lucene-Solr-7.x-Solaris/lucene/top-level-ivy-settings.xml

resolve:

ivy-availability-check:
[loadresource] Do not set property disallowed.ivy.jars.list as its length is 0.

-ivy-fail-disallowed-ivy-version:

ivy-fail:

ivy-configure:
[ivy:configure] :: loading settings :: file = /export/home/jenkins/workspace/Lucene-Solr-7.x-Solaris/lucene/top-level-ivy-settings.xml

resolve:

ivy-availability-check:
[loadresource] Do not set property disallowed.ivy.jars.list as its length is 0.

-ivy-fail-disallowed-ivy-version:

ivy-fail:

ivy-configure:
[ivy:configure] :: loading settings :: file = /export/home/jenkins/workspace/Lucene-Solr-7.x-Solaris/lucene/top-level-ivy-settings.xml

resolve:

ivy-availability-check:
[loadresource] Do not set property disallowed.ivy.jars.list as its length is 0.

-ivy-fail-disallowed-ivy-version:

ivy-fail:

ivy-configure:
[ivy:configure] :: loading settings :: file = /export/home/jenkins/workspace/Lucene-Solr-7.x-Solaris/lucene/top-level-ivy-settings.xml

resolve:

jar-checksums:
    [mkdir] Created dir: /export/home/jenkins/workspace/Lucene-Solr-7.x-Solaris/lucene/null547290858
     [copy] Copying 35 files to /export/home/jenkins/workspace/Lucene-Solr-7.x-Solaris/lucene/null547290858
   [delete] Deleting directory /export/home/jenkins/workspace/Lucene-Solr-7.x-Solaris/lucene/null547290858

resolve-example:

ivy-availability-check:
[loadresource] Do not set property disallowed.ivy.jars.list as its length is 0.

-ivy-fail-disallowed-ivy-version:

ivy-fail:

ivy-configure:
[ivy:configure] :: loading settings :: file = /export/home/jenkins/workspace/Lucene-Solr-7.x-Solaris/lucene/top-level-ivy-settings.xml

resolve:

resolve-server:

ivy-availability-check:
[loadresource] Do not set property disallowed.ivy.jars.list as its length is 0.

-ivy-fail-disallowed-ivy-version:

ivy-fail:

ivy-fail:

ivy-configure:
[ivy:configure] :: loading settings :: file = /export/home/jenkins/workspace/Lucene-Solr-7.x-Solaris/lucene/top-level-ivy-settings.xml

resolve:

resolve:

ivy-availability-check:
[loadresource] Do not set property disallowed.ivy.jars.list as its length is 0.

-ivy-fail-disallowed-ivy-version:

ivy-fail:

ivy-fail:

ivy-configure:
[ivy:configure] :: loading settings :: file = /export/home/jenkins/workspace/Lucene-Solr-7.x-Solaris/lucene/top-level-ivy-settings.xml

resolve:

ivy-availability-check:
[loadresource] Do not set property disallowed.ivy.jars.list as its length is 0.

-ivy-fail-disallowed-ivy-version:

ivy-fail:

ivy-fail:

ivy-configure:
[ivy:configure] :: loading settings :: file = /export/home/jenkins/workspace/Lucene-Solr-7.x-Solaris/lucene/top-level-ivy-settings.xml

resolve:

ivy-availability-check:
[loadresource] Do not set property disallowed.ivy.jars.list as its length is 0.

-ivy-fail-disallowed-ivy-version:

ivy-fail:

ivy-configure:
[ivy:configure] :: loading settings :: file = /export/home/jenkins/workspace/Lucene-Solr-7.x-Solaris/lucene/top-level-ivy-settings.xml

resolve:

ivy-availability-check:
[loadresource] Do not set property disallowed.ivy.jars.list as its length is 0.

-ivy-fail-disallowed-ivy-version:

ivy-fail:

ivy-fail:

ivy-configure:
[ivy:configure] :: loading settings :: file = /export/home/jenkins/workspace/Lucene-Solr-7.x-Solaris/lucene/top-level-ivy-settings.xml

resolve:

ivy-availability-check:
[loadresource] Do not set property disallowed.ivy.jars.list as its length is 0.

-ivy-fail-disallowed-ivy-version:

ivy-fail:

ivy-configure:
[ivy:configure] :: loading settings :: file = /export/home/jenkins/workspace/Lucene-Solr-7.x-Solaris/lucene/top-level-ivy-settings.xml

resolve:

ivy-availability-check:
[loadresource] Do not set property disallowed.ivy.jars.list as its length is 0.

-ivy-fail-disallowed-ivy-version:

ivy-fail:

ivy-fail:

ivy-configure:
[ivy:configure] :: loading settings :: file = /export/home/jenkins/workspace/Lucene-Solr-7.x-Solaris/lucene/top-level-ivy-settings.xml

resolve:

ivy-availability-check:
[loadresource] Do not set property disallowed.ivy.jars.list as its length is 0.

-ivy-fail-disallowed-ivy-version:

ivy-fail:

ivy-fail:

ivy-configure:
[ivy:configure] :: loading settings :: file = /export/home/jenkins/workspace/Lucene-Solr-7.x-Solaris/lucene/top-level-ivy-settings.xml

resolve:

ivy-availability-check:
[loadresource] Do not set property disallowed.ivy.jars.list as its length is 0.

-ivy-fail-disallowed-ivy-version:

ivy-fail:

ivy-fail:

ivy-configure:
[ivy:configure] :: loading settings :: file = /export/home/jenkins/workspace/Lucene-Solr-7.x-Solaris/lucene/top-level-ivy-settings.xml

resolve:

ivy-availability-check:
[loadresource] Do not set property disallowed.ivy.jars.list as its length is 0.

-ivy-fail-disallowed-ivy-version:

ivy-fail:

ivy-fail:

ivy-configure:
[ivy:configure] :: loading settings :: file = /export/home/jenkins/workspace/Lucene-Solr-7.x-Solaris/lucene/top-level-ivy-settings.xml

resolve:

ivy-availability-check:
[loadresource] Do not set property disallowed.ivy.jars.list as its length is 0.

-ivy-fail-disallowed-ivy-version:

ivy-fail:

ivy-fail:

ivy-configure:
[ivy:configure] :: loading settings :: file = /export/home/jenkins/workspace/Lucene-Solr-7.x-Solaris/lucene/top-level-ivy-settings.xml

resolve:

ivy-availability-check:
[loadresource] Do not set property disallowed.ivy.jars.list as its length is 0.

-ivy-fail-disallowed-ivy-version:

ivy-fail:

ivy-fail:

ivy-configure:
[ivy:configure] :: loading settings :: file = /export/home/jenkins/workspace/Lucene-Solr-7.x-Solaris/lucene/top-level-ivy-settings.xml

resolve:

ivy-availability-check:
[loadresource] Do not set property disallowed.ivy.jars.list as its length is 0.

-ivy-fail-disallowed-ivy-version:

ivy-fail:

ivy-fail:

ivy-configure:
[ivy:configure] :: loading settings :: file = /export/home/jenkins/workspace/Lucene-Solr-7.x-Solaris/lucene/top-level-ivy-settings.xml

resolve:

ivy-availability-check:
[loadresource] Do not set property disallowed.ivy.jars.list as its length is 0.

-ivy-fail-disallowed-ivy-version:

ivy-fail:

ivy-fail:

ivy-configure:
[ivy:configure] :: loading settings :: file = /export/home/jenkins/workspace/Lucene-Solr-7.x-Solaris/lucene/top-level-ivy-settings.xml

resolve:

ivy-availability-check:
[loadresource] Do not set property disallowed.ivy.jars.list as its length is 0.

-ivy-fail-disallowed-ivy-version:

ivy-fail:

ivy-fail:

ivy-configure:
[ivy:configure] :: loading settings :: file = /export/home/jenkins/workspace/Lucene-Solr-7.x-Solaris/lucene/top-level-ivy-settings.xml

resolve:

ivy-availability-check:
[loadresource] Do not set property disallowed.ivy.jars.list as its length is 0.

-ivy-fail-disallowed-ivy-version:

ivy-fail:

ivy-fail:

ivy-configure:
[ivy:configure] :: loading settings :: file = /export/home/jenkins/workspace/Lucene-Solr-7.x-Solaris/lucene/top-level-ivy-settings.xml

resolve:

jar-checksums:
    [mkdir] Created dir: /export/home/jenkins/workspace/Lucene-Solr-7.x-Solaris/solr/null1587454285
     [copy] Copying 241 files to /export/home/jenkins/workspace/Lucene-Solr-7.x-Solaris/solr/null1587454285
   [delete] Deleting directory /export/home/jenkins/workspace/Lucene-Solr-7.x-Solaris/solr/null1587454285

check-working-copy:
[ivy:cachepath] :: resolving dependencies :: org.eclipse.jgit#org.eclipse.jgit-caller;working
[ivy:cachepath] 	confs: [default]
[ivy:cachepath] 	found org.eclipse.jgit#org.eclipse.jgit;4.6.0.201612231935-r in public
[ivy:cachepath] 	found com.jcraft#jsch;0.1.53 in public
[ivy:cachepath] 	found com.googlecode.javaewah#JavaEWAH;1.1.6 in public
[ivy:cachepath] 	found org.apache.httpcomponents#httpclient;4.3.6 in public
[ivy:cachepath] 	found org.apache.httpcomponents#httpcore;4.3.3 in public
[ivy:cachepath] 	found commons-logging#commons-logging;1.1.3 in public
[ivy:cachepath] 	found commons-codec#commons-codec;1.6 in public
[ivy:cachepath] 	found org.slf4j#slf4j-api;1.7.2 in public
[ivy:cachepath] :: resolution report :: resolve 34ms :: artifacts dl 3ms
	---------------------------------------------------------------------
	|                  |            modules            ||   artifacts   |
	|       conf       | number| search|dwnlded|evicted|| number|dwnlded|
	---------------------------------------------------------------------
	|      default     |   8   |   0   |   0   |   0   ||   8   |   0   |
	---------------------------------------------------------------------
[wc-checker] Initializing working copy...
[wc-checker] SLF4J: Failed to load class "org.slf4j.impl.StaticLoggerBinder".
[wc-checker] SLF4J: Defaulting to no-operation (NOP) logger implementation
[wc-checker] SLF4J: See http://www.slf4j.org/codes.html#StaticLoggerBinder for further details.
[wc-checker] Checking working copy status...

-jenkins-base:

BUILD SUCCESSFUL
Total time: 105 minutes 29 seconds
Setting ANT_1_8_2_HOME=/export/home/jenkins/tools/hudson.tasks.Ant_AntInstallation/ANT_1.8.2
[Lucene-Solr-7.x-Solaris] $ /bin/sh -xe /var/tmp/jenkins1330670635419958230.sh
+ mv lucene/build lucene/build.orig
+ mv solr/build solr/build.orig
+ ANT_HOME=/export/home/jenkins/tools/hudson.tasks.Ant_AntInstallation/ANT_1.8.2
+ export ANT_HOME
+ PATH=/export/home/jenkins/tools/hudson.tasks.Ant_AntInstallation/ANT_1.8.2/bin:/export/home/jenkins/tools/java/64bit/jdk1.8.0/bin:/usr/bin:/usr/sbin
+ export PATH
+ python3.4 -u dev-tools/scripts/reproduceJenkinsFailures.py --no-git https://jenkins.thetaphi.de/job/Lucene-Solr-7.x-Solaris/899/consoleText
[repro] Jenkins log URL: https://jenkins.thetaphi.de/job/Lucene-Solr-7.x-Solaris/899/consoleText

[repro] Revision: d214f968d765e5c30c8782c5545c38d9aef487fe

[repro] Ant options: "-Dargs=-XX:-UseCompressedOops -XX:+UseConcMarkSweepGC"
[repro] Repro line:  ant test  -Dtestcase=ExtractingRequestHandlerTest -Dtests.seed=B4BB8D072ABBC41E -Dtests.slow=true -Dtests.locale=en-CA -Dtests.timezone=Pacific/Guam -Dtests.asserts=true -Dtests.file.encoding=UTF-8

[repro] ant clean
Buildfile: /export/home/jenkins/workspace/Lucene-Solr-7.x-Solaris/build.xml

clean:

clean:

clean:

BUILD SUCCESSFUL
Total time: 0 seconds
[repro] Test suites by module:
[repro]    solr/contrib/extraction
[repro]       ExtractingRequestHandlerTest
[repro] ant compile-test
Buildfile: /export/home/jenkins/workspace/Lucene-Solr-7.x-Solaris/solr/contrib/extraction/build.xml

compile-solr-test-framework:

ivy-availability-check:
[loadresource] Do not set property disallowed.ivy.jars.list as its length is 0.

-ivy-fail-disallowed-ivy-version:

ivy-fail:

ivy-configure:
[ivy:configure] :: Apache Ivy 2.4.0 - 20141213170938 :: http://ant.apache.org/ivy/ ::
[ivy:configure] :: loading settings :: file = /export/home/jenkins/workspace/Lucene-Solr-7.x-Solaris/lucene/top-level-ivy-settings.xml

resolve:

-clover.disable:

-clover.load:

-clover.classpath:

-clover.setup:

clover:

compile-solr-core:

compile-solrj:

ivy-availability-check:
[loadresource] Do not set property disallowed.ivy.jars.list as its length is 0.

-ivy-fail-disallowed-ivy-version:

ivy-fail:

ivy-configure:
[ivy:configure] :: loading settings :: file = /export/home/jenkins/workspace/Lucene-Solr-7.x-Solaris/lucene/top-level-ivy-settings.xml

resolve-groovy:
[ivy:cachepath] :: resolving dependencies :: org.codehaus.groovy#groovy-all-caller;working
[ivy:cachepath] 	confs: [default]
[ivy:cachepath] 	found org.codehaus.groovy#groovy-all;2.4.15 in public
[ivy:cachepath] :: resolution report :: resolve 15ms :: artifacts dl 1ms
	---------------------------------------------------------------------
	|                  |            modules            ||   artifacts   |
	|       conf       | number| search|dwnlded|evicted|| number|dwnlded|
	---------------------------------------------------------------------
	|      default     |   1   |   0   |   0   |   0   ||   1   |   0   |
	---------------------------------------------------------------------

check-lucene-core-uptodate:

jar-lucene-core:

-mrjar-classes-uptodate:

ivy-availability-check:
[loadresource] Do not set property disallowed.ivy.jars.list as its length is 0.

-ivy-fail-disallowed-ivy-version:

ivy-fail:

ivy-configure:
[ivy:configure] :: loading settings :: file = /export/home/jenkins/workspace/Lucene-Solr-7.x-Solaris/lucene/top-level-ivy-settings.xml

resolve-groovy:

-check-git-state:

-git-cleanroot:

-copy-git-state:
     [copy] Copying 1 file to /export/home/jenkins/workspace/Lucene-Solr-7.x-Solaris/lucene/build

git-autoclean:

resolve:

init:

-clover.disable:

-clover.load:

-clover.classpath:

-clover.setup:

clover:

compile-core:
    [mkdir] Created dir: /export/home/jenkins/workspace/Lucene-Solr-7.x-Solaris/lucene/build/core/classes/java
    [javac] Compiling 858 source files to /export/home/jenkins/workspace/Lucene-Solr-7.x-Solaris/lucene/build/core/classes/java
    [javac] Note: Some input files use or override a deprecated API.
    [javac] Note: Recompile with -Xlint:deprecation for details.
    [javac] Creating empty /export/home/jenkins/workspace/Lucene-Solr-7.x-Solaris/lucene/build/core/classes/java/org/apache/lucene/util/graph/package-info.class
    [javac] Creating empty /export/home/jenkins/workspace/Lucene-Solr-7.x-Solaris/lucene/build/core/classes/java/org/apache/lucene/document/package-info.class
    [javac] Creating empty /export/home/jenkins/workspace/Lucene-Solr-7.x-Solaris/lucene/build/core/classes/java/org/apache/lucene/package-info.class
    [javac] Creating empty /export/home/jenkins/workspace/Lucene-Solr-7.x-Solaris/lucene/build/core/classes/java/org/apache/lucene/util/bkd/package-info.class
    [javac] Creating empty /export/home/jenkins/workspace/Lucene-Solr-7.x-Solaris/lucene/build/core/classes/java/org/apache/lucene/codecs/compressing/package-info.class
    [javac] Creating empty /export/home/jenkins/workspace/Lucene-Solr-7.x-Solaris/lucene/build/core/classes/java/org/apache/lucene/codecs/lucene60/package-info.class
    [javac] Creating empty /export/home/jenkins/workspace/Lucene-Solr-7.x-Solaris/lucene/build/core/classes/java/org/apache/lucene/codecs/package-info.class
    [javac] Creating empty /export/home/jenkins/workspace/Lucene-Solr-7.x-Solaris/lucene/build/core/classes/java/org/apache/lucene/util/package-info.class
    [javac] Creating empty /export/home/jenkins/workspace/Lucene-Solr-7.x-Solaris/lucene/build/core/classes/java/org/apache/lucene/index/package-info.class
    [javac] Creating empty /export/home/jenkins/workspace/Lucene-Solr-7.x-Solaris/lucene/build/core/classes/java/org/apache/lucene/util/fst/package-info.class
    [javac] Creating empty /export/home/jenkins/workspace/Lucene-Solr-7.x-Solaris/lucene/build/core/classes/java/org/apache/lucene/analysis/tokenattributes/package-info.class
    [javac] Creating empty /export/home/jenkins/workspace/Lucene-Solr-7.x-Solaris/lucene/build/core/classes/java/org/apache/lucene/search/package-info.class
    [javac] Creating empty /export/home/jenkins/workspace/Lucene-Solr-7.x-Solaris/lucene/build/core/classes/java/org/apache/lucene/codecs/lucene62/package-info.class
    [javac] Creating empty /export/home/jenkins/workspace/Lucene-Solr-7.x-Solaris/lucene/build/core/classes/java/org/apache/lucene/util/packed/package-info.class
    [javac] Creating empty /export/home/jenkins/workspace/Lucene-Solr-7.x-Solaris/lucene/build/core/classes/java/org/apache/lucene/util/mutable/package-info.class
    [javac] Creating empty /export/home/jenkins/workspace/Lucene-Solr-7.x-Solaris/lucene/build/core/classes/java/org/apache/lucene/codecs/lucene70/package-info.class
    [javac] Creating empty /export/home/jenkins/workspace/Lucene-Solr-7.x-Solaris/lucene/build/core/classes/java/org/apache/lucene/codecs/perfield/package-info.class
    [javac] Creating empty /export/home/jenkins/workspace/Lucene-Solr-7.x-Solaris/lucene/build/core/classes/java/org/apache/lucene/analysis/package-info.class
    [javac] Creating empty /export/home/jenkins/workspace/Lucene-Solr-7.x-Solaris/lucene/build/core/classes/java/org/apache/lucene/analysis/standard/package-info.class
    [javac] Creating empty /export/home/jenkins/workspace/Lucene-Solr-7.x-Solaris/lucene/build/core/classes/java/org/apache/lucene/store/package-info.class
    [javac] Creating empty /export/home/jenkins/workspace/Lucene-Solr-7.x-Solaris/lucene/build/core/classes/java/org/apache/lucene/codecs/blocktree/package-info.class
    [javac] Creating empty /export/home/jenkins/workspace/Lucene-Solr-7.x-Solaris/lucene/build/core/classes/java/org/apache/lucene/search/spans/package-info.class
    [javac] Creating empty /export/home/jenkins/workspace/Lucene-Solr-7.x-Solaris/lucene/build/core/classes/java/org/apache/lucene/search/similarities/package-info.class
    [javac] Creating empty /export/home/jenkins/workspace/Lucene-Solr-7.x-Solaris/lucene/build/core/classes/java/org/apache/lucene/util/automaton/package-info.class
    [javac] Creating empty /export/home/jenkins/workspace/Lucene-Solr-7.x-Solaris/lucene/build/core/classes/java/org/apache/lucene/codecs/lucene50/package-info.class
    [javac] Creating empty /export/home/jenkins/workspace/Lucene-Solr-7.x-Solaris/lucene/build/core/classes/java/org/apache/lucene/geo/package-info.class
     [copy] Copying 3 files to /export/home/jenkins/workspace/Lucene-Solr-7.x-Solaris/lucene/build/core/classes/java

patch-mrjar-classes:
[patch-cls] Remapped: org/apache/lucene/analysis/tokenattributes/CharTermAttributeImpl
[patch-cls] Remapped: org/apache/lucene/codecs/compressing/LZ4
[patch-cls] Remapped: org/apache/lucene/document/BinaryPoint$2
[patch-cls] Remapped: org/apache/lucene/document/DoubleRange
[patch-cls] Remapped: org/apache/lucene/document/FloatRange
[patch-cls] Remapped: org/apache/lucene/document/IntRange
[patch-cls] Remapped: org/apache/lucene/document/LatLonPointDistanceQuery$1$2
[patch-cls] Remapped: org/apache/lucene/document/LatLonPointDistanceQuery$1$3
[patch-cls] Remapped: org/apache/lucene/document/LatLonPointInPolygonQuery$1$1
[patch-cls] Remapped: org/apache/lucene/document/LongRange
[patch-cls] Remapped: org/apache/lucene/document/RangeFieldQuery$QueryType$1
[patch-cls] Remapped: org/apache/lucene/document/RangeFieldQuery$QueryType$2
[patch-cls] Remapped: org/apache/lucene/document/RangeFieldQuery$QueryType$3
[patch-cls] Remapped: org/apache/lucene/index/BitsSlice
[patch-cls] Remapped: org/apache/lucene/index/CheckIndex$VerifyPointsVisitor
[patch-cls] Remapped: org/apache/lucene/index/CodecReader
[patch-cls] Remapped: org/apache/lucene/index/MergeReaderWrapper
[patch-cls] Remapped: org/apache/lucene/index/PointValues
[patch-cls] Remapped: org/apache/lucene/search/BooleanScorer$TailPriorityQueue
[patch-cls] Remapped: org/apache/lucene/search/PointInSetQuery$SinglePointVisitor
[patch-cls] Remapped: org/apache/lucene/search/PointRangeQuery$1$1
[patch-cls] Remapped: org/apache/lucene/search/PointRangeQuery$1$2
[patch-cls] Remapped: org/apache/lucene/search/PointRangeQuery$1
[patch-cls] Remapped: org/apache/lucene/util/BytesRef
[patch-cls] Remapped: org/apache/lucene/util/BytesRefArray
[patch-cls] Remapped: org/apache/lucene/util/CharsRef$UTF16SortedAsUTF8Comparator
[patch-cls] Remapped: org/apache/lucene/util/CharsRef
[patch-cls] Remapped: org/apache/lucene/util/IntsRef
[patch-cls] Remapped: org/apache/lucene/util/LongsRef
[patch-cls] Remapped: org/apache/lucene/util/StringHelper
[patch-cls] Remapped: org/apache/lucene/util/automaton/Automaton$Builder
[patch-cls] Remapped: org/apache/lucene/util/automaton/Automaton
[patch-cls] Remapped: org/apache/lucene/util/bkd/BKDReader
[patch-cls] Remapped: org/apache/lucene/util/bkd/BKDWriter$BKDMergeQueue
[patch-cls] Remapped: org/apache/lucene/util/bkd/BKDWriter
[patch-cls] Remapped: org/apache/lucene/util/bkd/MutablePointsReaderUtils$1$1
[patch-cls] Remapped: org/apache/lucene/util/bkd/MutablePointsReaderUtils$2
[patch-cls] Remapped: org/apache/lucene/util/bkd/MutablePointsReaderUtils$3$1
[patch-cls] Remapped 38 class files for Java 9 to: /export/home/jenkins/workspace/Lucene-Solr-7.x-Solaris/lucene/build/core/classes/java9
    [touch] Creating /export/home/jenkins/workspace/Lucene-Solr-7.x-Solaris/lucene/build/core/patch-mrjar.stamp

-mrjar-check:

-mrjar-core:
     [exec] Execute failed: java.io.IOException: Cannot run program "git" (in directory "/export/home/jenkins/workspace/Lucene-Solr-7.x-Solaris/lucene/core"): error=2, No such file or directory
      [jar] Building jar: /export/home/jenkins/workspace/Lucene-Solr-7.x-Solaris/lucene/build/core/lucene-core-7.6.0-SNAPSHOT.jar

-jar-core:

jar-core:

check-backward-codecs-uptodate:

jar-backward-codecs:

-mrjar-classes-uptodate:

ivy-availability-check:
[loadresource] Do not set property disallowed.ivy.jars.list as its length is 0.

-ivy-fail-disallowed-ivy-version:

ivy-fail:

ivy-configure:
[ivy:configure] :: loading settings :: file = /export/home/jenkins/workspace/Lucene-Solr-7.x-Solaris/lucene/top-level-ivy-settings.xml

resolve-groovy:

-check-git-state:

-git-cleanroot:

-copy-git-state:

git-autoclean:

resolve:

common.init:

compile-lucene-core:

-check-git-state:

-git-cleanroot:

-copy-git-state:

git-autoclean:

ivy-availability-check:
[loadresource] Do not set property disallowed.ivy.jars.list as its length is 0.

-ivy-fail-disallowed-ivy-version:

ivy-fail:

ivy-configure:
[ivy:configure] :: loading settings :: file = /export/home/jenkins/workspace/Lucene-Solr-7.x-Solaris/lucene/top-level-ivy-settings.xml

resolve:

init:

-clover.disable:

-clover.load:

-clover.classpath:

-clover.setup:

clover:

compile-core:

init:

-clover.disable:

-clover.load:

-clover.classpath:

-clover.setup:

clover:

compile-core:
    [mkdir] Created dir: /export/home/jenkins/workspace/Lucene-Solr-7.x-Solaris/lucene/build/backward-codecs/classes/java
    [javac] Compiling 13 source files to /export/home/jenkins/workspace/Lucene-Solr-7.x-Solaris/lucene/build/backward-codecs/classes/java
    [javac] Note: Some input files use or override a deprecated API.
    [javac] Note: Recompile with -Xlint:deprecation for details.
    [javac] Creating empty /export/home/jenkins/workspace/Lucene-Solr-7.x-Solaris/lucene/build/backward-codecs/classes/java/org/apache/lucene/codecs/lucene54/package-info.class
    [javac] Creating empty /export/home/jenkins/workspace/Lucene-Solr-7.x-Solaris/lucene/build/backward-codecs/classes/java/org/apache/lucene/codecs/lucene53/package-info.class
     [copy] Copying 3 files to /export/home/jenkins/workspace/Lucene-Solr-7.x-Solaris/lucene/build/backward-codecs/classes/java

patch-mrjar-classes:
[patch-cls] Remapped 0 class files for Java 9 to: /export/home/jenkins/workspace/Lucene-Solr-7.x-Solaris/lucene/build/backward-codecs/classes/java9
    [touch] Creating /export/home/jenkins/workspace/Lucene-Solr-7.x-Solaris/lucene/build/backward-codecs/patch-mrjar.stamp

-mrjar-check:

-mrjar-core:

-jar-core:
     [exec] Execute failed: java.io.IOException: Cannot run program "git" (in directory "/export/home/jenkins/workspace/Lucene-Solr-7.x-Solaris/lucene/backward-codecs"): error=2, No such file or directory
      [jar] Building jar: /export/home/jenkins/workspace/Lucene-Solr-7.x-Solaris/lucene/build/backward-codecs/lucene-backward-codecs-7.6.0-SNAPSHOT.jar

jar-core:

check-analyzers-phonetic-uptodate:

jar-analyzers-phonetic:

-mrjar-classes-uptodate:

ivy-availability-check:
[loadresource] Do not set property disallowed.ivy.jars.list as its length is 0.

-ivy-fail-disallowed-ivy-version:

ivy-fail:

ivy-configure:
[ivy:configure] :: loading settings :: file = /export/home/jenkins/workspace/Lucene-Solr-7.x-Solaris/lucene/top-level-ivy-settings.xml

resolve-groovy:

check-analyzers-common-uptodate:

jar-analyzers-common:

-mrjar-classes-uptodate:

ivy-availability-check:
[loadresource] Do not set property disallowed.ivy.jars.list as its length is 0.

-ivy-fail-disallowed-ivy-version:

ivy-fail:

ivy-configure:
[ivy:configure] :: loading settings :: file = /export/home/jenkins/workspace/Lucene-Solr-7.x-Solaris/lucene/top-level-ivy-settings.xml

resolve-groovy:

-check-git-state:

-git-cleanroot:

-copy-git-state:

git-autoclean:

resolve:

common.init:

compile-lucene-core:

-check-git-state:

-git-cleanroot:

-copy-git-state:

git-autoclean:

ivy-availability-check:
[loadresource] Do not set property disallowed.ivy.jars.list as its length is 0.

-ivy-fail-disallowed-ivy-version:

ivy-fail:

ivy-configure:
[ivy:configure] :: loading settings :: file = /export/home/jenkins/workspace/Lucene-Solr-7.x-Solaris/lucene/top-level-ivy-settings.xml

resolve:

init:

-clover.disable:

-clover.load:

-clover.classpath:

-clover.setup:

clover:

compile-core:

init:

-clover.disable:

-clover.load:

-clover.classpath:

-clover.setup:

clover:

compile-core:
    [mkdir] Created dir: /export/home/jenkins/workspace/Lucene-Solr-7.x-Solaris/lucene/build/analysis/common/classes/java
    [javac] Compiling 476 source files to /export/home/jenkins/workspace/Lucene-Solr-7.x-Solaris/lucene/build/analysis/common/classes/java
    [javac] Note: Some input files use or override a deprecated API.
    [javac] Note: Recompile with -Xlint:deprecation for details.
    [javac] Creating empty /export/home/jenkins/workspace/Lucene-Solr-7.x-Solaris/lucene/build/analysis/common/classes/java/org/apache/lucene/analysis/hunspell/package-info.class
    [javac] Creating empty /export/home/jenkins/workspace/Lucene-Solr-7.x-Solaris/lucene/build/analysis/common/classes/java/org/apache/lucene/analysis/minhash/package-info.class
    [javac] Creating empty /export/home/jenkins/workspace/Lucene-Solr-7.x-Solaris/lucene/build/analysis/common/classes/java/org/apache/lucene/analysis/ga/package-info.class
    [javac] Creating empty /export/home/jenkins/workspace/Lucene-Solr-7.x-Solaris/lucene/build/analysis/common/classes/java/org/apache/lucene/analysis/ca/package-info.class
    [javac] Creating empty /export/home/jenkins/workspace/Lucene-Solr-7.x-Solaris/lucene/build/analysis/common/classes/java/org/apache/lucene/analysis/custom/package-info.class
    [javac] Creating empty /export/home/jenkins/workspace/Lucene-Solr-7.x-Solaris/lucene/build/analysis/common/classes/java/org/apache/lucene/analysis/sr/package-info.class
    [javac] Creating empty /export/home/jenkins/workspace/Lucene-Solr-7.x-Solaris/lucene/build/analysis/common/classes/java/org/apache/lucene/collation/package-info.class
    [javac] Creating empty /export/home/jenkins/workspace/Lucene-Solr-7.x-Solaris/lucene/build/analysis/common/classes/java/org/apache/lucene/analysis/sv/package-info.class
    [javac] Creating empty /export/home/jenkins/workspace/Lucene-Solr-7.x-Solaris/lucene/build/analysis/common/classes/java/org/apache/lucene/analysis/bg/package-info.class
    [javac] Creating empty /export/home/jenkins/workspace/Lucene-Solr-7.x-Solaris/lucene/build/analysis/common/classes/java/org/apache/lucene/analysis/payloads/package-info.class
    [javac] Creating empty /export/home/jenkins/workspace/Lucene-Solr-7.x-Solaris/lucene/build/analysis/common/classes/java/org/apache/lucene/analysis/ngram/package-info.class
    [javac] Creating empty /export/home/jenkins/workspace/Lucene-Solr-7.x-Solaris/lucene/build/analysis/common/classes/java/org/apache/lucene/analysis/core/package-info.class
    [javac] Creating empty /export/home/jenkins/workspace/Lucene-Solr-7.x-Solaris/lucene/build/analysis/common/classes/java/org/apache/lucene/analysis/bn/package-info.class
    [javac] Creating empty /export/home/jenkins/workspace/Lucene-Solr-7.x-Solaris/lucene/build/analysis/common/classes/java/org/apache/lucene/analysis/fr/package-info.class
    [javac] Creating empty /export/home/jenkins/workspace/Lucene-Solr-7.x-Solaris/lucene/build/analysis/common/classes/java/org/tartarus/snowball/ext/package-info.class
    [javac] Creating empty /export/home/jenkins/workspace/Lucene-Solr-7.x-Solaris/lucene/build/analysis/common/classes/java/org/apache/lucene/analysis/br/package-info.class
    [javac] Creating empty /export/home/jenkins/workspace/Lucene-Solr-7.x-Solaris/lucene/build/analysis/common/classes/java/org/apache/lucene/analysis/miscellaneous/package-info.class
    [javac] Creating empty /export/home/jenkins/workspace/Lucene-Solr-7.x-Solaris/lucene/build/analysis/common/classes/java/org/apache/lucene/analysis/sinks/package-info.class
    [javac] Creating empty /export/home/jenkins/workspace/Lucene-Solr-7.x-Solaris/lucene/build/analysis/common/classes/java/org/apache/lucene/analysis/cjk/package-info.class
    [javac] Creating empty /export/home/jenkins/workspace/Lucene-Solr-7.x-Solaris/lucene/build/analysis/common/classes/java/org/apache/lucene/analysis/synonym/package-info.class
    [javac] Creating empty /export/home/jenkins/workspace/Lucene-Solr-7.x-Solaris/lucene/build/analysis/common/classes/java/org/apache/lucene/analysis/wikipedia/package-info.class
    [javac] Creating empty /export/home/jenkins/workspace/Lucene-Solr-7.x-Solaris/lucene/build/analysis/common/classes/java/org/apache/lucene/analysis/fa/package-info.class
    [javac] Creating empty /export/home/jenkins/workspace/Lucene-Solr-7.x-Solaris/lucene/build/analysis/common/classes/java/org/apache/lucene/analysis/reverse/package-info.class
    [javac] Creating empty /export/home/jenkins/workspace/Lucene-Solr-7.x-Solaris/lucene/build/analysis/common/classes/java/org/apache/lucene/analysis/nl/package-info.class
    [javac] Creating empty /export/home/jenkins/workspace/Lucene-Solr-7.x-Solaris/lucene/build/analysis/common/classes/java/org/apache/lucene/analysis/ro/package-info.class
    [javac] Creating empty /export/home/jenkins/workspace/Lucene-Solr-7.x-Solaris/lucene/build/analysis/common/classes/java/org/apache/lucene/analysis/fi/package-info.class
    [javac] Creating empty /export/home/jenkins/workspace/Lucene-Solr-7.x-Solaris/lucene/build/analysis/common/classes/java/org/apache/lucene/analysis/ru/package-info.class
    [javac] Creating empty /export/home/jenkins/workspace/Lucene-Solr-7.x-Solaris/lucene/build/analysis/common/classes/java/org/apache/lucene/analysis/no/package-info.class
    [javac] Creating empty /export/home/jenkins/workspace/Lucene-Solr-7.x-Solaris/lucene/build/analysis/common/classes/java/org/apache/lucene/analysis/el/package-info.class
    [javac] Creating empty /export/home/jenkins/workspace/Lucene-Solr-7.x-Solaris/lucene/build/analysis/common/classes/java/org/apache/lucene/analysis/ckb/package-info.class
    [javac] Creating empty /export/home/jenkins/workspace/Lucene-Solr-7.x-Solaris/lucene/build/analysis/common/classes/java/org/tartarus/snowball/package-info.class
    [javac] Creating empty /export/home/jenkins/workspace/Lucene-Solr-7.x-Solaris/lucene/build/analysis/common/classes/java/org/apache/lucene/analysis/in/package-info.class
    [javac] Creating empty /export/home/jenkins/workspace/Lucene-Solr-7.x-Solaris/lucene/build/analysis/common/classes/java/org/apache/lucene/analysis/util/package-info.class
    [javac] Creating empty /export/home/jenkins/workspace/Lucene-Solr-7.x-Solaris/lucene/build/analysis/common/classes/java/org/apache/lucene/analysis/it/package-info.class
    [javac] Creating empty /export/home/jenkins/workspace/Lucene-Solr-7.x-Solaris/lucene/build/analysis/common/classes/java/org/apache/lucene/analysis/snowball/package-info.class
    [javac] Creating empty /export/home/jenkins/workspace/Lucene-Solr-7.x-Solaris/lucene/build/analysis/common/classes/java/org/apache/lucene/analysis/en/package-info.class
    [javac] Creating empty /export/home/jenkins/workspace/Lucene-Solr-7.x-Solaris/lucene/build/analysis/common/classes/java/org/apache/lucene/analysis/es/package-info.class
    [javac] Creating empty /export/home/jenkins/workspace/Lucene-Solr-7.x-Solaris/lucene/build/analysis/common/classes/java/org/apache/lucene/analysis/shingle/package-info.class
    [javac] Creating empty /export/home/jenkins/workspace/Lucene-Solr-7.x-Solaris/lucene/build/analysis/common/classes/java/org/apache/lucene/analysis/eu/package-info.class
    [javac] Creating empty /export/home/jenkins/workspace/Lucene-Solr-7.x-Solaris/lucene/build/analysis/common/classes/java/org/apache/lucene/analysis/ar/package-info.class
    [javac] Creating empty /export/home/jenkins/workspace/Lucene-Solr-7.x-Solaris/lucene/build/analysis/common/classes/java/org/apache/lucene/analysis/query/package-info.class
    [javac] Creating empty /export/home/jenkins/workspace/Lucene-Solr-7.x-Solaris/lucene/build/analysis/common/classes/java/org/apache/lucene/analysis/id/package-info.class
    [javac] Creating empty /export/home/jenkins/workspace/Lucene-Solr-7.x-Solaris/lucene/build/analysis/common/classes/java/org/apache/lucene/analysis/compound/hyphenation/package-info.class
    [javac] Creating empty /export/home/jenkins/workspace/Lucene-Solr-7.x-Solaris/lucene/build/analysis/common/classes/java/org/apache/lucene/analysis/charfilter/package-info.class
    [javac] Creating empty /export/home/jenkins/workspace/Lucene-Solr-7.x-Solaris/lucene/build/analysis/common/classes/java/org/apache/lucene/analysis/pt/package-info.class
    [javac] Creating empty /export/home/jenkins/workspace/Lucene-Solr-7.x-Solaris/lucene/build/analysis/common/classes/java/org/apache/lucene/analysis/lv/package-info.class
    [javac] Creating empty /export/home/jenkins/workspace/Lucene-Solr-7.x-Solaris/lucene/build/analysis/common/classes/java/org/apache/lucene/analysis/lt/package-info.class
    [javac] Creating empty /export/home/jenkins/workspace/Lucene-Solr-7.x-Solaris/lucene/build/analysis/common/classes/java/org/apache/lucene/analysis/hu/package-info.class
    [javac] Creating empty /export/home/jenkins/workspace/Lucene-Solr-7.x-Solaris/lucene/build/analysis/common/classes/java/org/apache/lucene/analysis/hy/package-info.class
    [javac] Creating empty /export/home/jenkins/workspace/Lucene-Solr-7.x-Solaris/lucene/build/analysis/common/classes/java/org/apache/lucene/analysis/pattern/package-info.class
    [javac] Creating empty /export/home/jenkins/workspace/Lucene-Solr-7.x-Solaris/lucene/build/analysis/common/classes/java/org/apache/lucene/analysis/cz/package-info.class
    [javac] Creating empty /export/home/jenkins/workspace/Lucene-Solr-7.x-Solaris/lucene/build/analysis/common/classes/java/org/apache/lucene/analysis/th/package-info.class
    [javac] Creating empty /export/home/jenkins/workspace/Lucene-Solr-7.x-Solaris/lucene/build/analysis/common/classes/java/org/apache/lucene/analysis/path/package-info.class
    [javac] Creating empty /export/home/jenkins/workspace/Lucene-Solr-7.x-Solaris/lucene/build/analysis/common/classes/java/org/apache/lucene/analysis/tr/package-info.class
    [javac] Creating empty /export/home/jenkins/workspace/Lucene-Solr-7.x-Solaris/lucene/build/analysis/common/classes/java/org/apache/lucene/analysis/da/package-info.class
    [javac] Creating empty /export/home/jenkins/workspace/Lucene-Solr-7.x-Solaris/lucene/build/analysis/common/classes/java/org/apache/lucene/analysis/de/package-info.class
    [javac] Creating empty /export/home/jenkins/workspace/Lucene-Solr-7.x-Solaris/lucene/build/analysis/common/classes/java/org/apache/lucene/analysis/hi/package-info.class
    [javac] Creating empty /export/home/jenkins/workspace/Lucene-Solr-7.x-Solaris/lucene/build/analysis/common/classes/java/org/apache/lucene/collation/tokenattributes/package-info.class
    [javac] Creating empty /export/home/jenkins/workspace/Lucene-Solr-7.x-Solaris/lucene/build/analysis/common/classes/java/org/apache/lucene/analysis/gl/package-info.class
    [javac] Creating empty /export/home/jenkins/workspace/Lucene-Solr-7.x-Solaris/lucene/build/analysis/common/classes/java/org/apache/lucene/analysis/commongrams/package-info.class
    [javac] Creating empty /export/home/jenkins/workspace/Lucene-Solr-7.x-Solaris/lucene/build/analysis/common/classes/java/org/apache/lucene/analysis/compound/package-info.class
     [copy] Copying 40 files to /export/home/jenkins/workspace/Lucene-Solr-7.x-Solaris/lucene/build/analysis/common/classes/java

patch-mrjar-classes:
[patch-cls] Remapped 0 class files for Java 9 to: /export/home/jenkins/workspace/Lucene-Solr-7.x-Solaris/lucene/build/analysis/common/classes/java9
    [touch] Creating /export/home/jenkins/workspace/Lucene-Solr-7.x-Solaris/lucene/build/analysis/common/patch-mrjar.stamp

-mrjar-check:

-mrjar-core:

-jar-core:
     [exec] Execute failed: java.io.IOException: Cannot run program "git" (in directory "/export/home/jenkins/workspace/Lucene-Solr-7.x-Solaris/lucene/analysis/common"): error=2, No such file or directory
      [jar] Building jar: /export/home/jenkins/workspace/Lucene-Solr-7.x-Solaris/lucene/build/analysis/common/lucene-analyzers-common-7.6.0-SNAPSHOT.jar

jar-core:

-check-git-state:

-git-cleanroot:

-copy-git-state:

git-autoclean:

resolve:

common.init:

compile-lucene-core:

-check-git-state:

-git-cleanroot:

-copy-git-state:

git-autoclean:

ivy-availability-check:
[loadresource] Do not set property disallowed.ivy.jars.list as its length is 0.

-ivy-fail-disallowed-ivy-version:

ivy-fail:

ivy-configure:
[ivy:configure] :: loading settings :: file = /export/home/jenkins/workspace/Lucene-Solr-7.x-Solaris/lucene/top-level-ivy-settings.xml

resolve:

init:

-clover.disable:

-clover.load:

-clover.classpath:

-clover.setup:

clover:

compile-core:

init:

-clover.disable:

-clover.load:

-clover.classpath:

-clover.setup:

clover:

common.compile-core:
    [mkdir] Created dir: /export/home/jenkins/workspace/Lucene-Solr-7.x-Solaris/lucene/build/analysis/phonetic/classes/java
    [javac] Compiling 9 source files to /export/home/jenkins/workspace/Lucene-Solr-7.x-Solaris/lucene/build/analysis/phonetic/classes/java
    [javac] Creating empty /export/home/jenkins/workspace/Lucene-Solr-7.x-Solaris/lucene/build/analysis/phonetic/classes/java/org/apache/lucene/analysis/phonetic/package-info.class
     [copy] Copying 1 file to /export/home/jenkins/workspace/Lucene-Solr-7.x-Solaris/lucene/build/analysis/phonetic/classes/java

compile-core:

patch-mrjar-classes:
[patch-cls] Remapped 0 class files for Java 9 to: /export/home/jenkins/workspace/Lucene-Solr-7.x-Solaris/lucene/build/analysis/phonetic/classes/java9
    [touch] Creating /export/home/jenkins/workspace/Lucene-Solr-7.x-Solaris/lucene/build/analysis/phonetic/patch-mrjar.stamp

-mrjar-check:

-mrjar-core:

-jar-core:
     [exec] Execute failed: java.io.IOException: Cannot run program "git" (in directory "/export/home/jenkins/workspace/Lucene-Solr-7.x-Solaris/lucene/analysis/phonetic"): error=2, No such file or directory
      [jar] Building jar: /export/home/jenkins/workspace/Lucene-Solr-7.x-Solaris/lucene/build/analysis/phonetic/lucene-analyzers-phonetic-7.6.0-SNAPSHOT.jar

jar-core:

check-analyzers-kuromoji-uptodate:

jar-analyzers-kuromoji:

-mrjar-classes-uptodate:

ivy-availability-check:
[loadresource] Do not set property disallowed.ivy.jars.list as its length is 0.

-ivy-fail-disallowed-ivy-version:

ivy-fail:

ivy-configure:
[ivy:configure] :: loading settings :: file = /export/home/jenkins/workspace/Lucene-Solr-7.x-Solaris/lucene/top-level-ivy-settings.xml

resolve-groovy:

check-analyzers-common-uptodate:

jar-analyzers-common:

-check-git-state:

-git-cleanroot:

-copy-git-state:

git-autoclean:

resolve:

common.init:

compile-lucene-core:

-check-git-state:

-git-cleanroot:

-copy-git-state:

git-autoclean:

ivy-availability-check:
[loadresource] Do not set property disallowed.ivy.jars.list as its length is 0.

-ivy-fail-disallowed-ivy-version:

ivy-fail:

ivy-configure:
[ivy:configure] :: loading settings :: file = /export/home/jenkins/workspace/Lucene-Solr-7.x-Solaris/lucene/top-level-ivy-settings.xml

resolve:

init:

-clover.disable:

-clover.load:

-clover.classpath:

-clover.setup:

clover:

compile-core:

init:

-clover.disable:

-clover.load:

-clover.classpath:

-clover.setup:

clover:

common.compile-core:
    [mkdir] Created dir: /export/home/jenkins/workspace/Lucene-Solr-7.x-Solaris/lucene/build/analysis/kuromoji/classes/java
    [javac] Compiling 39 source files to /export/home/jenkins/workspace/Lucene-Solr-7.x-Solaris/lucene/build/analysis/kuromoji/classes/java
    [javac] Creating empty /export/home/jenkins/workspace/Lucene-Solr-7.x-Solaris/lucene/build/analysis/kuromoji/classes/java/org/apache/lucene/analysis/ja/dict/package-info.class
    [javac] Creating empty /export/home/jenkins/workspace/Lucene-Solr-7.x-Solaris/lucene/build/analysis/kuromoji/classes/java/org/apache/lucene/analysis/ja/package-info.class
    [javac] Creating empty /export/home/jenkins/workspace/Lucene-Solr-7.x-Solaris/lucene/build/analysis/kuromoji/classes/java/org/apache/lucene/analysis/ja/util/package-info.class
    [javac] Creating empty /export/home/jenkins/workspace/Lucene-Solr-7.x-Solaris/lucene/build/analysis/kuromoji/classes/java/org/apache/lucene/analysis/ja/tokenattributes/package-info.class
     [copy] Copying 14 files to /export/home/jenkins/workspace/Lucene-Solr-7.x-Solaris/lucene/build/analysis/kuromoji/classes/java

compile-core:

patch-mrjar-classes:
[patch-cls] Remapped 0 class files for Java 9 to: /export/home/jenkins/workspace/Lucene-Solr-7.x-Solaris/lucene/build/analysis/kuromoji/classes/java9
    [touch] Creating /export/home/jenkins/workspace/Lucene-Solr-7.x-Solaris/lucene/build/analysis/kuromoji/patch-mrjar.stamp

-mrjar-check:

-mrjar-core:

-jar-core:
     [exec] Execute failed: java.io.IOException: Cannot run program "git" (in directory "/export/home/jenkins/workspace/Lucene-Solr-7.x-Solaris/lucene/analysis/kuromoji"): error=2, No such file or directory
      [jar] Building jar: /export/home/jenkins/workspace/Lucene-Solr-7.x-Solaris/lucene/build/analysis/kuromoji/lucene-analyzers-kuromoji-7.6.0-SNAPSHOT.jar

jar-core:

check-analyzers-nori-uptodate:

jar-analyzers-nori:

-mrjar-classes-uptodate:

ivy-availability-check:
[loadresource] Do not set property disallowed.ivy.jars.list as its length is 0.

-ivy-fail-disallowed-ivy-version:

ivy-fail:

ivy-configure:
[ivy:configure] :: loading settings :: file = /export/home/jenkins/workspace/Lucene-Solr-7.x-Solaris/lucene/top-level-ivy-settings.xml

resolve-groovy:

check-analyzers-common-uptodate:

jar-analyzers-common:

-check-git-state:

-git-cleanroot:

-copy-git-state:

git-autoclean:

resolve:

common.init:

compile-lucene-core:

-check-git-state:

-git-cleanroot:

-copy-git-state:

git-autoclean:

ivy-availability-check:
[loadresource] Do not set property disallowed.ivy.jars.list as its length is 0.

-ivy-fail-disallowed-ivy-version:

ivy-fail:

ivy-configure:
[ivy:configure] :: loading settings :: file = /export/home/jenkins/workspace/Lucene-Solr-7.x-Solaris/lucene/top-level-ivy-settings.xml

resolve:

init:

-clover.disable:

-clover.load:

-clover.classpath:

-clover.setup:

clover:

compile-core:

init:

-clover.disable:

-clover.load:

-clover.classpath:

-clover.setup:

clover:

common.compile-core:
    [mkdir] Created dir: /export/home/jenkins/workspace/Lucene-Solr-7.x-Solaris/lucene/build/analysis/nori/classes/java
    [javac] Compiling 29 source files to /export/home/jenkins/workspace/Lucene-Solr-7.x-Solaris/lucene/build/analysis/nori/classes/java
    [javac] Creating empty /export/home/jenkins/workspace/Lucene-Solr-7.x-Solaris/lucene/build/analysis/nori/classes/java/org/apache/lucene/analysis/ko/package-info.class
    [javac] Creating empty /export/home/jenkins/workspace/Lucene-Solr-7.x-Solaris/lucene/build/analysis/nori/classes/java/org/apache/lucene/analysis/ko/tokenattributes/package-info.class
    [javac] Creating empty /export/home/jenkins/workspace/Lucene-Solr-7.x-Solaris/lucene/build/analysis/nori/classes/java/org/apache/lucene/analysis/ko/util/package-info.class
    [javac] Creating empty /export/home/jenkins/workspace/Lucene-Solr-7.x-Solaris/lucene/build/analysis/nori/classes/java/org/apache/lucene/analysis/ko/dict/package-info.class
     [copy] Copying 11 files to /export/home/jenkins/workspace/Lucene-Solr-7.x-Solaris/lucene/build/analysis/nori/classes/java

compile-core:

patch-mrjar-classes:
[patch-cls] Remapped 0 class files for Java 9 to: /export/home/jenkins/workspace/Lucene-Solr-7.x-Solaris/lucene/build/analysis/nori/classes/java9
    [touch] Creating /export/home/jenkins/workspace/Lucene-Solr-7.x-Solaris/lucene/build/analysis/nori/patch-mrjar.stamp

-mrjar-check:

-mrjar-core:

-jar-core:
     [exec] Execute failed: java.io.IOException: Cannot run program "git" (in directory "/export/home/jenkins/workspace/Lucene-Solr-7.x-Solaris/lucene/analysis/nori"): error=2, No such file or directory
      [jar] Building jar: /export/home/jenkins/workspace/Lucene-Solr-7.x-Solaris/lucene/build/analysis/nori/lucene-analyzers-nori-7.6.0-SNAPSHOT.jar

jar-core:

check-codecs-uptodate:

jar-codecs:

-mrjar-classes-uptodate:

ivy-availability-check:
[loadresource] Do not set property disallowed.ivy.jars.list as its length is 0.

-ivy-fail-disallowed-ivy-version:

ivy-fail:

ivy-configure:
[ivy:configure] :: loading settings :: file = /export/home/jenkins/workspace/Lucene-Solr-7.x-Solaris/lucene/top-level-ivy-settings.xml

resolve-groovy:

-check-git-state:

-git-cleanroot:

-copy-git-state:

git-autoclean:

resolve:

common.init:

compile-lucene-core:

-check-git-state:

-git-cleanroot:

-copy-git-state:

git-autoclean:

ivy-availability-check:
[loadresource] Do not set property disallowed.ivy.jars.list as its length is 0.

-ivy-fail-disallowed-ivy-version:

ivy-fail:

ivy-configure:
[ivy:configure] :: loading settings :: file = /export/home/jenkins/workspace/Lucene-Solr-7.x-Solaris/lucene/top-level-ivy-settings.xml

resolve:

init:

-clover.disable:

-clover.load:

-clover.classpath:

-clover.setup:

clover:

compile-core:

init:

-clover.disable:

-clover.load:

-clover.classpath:

-clover.setup:

clover:

compile-core:
    [mkdir] Created dir: /export/home/jenkins/workspace/Lucene-Solr-7.x-Solaris/lucene/build/codecs/classes/java
    [javac] Compiling 67 source files to /export/home/jenkins/workspace/Lucene-Solr-7.x-Solaris/lucene/build/codecs/classes/java
    [javac] Note: Some input files use or override a deprecated API.
    [javac] Note: Recompile with -Xlint:deprecation for details.
    [javac] Creating empty /export/home/jenkins/workspace/Lucene-Solr-7.x-Solaris/lucene/build/codecs/classes/java/org/apache/lucene/codecs/bloom/package-info.class
    [javac] Creating empty /export/home/jenkins/workspace/Lucene-Solr-7.x-Solaris/lucene/build/codecs/classes/java/org/apache/lucene/codecs/memory/package-info.class
    [javac] Creating empty /export/home/jenkins/workspace/Lucene-Solr-7.x-Solaris/lucene/build/codecs/classes/java/org/apache/lucene/codecs/simpletext/package-info.class
    [javac] Creating empty /export/home/jenkins/workspace/Lucene-Solr-7.x-Solaris/lucene/build/codecs/classes/java/org/apache/lucene/codecs/blockterms/package-info.class
    [javac] Creating empty /export/home/jenkins/workspace/Lucene-Solr-7.x-Solaris/lucene/build/codecs/classes/java/org/apache/lucene/codecs/blocktreeords/package-info.class
     [copy] Copying 3 files to /export/home/jenkins/workspace/Lucene-Solr-7.x-Solaris/lucene/build/codecs/classes/java

patch-mrjar-classes:
[patch-cls] Remapped: org/apache/lucene/codecs/simpletext/SimpleTextBKDWriter$BKDMergeQueue
[patch-cls] Remapped: org/apache/lucene/codecs/simpletext/SimpleTextBKDWriter
[patch-cls] Remapped: org/apache/lucene/codecs/simpletext/SimpleTextStoredFieldsReader
[patch-cls] Remapped 3 class files for Java 9 to: /export/home/jenkins/workspace/Lucene-Solr-7.x-Solaris/lucene/build/codecs/classes/java9
    [touch] Creating /export/home/jenkins/workspace/Lucene-Solr-7.x-Solaris/lucene/build/codecs/patch-mrjar.stamp

-mrjar-check:

-mrjar-core:
     [exec] Execute failed: java.io.IOException: Cannot run program "git" (in directory "/export/home/jenkins/workspace/Lucene-Solr-7.x-Solaris/lucene/codecs"): error=2, No such file or directory
      [jar] Building jar: /export/home/jenkins/workspace/Lucene-Solr-7.x-Solaris/lucene/build/codecs/lucene-codecs-7.6.0-SNAPSHOT.jar

-jar-core:

jar-core:

check-expressions-uptodate:

jar-expressions:

-mrjar-classes-uptodate:

ivy-availability-check:
[loadresource] Do not set property disallowed.ivy.jars.list as its length is 0.

-ivy-fail-disallowed-ivy-version:

ivy-fail:

ivy-configure:
[ivy:configure] :: loading settings :: file = /export/home/jenkins/workspace/Lucene-Solr-7.x-Solaris/lucene/top-level-ivy-settings.xml

resolve-groovy:

-check-git-state:

-git-cleanroot:

-copy-git-state:

git-autoclean:

resolve:

common.init:

compile-lucene-core:

-check-git-state:

-git-cleanroot:

-copy-git-state:

git-autoclean:

ivy-availability-check:
[loadresource] Do not set property disallowed.ivy.jars.list as its length is 0.

-ivy-fail-disallowed-ivy-version:

ivy-fail:

ivy-configure:
[ivy:configure] :: loading settings :: file = /export/home/jenkins/workspace/Lucene-Solr-7.x-Solaris/lucene/top-level-ivy-settings.xml

resolve:

init:

-clover.disable:

-clover.load:

-clover.classpath:

-clover.setup:

clover:

compile-core:

init:

-clover.disable:

-clover.load:

-clover.classpath:

-clover.setup:

clover:

compile-core:
    [mkdir] Created dir: /export/home/jenkins/workspace/Lucene-Solr-7.x-Solaris/lucene/build/expressions/classes/java
    [javac] Compiling 17 source files to /export/home/jenkins/workspace/Lucene-Solr-7.x-Solaris/lucene/build/expressions/classes/java
    [javac] Creating empty /export/home/jenkins/workspace/Lucene-Solr-7.x-Solaris/lucene/build/expressions/classes/java/org/apache/lucene/expressions/js/package-info.class
    [javac] Creating empty /export/home/jenkins/workspace/Lucene-Solr-7.x-Solaris/lucene/build/expressions/classes/java/org/apache/lucene/expressions/package-info.class
     [copy] Copying 1 file to /export/home/jenkins/workspace/Lucene-Solr-7.x-Solaris/lucene/build/expressions/classes/java

patch-mrjar-classes:
[patch-cls] Remapped 0 class files for Java 9 to: /export/home/jenkins/workspace/Lucene-Solr-7.x-Solaris/lucene/build/expressions/classes/java9
    [touch] Creating /export/home/jenkins/workspace/Lucene-Solr-7.x-Solaris/lucene/build/expressions/patch-mrjar.stamp

-mrjar-check:

-mrjar-core:

-jar-core:
     [exec] Execute failed: java.io.IOException: Cannot run program "git" (in directory "/export/home/jenkins/workspace/Lucene-Solr-7.x-Solaris/lucene/expressions"): error=2, No such file or directory
      [jar] Building jar: /export/home/jenkins/workspace/Lucene-Solr-7.x-Solaris/lucene/build/expressions/lucene-expressions-7.6.0-SNAPSHOT.jar

jar-core:

check-suggest-uptodate:

jar-suggest:

-mrjar-classes-uptodate:

ivy-availability-check:
[loadresource] Do not set property disallowed.ivy.jars.list as its length is 0.

-ivy-fail-disallowed-ivy-version:

ivy-fail:

ivy-configure:
[ivy:configure] :: loading settings :: file = /export/home/jenkins/workspace/Lucene-Solr-7.x-Solaris/lucene/top-level-ivy-settings.xml

resolve-groovy:

check-expressions-uptodate:

jar-expressions:

check-analyzers-common-uptodate:

jar-analyzers-common:

-check-git-state:

-git-cleanroot:

-copy-git-state:

git-autoclean:

resolve:

common.init:

compile-lucene-core:

-check-git-state:

-git-cleanroot:

-copy-git-state:

git-autoclean:

ivy-availability-check:
[loadresource] Do not set property disallowed.ivy.jars.list as its length is 0.

-ivy-fail-disallowed-ivy-version:

ivy-fail:

ivy-configure:
[ivy:configure] :: loading settings :: file = /export/home/jenkins/workspace/Lucene-Solr-7.x-Solaris/lucene/top-level-ivy-settings.xml

resolve:

init:

-clover.disable:

-clover.load:

-clover.classpath:

-clover.setup:

clover:

compile-core:

init:

-clover.disable:

-clover.load:

-clover.classpath:

-clover.setup:

clover:

common.compile-core:
    [mkdir] Created dir: /export/home/jenkins/workspace/Lucene-Solr-7.x-Solaris/lucene/build/suggest/classes/java
    [javac] Compiling 78 source files to /export/home/jenkins/workspace/Lucene-Solr-7.x-Solaris/lucene/build/suggest/classes/java
    [javac] /export/home/jenkins/workspace/Lucene-Solr-7.x-Solaris/lucene/suggest/src/java/org/apache/lucene/search/spell/LuceneLevenshteinDistance.java:39: warning: [overrides] Class LuceneLevenshteinDistance overrides equals, but neither it nor any superclass overrides hashCode method
    [javac] public final class LuceneLevenshteinDistance implements StringDistance {
    [javac]              ^
    [javac] Note: /export/home/jenkins/workspace/Lucene-Solr-7.x-Solaris/lucene/suggest/src/java/org/apache/lucene/search/suggest/jaspell/JaspellLookup.java uses or overrides a deprecated API.
    [javac] Note: Recompile with -Xlint:deprecation for details.
    [javac] 1 warning
    [javac] Creating empty /export/home/jenkins/workspace/Lucene-Solr-7.x-Solaris/lucene/build/suggest/classes/java/org/apache/lucene/search/suggest/package-info.class
    [javac] Creating empty /export/home/jenkins/workspace/Lucene-Solr-7.x-Solaris/lucene/build/suggest/classes/java/org/apache/lucene/search/suggest/document/package-info.class
    [javac] Creating empty /export/home/jenkins/workspace/Lucene-Solr-7.x-Solaris/lucene/build/suggest/classes/java/org/apache/lucene/search/spell/package-info.class
    [javac] Creating empty /export/home/jenkins/workspace/Lucene-Solr-7.x-Solaris/lucene/build/suggest/classes/java/org/apache/lucene/search/suggest/jaspell/package-info.class
    [javac] Creating empty /export/home/jenkins/workspace/Lucene-Solr-7.x-Solaris/lucene/build/suggest/classes/java/org/apache/lucene/search/suggest/tst/package-info.class
    [javac] Creating empty /export/home/jenkins/workspace/Lucene-Solr-7.x-Solaris/lucene/build/suggest/classes/java/org/apache/lucene/search/suggest/analyzing/package-info.class
    [javac] Creating empty /export/home/jenkins/workspace/Lucene-Solr-7.x-Solaris/lucene/build/suggest/classes/java/org/apache/lucene/search/suggest/fst/package-info.class
     [copy] Copying 2 files to /export/home/jenkins/workspace/Lucene-Solr-7.x-Solaris/lucene/build/suggest/classes/java

compile-core:

patch-mrjar-classes:
[patch-cls] Remapped 0 class files for Java 9 to: /export/home/jenkins/workspace/Lucene-Solr-7.x-Solaris/lucene/build/suggest/classes/java9
    [touch] Creating /export/home/jenkins/workspace/Lucene-Solr-7.x-Solaris/lucene/build/suggest/patch-mrjar.stamp

-mrjar-check:

-mrjar-core:

-jar-core:
     [exec] Execute failed: java.io.IOException: Cannot run program "git" (in directory "/export/home/jenkins/workspace/Lucene-Solr-7.x-Solaris/lucene/suggest"): error=2, No such file or directory
      [jar] Building jar: /export/home/jenkins/workspace/Lucene-Solr-7.x-Solaris/lucene/build/suggest/lucene-suggest-7.6.0-SNAPSHOT.jar

jar-core:

check-highlighter-uptodate:

jar-highlighter:

-mrjar-classes-uptodate:

ivy-availability-check:
[loadresource] Do not set property disallowed.ivy.jars.list as its length is 0.

-ivy-fail-disallowed-ivy-version:

ivy-fail:

ivy-configure:
[ivy:configure] :: loading settings :: file = /export/home/jenkins/workspace/Lucene-Solr-7.x-Solaris/lucene/top-level-ivy-settings.xml

resolve-groovy:

check-memory-uptodate:

jar-memory:

-mrjar-classes-uptodate:

ivy-availability-check:
[loadresource] Do not set property disallowed.ivy.jars.list as its length is 0.

-ivy-fail-disallowed-ivy-version:

ivy-fail:

ivy-configure:
[ivy:configure] :: loading settings :: file = /export/home/jenkins/workspace/Lucene-Solr-7.x-Solaris/lucene/top-level-ivy-settings.xml

resolve-groovy:

check-queryparser-uptodate:

jar-queryparser:

-mrjar-classes-uptodate:

ivy-availability-check:
[loadresource] Do not set property disallowed.ivy.jars.list as its length is 0.

-ivy-fail-disallowed-ivy-version:

ivy-fail:

ivy-configure:
[ivy:configure] :: loading settings :: file = /export/home/jenkins/workspace/Lucene-Solr-7.x-Solaris/lucene/top-level-ivy-settings.xml

resolve-groovy:

check-queries-uptodate:

jar-queries:

-mrjar-classes-uptodate:

ivy-availability-check:
[loadresource] Do not set property disallowed.ivy.jars.list as its length is 0.

-ivy-fail-disallowed-ivy-version:

ivy-fail:

ivy-configure:
[ivy:configure] :: loading settings :: file = /export/home/jenkins/workspace/Lucene-Solr-7.x-Solaris/lucene/top-level-ivy-settings.xml

resolve-groovy:

check-expressions-uptodate:

jar-expressions:

-check-git-state:

-git-cleanroot:

-copy-git-state:

git-autoclean:

resolve:

common.init:

compile-lucene-core:

-check-git-state:

-git-cleanroot:

-copy-git-state:

git-autoclean:

ivy-availability-check:
[loadresource] Do not set property disallowed.ivy.jars.list as its length is 0.

-ivy-fail-disallowed-ivy-version:

ivy-fail:

ivy-configure:
[ivy:configure] :: loading settings :: file = /export/home/jenkins/workspace/Lucene-Solr-7.x-Solaris/lucene/top-level-ivy-settings.xml

resolve:

init:

-clover.disable:

-clover.load:

-clover.classpath:

-clover.setup:

clover:

compile-core:

init:

-clover.disable:

-clover.load:

-clover.classpath:

-clover.setup:

clover:

common.compile-core:
    [mkdir] Created dir: /export/home/jenkins/workspace/Lucene-Solr-7.x-Solaris/lucene/build/queries/classes/java
    [javac] Compiling 86 source files to /export/home/jenkins/workspace/Lucene-Solr-7.x-Solaris/lucene/build/queries/classes/java
    [javac] /export/home/jenkins/workspace/Lucene-Solr-7.x-Solaris/lucene/queries/src/java/org/apache/lucene/queries/function/FunctionQuery.java:59: warning: [rawtypes] found raw type: Map
    [javac]     protected final Map context;
    [javac]                     ^
    [javac]   missing type arguments for generic class Map<K,V>
    [javac]   where K,V are type-variables:
    [javac]     K extends Object declared in interface Map
    [javac]     V extends Object declared in interface Map
    [javac] /export/home/jenkins/workspace/Lucene-Solr-7.x-Solaris/lucene/queries/src/java/org/apache/lucene/queries/function/ValueSource.java:54: warning: [rawtypes] found raw type: Map
    [javac]   public abstract FunctionValues getValues(Map context, LeafReaderContext readerContext) throws IOException;
    [javac]                                            ^
    [javac]   missing type arguments for generic class Map<K,V>
    [javac]   where K,V are type-variables:
    [javac]     K extends Object declared in interface Map
    [javac]     V extends Object declared in interface Map
    [javac] /export/home/jenkins/workspace/Lucene-Solr-7.x-Solaris/lucene/queries/src/java/org/apache/lucene/queries/function/ValueSource.java:78: warning: [rawtypes] found raw type: Map
    [javac]   public void createWeight(Map context, IndexSearcher searcher) throws IOException {
    [javac]                            ^
    [javac]   missing type arguments for generic class Map<K,V>
    [javac]   where K,V are type-variables:
    [javac]     K extends Object declared in interface Map
    [javac]     V extends Object declared in interface Map
    [javac] /export/home/jenkins/workspace/Lucene-Solr-7.x-Solaris/lucene/queries/src/java/org/apache/lucene/queries/function/ValueSource.java:84: warning: [rawtypes] found raw type: Map
    [javac]   public static Map newContext(IndexSearcher searcher) {
    [javac]                 ^
    [javac]   missing type arguments for generic class Map<K,V>
    [javac]   where K,V are type-variables:
    [javac]     K extends Object declared in interface Map
    [javac]     V extends Object declared in interface Map
    [javac] /export/home/jenkins/workspace/Lucene-Solr-7.x-Solaris/lucene/queries/src/java/org/apache/lucene/queries/function/ValueSource.java:85: warning: [rawtypes] found raw type: Map
    [javac]     Map context = new IdentityHashMap();
    [javac]     ^
    [javac]   missing type arguments for generic class Map<K,V>
    [javac]   where K,V are type-variables:
    [javac]     K extends Object declared in interface Map
    [javac]     V extends Object declared in interface Map
    [javac] /export/home/jenkins/workspace/Lucene-Solr-7.x-Solaris/lucene/queries/src/java/org/apache/lucene/queries/function/ValueSource.java:85: warning: [rawtypes] found raw type: IdentityHashMap
    [javac]     Map context = new IdentityHashMap();
    [javac]                       ^
    [javac]   missing type arguments for generic class IdentityHashMap<K,V>
    [javac]   where K,V are type-variables:
    [javac]     K extends Object declared in class IdentityHashMap
    [javac]     V extends Object declared in class IdentityHashMap
    [javac] /export/home/jenkins/workspace/Lucene-Solr-7.x-Solaris/lucene/queries/src/java/org/apache/lucene/queries/function/ValueSource.java:86: warning: [unchecked] unchecked call to put(K,V) as a member of the raw type Map
    [javac]     context.put("searcher", searcher);
    [javac]                ^
    [javac]   where K,V are type-variables:
    [javac]     K extends Object declared in interface Map
    [javac]     V extends Object declared in interface Map
    [javac] /export/home/jenkins/workspace/Lucene-Solr-7.x-Solaris/lucene/queries/src/java/org/apache/lucene/queries/function/ValueSource.java:132: warning: [rawtypes] found raw type: Map
    [javac]       Map context = new IdentityHashMap<>();
    [javac]       ^
    [javac]   missing type arguments for generic class Map<K,V>
    [javac]   where K,V are type-variables:
    [javac]     K extends Object declared in interface Map
    [javac]     V extends Object declared in interface Map
    [javac] /export/home/jenkins/workspace/Lucene-Solr-7.x-Solaris/lucene/queries/src/java/org/apache/lucene/queries/function/ValueSource.java:134: warning: [unchecked] unchecked call to put(K,V) as a member of the raw type Map
    [javac]       context.put("scorer", scorer);
    [javac]                  ^
    [javac]   where K,V are type-variables:
    [javac]     K extends Object declared in interface Map
    [javac]     V extends Object declared in interface Map
    [javac] /export/home/jenkins/workspace/Lucene-Solr-7.x-Solaris/lucene/queries/src/java/org/apache/lucene/queries/function/ValueSource.java:208: warning: [rawtypes] found raw type: Map
    [javac]       Map context = new HashMap<>();
    [javac]       ^
    [javac]   missing type arguments for generic class Map<K,V>
    [javac]   where K,V are type-variables:
    [javac]     K extends Object declared in interface Map
    [javac]     V extends Object declared in interface Map
    [javac] /export/home/jenkins/workspace/Lucene-Solr-7.x-Solaris/lucene/queries/src/java/org/apache/lucene/queries/function/ValueSource.java:210: warning: [unchecked] unchecked call to put(K,V) as a member of the raw type Map
    [javac]       context.put("scorer", scorer);
    [javac]                  ^
    [javac]   where K,V are type-variables:
    [javac]     K extends Object declared in interface Map
    [javac]     V extends Object declared in interface Map
    [javac] /export/home/jenkins/workspace/Lucene-Solr-7.x-Solaris/lucene/queries/src/java/org/apache/lucene/queries/function/ValueSource.java:211: warning: [unchecked] unchecked call to put(K,V) as a member of the raw type Map
    [javac]       context.put("searcher", searcher);
    [javac]                  ^
    [javac]   where K,V are type-variables:
    [javac]     K extends Object declared in interface Map
    [javac]     V extends Object declared in interface Map
    [javac] /export/home/jenkins/workspace/Lucene-Solr-7.x-Solaris/lucene/queries/src/java/org/apache/lucene/queries/function/ValueSource.java:245: warning: [rawtypes] found raw type: Map
    [javac]       Map context = new HashMap<>();
    [javac]       ^
    [javac]   missing type arguments for generic class Map<K,V>
    [javac]   where K,V are type-variables:
    [javac]     K extends Object declared in interface Map
    [javac]     V extends Object declared in interface Map
    [javac] /export/home/jenkins/workspace/Lucene-Solr-7.x-Solaris/lucene/queries/src/java/org/apache/lucene/queries/function/ValueSource.java:248: warning: [unchecked] unchecked call to put(K,V) as a member of the raw type Map
    [javac]       context.put("scorer", scorer);
    [javac]                  ^
    [javac]   where K,V are type-variables:
    [javac]     K extends Object declared in interface Map
    [javac]     V extends Object declared in interface Map
    [javac] /export/home/jenkins/workspace/Lucene-Solr-7.x-Solaris/lucene/queries/src/java/org/apache/lucene/queries/function/ValueSource.java:249: warning: [un

[...truncated too long message...]

0)
   [junit4]    > 	at org.apache.solr.handler.extraction.ExtractingRequestHandlerTest.beforeClass(ExtractingRequestHandlerTest.java:50)
   [junit4]    > 	at java.lang.Thread.run(Thread.java:748)
   [junit4] Completed [1/5 (1!)] on J1 in 1.89s, 0 tests, 1 failure <<< FAILURES!
   [junit4] 
   [junit4] Suite: org.apache.solr.handler.extraction.ExtractingRequestHandlerTest
   [junit4]   2> ERROR StatusLogger No Log4j 2 configuration file found. Using default configuration (logging only errors to the console), or user programmatically provided configurations. Set system property 'log4j2.debug' to show Log4j 2 internal initialization logging. See https://logging.apache.org/log4j/2.x/manual/configuration.html for instructions on how to configure Log4j 2
   [junit4]   2> Creating dataDir: /export/home/jenkins/workspace/Lucene-Solr-7.x-Solaris/solr/build/contrib/solr-cell/test/J0/temp/solr.handler.extraction.ExtractingRequestHandlerTest_B4BB8D072ABBC41E-001/init-core-data-001
   [junit4]   2> NOTE: test params are: codec=Asserting(Lucene70): {}, docValues:{}, maxPointsInLeafNode=1995, maxMBSortInHeap=6.255422242273797, sim=RandomSimilarity(queryNorm=false): {}, locale=en-CA, timezone=Pacific/Guam
   [junit4]   2> NOTE: SunOS 5.11 amd64/Oracle Corporation 1.8.0_191 (64-bit)/cpus=3,threads=1,free=58250904,total=97320960
   [junit4]   2> NOTE: All tests run in this JVM: [ExtractingRequestHandlerTest]
   [junit4]   2> NOTE: reproduce with: ant test  -Dtestcase=ExtractingRequestHandlerTest -Dtests.seed=B4BB8D072ABBC41E -Dtests.slow=true -Dtests.badapples=true -Dtests.locale=en-CA -Dtests.timezone=Pacific/Guam -Dtests.asserts=true -Dtests.file.encoding=UTF-8
   [junit4] ERROR   0.00s J0 | ExtractingRequestHandlerTest (suite) <<<
   [junit4]    > Throwable #1: java.lang.AssertionError: Is some other JVM affected?  Or bad regex? TzDisplayName: ChST
   [junit4]    > 	at __randomizedtesting.SeedInfo.seed([B4BB8D072ABBC41E]:0)
   [junit4]    > 	at org.apache.solr.handler.extraction.ExtractingRequestHandlerTest.beforeClass(ExtractingRequestHandlerTest.java:50)
   [junit4]    > 	at java.lang.Thread.run(Thread.java:748)
   [junit4] Completed [2/5 (2!)] on J0 in 1.96s, 0 tests, 1 failure <<< FAILURES!
   [junit4] 
   [junit4] Duplicate suite name used with XML reports: org.apache.solr.handler.extraction.ExtractingRequestHandlerTest. This may confuse tools that process XML reports. Set 'ignoreDuplicateSuites' to true to skip this message.
   [junit4] Suite: org.apache.solr.handler.extraction.ExtractingRequestHandlerTest
   [junit4]   2> Creating dataDir: /export/home/jenkins/workspace/Lucene-Solr-7.x-Solaris/solr/build/contrib/solr-cell/test/J0/temp/solr.handler.extraction.ExtractingRequestHandlerTest_B4BB8D072ABBC41E-001/init-core-data-001
   [junit4]   2> NOTE: test params are: codec=Asserting(Lucene70): {}, docValues:{}, maxPointsInLeafNode=1995, maxMBSortInHeap=6.255422242273797, sim=RandomSimilarity(queryNorm=false): {}, locale=en-CA, timezone=Pacific/Guam
   [junit4]   2> NOTE: SunOS 5.11 amd64/Oracle Corporation 1.8.0_191 (64-bit)/cpus=3,threads=1,free=58106496,total=97320960
   [junit4]   2> NOTE: All tests run in this JVM: [ExtractingRequestHandlerTest, ExtractingRequestHandlerTest]
   [junit4]   2> NOTE: reproduce with: ant test  -Dtestcase=ExtractingRequestHandlerTest -Dtests.seed=B4BB8D072ABBC41E -Dtests.slow=true -Dtests.badapples=true -Dtests.locale=en-CA -Dtests.timezone=Pacific/Guam -Dtests.asserts=true -Dtests.file.encoding=UTF-8
   [junit4] ERROR   0.00s J0 | ExtractingRequestHandlerTest (suite) <<<
   [junit4]    > Throwable #1: java.lang.AssertionError: Is some other JVM affected?  Or bad regex? TzDisplayName: ChST
   [junit4]    > 	at __randomizedtesting.SeedInfo.seed([B4BB8D072ABBC41E]:0)
   [junit4]    > 	at org.apache.solr.handler.extraction.ExtractingRequestHandlerTest.beforeClass(ExtractingRequestHandlerTest.java:50)
   [junit4]    > 	at java.lang.Thread.run(Thread.java:748)
   [junit4] Completed [3/5 (3!)] on J0 in 0.05s, 0 tests, 1 failure <<< FAILURES!
   [junit4] 
   [junit4] Suite: org.apache.solr.handler.extraction.ExtractingRequestHandlerTest
   [junit4]   2> Creating dataDir: /export/home/jenkins/workspace/Lucene-Solr-7.x-Solaris/solr/build/contrib/solr-cell/test/J1/temp/solr.handler.extraction.ExtractingRequestHandlerTest_B4BB8D072ABBC41E-001/init-core-data-001
   [junit4]   2> NOTE: test params are: codec=Asserting(Lucene70): {}, docValues:{}, maxPointsInLeafNode=1995, maxMBSortInHeap=6.255422242273797, sim=RandomSimilarity(queryNorm=false): {}, locale=en-CA, timezone=Pacific/Guam
   [junit4]   2> NOTE: SunOS 5.11 amd64/Oracle Corporation 1.8.0_191 (64-bit)/cpus=3,threads=1,free=57661376,total=97320960
   [junit4]   2> NOTE: All tests run in this JVM: [ExtractingRequestHandlerTest, ExtractingRequestHandlerTest]
   [junit4]   2> NOTE: reproduce with: ant test  -Dtestcase=ExtractingRequestHandlerTest -Dtests.seed=B4BB8D072ABBC41E -Dtests.slow=true -Dtests.badapples=true -Dtests.locale=en-CA -Dtests.timezone=Pacific/Guam -Dtests.asserts=true -Dtests.file.encoding=UTF-8
   [junit4] ERROR   0.00s J1 | ExtractingRequestHandlerTest (suite) <<<
   [junit4]    > Throwable #1: java.lang.AssertionError: Is some other JVM affected?  Or bad regex? TzDisplayName: ChST
   [junit4]    > 	at __randomizedtesting.SeedInfo.seed([B4BB8D072ABBC41E]:0)
   [junit4]    > 	at org.apache.solr.handler.extraction.ExtractingRequestHandlerTest.beforeClass(ExtractingRequestHandlerTest.java:50)
   [junit4]    > 	at java.lang.Thread.run(Thread.java:748)
   [junit4] Completed [4/5 (4!)] on J1 in 0.03s, 0 tests, 1 failure <<< FAILURES!
   [junit4] 
   [junit4] Suite: org.apache.solr.handler.extraction.ExtractingRequestHandlerTest
   [junit4]   2> Creating dataDir: /export/home/jenkins/workspace/Lucene-Solr-7.x-Solaris/solr/build/contrib/solr-cell/test/J0/temp/solr.handler.extraction.ExtractingRequestHandlerTest_B4BB8D072ABBC41E-001/init-core-data-001
   [junit4]   2> NOTE: test params are: codec=Asserting(Lucene70): {}, docValues:{}, maxPointsInLeafNode=1995, maxMBSortInHeap=6.255422242273797, sim=RandomSimilarity(queryNorm=false): {}, locale=en-CA, timezone=Pacific/Guam
   [junit4]   2> NOTE: SunOS 5.11 amd64/Oracle Corporation 1.8.0_191 (64-bit)/cpus=3,threads=1,free=61003480,total=97320960
   [junit4]   2> NOTE: All tests run in this JVM: [ExtractingRequestHandlerTest, ExtractingRequestHandlerTest, ExtractingRequestHandlerTest]
   [junit4]   2> NOTE: reproduce with: ant test  -Dtestcase=ExtractingRequestHandlerTest -Dtests.seed=B4BB8D072ABBC41E -Dtests.slow=true -Dtests.badapples=true -Dtests.locale=en-CA -Dtests.timezone=Pacific/Guam -Dtests.asserts=true -Dtests.file.encoding=UTF-8
   [junit4] ERROR   0.00s J0 | ExtractingRequestHandlerTest (suite) <<<
   [junit4]    > Throwable #1: java.lang.AssertionError: Is some other JVM affected?  Or bad regex? TzDisplayName: ChST
   [junit4]    > 	at __randomizedtesting.SeedInfo.seed([B4BB8D072ABBC41E]:0)
   [junit4]    > 	at org.apache.solr.handler.extraction.ExtractingRequestHandlerTest.beforeClass(ExtractingRequestHandlerTest.java:50)
   [junit4]    > 	at java.lang.Thread.run(Thread.java:748)
   [junit4] Completed [5/5 (5!)] on J0 in 0.03s, 0 tests, 1 failure <<< FAILURES!
   [junit4] 
   [junit4] 
   [junit4] Tests with failures [seed: B4BB8D072ABBC41E]:
   [junit4]   - org.apache.solr.handler.extraction.ExtractingRequestHandlerTest (suite)
   [junit4]   - org.apache.solr.handler.extraction.ExtractingRequestHandlerTest (suite)
   [junit4]   - org.apache.solr.handler.extraction.ExtractingRequestHandlerTest (suite)
   [junit4]   - org.apache.solr.handler.extraction.ExtractingRequestHandlerTest (suite)
   [junit4]   - org.apache.solr.handler.extraction.ExtractingRequestHandlerTest (suite)
   [junit4] 
   [junit4] 
   [junit4] JVM J0:     0.75 ..     3.91 =     3.17s
   [junit4] JVM J1:     0.74 ..     3.89 =     3.15s
   [junit4] Execution time total: 3.92 sec.
   [junit4] Tests summary: 5 suites, 0 tests, 5 suite-level errors

BUILD FAILED
/export/home/jenkins/workspace/Lucene-Solr-7.x-Solaris/lucene/common-build.xml:1567: The following error occurred while executing this line:
/export/home/jenkins/workspace/Lucene-Solr-7.x-Solaris/lucene/common-build.xml:1092: There were test failures: 5 suites, 0 tests, 5 suite-level errors [seed: B4BB8D072ABBC41E]

Total time: 5 seconds

[repro] Setting last failure code to 256

[repro] Failures:
[repro]   5/5 failed: org.apache.solr.handler.extraction.ExtractingRequestHandlerTest
[repro] Exiting with code 256
+ mv lucene/build lucene/build.repro
+ mv solr/build solr/build.repro
+ mv lucene/build.orig lucene/build
+ mv solr/build.orig solr/build
Archiving artifacts
Setting ANT_1_8_2_HOME=/export/home/jenkins/tools/hudson.tasks.Ant_AntInstallation/ANT_1.8.2
[WARNINGS] Parsing warnings in console log with parser Java Compiler (javac)
Setting ANT_1_8_2_HOME=/export/home/jenkins/tools/hudson.tasks.Ant_AntInstallation/ANT_1.8.2
Setting ANT_1_8_2_HOME=/export/home/jenkins/tools/hudson.tasks.Ant_AntInstallation/ANT_1.8.2
<Git Blamer> Using GitBlamer to create author and commit information for all warnings.
<Git Blamer> GIT_COMMIT=d214f968d765e5c30c8782c5545c38d9aef487fe, workspace=/export/home/jenkins/workspace/Lucene-Solr-7.x-Solaris
[WARNINGS] Computing warning deltas based on reference build #898
Recording test results
Setting ANT_1_8_2_HOME=/export/home/jenkins/tools/hudson.tasks.Ant_AntInstallation/ANT_1.8.2
Build step 'Publish JUnit test result report' changed build result to UNSTABLE
Email was triggered for: Unstable (Test Failures)
Sending email for trigger: Unstable (Test Failures)
Setting ANT_1_8_2_HOME=/export/home/jenkins/tools/hudson.tasks.Ant_AntInstallation/ANT_1.8.2
Setting ANT_1_8_2_HOME=/export/home/jenkins/tools/hudson.tasks.Ant_AntInstallation/ANT_1.8.2
Setting ANT_1_8_2_HOME=/export/home/jenkins/tools/hudson.tasks.Ant_AntInstallation/ANT_1.8.2
Setting ANT_1_8_2_HOME=/export/home/jenkins/tools/hudson.tasks.Ant_AntInstallation/ANT_1.8.2

Mime
View raw message