lucene-dev mailing list archives

Site index · List index
Message view « Date » · « Thread »
Top « Date » · « Thread »
From Policeman Jenkins Server <jenk...@thetaphi.de>
Subject [JENKINS] Lucene-Solr-7.x-Solaris (64bit/jdk1.8.0) - Build # 908 - Unstable!
Date Thu, 15 Nov 2018 12:04:16 GMT
Build: https://jenkins.thetaphi.de/job/Lucene-Solr-7.x-Solaris/908/
Java: 64bit/jdk1.8.0 -XX:-UseCompressedOops -XX:+UseSerialGC

4 tests failed.
FAILED:  junit.framework.TestSuite.org.apache.solr.rest.TestManagedResourceStorage

Error Message:
SolrCore.getOpenCount()==2

Stack Trace:
java.lang.RuntimeException: SolrCore.getOpenCount()==2
	at __randomizedtesting.SeedInfo.seed([FBB9BBBE6540BB3E]:0)
	at org.apache.solr.util.TestHarness.close(TestHarness.java:380)
	at org.apache.solr.SolrTestCaseJ4.deleteCore(SolrTestCaseJ4.java:802)
	at org.apache.solr.cloud.AbstractZkTestCase.azt_afterClass(AbstractZkTestCase.java:147)
	at sun.reflect.NativeMethodAccessorImpl.invoke0(Native Method)
	at sun.reflect.NativeMethodAccessorImpl.invoke(NativeMethodAccessorImpl.java:62)
	at sun.reflect.DelegatingMethodAccessorImpl.invoke(DelegatingMethodAccessorImpl.java:43)
	at java.lang.reflect.Method.invoke(Method.java:498)
	at com.carrotsearch.randomizedtesting.RandomizedRunner.invoke(RandomizedRunner.java:1742)
	at com.carrotsearch.randomizedtesting.RandomizedRunner$7.evaluate(RandomizedRunner.java:898)
	at com.carrotsearch.randomizedtesting.rules.StatementAdapter.evaluate(StatementAdapter.java:36)
	at com.carrotsearch.randomizedtesting.rules.SystemPropertiesRestoreRule$1.evaluate(SystemPropertiesRestoreRule.java:57)
	at org.apache.lucene.util.AbstractBeforeAfterRule$1.evaluate(AbstractBeforeAfterRule.java:45)
	at com.carrotsearch.randomizedtesting.rules.StatementAdapter.evaluate(StatementAdapter.java:36)
	at org.apache.lucene.util.TestRuleStoreClassName$1.evaluate(TestRuleStoreClassName.java:41)
	at com.carrotsearch.randomizedtesting.rules.NoShadowingOrOverridesOnMethodsRule$1.evaluate(NoShadowingOrOverridesOnMethodsRule.java:40)
	at com.carrotsearch.randomizedtesting.rules.NoShadowingOrOverridesOnMethodsRule$1.evaluate(NoShadowingOrOverridesOnMethodsRule.java:40)
	at com.carrotsearch.randomizedtesting.rules.StatementAdapter.evaluate(StatementAdapter.java:36)
	at com.carrotsearch.randomizedtesting.rules.StatementAdapter.evaluate(StatementAdapter.java:36)
	at com.carrotsearch.randomizedtesting.rules.StatementAdapter.evaluate(StatementAdapter.java:36)
	at org.apache.lucene.util.TestRuleAssertionsRequired$1.evaluate(TestRuleAssertionsRequired.java:53)
	at org.apache.lucene.util.TestRuleMarkFailure$1.evaluate(TestRuleMarkFailure.java:47)
	at org.apache.lucene.util.TestRuleIgnoreAfterMaxFailures$1.evaluate(TestRuleIgnoreAfterMaxFailures.java:64)
	at org.apache.lucene.util.TestRuleIgnoreTestSuites$1.evaluate(TestRuleIgnoreTestSuites.java:54)
	at com.carrotsearch.randomizedtesting.rules.StatementAdapter.evaluate(StatementAdapter.java:36)
	at com.carrotsearch.randomizedtesting.ThreadLeakControl$StatementRunner.run(ThreadLeakControl.java:368)
	at java.lang.Thread.run(Thread.java:748)


FAILED:  junit.framework.TestSuite.org.apache.solr.rest.TestManagedResourceStorage

Error Message:
SolrCore.getOpenCount()==2

Stack Trace:
java.lang.RuntimeException: SolrCore.getOpenCount()==2
	at __randomizedtesting.SeedInfo.seed([FBB9BBBE6540BB3E]:0)
	at org.apache.solr.util.TestHarness.close(TestHarness.java:380)
	at org.apache.solr.SolrTestCaseJ4.deleteCore(SolrTestCaseJ4.java:802)
	at org.apache.solr.SolrTestCaseJ4.teardownTestCases(SolrTestCaseJ4.java:297)
	at sun.reflect.GeneratedMethodAccessor64.invoke(Unknown Source)
	at sun.reflect.DelegatingMethodAccessorImpl.invoke(DelegatingMethodAccessorImpl.java:43)
	at java.lang.reflect.Method.invoke(Method.java:498)
	at com.carrotsearch.randomizedtesting.RandomizedRunner.invoke(RandomizedRunner.java:1742)
	at com.carrotsearch.randomizedtesting.RandomizedRunner$7.evaluate(RandomizedRunner.java:898)
	at com.carrotsearch.randomizedtesting.rules.StatementAdapter.evaluate(StatementAdapter.java:36)
	at com.carrotsearch.randomizedtesting.rules.SystemPropertiesRestoreRule$1.evaluate(SystemPropertiesRestoreRule.java:57)
	at org.apache.lucene.util.AbstractBeforeAfterRule$1.evaluate(AbstractBeforeAfterRule.java:45)
	at com.carrotsearch.randomizedtesting.rules.StatementAdapter.evaluate(StatementAdapter.java:36)
	at org.apache.lucene.util.TestRuleStoreClassName$1.evaluate(TestRuleStoreClassName.java:41)
	at com.carrotsearch.randomizedtesting.rules.NoShadowingOrOverridesOnMethodsRule$1.evaluate(NoShadowingOrOverridesOnMethodsRule.java:40)
	at com.carrotsearch.randomizedtesting.rules.NoShadowingOrOverridesOnMethodsRule$1.evaluate(NoShadowingOrOverridesOnMethodsRule.java:40)
	at com.carrotsearch.randomizedtesting.rules.StatementAdapter.evaluate(StatementAdapter.java:36)
	at com.carrotsearch.randomizedtesting.rules.StatementAdapter.evaluate(StatementAdapter.java:36)
	at com.carrotsearch.randomizedtesting.rules.StatementAdapter.evaluate(StatementAdapter.java:36)
	at org.apache.lucene.util.TestRuleAssertionsRequired$1.evaluate(TestRuleAssertionsRequired.java:53)
	at org.apache.lucene.util.TestRuleMarkFailure$1.evaluate(TestRuleMarkFailure.java:47)
	at org.apache.lucene.util.TestRuleIgnoreAfterMaxFailures$1.evaluate(TestRuleIgnoreAfterMaxFailures.java:64)
	at org.apache.lucene.util.TestRuleIgnoreTestSuites$1.evaluate(TestRuleIgnoreTestSuites.java:54)
	at com.carrotsearch.randomizedtesting.rules.StatementAdapter.evaluate(StatementAdapter.java:36)
	at com.carrotsearch.randomizedtesting.ThreadLeakControl$StatementRunner.run(ThreadLeakControl.java:368)
	at java.lang.Thread.run(Thread.java:748)


FAILED:  junit.framework.TestSuite.org.apache.solr.rest.TestManagedResourceStorage

Error Message:
25 threads leaked from SUITE scope at org.apache.solr.rest.TestManagedResourceStorage:     1) Thread[id=35435, name=SolrRrdBackendFactory-13432-thread-1, state=TIMED_WAITING, group=TGRP-TestManagedResourceStorage]         at sun.misc.Unsafe.park(Native Method)         at java.util.concurrent.locks.LockSupport.parkNanos(LockSupport.java:215)         at java.util.concurrent.locks.AbstractQueuedSynchronizer$ConditionObject.awaitNanos(AbstractQueuedSynchronizer.java:2078)         at java.util.concurrent.ScheduledThreadPoolExecutor$DelayedWorkQueue.take(ScheduledThreadPoolExecutor.java:1093)         at java.util.concurrent.ScheduledThreadPoolExecutor$DelayedWorkQueue.take(ScheduledThreadPoolExecutor.java:809)         at java.util.concurrent.ThreadPoolExecutor.getTask(ThreadPoolExecutor.java:1074)         at java.util.concurrent.ThreadPoolExecutor.runWorker(ThreadPoolExecutor.java:1134)         at java.util.concurrent.ThreadPoolExecutor$Worker.run(ThreadPoolExecutor.java:624)         at java.lang.Thread.run(Thread.java:748)    2) Thread[id=35404, name=NIOServerCxn.Factory:0.0.0.0/0.0.0.0:0, state=RUNNABLE, group=TGRP-TestManagedResourceStorage]         at sun.nio.ch.DevPollArrayWrapper.poll0(Native Method)         at sun.nio.ch.DevPollArrayWrapper.poll(DevPollArrayWrapper.java:223)         at sun.nio.ch.DevPollSelectorImpl.doSelect(DevPollSelectorImpl.java:98)         at sun.nio.ch.SelectorImpl.lockAndDoSelect(SelectorImpl.java:86)         at sun.nio.ch.SelectorImpl.select(SelectorImpl.java:97)         at org.apache.zookeeper.server.NIOServerCnxnFactory.run(NIOServerCnxnFactory.java:196)         at java.lang.Thread.run(Thread.java:748)    3) Thread[id=35420, name=SUITE-TestManagedResourceStorage-seed#[FBB9BBBE6540BB3E]-worker-SendThread(127.0.0.1:41549), state=RUNNABLE, group=TGRP-TestManagedResourceStorage]         at sun.nio.ch.DevPollArrayWrapper.poll0(Native Method)         at sun.nio.ch.DevPollArrayWrapper.poll(DevPollArrayWrapper.java:223)         at sun.nio.ch.DevPollSelectorImpl.doSelect(DevPollSelectorImpl.java:98)         at sun.nio.ch.SelectorImpl.lockAndDoSelect(SelectorImpl.java:86)         at sun.nio.ch.SelectorImpl.select(SelectorImpl.java:97)         at org.apache.zookeeper.ClientCnxnSocketNIO.doTransport(ClientCnxnSocketNIO.java:349)         at org.apache.zookeeper.ClientCnxn$SendThread.run(ClientCnxn.java:1144)    4) Thread[id=35415, name=Connection evictor, state=TIMED_WAITING, group=TGRP-TestManagedResourceStorage]         at java.lang.Thread.sleep(Native Method)         at org.apache.http.impl.client.IdleConnectionEvictor$1.run(IdleConnectionEvictor.java:66)         at java.lang.Thread.run(Thread.java:748)    5) Thread[id=35433, name=ScheduledTrigger-13428-thread-3, state=WAITING, group=TGRP-TestManagedResourceStorage]         at sun.misc.Unsafe.park(Native Method)         at java.util.concurrent.locks.LockSupport.park(LockSupport.java:175)         at java.util.concurrent.locks.AbstractQueuedSynchronizer$ConditionObject.await(AbstractQueuedSynchronizer.java:2039)         at java.util.concurrent.ScheduledThreadPoolExecutor$DelayedWorkQueue.take(ScheduledThreadPoolExecutor.java:1088)         at java.util.concurrent.ScheduledThreadPoolExecutor$DelayedWorkQueue.take(ScheduledThreadPoolExecutor.java:809)         at java.util.concurrent.ThreadPoolExecutor.getTask(ThreadPoolExecutor.java:1074)         at java.util.concurrent.ThreadPoolExecutor.runWorker(ThreadPoolExecutor.java:1134)         at java.util.concurrent.ThreadPoolExecutor$Worker.run(ThreadPoolExecutor.java:624)         at java.lang.Thread.run(Thread.java:748)    6) Thread[id=35405, name=SessionTracker, state=TIMED_WAITING, group=TGRP-TestManagedResourceStorage]         at java.lang.Object.wait(Native Method)         at org.apache.zookeeper.server.SessionTrackerImpl.run(SessionTrackerImpl.java:147)    7) Thread[id=35444, name=SolrRrdBackendFactory-13432-thread-2, state=WAITING, group=TGRP-TestManagedResourceStorage]         at sun.misc.Unsafe.park(Native Method)         at java.util.concurrent.locks.LockSupport.park(LockSupport.java:175)         at java.util.concurrent.locks.AbstractQueuedSynchronizer$ConditionObject.await(AbstractQueuedSynchronizer.java:2039)         at java.util.concurrent.ScheduledThreadPoolExecutor$DelayedWorkQueue.take(ScheduledThreadPoolExecutor.java:1088)         at java.util.concurrent.ScheduledThreadPoolExecutor$DelayedWorkQueue.take(ScheduledThreadPoolExecutor.java:809)         at java.util.concurrent.ThreadPoolExecutor.getTask(ThreadPoolExecutor.java:1074)         at java.util.concurrent.ThreadPoolExecutor.runWorker(ThreadPoolExecutor.java:1134)         at java.util.concurrent.ThreadPoolExecutor$Worker.run(ThreadPoolExecutor.java:624)         at java.lang.Thread.run(Thread.java:748)    8) Thread[id=35426, name=zkConnectionManagerCallback-11562-thread-1, state=WAITING, group=TGRP-TestManagedResourceStorage]         at sun.misc.Unsafe.park(Native Method)         at java.util.concurrent.locks.LockSupport.park(LockSupport.java:175)         at java.util.concurrent.locks.AbstractQueuedSynchronizer$ConditionObject.await(AbstractQueuedSynchronizer.java:2039)         at java.util.concurrent.LinkedBlockingQueue.take(LinkedBlockingQueue.java:442)         at java.util.concurrent.ThreadPoolExecutor.getTask(ThreadPoolExecutor.java:1074)         at java.util.concurrent.ThreadPoolExecutor.runWorker(ThreadPoolExecutor.java:1134)         at java.util.concurrent.ThreadPoolExecutor$Worker.run(ThreadPoolExecutor.java:624)         at java.lang.Thread.run(Thread.java:748)    9) Thread[id=35414, name=Connection evictor, state=TIMED_WAITING, group=TGRP-TestManagedResourceStorage]         at java.lang.Thread.sleep(Native Method)         at org.apache.http.impl.client.IdleConnectionEvictor$1.run(IdleConnectionEvictor.java:66)         at java.lang.Thread.run(Thread.java:748)   10) Thread[id=35425, name=SUITE-TestManagedResourceStorage-seed#[FBB9BBBE6540BB3E]-worker-EventThread, state=WAITING, group=TGRP-TestManagedResourceStorage]         at sun.misc.Unsafe.park(Native Method)         at java.util.concurrent.locks.LockSupport.park(LockSupport.java:175)         at java.util.concurrent.locks.AbstractQueuedSynchronizer$ConditionObject.await(AbstractQueuedSynchronizer.java:2039)         at java.util.concurrent.LinkedBlockingQueue.take(LinkedBlockingQueue.java:442)         at org.apache.zookeeper.ClientCnxn$EventThread.run(ClientCnxn.java:502)   11) Thread[id=35403, name=Thread-5741, state=WAITING, group=TGRP-TestManagedResourceStorage]         at java.lang.Object.wait(Native Method)         at java.lang.Thread.join(Thread.java:1252)         at java.lang.Thread.join(Thread.java:1326)         at org.apache.zookeeper.server.NIOServerCnxnFactory.join(NIOServerCnxnFactory.java:313)         at org.apache.solr.cloud.ZkTestServer$ZKServerMain.runFromConfig(ZkTestServer.java:313)         at org.apache.solr.cloud.ZkTestServer$2.run(ZkTestServer.java:496)   12) Thread[id=35430, name=ScheduledTrigger-13428-thread-1, state=WAITING, group=TGRP-TestManagedResourceStorage]         at sun.misc.Unsafe.park(Native Method)         at java.util.concurrent.locks.LockSupport.park(LockSupport.java:175)         at java.util.concurrent.locks.AbstractQueuedSynchronizer$ConditionObject.await(AbstractQueuedSynchronizer.java:2039)         at java.util.concurrent.ScheduledThreadPoolExecutor$DelayedWorkQueue.take(ScheduledThreadPoolExecutor.java:1088)         at java.util.concurrent.ScheduledThreadPoolExecutor$DelayedWorkQueue.take(ScheduledThreadPoolExecutor.java:809)         at java.util.concurrent.ThreadPoolExecutor.getTask(ThreadPoolExecutor.java:1074)         at java.util.concurrent.ThreadPoolExecutor.runWorker(ThreadPoolExecutor.java:1134)         at java.util.concurrent.ThreadPoolExecutor$Worker.run(ThreadPoolExecutor.java:624)         at java.lang.Thread.run(Thread.java:748)   13) Thread[id=35423, name=OverseerStateUpdate-72063507136970755-127.0.0.1:8983_-n_0000000000, state=TIMED_WAITING, group=Overseer state updater.]         at sun.misc.Unsafe.park(Native Method)         at java.util.concurrent.locks.LockSupport.parkNanos(LockSupport.java:215)         at java.util.concurrent.locks.AbstractQueuedSynchronizer$ConditionObject.awaitNanos(AbstractQueuedSynchronizer.java:2078)         at org.apache.solr.cloud.ZkDistributedQueue.peekElements(ZkDistributedQueue.java:463)         at org.apache.solr.cloud.Overseer$ClusterStateUpdater.run(Overseer.java:207)         at java.lang.Thread.run(Thread.java:748)   14) Thread[id=35434, name=ScheduledTrigger-13428-thread-4, state=WAITING, group=TGRP-TestManagedResourceStorage]         at sun.misc.Unsafe.park(Native Method)         at java.util.concurrent.locks.LockSupport.park(LockSupport.java:175)         at java.util.concurrent.locks.AbstractQueuedSynchronizer$ConditionObject.await(AbstractQueuedSynchronizer.java:2039)         at java.util.concurrent.ScheduledThreadPoolExecutor$DelayedWorkQueue.take(ScheduledThreadPoolExecutor.java:1088)         at java.util.concurrent.ScheduledThreadPoolExecutor$DelayedWorkQueue.take(ScheduledThreadPoolExecutor.java:809)         at java.util.concurrent.ThreadPoolExecutor.getTask(ThreadPoolExecutor.java:1074)         at java.util.concurrent.ThreadPoolExecutor.runWorker(ThreadPoolExecutor.java:1134)         at java.util.concurrent.ThreadPoolExecutor$Worker.run(ThreadPoolExecutor.java:624)         at java.lang.Thread.run(Thread.java:748)   15) Thread[id=35416, name=Connection evictor, state=TIMED_WAITING, group=TGRP-TestManagedResourceStorage]         at java.lang.Thread.sleep(Native Method)         at org.apache.http.impl.client.IdleConnectionEvictor$1.run(IdleConnectionEvictor.java:66)         at java.lang.Thread.run(Thread.java:748)   16) Thread[id=35427, name=OverseerCollectionConfigSetProcessor-72063507136970755-127.0.0.1:8983_-n_0000000000, state=TIMED_WAITING, group=Overseer collection creation process.]         at sun.misc.Unsafe.park(Native Method)         at java.util.concurrent.locks.LockSupport.parkNanos(LockSupport.java:215)         at java.util.concurrent.locks.AbstractQueuedSynchronizer$ConditionObject.awaitNanos(AbstractQueuedSynchronizer.java:2078)         at org.apache.solr.cloud.ZkDistributedQueue.peekElements(ZkDistributedQueue.java:463)         at org.apache.solr.cloud.OverseerTaskQueue.peekTopN(OverseerTaskQueue.java:243)         at org.apache.solr.cloud.OverseerTaskProcessor.run(OverseerTaskProcessor.java:233)         at java.lang.Thread.run(Thread.java:748)   17) Thread[id=35431, name=ScheduledTrigger-13428-thread-2, state=TIMED_WAITING, group=TGRP-TestManagedResourceStorage]         at sun.misc.Unsafe.park(Native Method)         at java.util.concurrent.locks.LockSupport.parkNanos(LockSupport.java:215)         at java.util.concurrent.locks.AbstractQueuedSynchronizer$ConditionObject.awaitNanos(AbstractQueuedSynchronizer.java:2078)         at java.util.concurrent.ScheduledThreadPoolExecutor$DelayedWorkQueue.take(ScheduledThreadPoolExecutor.java:1093)         at java.util.concurrent.ScheduledThreadPoolExecutor$DelayedWorkQueue.take(ScheduledThreadPoolExecutor.java:809)         at java.util.concurrent.ThreadPoolExecutor.getTask(ThreadPoolExecutor.java:1074)         at java.util.concurrent.ThreadPoolExecutor.runWorker(ThreadPoolExecutor.java:1134)         at java.util.concurrent.ThreadPoolExecutor$Worker.run(ThreadPoolExecutor.java:624)         at java.lang.Thread.run(Thread.java:748)   18) Thread[id=35441, name=searcherExecutor-13435-thread-1, state=WAITING, group=TGRP-TestManagedResourceStorage]         at sun.misc.Unsafe.park(Native Method)         at java.util.concurrent.locks.LockSupport.park(LockSupport.java:175)         at java.util.concurrent.locks.AbstractQueuedSynchronizer$ConditionObject.await(AbstractQueuedSynchronizer.java:2039)         at java.util.concurrent.LinkedBlockingQueue.take(LinkedBlockingQueue.java:442)         at java.util.concurrent.ThreadPoolExecutor.getTask(ThreadPoolExecutor.java:1074)         at java.util.concurrent.ThreadPoolExecutor.runWorker(ThreadPoolExecutor.java:1134)         at java.util.concurrent.ThreadPoolExecutor$Worker.run(ThreadPoolExecutor.java:624)         at java.lang.Thread.run(Thread.java:748)   19) Thread[id=35422, name=zkConnectionManagerCallback-11555-thread-1, state=WAITING, group=TGRP-TestManagedResourceStorage]         at sun.misc.Unsafe.park(Native Method)         at java.util.concurrent.locks.LockSupport.park(LockSupport.java:175)         at java.util.concurrent.locks.AbstractQueuedSynchronizer$ConditionObject.await(AbstractQueuedSynchronizer.java:2039)         at java.util.concurrent.LinkedBlockingQueue.take(LinkedBlockingQueue.java:442)         at java.util.concurrent.ThreadPoolExecutor.getTask(ThreadPoolExecutor.java:1074)         at java.util.concurrent.ThreadPoolExecutor.runWorker(ThreadPoolExecutor.java:1134)         at java.util.concurrent.ThreadPoolExecutor$Worker.run(ThreadPoolExecutor.java:624)         at java.lang.Thread.run(Thread.java:748)   20) Thread[id=35436, name=MetricsHistoryHandler-13433-thread-1, state=WAITING, group=TGRP-TestManagedResourceStorage]         at sun.misc.Unsafe.park(Native Method)         at java.util.concurrent.locks.LockSupport.park(LockSupport.java:175)         at java.util.concurrent.locks.AbstractQueuedSynchronizer$ConditionObject.await(AbstractQueuedSynchronizer.java:2039)         at java.util.concurrent.ScheduledThreadPoolExecutor$DelayedWorkQueue.take(ScheduledThreadPoolExecutor.java:1081)         at java.util.concurrent.ScheduledThreadPoolExecutor$DelayedWorkQueue.take(ScheduledThreadPoolExecutor.java:809)         at java.util.concurrent.ThreadPoolExecutor.getTask(ThreadPoolExecutor.java:1074)         at java.util.concurrent.ThreadPoolExecutor.runWorker(ThreadPoolExecutor.java:1134)         at java.util.concurrent.ThreadPoolExecutor$Worker.run(ThreadPoolExecutor.java:624)         at java.lang.Thread.run(Thread.java:748)   21) Thread[id=35407, name=ProcessThread(sid:0 cport:41549):, state=WAITING, group=TGRP-TestManagedResourceStorage]         at sun.misc.Unsafe.park(Native Method)         at java.util.concurrent.locks.LockSupport.park(LockSupport.java:175)         at java.util.concurrent.locks.AbstractQueuedSynchronizer$ConditionObject.await(AbstractQueuedSynchronizer.java:2039)         at java.util.concurrent.LinkedBlockingQueue.take(LinkedBlockingQueue.java:442)         at org.apache.zookeeper.server.PrepRequestProcessor.run(PrepRequestProcessor.java:123)   22) Thread[id=35438, name=Thread-5742, state=WAITING, group=TGRP-TestManagedResourceStorage]         at java.lang.Object.wait(Native Method)         at java.lang.Object.wait(Object.java:502)         at org.apache.solr.core.CloserThread.run(CoreContainer.java:1850)   23) Thread[id=35428, name=OverseerAutoScalingTriggerThread-72063507136970755-127.0.0.1:8983_-n_0000000000, state=WAITING, group=Overseer autoscaling triggers]         at sun.misc.Unsafe.park(Native Method)         at java.util.concurrent.locks.LockSupport.park(LockSupport.java:175)         at java.util.concurrent.locks.AbstractQueuedSynchronizer$ConditionObject.await(AbstractQueuedSynchronizer.java:2039)         at org.apache.solr.cloud.autoscaling.OverseerTriggerThread.run(OverseerTriggerThread.java:189)         at java.lang.Thread.run(Thread.java:748)   24) Thread[id=35421, name=SUITE-TestManagedResourceStorage-seed#[FBB9BBBE6540BB3E]-worker-EventThread, state=WAITING, group=TGRP-TestManagedResourceStorage]         at sun.misc.Unsafe.park(Native Method)         at java.util.concurrent.locks.LockSupport.park(LockSupport.java:175)         at java.util.concurrent.locks.AbstractQueuedSynchronizer$ConditionObject.await(AbstractQueuedSynchronizer.java:2039)         at java.util.concurrent.LinkedBlockingQueue.take(LinkedBlockingQueue.java:442)         at org.apache.zookeeper.ClientCnxn$EventThread.run(ClientCnxn.java:502)   25) Thread[id=35424, name=SUITE-TestManagedResourceStorage-seed#[FBB9BBBE6540BB3E]-worker-SendThread(127.0.0.1:41549), state=RUNNABLE, group=TGRP-TestManagedResourceStorage]         at sun.nio.ch.DevPollArrayWrapper.poll0(Native Method)         at sun.nio.ch.DevPollArrayWrapper.poll(DevPollArrayWrapper.java:223)         at sun.nio.ch.DevPollSelectorImpl.doSelect(DevPollSelectorImpl.java:98)         at sun.nio.ch.SelectorImpl.lockAndDoSelect(SelectorImpl.java:86)         at sun.nio.ch.SelectorImpl.select(SelectorImpl.java:97)         at org.apache.zookeeper.ClientCnxnSocketNIO.doTransport(ClientCnxnSocketNIO.java:349)         at org.apache.zookeeper.ClientCnxn$SendThread.run(ClientCnxn.java:1144)

Stack Trace:
com.carrotsearch.randomizedtesting.ThreadLeakError: 25 threads leaked from SUITE scope at org.apache.solr.rest.TestManagedResourceStorage: 
   1) Thread[id=35435, name=SolrRrdBackendFactory-13432-thread-1, state=TIMED_WAITING, group=TGRP-TestManagedResourceStorage]
        at sun.misc.Unsafe.park(Native Method)
        at java.util.concurrent.locks.LockSupport.parkNanos(LockSupport.java:215)
        at java.util.concurrent.locks.AbstractQueuedSynchronizer$ConditionObject.awaitNanos(AbstractQueuedSynchronizer.java:2078)
        at java.util.concurrent.ScheduledThreadPoolExecutor$DelayedWorkQueue.take(ScheduledThreadPoolExecutor.java:1093)
        at java.util.concurrent.ScheduledThreadPoolExecutor$DelayedWorkQueue.take(ScheduledThreadPoolExecutor.java:809)
        at java.util.concurrent.ThreadPoolExecutor.getTask(ThreadPoolExecutor.java:1074)
        at java.util.concurrent.ThreadPoolExecutor.runWorker(ThreadPoolExecutor.java:1134)
        at java.util.concurrent.ThreadPoolExecutor$Worker.run(ThreadPoolExecutor.java:624)
        at java.lang.Thread.run(Thread.java:748)
   2) Thread[id=35404, name=NIOServerCxn.Factory:0.0.0.0/0.0.0.0:0, state=RUNNABLE, group=TGRP-TestManagedResourceStorage]
        at sun.nio.ch.DevPollArrayWrapper.poll0(Native Method)
        at sun.nio.ch.DevPollArrayWrapper.poll(DevPollArrayWrapper.java:223)
        at sun.nio.ch.DevPollSelectorImpl.doSelect(DevPollSelectorImpl.java:98)
        at sun.nio.ch.SelectorImpl.lockAndDoSelect(SelectorImpl.java:86)
        at sun.nio.ch.SelectorImpl.select(SelectorImpl.java:97)
        at org.apache.zookeeper.server.NIOServerCnxnFactory.run(NIOServerCnxnFactory.java:196)
        at java.lang.Thread.run(Thread.java:748)
   3) Thread[id=35420, name=SUITE-TestManagedResourceStorage-seed#[FBB9BBBE6540BB3E]-worker-SendThread(127.0.0.1:41549), state=RUNNABLE, group=TGRP-TestManagedResourceStorage]
        at sun.nio.ch.DevPollArrayWrapper.poll0(Native Method)
        at sun.nio.ch.DevPollArrayWrapper.poll(DevPollArrayWrapper.java:223)
        at sun.nio.ch.DevPollSelectorImpl.doSelect(DevPollSelectorImpl.java:98)
        at sun.nio.ch.SelectorImpl.lockAndDoSelect(SelectorImpl.java:86)
        at sun.nio.ch.SelectorImpl.select(SelectorImpl.java:97)
        at org.apache.zookeeper.ClientCnxnSocketNIO.doTransport(ClientCnxnSocketNIO.java:349)
        at org.apache.zookeeper.ClientCnxn$SendThread.run(ClientCnxn.java:1144)
   4) Thread[id=35415, name=Connection evictor, state=TIMED_WAITING, group=TGRP-TestManagedResourceStorage]
        at java.lang.Thread.sleep(Native Method)
        at org.apache.http.impl.client.IdleConnectionEvictor$1.run(IdleConnectionEvictor.java:66)
        at java.lang.Thread.run(Thread.java:748)
   5) Thread[id=35433, name=ScheduledTrigger-13428-thread-3, state=WAITING, group=TGRP-TestManagedResourceStorage]
        at sun.misc.Unsafe.park(Native Method)
        at java.util.concurrent.locks.LockSupport.park(LockSupport.java:175)
        at java.util.concurrent.locks.AbstractQueuedSynchronizer$ConditionObject.await(AbstractQueuedSynchronizer.java:2039)
        at java.util.concurrent.ScheduledThreadPoolExecutor$DelayedWorkQueue.take(ScheduledThreadPoolExecutor.java:1088)
        at java.util.concurrent.ScheduledThreadPoolExecutor$DelayedWorkQueue.take(ScheduledThreadPoolExecutor.java:809)
        at java.util.concurrent.ThreadPoolExecutor.getTask(ThreadPoolExecutor.java:1074)
        at java.util.concurrent.ThreadPoolExecutor.runWorker(ThreadPoolExecutor.java:1134)
        at java.util.concurrent.ThreadPoolExecutor$Worker.run(ThreadPoolExecutor.java:624)
        at java.lang.Thread.run(Thread.java:748)
   6) Thread[id=35405, name=SessionTracker, state=TIMED_WAITING, group=TGRP-TestManagedResourceStorage]
        at java.lang.Object.wait(Native Method)
        at org.apache.zookeeper.server.SessionTrackerImpl.run(SessionTrackerImpl.java:147)
   7) Thread[id=35444, name=SolrRrdBackendFactory-13432-thread-2, state=WAITING, group=TGRP-TestManagedResourceStorage]
        at sun.misc.Unsafe.park(Native Method)
        at java.util.concurrent.locks.LockSupport.park(LockSupport.java:175)
        at java.util.concurrent.locks.AbstractQueuedSynchronizer$ConditionObject.await(AbstractQueuedSynchronizer.java:2039)
        at java.util.concurrent.ScheduledThreadPoolExecutor$DelayedWorkQueue.take(ScheduledThreadPoolExecutor.java:1088)
        at java.util.concurrent.ScheduledThreadPoolExecutor$DelayedWorkQueue.take(ScheduledThreadPoolExecutor.java:809)
        at java.util.concurrent.ThreadPoolExecutor.getTask(ThreadPoolExecutor.java:1074)
        at java.util.concurrent.ThreadPoolExecutor.runWorker(ThreadPoolExecutor.java:1134)
        at java.util.concurrent.ThreadPoolExecutor$Worker.run(ThreadPoolExecutor.java:624)
        at java.lang.Thread.run(Thread.java:748)
   8) Thread[id=35426, name=zkConnectionManagerCallback-11562-thread-1, state=WAITING, group=TGRP-TestManagedResourceStorage]
        at sun.misc.Unsafe.park(Native Method)
        at java.util.concurrent.locks.LockSupport.park(LockSupport.java:175)
        at java.util.concurrent.locks.AbstractQueuedSynchronizer$ConditionObject.await(AbstractQueuedSynchronizer.java:2039)
        at java.util.concurrent.LinkedBlockingQueue.take(LinkedBlockingQueue.java:442)
        at java.util.concurrent.ThreadPoolExecutor.getTask(ThreadPoolExecutor.java:1074)
        at java.util.concurrent.ThreadPoolExecutor.runWorker(ThreadPoolExecutor.java:1134)
        at java.util.concurrent.ThreadPoolExecutor$Worker.run(ThreadPoolExecutor.java:624)
        at java.lang.Thread.run(Thread.java:748)
   9) Thread[id=35414, name=Connection evictor, state=TIMED_WAITING, group=TGRP-TestManagedResourceStorage]
        at java.lang.Thread.sleep(Native Method)
        at org.apache.http.impl.client.IdleConnectionEvictor$1.run(IdleConnectionEvictor.java:66)
        at java.lang.Thread.run(Thread.java:748)
  10) Thread[id=35425, name=SUITE-TestManagedResourceStorage-seed#[FBB9BBBE6540BB3E]-worker-EventThread, state=WAITING, group=TGRP-TestManagedResourceStorage]
        at sun.misc.Unsafe.park(Native Method)
        at java.util.concurrent.locks.LockSupport.park(LockSupport.java:175)
        at java.util.concurrent.locks.AbstractQueuedSynchronizer$ConditionObject.await(AbstractQueuedSynchronizer.java:2039)
        at java.util.concurrent.LinkedBlockingQueue.take(LinkedBlockingQueue.java:442)
        at org.apache.zookeeper.ClientCnxn$EventThread.run(ClientCnxn.java:502)
  11) Thread[id=35403, name=Thread-5741, state=WAITING, group=TGRP-TestManagedResourceStorage]
        at java.lang.Object.wait(Native Method)
        at java.lang.Thread.join(Thread.java:1252)
        at java.lang.Thread.join(Thread.java:1326)
        at org.apache.zookeeper.server.NIOServerCnxnFactory.join(NIOServerCnxnFactory.java:313)
        at org.apache.solr.cloud.ZkTestServer$ZKServerMain.runFromConfig(ZkTestServer.java:313)
        at org.apache.solr.cloud.ZkTestServer$2.run(ZkTestServer.java:496)
  12) Thread[id=35430, name=ScheduledTrigger-13428-thread-1, state=WAITING, group=TGRP-TestManagedResourceStorage]
        at sun.misc.Unsafe.park(Native Method)
        at java.util.concurrent.locks.LockSupport.park(LockSupport.java:175)
        at java.util.concurrent.locks.AbstractQueuedSynchronizer$ConditionObject.await(AbstractQueuedSynchronizer.java:2039)
        at java.util.concurrent.ScheduledThreadPoolExecutor$DelayedWorkQueue.take(ScheduledThreadPoolExecutor.java:1088)
        at java.util.concurrent.ScheduledThreadPoolExecutor$DelayedWorkQueue.take(ScheduledThreadPoolExecutor.java:809)
        at java.util.concurrent.ThreadPoolExecutor.getTask(ThreadPoolExecutor.java:1074)
        at java.util.concurrent.ThreadPoolExecutor.runWorker(ThreadPoolExecutor.java:1134)
        at java.util.concurrent.ThreadPoolExecutor$Worker.run(ThreadPoolExecutor.java:624)
        at java.lang.Thread.run(Thread.java:748)
  13) Thread[id=35423, name=OverseerStateUpdate-72063507136970755-127.0.0.1:8983_-n_0000000000, state=TIMED_WAITING, group=Overseer state updater.]
        at sun.misc.Unsafe.park(Native Method)
        at java.util.concurrent.locks.LockSupport.parkNanos(LockSupport.java:215)
        at java.util.concurrent.locks.AbstractQueuedSynchronizer$ConditionObject.awaitNanos(AbstractQueuedSynchronizer.java:2078)
        at org.apache.solr.cloud.ZkDistributedQueue.peekElements(ZkDistributedQueue.java:463)
        at org.apache.solr.cloud.Overseer$ClusterStateUpdater.run(Overseer.java:207)
        at java.lang.Thread.run(Thread.java:748)
  14) Thread[id=35434, name=ScheduledTrigger-13428-thread-4, state=WAITING, group=TGRP-TestManagedResourceStorage]
        at sun.misc.Unsafe.park(Native Method)
        at java.util.concurrent.locks.LockSupport.park(LockSupport.java:175)
        at java.util.concurrent.locks.AbstractQueuedSynchronizer$ConditionObject.await(AbstractQueuedSynchronizer.java:2039)
        at java.util.concurrent.ScheduledThreadPoolExecutor$DelayedWorkQueue.take(ScheduledThreadPoolExecutor.java:1088)
        at java.util.concurrent.ScheduledThreadPoolExecutor$DelayedWorkQueue.take(ScheduledThreadPoolExecutor.java:809)
        at java.util.concurrent.ThreadPoolExecutor.getTask(ThreadPoolExecutor.java:1074)
        at java.util.concurrent.ThreadPoolExecutor.runWorker(ThreadPoolExecutor.java:1134)
        at java.util.concurrent.ThreadPoolExecutor$Worker.run(ThreadPoolExecutor.java:624)
        at java.lang.Thread.run(Thread.java:748)
  15) Thread[id=35416, name=Connection evictor, state=TIMED_WAITING, group=TGRP-TestManagedResourceStorage]
        at java.lang.Thread.sleep(Native Method)
        at org.apache.http.impl.client.IdleConnectionEvictor$1.run(IdleConnectionEvictor.java:66)
        at java.lang.Thread.run(Thread.java:748)
  16) Thread[id=35427, name=OverseerCollectionConfigSetProcessor-72063507136970755-127.0.0.1:8983_-n_0000000000, state=TIMED_WAITING, group=Overseer collection creation process.]
        at sun.misc.Unsafe.park(Native Method)
        at java.util.concurrent.locks.LockSupport.parkNanos(LockSupport.java:215)
        at java.util.concurrent.locks.AbstractQueuedSynchronizer$ConditionObject.awaitNanos(AbstractQueuedSynchronizer.java:2078)
        at org.apache.solr.cloud.ZkDistributedQueue.peekElements(ZkDistributedQueue.java:463)
        at org.apache.solr.cloud.OverseerTaskQueue.peekTopN(OverseerTaskQueue.java:243)
        at org.apache.solr.cloud.OverseerTaskProcessor.run(OverseerTaskProcessor.java:233)
        at java.lang.Thread.run(Thread.java:748)
  17) Thread[id=35431, name=ScheduledTrigger-13428-thread-2, state=TIMED_WAITING, group=TGRP-TestManagedResourceStorage]
        at sun.misc.Unsafe.park(Native Method)
        at java.util.concurrent.locks.LockSupport.parkNanos(LockSupport.java:215)
        at java.util.concurrent.locks.AbstractQueuedSynchronizer$ConditionObject.awaitNanos(AbstractQueuedSynchronizer.java:2078)
        at java.util.concurrent.ScheduledThreadPoolExecutor$DelayedWorkQueue.take(ScheduledThreadPoolExecutor.java:1093)
        at java.util.concurrent.ScheduledThreadPoolExecutor$DelayedWorkQueue.take(ScheduledThreadPoolExecutor.java:809)
        at java.util.concurrent.ThreadPoolExecutor.getTask(ThreadPoolExecutor.java:1074)
        at java.util.concurrent.ThreadPoolExecutor.runWorker(ThreadPoolExecutor.java:1134)
        at java.util.concurrent.ThreadPoolExecutor$Worker.run(ThreadPoolExecutor.java:624)
        at java.lang.Thread.run(Thread.java:748)
  18) Thread[id=35441, name=searcherExecutor-13435-thread-1, state=WAITING, group=TGRP-TestManagedResourceStorage]
        at sun.misc.Unsafe.park(Native Method)
        at java.util.concurrent.locks.LockSupport.park(LockSupport.java:175)
        at java.util.concurrent.locks.AbstractQueuedSynchronizer$ConditionObject.await(AbstractQueuedSynchronizer.java:2039)
        at java.util.concurrent.LinkedBlockingQueue.take(LinkedBlockingQueue.java:442)
        at java.util.concurrent.ThreadPoolExecutor.getTask(ThreadPoolExecutor.java:1074)
        at java.util.concurrent.ThreadPoolExecutor.runWorker(ThreadPoolExecutor.java:1134)
        at java.util.concurrent.ThreadPoolExecutor$Worker.run(ThreadPoolExecutor.java:624)
        at java.lang.Thread.run(Thread.java:748)
  19) Thread[id=35422, name=zkConnectionManagerCallback-11555-thread-1, state=WAITING, group=TGRP-TestManagedResourceStorage]
        at sun.misc.Unsafe.park(Native Method)
        at java.util.concurrent.locks.LockSupport.park(LockSupport.java:175)
        at java.util.concurrent.locks.AbstractQueuedSynchronizer$ConditionObject.await(AbstractQueuedSynchronizer.java:2039)
        at java.util.concurrent.LinkedBlockingQueue.take(LinkedBlockingQueue.java:442)
        at java.util.concurrent.ThreadPoolExecutor.getTask(ThreadPoolExecutor.java:1074)
        at java.util.concurrent.ThreadPoolExecutor.runWorker(ThreadPoolExecutor.java:1134)
        at java.util.concurrent.ThreadPoolExecutor$Worker.run(ThreadPoolExecutor.java:624)
        at java.lang.Thread.run(Thread.java:748)
  20) Thread[id=35436, name=MetricsHistoryHandler-13433-thread-1, state=WAITING, group=TGRP-TestManagedResourceStorage]
        at sun.misc.Unsafe.park(Native Method)
        at java.util.concurrent.locks.LockSupport.park(LockSupport.java:175)
        at java.util.concurrent.locks.AbstractQueuedSynchronizer$ConditionObject.await(AbstractQueuedSynchronizer.java:2039)
        at java.util.concurrent.ScheduledThreadPoolExecutor$DelayedWorkQueue.take(ScheduledThreadPoolExecutor.java:1081)
        at java.util.concurrent.ScheduledThreadPoolExecutor$DelayedWorkQueue.take(ScheduledThreadPoolExecutor.java:809)
        at java.util.concurrent.ThreadPoolExecutor.getTask(ThreadPoolExecutor.java:1074)
        at java.util.concurrent.ThreadPoolExecutor.runWorker(ThreadPoolExecutor.java:1134)
        at java.util.concurrent.ThreadPoolExecutor$Worker.run(ThreadPoolExecutor.java:624)
        at java.lang.Thread.run(Thread.java:748)
  21) Thread[id=35407, name=ProcessThread(sid:0 cport:41549):, state=WAITING, group=TGRP-TestManagedResourceStorage]
        at sun.misc.Unsafe.park(Native Method)
        at java.util.concurrent.locks.LockSupport.park(LockSupport.java:175)
        at java.util.concurrent.locks.AbstractQueuedSynchronizer$ConditionObject.await(AbstractQueuedSynchronizer.java:2039)
        at java.util.concurrent.LinkedBlockingQueue.take(LinkedBlockingQueue.java:442)
        at org.apache.zookeeper.server.PrepRequestProcessor.run(PrepRequestProcessor.java:123)
  22) Thread[id=35438, name=Thread-5742, state=WAITING, group=TGRP-TestManagedResourceStorage]
        at java.lang.Object.wait(Native Method)
        at java.lang.Object.wait(Object.java:502)
        at org.apache.solr.core.CloserThread.run(CoreContainer.java:1850)
  23) Thread[id=35428, name=OverseerAutoScalingTriggerThread-72063507136970755-127.0.0.1:8983_-n_0000000000, state=WAITING, group=Overseer autoscaling triggers]
        at sun.misc.Unsafe.park(Native Method)
        at java.util.concurrent.locks.LockSupport.park(LockSupport.java:175)
        at java.util.concurrent.locks.AbstractQueuedSynchronizer$ConditionObject.await(AbstractQueuedSynchronizer.java:2039)
        at org.apache.solr.cloud.autoscaling.OverseerTriggerThread.run(OverseerTriggerThread.java:189)
        at java.lang.Thread.run(Thread.java:748)
  24) Thread[id=35421, name=SUITE-TestManagedResourceStorage-seed#[FBB9BBBE6540BB3E]-worker-EventThread, state=WAITING, group=TGRP-TestManagedResourceStorage]
        at sun.misc.Unsafe.park(Native Method)
        at java.util.concurrent.locks.LockSupport.park(LockSupport.java:175)
        at java.util.concurrent.locks.AbstractQueuedSynchronizer$ConditionObject.await(AbstractQueuedSynchronizer.java:2039)
        at java.util.concurrent.LinkedBlockingQueue.take(LinkedBlockingQueue.java:442)
        at org.apache.zookeeper.ClientCnxn$EventThread.run(ClientCnxn.java:502)
  25) Thread[id=35424, name=SUITE-TestManagedResourceStorage-seed#[FBB9BBBE6540BB3E]-worker-SendThread(127.0.0.1:41549), state=RUNNABLE, group=TGRP-TestManagedResourceStorage]
        at sun.nio.ch.DevPollArrayWrapper.poll0(Native Method)
        at sun.nio.ch.DevPollArrayWrapper.poll(DevPollArrayWrapper.java:223)
        at sun.nio.ch.DevPollSelectorImpl.doSelect(DevPollSelectorImpl.java:98)
        at sun.nio.ch.SelectorImpl.lockAndDoSelect(SelectorImpl.java:86)
        at sun.nio.ch.SelectorImpl.select(SelectorImpl.java:97)
        at org.apache.zookeeper.ClientCnxnSocketNIO.doTransport(ClientCnxnSocketNIO.java:349)
        at org.apache.zookeeper.ClientCnxn$SendThread.run(ClientCnxn.java:1144)
	at __randomizedtesting.SeedInfo.seed([FBB9BBBE6540BB3E]:0)


FAILED:  junit.framework.TestSuite.org.apache.solr.rest.TestManagedResourceStorage

Error Message:
There are still zombie threads that couldn't be terminated:    1) Thread[id=35431, name=ScheduledTrigger-13428-thread-2, state=TIMED_WAITING, group=TGRP-TestManagedResourceStorage]         at sun.misc.Unsafe.park(Native Method)         at java.util.concurrent.locks.LockSupport.parkNanos(LockSupport.java:215)         at java.util.concurrent.locks.AbstractQueuedSynchronizer$ConditionObject.awaitNanos(AbstractQueuedSynchronizer.java:2078)         at java.util.concurrent.ScheduledThreadPoolExecutor$DelayedWorkQueue.take(ScheduledThreadPoolExecutor.java:1093)         at java.util.concurrent.ScheduledThreadPoolExecutor$DelayedWorkQueue.take(ScheduledThreadPoolExecutor.java:809)         at java.util.concurrent.ThreadPoolExecutor.getTask(ThreadPoolExecutor.java:1074)         at java.util.concurrent.ThreadPoolExecutor.runWorker(ThreadPoolExecutor.java:1134)         at java.util.concurrent.ThreadPoolExecutor$Worker.run(ThreadPoolExecutor.java:624)         at java.lang.Thread.run(Thread.java:748)    2) Thread[id=35435, name=SolrRrdBackendFactory-13432-thread-1, state=TIMED_WAITING, group=TGRP-TestManagedResourceStorage]         at sun.misc.Unsafe.park(Native Method)         at java.util.concurrent.locks.LockSupport.parkNanos(LockSupport.java:215)         at java.util.concurrent.locks.AbstractQueuedSynchronizer$ConditionObject.awaitNanos(AbstractQueuedSynchronizer.java:2078)         at java.util.concurrent.ScheduledThreadPoolExecutor$DelayedWorkQueue.take(ScheduledThreadPoolExecutor.java:1093)         at java.util.concurrent.ScheduledThreadPoolExecutor$DelayedWorkQueue.take(ScheduledThreadPoolExecutor.java:809)         at java.util.concurrent.ThreadPoolExecutor.getTask(ThreadPoolExecutor.java:1074)         at java.util.concurrent.ThreadPoolExecutor.runWorker(ThreadPoolExecutor.java:1134)         at java.util.concurrent.ThreadPoolExecutor$Worker.run(ThreadPoolExecutor.java:624)         at java.lang.Thread.run(Thread.java:748)    3) Thread[id=35441, name=searcherExecutor-13435-thread-1, state=WAITING, group=TGRP-TestManagedResourceStorage]         at sun.misc.Unsafe.park(Native Method)         at java.util.concurrent.locks.LockSupport.park(LockSupport.java:175)         at java.util.concurrent.locks.AbstractQueuedSynchronizer$ConditionObject.await(AbstractQueuedSynchronizer.java:2039)         at java.util.concurrent.LinkedBlockingQueue.take(LinkedBlockingQueue.java:442)         at java.util.concurrent.ThreadPoolExecutor.getTask(ThreadPoolExecutor.java:1074)         at java.util.concurrent.ThreadPoolExecutor.runWorker(ThreadPoolExecutor.java:1134)         at java.util.concurrent.ThreadPoolExecutor$Worker.run(ThreadPoolExecutor.java:624)         at java.lang.Thread.run(Thread.java:748)    4) Thread[id=35420, name=SUITE-TestManagedResourceStorage-seed#[FBB9BBBE6540BB3E]-worker-SendThread(127.0.0.1:41549), state=TIMED_WAITING, group=TGRP-TestManagedResourceStorage]         at java.lang.Thread.sleep(Native Method)         at org.apache.zookeeper.client.StaticHostProvider.next(StaticHostProvider.java:105)         at org.apache.zookeeper.ClientCnxn$SendThread.startConnect(ClientCnxn.java:1000)         at org.apache.zookeeper.ClientCnxn$SendThread.run(ClientCnxn.java:1063)    5) Thread[id=35422, name=zkConnectionManagerCallback-11555-thread-1, state=WAITING, group=TGRP-TestManagedResourceStorage]         at sun.misc.Unsafe.park(Native Method)         at java.util.concurrent.locks.LockSupport.park(LockSupport.java:175)         at java.util.concurrent.locks.AbstractQueuedSynchronizer$ConditionObject.await(AbstractQueuedSynchronizer.java:2039)         at java.util.concurrent.LinkedBlockingQueue.take(LinkedBlockingQueue.java:442)         at java.util.concurrent.ThreadPoolExecutor.getTask(ThreadPoolExecutor.java:1074)         at java.util.concurrent.ThreadPoolExecutor.runWorker(ThreadPoolExecutor.java:1134)         at java.util.concurrent.ThreadPoolExecutor$Worker.run(ThreadPoolExecutor.java:624)         at java.lang.Thread.run(Thread.java:748)    6) Thread[id=35436, name=MetricsHistoryHandler-13433-thread-1, state=WAITING, group=TGRP-TestManagedResourceStorage]         at sun.misc.Unsafe.park(Native Method)         at java.util.concurrent.locks.LockSupport.park(LockSupport.java:175)         at java.util.concurrent.locks.AbstractQueuedSynchronizer$ConditionObject.await(AbstractQueuedSynchronizer.java:2039)         at java.util.concurrent.ScheduledThreadPoolExecutor$DelayedWorkQueue.take(ScheduledThreadPoolExecutor.java:1081)         at java.util.concurrent.ScheduledThreadPoolExecutor$DelayedWorkQueue.take(ScheduledThreadPoolExecutor.java:809)         at java.util.concurrent.ThreadPoolExecutor.getTask(ThreadPoolExecutor.java:1074)         at java.util.concurrent.ThreadPoolExecutor.runWorker(ThreadPoolExecutor.java:1134)         at java.util.concurrent.ThreadPoolExecutor$Worker.run(ThreadPoolExecutor.java:624)         at java.lang.Thread.run(Thread.java:748)    7) Thread[id=35433, name=ScheduledTrigger-13428-thread-3, state=WAITING, group=TGRP-TestManagedResourceStorage]         at sun.misc.Unsafe.park(Native Method)         at java.util.concurrent.locks.LockSupport.park(LockSupport.java:175)         at java.util.concurrent.locks.AbstractQueuedSynchronizer$ConditionObject.await(AbstractQueuedSynchronizer.java:2039)         at java.util.concurrent.ScheduledThreadPoolExecutor$DelayedWorkQueue.take(ScheduledThreadPoolExecutor.java:1088)         at java.util.concurrent.ScheduledThreadPoolExecutor$DelayedWorkQueue.take(ScheduledThreadPoolExecutor.java:809)         at java.util.concurrent.ThreadPoolExecutor.getTask(ThreadPoolExecutor.java:1074)         at java.util.concurrent.ThreadPoolExecutor.runWorker(ThreadPoolExecutor.java:1134)         at java.util.concurrent.ThreadPoolExecutor$Worker.run(ThreadPoolExecutor.java:624)         at java.lang.Thread.run(Thread.java:748)    8) Thread[id=35444, name=SolrRrdBackendFactory-13432-thread-2, state=WAITING, group=TGRP-TestManagedResourceStorage]         at sun.misc.Unsafe.park(Native Method)         at java.util.concurrent.locks.LockSupport.park(LockSupport.java:175)         at java.util.concurrent.locks.AbstractQueuedSynchronizer$ConditionObject.await(AbstractQueuedSynchronizer.java:2039)         at java.util.concurrent.ScheduledThreadPoolExecutor$DelayedWorkQueue.take(ScheduledThreadPoolExecutor.java:1088)         at java.util.concurrent.ScheduledThreadPoolExecutor$DelayedWorkQueue.take(ScheduledThreadPoolExecutor.java:809)         at java.util.concurrent.ThreadPoolExecutor.getTask(ThreadPoolExecutor.java:1074)         at java.util.concurrent.ThreadPoolExecutor.runWorker(ThreadPoolExecutor.java:1134)         at java.util.concurrent.ThreadPoolExecutor$Worker.run(ThreadPoolExecutor.java:624)         at java.lang.Thread.run(Thread.java:748)    9) Thread[id=35426, name=zkConnectionManagerCallback-11562-thread-1, state=WAITING, group=TGRP-TestManagedResourceStorage]         at sun.misc.Unsafe.park(Native Method)         at java.util.concurrent.locks.LockSupport.park(LockSupport.java:175)         at java.util.concurrent.locks.AbstractQueuedSynchronizer$ConditionObject.await(AbstractQueuedSynchronizer.java:2039)         at java.util.concurrent.LinkedBlockingQueue.take(LinkedBlockingQueue.java:442)         at java.util.concurrent.ThreadPoolExecutor.getTask(ThreadPoolExecutor.java:1074)         at java.util.concurrent.ThreadPoolExecutor.runWorker(ThreadPoolExecutor.java:1134)         at java.util.concurrent.ThreadPoolExecutor$Worker.run(ThreadPoolExecutor.java:624)         at java.lang.Thread.run(Thread.java:748)   10) Thread[id=35438, name=Thread-5742, state=WAITING, group=TGRP-TestManagedResourceStorage]         at java.lang.Object.wait(Native Method)         at java.lang.Object.wait(Object.java:502)         at org.apache.solr.core.CloserThread.run(CoreContainer.java:1850)   11) Thread[id=35430, name=ScheduledTrigger-13428-thread-1, state=WAITING, group=TGRP-TestManagedResourceStorage]         at sun.misc.Unsafe.park(Native Method)         at java.util.concurrent.locks.LockSupport.park(LockSupport.java:175)         at java.util.concurrent.locks.AbstractQueuedSynchronizer$ConditionObject.await(AbstractQueuedSynchronizer.java:2039)         at java.util.concurrent.ScheduledThreadPoolExecutor$DelayedWorkQueue.take(ScheduledThreadPoolExecutor.java:1088)         at java.util.concurrent.ScheduledThreadPoolExecutor$DelayedWorkQueue.take(ScheduledThreadPoolExecutor.java:809)         at java.util.concurrent.ThreadPoolExecutor.getTask(ThreadPoolExecutor.java:1074)         at java.util.concurrent.ThreadPoolExecutor.runWorker(ThreadPoolExecutor.java:1134)         at java.util.concurrent.ThreadPoolExecutor$Worker.run(ThreadPoolExecutor.java:624)         at java.lang.Thread.run(Thread.java:748)   12) Thread[id=35434, name=ScheduledTrigger-13428-thread-4, state=WAITING, group=TGRP-TestManagedResourceStorage]         at sun.misc.Unsafe.park(Native Method)         at java.util.concurrent.locks.LockSupport.park(LockSupport.java:175)         at java.util.concurrent.locks.AbstractQueuedSynchronizer$ConditionObject.await(AbstractQueuedSynchronizer.java:2039)         at java.util.concurrent.ScheduledThreadPoolExecutor$DelayedWorkQueue.take(ScheduledThreadPoolExecutor.java:1088)         at java.util.concurrent.ScheduledThreadPoolExecutor$DelayedWorkQueue.take(ScheduledThreadPoolExecutor.java:809)         at java.util.concurrent.ThreadPoolExecutor.getTask(ThreadPoolExecutor.java:1074)         at java.util.concurrent.ThreadPoolExecutor.runWorker(ThreadPoolExecutor.java:1134)         at java.util.concurrent.ThreadPoolExecutor$Worker.run(ThreadPoolExecutor.java:624)         at java.lang.Thread.run(Thread.java:748)   13) Thread[id=35424, name=SUITE-TestManagedResourceStorage-seed#[FBB9BBBE6540BB3E]-worker-SendThread(127.0.0.1:41549), state=TIMED_WAITING, group=TGRP-TestManagedResourceStorage]         at java.lang.Thread.sleep(Native Method)         at org.apache.zookeeper.client.StaticHostProvider.next(StaticHostProvider.java:105)         at org.apache.zookeeper.ClientCnxn$SendThread.startConnect(ClientCnxn.java:1000)         at org.apache.zookeeper.ClientCnxn$SendThread.run(ClientCnxn.java:1063)

Stack Trace:
com.carrotsearch.randomizedtesting.ThreadLeakError: There are still zombie threads that couldn't be terminated:
   1) Thread[id=35431, name=ScheduledTrigger-13428-thread-2, state=TIMED_WAITING, group=TGRP-TestManagedResourceStorage]
        at sun.misc.Unsafe.park(Native Method)
        at java.util.concurrent.locks.LockSupport.parkNanos(LockSupport.java:215)
        at java.util.concurrent.locks.AbstractQueuedSynchronizer$ConditionObject.awaitNanos(AbstractQueuedSynchronizer.java:2078)
        at java.util.concurrent.ScheduledThreadPoolExecutor$DelayedWorkQueue.take(ScheduledThreadPoolExecutor.java:1093)
        at java.util.concurrent.ScheduledThreadPoolExecutor$DelayedWorkQueue.take(ScheduledThreadPoolExecutor.java:809)
        at java.util.concurrent.ThreadPoolExecutor.getTask(ThreadPoolExecutor.java:1074)
        at java.util.concurrent.ThreadPoolExecutor.runWorker(ThreadPoolExecutor.java:1134)
        at java.util.concurrent.ThreadPoolExecutor$Worker.run(ThreadPoolExecutor.java:624)
        at java.lang.Thread.run(Thread.java:748)
   2) Thread[id=35435, name=SolrRrdBackendFactory-13432-thread-1, state=TIMED_WAITING, group=TGRP-TestManagedResourceStorage]
        at sun.misc.Unsafe.park(Native Method)
        at java.util.concurrent.locks.LockSupport.parkNanos(LockSupport.java:215)
        at java.util.concurrent.locks.AbstractQueuedSynchronizer$ConditionObject.awaitNanos(AbstractQueuedSynchronizer.java:2078)
        at java.util.concurrent.ScheduledThreadPoolExecutor$DelayedWorkQueue.take(ScheduledThreadPoolExecutor.java:1093)
        at java.util.concurrent.ScheduledThreadPoolExecutor$DelayedWorkQueue.take(ScheduledThreadPoolExecutor.java:809)
        at java.util.concurrent.ThreadPoolExecutor.getTask(ThreadPoolExecutor.java:1074)
        at java.util.concurrent.ThreadPoolExecutor.runWorker(ThreadPoolExecutor.java:1134)
        at java.util.concurrent.ThreadPoolExecutor$Worker.run(ThreadPoolExecutor.java:624)
        at java.lang.Thread.run(Thread.java:748)
   3) Thread[id=35441, name=searcherExecutor-13435-thread-1, state=WAITING, group=TGRP-TestManagedResourceStorage]
        at sun.misc.Unsafe.park(Native Method)
        at java.util.concurrent.locks.LockSupport.park(LockSupport.java:175)
        at java.util.concurrent.locks.AbstractQueuedSynchronizer$ConditionObject.await(AbstractQueuedSynchronizer.java:2039)
        at java.util.concurrent.LinkedBlockingQueue.take(LinkedBlockingQueue.java:442)
        at java.util.concurrent.ThreadPoolExecutor.getTask(ThreadPoolExecutor.java:1074)
        at java.util.concurrent.ThreadPoolExecutor.runWorker(ThreadPoolExecutor.java:1134)
        at java.util.concurrent.ThreadPoolExecutor$Worker.run(ThreadPoolExecutor.java:624)
        at java.lang.Thread.run(Thread.java:748)
   4) Thread[id=35420, name=SUITE-TestManagedResourceStorage-seed#[FBB9BBBE6540BB3E]-worker-SendThread(127.0.0.1:41549), state=TIMED_WAITING, group=TGRP-TestManagedResourceStorage]
        at java.lang.Thread.sleep(Native Method)
        at org.apache.zookeeper.client.StaticHostProvider.next(StaticHostProvider.java:105)
        at org.apache.zookeeper.ClientCnxn$SendThread.startConnect(ClientCnxn.java:1000)
        at org.apache.zookeeper.ClientCnxn$SendThread.run(ClientCnxn.java:1063)
   5) Thread[id=35422, name=zkConnectionManagerCallback-11555-thread-1, state=WAITING, group=TGRP-TestManagedResourceStorage]
        at sun.misc.Unsafe.park(Native Method)
        at java.util.concurrent.locks.LockSupport.park(LockSupport.java:175)
        at java.util.concurrent.locks.AbstractQueuedSynchronizer$ConditionObject.await(AbstractQueuedSynchronizer.java:2039)
        at java.util.concurrent.LinkedBlockingQueue.take(LinkedBlockingQueue.java:442)
        at java.util.concurrent.ThreadPoolExecutor.getTask(ThreadPoolExecutor.java:1074)
        at java.util.concurrent.ThreadPoolExecutor.runWorker(ThreadPoolExecutor.java:1134)
        at java.util.concurrent.ThreadPoolExecutor$Worker.run(ThreadPoolExecutor.java:624)
        at java.lang.Thread.run(Thread.java:748)
   6) Thread[id=35436, name=MetricsHistoryHandler-13433-thread-1, state=WAITING, group=TGRP-TestManagedResourceStorage]
        at sun.misc.Unsafe.park(Native Method)
        at java.util.concurrent.locks.LockSupport.park(LockSupport.java:175)
        at java.util.concurrent.locks.AbstractQueuedSynchronizer$ConditionObject.await(AbstractQueuedSynchronizer.java:2039)
        at java.util.concurrent.ScheduledThreadPoolExecutor$DelayedWorkQueue.take(ScheduledThreadPoolExecutor.java:1081)
        at java.util.concurrent.ScheduledThreadPoolExecutor$DelayedWorkQueue.take(ScheduledThreadPoolExecutor.java:809)
        at java.util.concurrent.ThreadPoolExecutor.getTask(ThreadPoolExecutor.java:1074)
        at java.util.concurrent.ThreadPoolExecutor.runWorker(ThreadPoolExecutor.java:1134)
        at java.util.concurrent.ThreadPoolExecutor$Worker.run(ThreadPoolExecutor.java:624)
        at java.lang.Thread.run(Thread.java:748)
   7) Thread[id=35433, name=ScheduledTrigger-13428-thread-3, state=WAITING, group=TGRP-TestManagedResourceStorage]
        at sun.misc.Unsafe.park(Native Method)
        at java.util.concurrent.locks.LockSupport.park(LockSupport.java:175)
        at java.util.concurrent.locks.AbstractQueuedSynchronizer$ConditionObject.await(AbstractQueuedSynchronizer.java:2039)
        at java.util.concurrent.ScheduledThreadPoolExecutor$DelayedWorkQueue.take(ScheduledThreadPoolExecutor.java:1088)
        at java.util.concurrent.ScheduledThreadPoolExecutor$DelayedWorkQueue.take(ScheduledThreadPoolExecutor.java:809)
        at java.util.concurrent.ThreadPoolExecutor.getTask(ThreadPoolExecutor.java:1074)
        at java.util.concurrent.ThreadPoolExecutor.runWorker(ThreadPoolExecutor.java:1134)
        at java.util.concurrent.ThreadPoolExecutor$Worker.run(ThreadPoolExecutor.java:624)
        at java.lang.Thread.run(Thread.java:748)
   8) Thread[id=35444, name=SolrRrdBackendFactory-13432-thread-2, state=WAITING, group=TGRP-TestManagedResourceStorage]
        at sun.misc.Unsafe.park(Native Method)
        at java.util.concurrent.locks.LockSupport.park(LockSupport.java:175)
        at java.util.concurrent.locks.AbstractQueuedSynchronizer$ConditionObject.await(AbstractQueuedSynchronizer.java:2039)
        at java.util.concurrent.ScheduledThreadPoolExecutor$DelayedWorkQueue.take(ScheduledThreadPoolExecutor.java:1088)
        at java.util.concurrent.ScheduledThreadPoolExecutor$DelayedWorkQueue.take(ScheduledThreadPoolExecutor.java:809)
        at java.util.concurrent.ThreadPoolExecutor.getTask(ThreadPoolExecutor.java:1074)
        at java.util.concurrent.ThreadPoolExecutor.runWorker(ThreadPoolExecutor.java:1134)
        at java.util.concurrent.ThreadPoolExecutor$Worker.run(ThreadPoolExecutor.java:624)
        at java.lang.Thread.run(Thread.java:748)
   9) Thread[id=35426, name=zkConnectionManagerCallback-11562-thread-1, state=WAITING, group=TGRP-TestManagedResourceStorage]
        at sun.misc.Unsafe.park(Native Method)
        at java.util.concurrent.locks.LockSupport.park(LockSupport.java:175)
        at java.util.concurrent.locks.AbstractQueuedSynchronizer$ConditionObject.await(AbstractQueuedSynchronizer.java:2039)
        at java.util.concurrent.LinkedBlockingQueue.take(LinkedBlockingQueue.java:442)
        at java.util.concurrent.ThreadPoolExecutor.getTask(ThreadPoolExecutor.java:1074)
        at java.util.concurrent.ThreadPoolExecutor.runWorker(ThreadPoolExecutor.java:1134)
        at java.util.concurrent.ThreadPoolExecutor$Worker.run(ThreadPoolExecutor.java:624)
        at java.lang.Thread.run(Thread.java:748)
  10) Thread[id=35438, name=Thread-5742, state=WAITING, group=TGRP-TestManagedResourceStorage]
        at java.lang.Object.wait(Native Method)
        at java.lang.Object.wait(Object.java:502)
        at org.apache.solr.core.CloserThread.run(CoreContainer.java:1850)
  11) Thread[id=35430, name=ScheduledTrigger-13428-thread-1, state=WAITING, group=TGRP-TestManagedResourceStorage]
        at sun.misc.Unsafe.park(Native Method)
        at java.util.concurrent.locks.LockSupport.park(LockSupport.java:175)
        at java.util.concurrent.locks.AbstractQueuedSynchronizer$ConditionObject.await(AbstractQueuedSynchronizer.java:2039)
        at java.util.concurrent.ScheduledThreadPoolExecutor$DelayedWorkQueue.take(ScheduledThreadPoolExecutor.java:1088)
        at java.util.concurrent.ScheduledThreadPoolExecutor$DelayedWorkQueue.take(ScheduledThreadPoolExecutor.java:809)
        at java.util.concurrent.ThreadPoolExecutor.getTask(ThreadPoolExecutor.java:1074)
        at java.util.concurrent.ThreadPoolExecutor.runWorker(ThreadPoolExecutor.java:1134)
        at java.util.concurrent.ThreadPoolExecutor$Worker.run(ThreadPoolExecutor.java:624)
        at java.lang.Thread.run(Thread.java:748)
  12) Thread[id=35434, name=ScheduledTrigger-13428-thread-4, state=WAITING, group=TGRP-TestManagedResourceStorage]
        at sun.misc.Unsafe.park(Native Method)
        at java.util.concurrent.locks.LockSupport.park(LockSupport.java:175)
        at java.util.concurrent.locks.AbstractQueuedSynchronizer$ConditionObject.await(AbstractQueuedSynchronizer.java:2039)
        at java.util.concurrent.ScheduledThreadPoolExecutor$DelayedWorkQueue.take(ScheduledThreadPoolExecutor.java:1088)
        at java.util.concurrent.ScheduledThreadPoolExecutor$DelayedWorkQueue.take(ScheduledThreadPoolExecutor.java:809)
        at java.util.concurrent.ThreadPoolExecutor.getTask(ThreadPoolExecutor.java:1074)
        at java.util.concurrent.ThreadPoolExecutor.runWorker(ThreadPoolExecutor.java:1134)
        at java.util.concurrent.ThreadPoolExecutor$Worker.run(ThreadPoolExecutor.java:624)
        at java.lang.Thread.run(Thread.java:748)
  13) Thread[id=35424, name=SUITE-TestManagedResourceStorage-seed#[FBB9BBBE6540BB3E]-worker-SendThread(127.0.0.1:41549), state=TIMED_WAITING, group=TGRP-TestManagedResourceStorage]
        at java.lang.Thread.sleep(Native Method)
        at org.apache.zookeeper.client.StaticHostProvider.next(StaticHostProvider.java:105)
        at org.apache.zookeeper.ClientCnxn$SendThread.startConnect(ClientCnxn.java:1000)
        at org.apache.zookeeper.ClientCnxn$SendThread.run(ClientCnxn.java:1063)
	at __randomizedtesting.SeedInfo.seed([FBB9BBBE6540BB3E]:0)




Build Log:
[...truncated 15005 lines...]
   [junit4] Suite: org.apache.solr.rest.TestManagedResourceStorage
   [junit4]   2> Creating dataDir: /export/home/jenkins/workspace/Lucene-Solr-7.x-Solaris/solr/build/solr-core/test/J0/temp/solr.rest.TestManagedResourceStorage_FBB9BBBE6540BB3E-001/init-core-data-001
   [junit4]   2> 3351316 INFO  (SUITE-TestManagedResourceStorage-seed#[FBB9BBBE6540BB3E]-worker) [    ] o.a.s.SolrTestCaseJ4 Using PointFields (NUMERIC_POINTS_SYSPROP=true) w/NUMERIC_DOCVALUES_SYSPROP=true
   [junit4]   2> 3351317 INFO  (SUITE-TestManagedResourceStorage-seed#[FBB9BBBE6540BB3E]-worker) [    ] o.a.s.SolrTestCaseJ4 Randomized ssl (true) and clientAuth (false) via: @org.apache.solr.util.RandomizeSSL(reason=, value=NaN, ssl=NaN, clientAuth=NaN)
   [junit4]   2> 3351317 INFO  (SUITE-TestManagedResourceStorage-seed#[FBB9BBBE6540BB3E]-worker) [    ] o.a.s.SolrTestCaseJ4 SecureRandom sanity checks: test.solr.allowed.securerandom=null & java.security.egd=file:/dev/./urandom
   [junit4]   2> 3351317 INFO  (SUITE-TestManagedResourceStorage-seed#[FBB9BBBE6540BB3E]-worker) [    ] o.a.s.c.ZkTestServer STARTING ZK TEST SERVER
   [junit4]   2> 3351318 INFO  (Thread-5741) [    ] o.a.s.c.ZkTestServer client port:0.0.0.0/0.0.0.0:0
   [junit4]   2> 3351318 INFO  (Thread-5741) [    ] o.a.s.c.ZkTestServer Starting server
   [junit4]   2> 3351319 ERROR (Thread-5741) [    ] o.a.z.s.ZooKeeperServer ZKShutdownHandler is not registered, so ZooKeeper server won't take any action on ERROR or SHUTDOWN server state changes
   [junit4]   2> 3351418 INFO  (SUITE-TestManagedResourceStorage-seed#[FBB9BBBE6540BB3E]-worker) [    ] o.a.s.c.ZkTestServer start zk server on port:41549
   [junit4]   2> 3351439 INFO  (zkConnectionManagerCallback-11547-thread-1) [    ] o.a.s.c.c.ConnectionManager zkClient has connected
   [junit4]   2> 3351444 INFO  (zkConnectionManagerCallback-11549-thread-1) [    ] o.a.s.c.c.ConnectionManager zkClient has connected
   [junit4]   2> 3351500 INFO  (SUITE-TestManagedResourceStorage-seed#[FBB9BBBE6540BB3E]-worker) [    ] o.a.s.c.AbstractZkTestCase put /export/home/jenkins/workspace/Lucene-Solr-7.x-Solaris/solr/core/src/test-files/solr/collection1/conf/solrconfig.xml to /configs/conf1/solrconfig.xml
   [junit4]   2> 3351504 INFO  (SUITE-TestManagedResourceStorage-seed#[FBB9BBBE6540BB3E]-worker) [    ] o.a.s.c.AbstractZkTestCase put /export/home/jenkins/workspace/Lucene-Solr-7.x-Solaris/solr/core/src/test-files/solr/collection1/conf/schema.xml to /configs/conf1/schema.xml
   [junit4]   2> 3351506 INFO  (SUITE-TestManagedResourceStorage-seed#[FBB9BBBE6540BB3E]-worker) [    ] o.a.s.c.AbstractZkTestCase put /export/home/jenkins/workspace/Lucene-Solr-7.x-Solaris/solr/core/src/test-files/solr/collection1/conf/solrconfig.snippet.randomindexconfig.xml to /configs/conf1/solrconfig.snippet.randomindexconfig.xml
   [junit4]   2> 3351508 INFO  (SUITE-TestManagedResourceStorage-seed#[FBB9BBBE6540BB3E]-worker) [    ] o.a.s.c.AbstractZkTestCase put /export/home/jenkins/workspace/Lucene-Solr-7.x-Solaris/solr/core/src/test-files/solr/collection1/conf/stopwords.txt to /configs/conf1/stopwords.txt
   [junit4]   2> 3351511 INFO  (SUITE-TestManagedResourceStorage-seed#[FBB9BBBE6540BB3E]-worker) [    ] o.a.s.c.AbstractZkTestCase put /export/home/jenkins/workspace/Lucene-Solr-7.x-Solaris/solr/core/src/test-files/solr/collection1/conf/protwords.txt to /configs/conf1/protwords.txt
   [junit4]   2> 3351521 INFO  (SUITE-TestManagedResourceStorage-seed#[FBB9BBBE6540BB3E]-worker) [    ] o.a.s.c.AbstractZkTestCase put /export/home/jenkins/workspace/Lucene-Solr-7.x-Solaris/solr/core/src/test-files/solr/collection1/conf/currency.xml to /configs/conf1/currency.xml
   [junit4]   2> 3351525 INFO  (SUITE-TestManagedResourceStorage-seed#[FBB9BBBE6540BB3E]-worker) [    ] o.a.s.c.AbstractZkTestCase put /export/home/jenkins/workspace/Lucene-Solr-7.x-Solaris/solr/core/src/test-files/solr/collection1/conf/enumsConfig.xml to /configs/conf1/enumsConfig.xml
   [junit4]   2> 3351529 INFO  (SUITE-TestManagedResourceStorage-seed#[FBB9BBBE6540BB3E]-worker) [    ] o.a.s.c.AbstractZkTestCase put /export/home/jenkins/workspace/Lucene-Solr-7.x-Solaris/solr/core/src/test-files/solr/collection1/conf/open-exchange-rates.json to /configs/conf1/open-exchange-rates.json
   [junit4]   2> 3351532 INFO  (SUITE-TestManagedResourceStorage-seed#[FBB9BBBE6540BB3E]-worker) [    ] o.a.s.c.AbstractZkTestCase put /export/home/jenkins/workspace/Lucene-Solr-7.x-Solaris/solr/core/src/test-files/solr/collection1/conf/mapping-ISOLatin1Accent.txt to /configs/conf1/mapping-ISOLatin1Accent.txt
   [junit4]   2> 3351534 INFO  (SUITE-TestManagedResourceStorage-seed#[FBB9BBBE6540BB3E]-worker) [    ] o.a.s.c.AbstractZkTestCase put /export/home/jenkins/workspace/Lucene-Solr-7.x-Solaris/solr/core/src/test-files/solr/collection1/conf/old_synonyms.txt to /configs/conf1/old_synonyms.txt
   [junit4]   2> 3351536 INFO  (SUITE-TestManagedResourceStorage-seed#[FBB9BBBE6540BB3E]-worker) [    ] o.a.s.c.AbstractZkTestCase put /export/home/jenkins/workspace/Lucene-Solr-7.x-Solaris/solr/core/src/test-files/solr/collection1/conf/synonyms.txt to /configs/conf1/synonyms.txt
   [junit4]   2> 3351540 INFO  (SUITE-TestManagedResourceStorage-seed#[FBB9BBBE6540BB3E]-worker) [    ] o.a.s.SolrTestCaseJ4 ####initCore
   [junit4]   2> 3351540 INFO  (SUITE-TestManagedResourceStorage-seed#[FBB9BBBE6540BB3E]-worker) [    ] o.a.s.c.SolrResourceLoader [null] Added 2 libs to classloader, from paths: [/export/home/jenkins/workspace/Lucene-Solr-7.x-Solaris/solr/core/src/test-files/solr/collection1/lib, /export/home/jenkins/workspace/Lucene-Solr-7.x-Solaris/solr/core/src/test-files/solr/collection1/lib/classes]
   [junit4]   2> 3351588 INFO  (SUITE-TestManagedResourceStorage-seed#[FBB9BBBE6540BB3E]-worker) [    ] o.a.s.c.SolrConfig Using Lucene MatchVersion: 7.7.0
   [junit4]   2> 3351661 INFO  (SUITE-TestManagedResourceStorage-seed#[FBB9BBBE6540BB3E]-worker) [    ] o.a.s.s.IndexSchema [null] Schema name=test
   [junit4]   2> 3351804 INFO  (SUITE-TestManagedResourceStorage-seed#[FBB9BBBE6540BB3E]-worker) [    ] o.a.s.s.IndexSchema Loaded schema test/1.0 with uniqueid field id
   [junit4]   2> 3352511 INFO  (SUITE-TestManagedResourceStorage-seed#[FBB9BBBE6540BB3E]-worker) [    ] o.a.s.c.ZkContainer Zookeeper client=127.0.0.1:41549/solr
   [junit4]   2> 3352523 INFO  (zkConnectionManagerCallback-11553-thread-1) [    ] o.a.s.c.c.ConnectionManager zkClient has connected
   [junit4]   2> 3352530 INFO  (zkConnectionManagerCallback-11555-thread-1) [    ] o.a.s.c.c.ConnectionManager zkClient has connected
   [junit4]   2> 3352701 INFO  (SUITE-TestManagedResourceStorage-seed#[FBB9BBBE6540BB3E]-worker) [n:127.0.0.1:8983_    ] o.a.s.c.OverseerElectionContext I am going to be the leader 127.0.0.1:8983_
   [junit4]   2> 3352703 INFO  (SUITE-TestManagedResourceStorage-seed#[FBB9BBBE6540BB3E]-worker) [n:127.0.0.1:8983_    ] o.a.s.c.Overseer Overseer (id=72063507136970755-127.0.0.1:8983_-n_0000000000) starting
   [junit4]   2> 3352716 INFO  (zkConnectionManagerCallback-11562-thread-1) [    ] o.a.s.c.c.ConnectionManager zkClient has connected
   [junit4]   2> 3352724 INFO  (SUITE-TestManagedResourceStorage-seed#[FBB9BBBE6540BB3E]-worker) [n:127.0.0.1:8983_    ] o.a.s.c.s.i.ZkClientClusterStateProvider Cluster at 127.0.0.1:41549/solr ready
   [junit4]   2> 3352725 INFO  (OverseerStateUpdate-72063507136970755-127.0.0.1:8983_-n_0000000000) [n:127.0.0.1:8983_    ] o.a.s.c.Overseer Starting to work on the main queue : 127.0.0.1:8983_
   [junit4]   2> 3352726 INFO  (SUITE-TestManagedResourceStorage-seed#[FBB9BBBE6540BB3E]-worker) [n:127.0.0.1:8983_    ] o.a.s.c.ZkController Register node as live in ZooKeeper:/live_nodes/127.0.0.1:8983_
   [junit4]   2> 3352726 DEBUG (OverseerAutoScalingTriggerThread-72063507136970755-127.0.0.1:8983_-n_0000000000) [    ] o.a.s.c.a.OverseerTriggerThread Adding .auto_add_replicas and .scheduled_maintenance triggers
   [junit4]   2> 3352728 DEBUG (OverseerAutoScalingTriggerThread-72063507136970755-127.0.0.1:8983_-n_0000000000) [    ] o.a.s.c.a.OverseerTriggerThread Refreshing /autoscaling.json with znode version 1
   [junit4]   2> 3352728 DEBUG (OverseerAutoScalingTriggerThread-72063507136970755-127.0.0.1:8983_-n_0000000000) [    ] o.a.s.c.a.OverseerTriggerThread Current znodeVersion 1, lastZnodeVersion -1
   [junit4]   2> 3352728 DEBUG (OverseerAutoScalingTriggerThread-72063507136970755-127.0.0.1:8983_-n_0000000000) [    ] o.a.s.c.a.OverseerTriggerThread Processed trigger updates upto znodeVersion 1
   [junit4]   2> 3352730 INFO  (OverseerStateUpdate-72063507136970755-127.0.0.1:8983_-n_0000000000) [n:127.0.0.1:8983_    ] o.a.s.c.c.ZkStateReader Updated live nodes from ZooKeeper... (0) -> (1)
   [junit4]   2> 3352732 INFO  (zkCallback-11561-thread-1) [    ] o.a.s.c.c.ZkStateReader Updated live nodes from ZooKeeper... (0) -> (1)
   [junit4]   2> 3352737 DEBUG (OverseerAutoScalingTriggerThread-72063507136970755-127.0.0.1:8983_-n_0000000000) [    ] o.a.s.c.a.NodeLostTrigger NodeLostTrigger .auto_add_replicas - Initial livenodes: [127.0.0.1:8983_]
   [junit4]   2> 3352738 DEBUG (OverseerAutoScalingTriggerThread-72063507136970755-127.0.0.1:8983_-n_0000000000) [    ] o.a.s.c.a.OverseerTriggerThread -- clean old nodeAdded markers
   [junit4]   2> 3352739 DEBUG (OverseerAutoScalingTriggerThread-72063507136970755-127.0.0.1:8983_-n_0000000000) [    ] o.a.s.c.a.OverseerTriggerThread Current znodeVersion 1, lastZnodeVersion 1
   [junit4]   2> 3352739 DEBUG (ScheduledTrigger-13428-thread-1) [    ] o.a.s.c.a.NodeLostTrigger Running NodeLostTrigger: .auto_add_replicas with currently live nodes: 1
   [junit4]   2> 3352757 INFO  (SUITE-TestManagedResourceStorage-seed#[FBB9BBBE6540BB3E]-worker) [n:127.0.0.1:8983_    ] o.a.s.h.a.MetricsHistoryHandler No .system collection, keeping metrics history in memory.
   [junit4]   2> 3352797 INFO  (SUITE-TestManagedResourceStorage-seed#[FBB9BBBE6540BB3E]-worker) [n:127.0.0.1:8983_    ] o.a.s.m.r.SolrJmxReporter JMX monitoring for 'solr.node' (registry 'solr.node') enabled at server: com.sun.jmx.mbeanserver.JmxMBeanServer@2dc4a3b0
   [junit4]   2> 3352804 INFO  (SUITE-TestManagedResourceStorage-seed#[FBB9BBBE6540BB3E]-worker) [n:127.0.0.1:8983_    ] o.a.s.m.r.SolrJmxReporter JMX monitoring for 'solr.jvm' (registry 'solr.jvm') enabled at server: com.sun.jmx.mbeanserver.JmxMBeanServer@2dc4a3b0
   [junit4]   2> 3352804 INFO  (SUITE-TestManagedResourceStorage-seed#[FBB9BBBE6540BB3E]-worker) [n:127.0.0.1:8983_    ] o.a.s.m.r.SolrJmxReporter JMX monitoring for 'solr.jetty' (registry 'solr.jetty') enabled at server: com.sun.jmx.mbeanserver.JmxMBeanServer@2dc4a3b0
   [junit4]   2> 3352807 INFO  (coreLoadExecutor-13434-thread-1-processing-n:127.0.0.1:8983_) [n:127.0.0.1:8983_    ] o.a.s.c.TransientSolrCoreCacheDefault Allocating transient cache for 2147483647 transient cores
   [junit4]   2> 3352810 DEBUG (OverseerStateUpdate-72063507136970755-127.0.0.1:8983_-n_0000000000) [n:127.0.0.1:8983_    ] o.a.s.c.Overseer processMessage: queueSize: 1, message = {
   [junit4]   2>   "core":"collection1",
   [junit4]   2>   "core_node_name":"127.0.0.1:8983__collection1",
   [junit4]   2>   "roles":null,
   [junit4]   2>   "base_url":"http://127.0.0.1:8983",
   [junit4]   2>   "node_name":"127.0.0.1:8983_",
   [junit4]   2>   "state":"down",
   [junit4]   2>   "shard":"shard1",
   [junit4]   2>   "collection":"collection1",
   [junit4]   2>   "type":"NRT",
   [junit4]   2>   "operation":"state"} current state version: 0
   [junit4]   2> 3352817 INFO  (coreLoadExecutor-13434-thread-1-processing-n:127.0.0.1:8983_) [n:127.0.0.1:8983_ c:collection1 s:shard1  x:collection1] o.a.s.c.SolrResourceLoader [null] Added 2 libs to classloader, from paths: [/export/home/jenkins/workspace/Lucene-Solr-7.x-Solaris/solr/core/src/test-files/solr/collection1/lib, /export/home/jenkins/workspace/Lucene-Solr-7.x-Solaris/solr/core/src/test-files/solr/collection1/lib/classes]
   [junit4]   2> 3352858 INFO  (coreLoadExecutor-13434-thread-1-processing-n:127.0.0.1:8983_) [n:127.0.0.1:8983_ c:collection1 s:shard1  x:collection1] o.a.s.c.SolrConfig Using Lucene MatchVersion: 7.7.0
   [junit4]   2> 3352888 INFO  (coreLoadExecutor-13434-thread-1-processing-n:127.0.0.1:8983_) [n:127.0.0.1:8983_ c:collection1 s:shard1  x:collection1] o.a.s.s.IndexSchema [collection1] Schema name=test
   [junit4]   2> 3353054 INFO  (coreLoadExecutor-13434-thread-1-processing-n:127.0.0.1:8983_) [n:127.0.0.1:8983_ c:collection1 s:shard1  x:collection1] o.a.s.s.IndexSchema Loaded schema test/1.0 with uniqueid field id
   [junit4]   2> 3353083 INFO  (coreLoadExecutor-13434-thread-1-processing-n:127.0.0.1:8983_) [n:127.0.0.1:8983_ c:collection1 s:shard1  x:collection1] o.a.s.c.CoreContainer Creating SolrCore 'collection1' using configuration from collection collection1, trusted=true
   [junit4]   2> 3353083 INFO  (coreLoadExecutor-13434-thread-1-processing-n:127.0.0.1:8983_) [n:127.0.0.1:8983_ c:collection1 s:shard1  x:collection1] o.a.s.m.r.SolrJmxReporter JMX monitoring for 'solr.core.collection1.shard1.127.0.0.1:8983__collection1' (registry 'solr.core.collection1.shard1.127.0.0.1:8983__collection1') enabled at server: com.sun.jmx.mbeanserver.JmxMBeanServer@2dc4a3b0
   [junit4]   2> 3353084 INFO  (coreLoadExecutor-13434-thread-1-processing-n:127.0.0.1:8983_) [n:127.0.0.1:8983_ c:collection1 s:shard1  x:collection1] o.a.s.c.SolrCore [[collection1] ] Opening new SolrCore at [/export/home/jenkins/workspace/Lucene-Solr-7.x-Solaris/solr/core/src/test-files/solr/collection1], dataDir=[/export/home/jenkins/workspace/Lucene-Solr-7.x-Solaris/solr/build/solr-core/test/J0/temp/solr.rest.TestManagedResourceStorage_FBB9BBBE6540BB3E-001/init-core-data-001/]
   [junit4]   2> 3353085 INFO  (coreLoadExecutor-13434-thread-1-processing-n:127.0.0.1:8983_) [n:127.0.0.1:8983_ c:collection1 s:shard1  x:collection1] o.a.s.u.RandomMergePolicy RandomMergePolicy wrapping class org.apache.lucene.index.AlcoholicMergePolicy: [AlcoholicMergePolicy: minMergeSize=0, mergeFactor=10, maxMergeSize=465461418, maxMergeSizeForForcedMerge=9223372036854775807, calibrateSizeByDeletes=true, maxMergeDocs=2147483647, maxCFSSegmentSizeMB=8.796093022207999E12, noCFSRatio=0.1]
   [junit4]   2> 3353157 INFO  (coreLoadExecutor-13434-thread-1-processing-n:127.0.0.1:8983_) [n:127.0.0.1:8983_ c:collection1 s:shard1  x:collection1] o.a.s.u.UpdateHandler Using UpdateLog implementation: org.apache.solr.update.UpdateLog
   [junit4]   2> 3353157 INFO  (coreLoadExecutor-13434-thread-1-processing-n:127.0.0.1:8983_) [n:127.0.0.1:8983_ c:collection1 s:shard1  x:collection1] o.a.s.u.UpdateLog Initializing UpdateLog: dataDir= defaultSyncLevel=FLUSH numRecordsToKeep=100 maxNumLogsToKeep=10 numVersionBuckets=65536
   [junit4]   2> 3353158 INFO  (coreLoadExecutor-13434-thread-1-processing-n:127.0.0.1:8983_) [n:127.0.0.1:8983_ c:collection1 s:shard1  x:collection1] o.a.s.u.CommitTracker Hard AutoCommit: disabled
   [junit4]   2> 3353158 INFO  (coreLoadExecutor-13434-thread-1-processing-n:127.0.0.1:8983_) [n:127.0.0.1:8983_ c:collection1 s:shard1  x:collection1] o.a.s.u.CommitTracker Soft AutoCommit: disabled
   [junit4]   2> 3353159 INFO  (coreLoadExecutor-13434-thread-1-processing-n:127.0.0.1:8983_) [n:127.0.0.1:8983_ c:collection1 s:shard1  x:collection1] o.a.s.u.RandomMergePolicy RandomMergePolicy wrapping class org.apache.lucene.index.AlcoholicMergePolicy: [AlcoholicMergePolicy: minMergeSize=0, mergeFactor=10, maxMergeSize=1303684992, maxMergeSizeForForcedMerge=9223372036854775807, calibrateSizeByDeletes=true, maxMergeDocs=2147483647, maxCFSSegmentSizeMB=8.796093022207999E12, noCFSRatio=0.1]
   [junit4]   2> 3353159 INFO  (coreLoadExecutor-13434-thread-1-processing-n:127.0.0.1:8983_) [n:127.0.0.1:8983_ c:collection1 s:shard1  x:collection1] o.a.s.s.SolrIndexSearcher Opening [Searcher@256ac693[collection1] main]
   [junit4]   2> 3353162 INFO  (coreLoadExecutor-13434-thread-1-processing-n:127.0.0.1:8983_) [n:127.0.0.1:8983_ c:collection1 s:shard1  x:collection1] o.a.s.h.c.SpellCheckComponent Initializing spell checkers
   [junit4]   2> 3353169 INFO  (coreLoadExecutor-13434-thread-1-processing-n:127.0.0.1:8983_) [n:127.0.0.1:8983_ c:collection1 s:shard1  x:collection1] o.a.s.s.DirectSolrSpellChecker init: {name=direct,classname=DirectSolrSpellChecker,field=lowerfilt,minQueryLength=3}
   [junit4]   2> 3353199 INFO  (coreLoadExecutor-13434-thread-1-processing-n:127.0.0.1:8983_) [n:127.0.0.1:8983_ c:collection1 s:shard1  x:collection1] o.a.s.h.ReplicationHandler Commits will be reserved for 10000ms.
   [junit4]   2> 3353199 INFO  (coreLoadExecutor-13434-thread-1-processing-n:127.0.0.1:8983_) [n:127.0.0.1:8983_ c:collection1 s:shard1  x:collection1] o.a.s.u.UpdateLog Could not find max version in index or recent updates, using new clock 1617199535612755968
   [junit4]   2> 3353201 INFO  (searcherExecutor-13435-thread-1-processing-n:127.0.0.1:8983_ x:collection1 c:collection1 s:shard1) [n:127.0.0.1:8983_ c:collection1 s:shard1  x:collection1] o.a.s.h.c.SpellCheckComponent Loading spell index for spellchecker: default
   [junit4]   2> 3353201 INFO  (searcherExecutor-13435-thread-1-processing-n:127.0.0.1:8983_ x:collection1 c:collection1 s:shard1) [n:127.0.0.1:8983_ c:collection1 s:shard1  x:collection1] o.a.s.h.c.SpellCheckComponent Loading spell index for spellchecker: direct
   [junit4]   2> 3353202 INFO  (searcherExecutor-13435-thread-1-processing-n:127.0.0.1:8983_ x:collection1 c:collection1 s:shard1) [n:127.0.0.1:8983_ c:collection1 s:shard1  x:collection1] o.a.s.h.c.SpellCheckComponent Loading spell index for spellchecker: wordbreak
   [junit4]   2> 3353202 INFO  (searcherExecutor-13435-thread-1-processing-n:127.0.0.1:8983_ x:collection1 c:collection1 s:shard1) [n:127.0.0.1:8983_ c:collection1 s:shard1  x:collection1] o.a.s.h.c.SpellCheckComponent Loading spell index for spellchecker: multipleFields
   [junit4]   2> 3353202 INFO  (searcherExecutor-13435-thread-1-processing-n:127.0.0.1:8983_ x:collection1 c:collection1 s:shard1) [n:127.0.0.1:8983_ c:collection1 s:shard1  x:collection1] o.a.s.h.c.SpellCheckComponent Loading spell index for spellchecker: jarowinkler
   [junit4]   2> 3353202 INFO  (searcherExecutor-13435-thread-1-processing-n:127.0.0.1:8983_ x:collection1 c:collection1 s:shard1) [n:127.0.0.1:8983_ c:collection1 s:shard1  x:collection1] o.a.s.h.c.SpellCheckComponent Loading spell index for spellchecker: external
   [junit4]   2> 3353203 INFO  (searcherExecutor-13435-thread-1-processing-n:127.0.0.1:8983_ x:collection1 c:collection1 s:shard1) [n:127.0.0.1:8983_ c:collection1 s:shard1  x:collection1] o.a.s.h.c.SpellCheckComponent Loading spell index for spellchecker: freq
   [junit4]   2> 3353203 INFO  (searcherExecutor-13435-thread-1-processing-n:127.0.0.1:8983_ x:collection1 c:collection1 s:shard1) [n:127.0.0.1:8983_ c:collection1 s:shard1  x:collection1] o.a.s.h.c.SpellCheckComponent Loading spell index for spellchecker: fqcn
   [junit4]   2> 3353203 INFO  (searcherExecutor-13435-thread-1-processing-n:127.0.0.1:8983_ x:collection1 c:collection1 s:shard1) [n:127.0.0.1:8983_ c:collection1 s:shard1  x:collection1] o.a.s.h.c.SpellCheckComponent Loading spell index for spellchecker: perDict
   [junit4]   2> 3353204 INFO  (searcherExecutor-13435-thread-1-processing-n:127.0.0.1:8983_ x:collection1 c:collection1 s:shard1) [n:127.0.0.1:8983_ c:collection1 s:shard1  x:collection1] o.a.s.c.SolrCore [collection1] Registered new searcher Searcher@256ac693[collection1] main{ExitableDirectoryReader(UninvertingDirectoryReader())}
   [junit4]   2> 3353210 INFO  (SUITE-TestManagedResourceStorage-seed#[FBB9BBBE6540BB3E]-worker) [n:127.0.0.1:8983_    ] o.a.s.SolrTestCaseJ4 ####initCore end
   [junit4]   2> 3353305 INFO  (TEST-TestManagedResourceStorage.testFileBasedJsonStorage-seed#[FBB9BBBE6540BB3E]) [n:127.0.0.1:8983_    ] o.a.s.SolrTestCaseJ4 ###Starting testFileBasedJsonStorage
   [junit4]   2> 3353306 INFO  (TEST-TestManagedResourceStorage.testFileBasedJsonStorage-seed#[FBB9BBBE6540BB3E]) [n:127.0.0.1:8983_    ] o.a.s.r.ManagedResourceStorage File-based storage initialized to use dir: /export/home/jenkins/workspace/Lucene-Solr-7.x-Solaris/solr/build/solr-core/test/J0/temp/solr.rest.TestManagedResourceStorage_FBB9BBBE6540BB3E-001/json-storage-001/managed
   [junit4]   2> 3353306 INFO  (TEST-TestManagedResourceStorage.testFileBasedJsonStorage-seed#[FBB9BBBE6540BB3E]) [n:127.0.0.1:8983_    ] o.a.s.r.ManagedResourceStorage Saved JSON object to path _test_foo.json using file:dir=/export/home/jenkins/workspace/Lucene-Solr-7.x-Solaris/solr/build/solr-core/test/J0/temp/solr.rest.TestManagedResourceStorage_FBB9BBBE6540BB3E-001/json-storage-001/managed
   [junit4]   2> 3353306 INFO  (TEST-TestManagedResourceStorage.testFileBasedJsonStorage-seed#[FBB9BBBE6540BB3E]) [n:127.0.0.1:8983_    ] o.a.s.r.ManagedResourceStorage Loaded LinkedHashMap at path _test_foo.json using file:dir=/export/home/jenkins/workspace/Lucene-Solr-7.x-Solaris/solr/build/solr-core/test/J0/temp/solr.rest.TestManagedResourceStorage_FBB9BBBE6540BB3E-001/json-storage-001/managed
   [junit4]   2> 3353307 INFO  (TEST-TestManagedResourceStorage.testFileBasedJsonStorage-seed#[FBB9BBBE6540BB3E]) [n:127.0.0.1:8983_    ] o.a.s.r.ManagedResourceStorage Saved JSON object to path _test_foo.json using file:dir=/export/home/jenkins/workspace/Lucene-Solr-7.x-Solaris/solr/build/solr-core/test/J0/temp/solr.rest.TestManagedResourceStorage_FBB9BBBE6540BB3E-001/json-storage-001/managed
   [junit4]   2> 3353307 INFO  (TEST-TestManagedResourceStorage.testFileBasedJsonStorage-seed#[FBB9BBBE6540BB3E]) [n:127.0.0.1:8983_    ] o.a.s.r.ManagedResourceStorage Loaded LinkedHashMap at path _test_foo.json using file:dir=/export/home/jenkins/workspace/Lucene-Solr-7.x-Solaris/solr/build/solr-core/test/J0/temp/solr.rest.TestManagedResourceStorage_FBB9BBBE6540BB3E-001/json-storage-001/managed
   [junit4]   2> 3353308 INFO  (TEST-TestManagedResourceStorage.testFileBasedJsonStorage-seed#[FBB9BBBE6540BB3E]) [n:127.0.0.1:8983_    ] o.a.s.SolrTestCaseJ4 ###Ending testFileBasedJsonStorage
   [junit4]   2> 3353308 INFO  (coreZkRegister-13422-thread-1-processing-n:127.0.0.1:8983_ x:collection1 c:collection1 s:shard1) [n:127.0.0.1:8983_ c:collection1 s:shard1 r:127.0.0.1:8983__collection1 x:collection1] o.a.s.c.ZkShardTerms Successful update of terms at /collections/collection1/terms/shard1 to Terms{values={127.0.0.1:8983__collection1=0}, version=0}
   [junit4]   2> 3353391 INFO  (TEST-TestManagedResourceStorage.testZkBasedJsonStorage-seed#[FBB9BBBE6540BB3E]) [n:127.0.0.1:8983_    ] o.a.s.SolrTestCaseJ4 ###Starting testZkBasedJsonStorage
   [junit4]   2> 3353393 INFO  (coreZkRegister-13422-thread-1-processing-n:127.0.0.1:8983_ x:collection1 c:collection1 s:shard1) [n:127.0.0.1:8983_ c:collection1 s:shard1 r:127.0.0.1:8983__collection1 x:collection1] o.a.s.c.ShardLeaderElectionContext Enough replicas found to continue.
   [junit4]   2> 3353393 INFO  (coreZkRegister-13422-thread-1-processing-n:127.0.0.1:8983_ x:collection1 c:collection1 s:shard1) [n:127.0.0.1:8983_ c:collection1 s:shard1 r:127.0.0.1:8983__collection1 x:collection1] o.a.s.c.ShardLeaderElectionContext I may be the new leader - try and sync
   [junit4]   2> 3353393 INFO  (coreZkRegister-13422-thread-1-processing-n:127.0.0.1:8983_ x:collection1 c:collection1 s:shard1) [n:127.0.0.1:8983_ c:collection1 s:shard1 r:127.0.0.1:8983__collection1 x:collection1] o.a.s.c.ShardLeaderElectionContext Found all replicas participating in election, clear LIR
   [junit4]   2> 3353393 INFO  (TEST-TestManagedResourceStorage.testZkBasedJsonStorage-seed#[FBB9BBBE6540BB3E]) [n:127.0.0.1:8983_    ] o.a.s.r.ManagedResourceStorage Configured ZooKeeperStorageIO with znodeBase: /test
   [junit4]   2> 3353399 INFO  (TEST-TestManagedResourceStorage.testZkBasedJsonStorage-seed#[FBB9BBBE6540BB3E]) [n:127.0.0.1:8983_    ] o.a.s.r.ManagedResourceStorage Wrote 136 bytes to new znode /test/_test_foo.json
   [junit4]   2> 3353399 INFO  (TEST-TestManagedResourceStorage.testZkBasedJsonStorage-seed#[FBB9BBBE6540BB3E]) [n:127.0.0.1:8983_    ] o.a.s.r.ManagedResourceStorage Saved JSON object to path _test_foo.json using ZooKeeperStorageIO:path=/test
   [junit4]   2> 3353401 INFO  (TEST-TestManagedResourceStorage.testZkBasedJsonStorage-seed#[FBB9BBBE6540BB3E]) [n:127.0.0.1:8983_    ] o.a.s.r.ManagedResourceStorage Loaded LinkedHashMap at path _test_foo.json using ZooKeeperStorageIO:path=/test
   [junit4]   2> 3353402 INFO  (TEST-TestManagedResourceStorage.testZkBasedJsonStorage-seed#[FBB9BBBE6540BB3E]) [n:127.0.0.1:8983_    ] o.a.s.r.ManagedResourceStorage Wrote 175 bytes to existing znode /test/_test_foo.json
   [junit4]   2> 3353402 INFO  (TEST-TestManagedResourceStorage.testZkBasedJsonStorage-seed#[FBB9BBBE6540BB3E]) [n:127.0.0.1:8983_    ] o.a.s.r.ManagedResourceStorage Saved JSON object to path _test_foo.json using ZooKeeperStorageIO:path=/test
   [junit4]   2> 3353403 INFO  (TEST-TestManagedResourceStorage.testZkBasedJsonStorage-seed#[FBB9BBBE6540BB3E]) [n:127.0.0.1:8983_    ] o.a.s.r.ManagedResourceStorage Loaded LinkedHashMap at path _test_foo.json using ZooKeeperStorageIO:path=/test
   [junit4]   2> 3353404 DEBUG (OverseerStateUpdate-72063507136970755-127.0.0.1:8983_-n_0000000000) [n:127.0.0.1:8983_    ] o.a.s.c.Overseer processMessage: queueSize: 1, message = {
   [junit4]   2>   "operation":"leader",
   [junit4]   2>   "shard":"shard1",
   [junit4]   2>   "collection":"collection1",
   [junit4]   2>   "base_url":"http://127.0.0.1:8983",
   [junit4]   2>   "core":"collection1",
   [junit4]   2>   "state":"active"} current state version: 1
   [junit4]   2> 3353404 INFO  (TEST-TestManagedResourceStorage.testZkBasedJsonStorage-seed#[FBB9BBBE6540BB3E]) [n:127.0.0.1:8983_    ] o.a.s.SolrTestCaseJ4 ###Ending testZkBasedJsonStorage
   [junit4]   2> 3353404 INFO  (SUITE-TestManagedResourceStorage-seed#[FBB9BBBE6540BB3E]-worker) [n:127.0.0.1:8983_    ] o.a.s.SolrTestCaseJ4 ###deleteCore
   [junit4]   2> 3353405 INFO  (SUITE-TestManagedResourceStorage-seed#[FBB9BBBE6540BB3E]-worker) [n:127.0.0.1:8983_    ] o.a.s.SolrTestCaseJ4 ###deleteCore
   [junit4]   2> 3353405 INFO  (coreZkRegister-13422-thread-1-processing-n:127.0.0.1:8983_ x:collection1 c:collection1 s:shard1) [n:127.0.0.1:8983_ c:collection1 s:shard1 r:127.0.0.1:8983__collection1 x:collection1] o.a.s.c.ShardLeaderElectionContext I am the new leader: http://127.0.0.1:8983/collection1/ shard1
   [junit4]   2> 3353512 WARN  (coreZkRegister-13422-thread-1-processing-n:127.0.0.1:8983_ x:collection1 c:collection1 s:shard1) [n:127.0.0.1:8983_ c:collection1 s:shard1 r:127.0.0.1:8983__collection1 x:collection1] o.a.s.c.ZkController Skipping recovery according to sys prop solrcloud.skip.autorecovery
   [junit4]   2> 3353514 DEBUG (OverseerStateUpdate-72063507136970755-127.0.0.1:8983_-n_0000000000) [n:127.0.0.1:8983_    ] o.a.s.c.Overseer processMessage: queueSize: 1, message = {
   [junit4]   2>   "core":"collection1",
   [junit4]   2>   "core_node_name":"127.0.0.1:8983__collection1",
   [junit4]   2>   "roles":null,
   [junit4]   2>   "base_url":"http://127.0.0.1:8983",
   [junit4]   2>   "node_name":"127.0.0.1:8983_",
   [junit4]   2>   "state":"active",
   [junit4]   2>   "shard":"shard1",
   [junit4]   2>   "collection":"collection1",
   [junit4]   2>   "type":"NRT",
   [junit4]   2>   "operation":"state"} current state version: 2
   [junit4]   2> Nov 15, 2018 11:34:22 AM com.carrotsearch.randomizedtesting.ThreadLeakControl checkThreadLeaks
   [junit4]   2> WARNING: Will linger awaiting termination of 29 leaked thread(s).
   [junit4]   2> 3353739 DEBUG (ScheduledTrigger-13428-thread-3) [    ] o.a.s.c.a.NodeLostTrigger Running NodeLostTrigger: .auto_add_replicas with currently live nodes: 1
   [junit4]   2> 3354739 DEBUG (ScheduledTrigger-13428-thread-4) [    ] o.a.s.c.a.NodeLostTrigger Running NodeLostTrigger: .auto_add_replicas with currently live nodes: 1
   [junit4]   2> 3355739 DEBUG (ScheduledTrigger-13428-thread-3) [    ] o.a.s.c.a.NodeLostTrigger Running NodeLostTrigger: .auto_add_replicas with currently live nodes: 1
   [junit4]   2> 3356746 DEBUG (ScheduledTrigger-13428-thread-2) [    ] o.a.s.c.a.NodeLostTrigger Running NodeLostTrigger: .auto_add_replicas with currently live nodes: 1
   [junit4]   2> 3357746 DEBUG (ScheduledTrigger-13428-thread-1) [    ] o.a.s.c.a.NodeLostTrigger Running NodeLostTrigger: .auto_add_replicas with currently live nodes: 1
   [junit4]   2> 3358747 DEBUG (ScheduledTrigger-13428-thread-3) [    ] o.a.s.c.a.NodeLostTrigger Running NodeLostTrigger: .auto_add_replicas with currently live nodes: 1
   [junit4]   2> 3359749 DEBUG (ScheduledTrigger-13428-thread-2) [    ] o.a.s.c.a.NodeLostTrigger Running NodeLostTrigger: .auto_add_replicas with currently live nodes: 1
   [junit4]   2> 3360750 DEBUG (ScheduledTrigger-13428-thread-4) [    ] o.a.s.c.a.NodeLostTrigger Running NodeLostTrigger: .auto_add_replicas with currently live nodes: 1
   [junit4]   2> 3361757 DEBUG (ScheduledTrigger-13428-thread-3) [    ] o.a.s.c.a.NodeLostTrigger Running NodeLostTrigger: .auto_add_replicas with currently live nodes: 1
   [junit4]   2> 3362757 DEBUG (ScheduledTrigger-13428-thread-1) [    ] o.a.s.c.a.NodeLostTrigger Running NodeLostTrigger: .auto_add_replicas with currently live nodes: 1
   [junit4]   2> 3363757 DEBUG (ScheduledTrigger-13428-thread-2) [    ] o.a.s.c.a.NodeLostTrigger Running NodeLostTrigger: .auto_add_replicas with currently live nodes: 1
   [junit4]   2> 3364761 DEBUG (ScheduledTrigger-13428-thread-1) [    ] o.a.s.c.a.NodeLostTrigger Running NodeLostTrigger: .auto_add_replicas with currently live nodes: 1
   [junit4]   2> 3365761 DEBUG (ScheduledTrigger-13428-thread-2) [    ] o.a.s.c.a.NodeLostTrigger Running NodeLostTrigger: .auto_add_replicas with currently live nodes: 1
   [junit4]   2> 3366761 DEBUG (ScheduledTrigger-13428-thread-3) [    ] o.a.s.c.a.NodeLostTrigger Running NodeLostTrigger: .auto_add_replicas with currently live nodes: 1
   [junit4]   2> 3367760 DEBUG (ScheduledTrigger-13428-thread-1) [    ] o.a.s.c.a.NodeLostTrigger Running NodeLostTrigger: .auto_add_replicas with currently live nodes: 1
   [junit4]   2> 3368797 DEBUG (ScheduledTrigger-13428-thread-1) [    ] o.a.s.c.a.NodeLostTrigger Running NodeLostTrigger: .auto_add_replicas with currently live nodes: 1
   [junit4]   2> 3369827 DEBUG (ScheduledTrigger-13428-thread-2) [    ] o.a.s.c.a.NodeLostTrigger Running NodeLostTrigger: .auto_add_replicas with currently live nodes: 1
   [junit4]   2> 3370830 DEBUG (ScheduledTrigger-13428-thread-4) [    ] o.a.s.c.a.NodeLostTrigger Running NodeLostTrigger: .auto_add_replicas with currently 

[...truncated too long message...]

ESSFUL
Total time: 1 minute 0 seconds
[repro] ant test-nocompile -Dtests.dups=5 -Dtests.maxfailures=5 -Dtests.class="*.TestManagedResourceStorage" -Dtests.showOutput=onerror "-Dargs=-XX:-UseCompressedOops -XX:+UseSerialGC" -Dtests.seed=FBB9BBBE6540BB3E -Dtests.slow=true -Dtests.locale=el-CY -Dtests.timezone=Brazil/West -Dtests.asserts=true -Dtests.file.encoding=UTF-8
Buildfile: /export/home/jenkins/workspace/Lucene-Solr-7.x-Solaris/solr/core/build.xml

-clover.disable:

ivy-configure:
[ivy:configure] :: Apache Ivy 2.4.0 - 20141213170938 :: http://ant.apache.org/ivy/ ::
[ivy:configure] :: loading settings :: file = /export/home/jenkins/workspace/Lucene-Solr-7.x-Solaris/lucene/top-level-ivy-settings.xml

install-junit4-taskdef:

ivy-availability-check:
[loadresource] Do not set property disallowed.ivy.jars.list as its length is 0.

-ivy-fail-disallowed-ivy-version:

ivy-fail:

resolve-groovy:
[ivy:cachepath] :: resolving dependencies :: org.codehaus.groovy#groovy-all-caller;working
[ivy:cachepath] 	confs: [default]
[ivy:cachepath] 	found org.codehaus.groovy#groovy-all;2.4.15 in public
[ivy:cachepath] :: resolution report :: resolve 15ms :: artifacts dl 1ms
	---------------------------------------------------------------------
	|                  |            modules            ||   artifacts   |
	|       conf       | number| search|dwnlded|evicted|| number|dwnlded|
	---------------------------------------------------------------------
	|      default     |   1   |   0   |   0   |   0   ||   1   |   0   |
	---------------------------------------------------------------------

-init-totals:

-test:
    [mkdir] Created dir: /export/home/jenkins/workspace/Lucene-Solr-7.x-Solaris/solr/build/solr-core/test
[junit4:pickseed] Seed property 'tests.seed' already defined: FBB9BBBE6540BB3E
    [mkdir] Created dir: /export/home/jenkins/workspace/Lucene-Solr-7.x-Solaris/solr/build/solr-core/test/temp
   [junit4] <JUnit4> says hello! Master seed: FBB9BBBE6540BB3E
   [junit4] Executing 5 suites with 2 JVMs.
   [junit4] 
   [junit4] Started J0 PID(9434@serv1-vm3).
   [junit4] Started J1 PID(9433@serv1-vm3).
   [junit4] Suite: org.apache.solr.rest.TestManagedResourceStorage
   [junit4] OK      0.03s J1 | TestManagedResourceStorage.testFileBasedJsonStorage
   [junit4] OK      0.04s J1 | TestManagedResourceStorage.testZkBasedJsonStorage
   [junit4] Completed [1/5] on J1 in 11.68s, 2 tests
   [junit4] 
   [junit4] Suite: org.apache.solr.rest.TestManagedResourceStorage
   [junit4] OK      0.03s J0 | TestManagedResourceStorage.testFileBasedJsonStorage
   [junit4] OK      0.04s J0 | TestManagedResourceStorage.testZkBasedJsonStorage
   [junit4] Completed [2/5] on J0 in 11.93s, 2 tests
   [junit4] 
   [junit4] Duplicate suite name used with XML reports: org.apache.solr.rest.TestManagedResourceStorage. This may confuse tools that process XML reports. Set 'ignoreDuplicateSuites' to true to skip this message.
   [junit4] Suite: org.apache.solr.rest.TestManagedResourceStorage
   [junit4] OK      0.02s J1 | TestManagedResourceStorage.testFileBasedJsonStorage
   [junit4] OK      0.03s J1 | TestManagedResourceStorage.testZkBasedJsonStorage
   [junit4] Completed [3/5] on J1 in 3.53s, 2 tests
   [junit4] 
   [junit4] Suite: org.apache.solr.rest.TestManagedResourceStorage
   [junit4] OK      0.02s J0 | TestManagedResourceStorage.testFileBasedJsonStorage
   [junit4] OK      0.03s J0 | TestManagedResourceStorage.testZkBasedJsonStorage
   [junit4] Completed [4/5] on J0 in 4.82s, 2 tests
   [junit4] 
   [junit4] Suite: org.apache.solr.rest.TestManagedResourceStorage
   [junit4] OK      0.01s J1 | TestManagedResourceStorage.testFileBasedJsonStorage
   [junit4] OK      0.02s J1 | TestManagedResourceStorage.testZkBasedJsonStorage
   [junit4] Completed [5/5] on J1 in 3.72s, 2 tests
   [junit4] 
   [junit4] JVM J0:     0.72 ..    18.16 =    17.44s
   [junit4] JVM J1:     0.74 ..    20.81 =    20.07s
   [junit4] Execution time total: 20 seconds
   [junit4] Tests summary: 5 suites, 10 tests
   [junit4] Could not remove temporary path: /export/home/jenkins/workspace/Lucene-Solr-7.x-Solaris/solr/build/solr-core/test/J0 (java.nio.file.DirectoryNotEmptyException: Remaining files: [/export/home/jenkins/workspace/Lucene-Solr-7.x-Solaris/solr/build/solr-core/test/J0/temp])
   [junit4] Could not remove temporary path: /export/home/jenkins/workspace/Lucene-Solr-7.x-Solaris/solr/build/solr-core/test/J1 (java.nio.file.DirectoryNotEmptyException: Remaining files: [/export/home/jenkins/workspace/Lucene-Solr-7.x-Solaris/solr/build/solr-core/test/J1/temp])
     [echo] 5 slowest tests:
[junit4:tophints] 349.85s | org.apache.solr.cloud.api.collections.ShardSplitTest
[junit4:tophints] 123.40s | org.apache.solr.cloud.cdcr.CdcrOpsAndBoundariesTest
[junit4:tophints] 117.70s | org.apache.solr.update.SoftAutoCommitTest
[junit4:tophints] 114.05s | org.apache.solr.cloud.ZkFailoverTest
[junit4:tophints] 112.90s | org.apache.solr.cloud.cdcr.CdcrWithNodesRestartsTest

-check-totals:

test-nocompile:

BUILD SUCCESSFUL
Total time: 23 seconds
[repro] Failures:
[repro]   0/5 failed: org.apache.solr.rest.TestManagedResourceStorage
[repro] Exiting with code 0
+ mv lucene/build lucene/build.repro
+ mv solr/build solr/build.repro
+ mv lucene/build.orig lucene/build
+ mv solr/build.orig solr/build
Archiving artifacts
Setting ANT_1_8_2_HOME=/export/home/jenkins/tools/hudson.tasks.Ant_AntInstallation/ANT_1.8.2
java.lang.InterruptedException: no matches found within 10000
	at hudson.FilePath$ValidateAntFileMask.hasMatch(FilePath.java:2845)
	at hudson.FilePath$ValidateAntFileMask.invoke(FilePath.java:2724)
	at hudson.FilePath$ValidateAntFileMask.invoke(FilePath.java:2705)
	at hudson.FilePath$FileCallableWrapper.call(FilePath.java:3084)
Also:   hudson.remoting.Channel$CallSiteStackTrace: Remote call to Solaris VBOX
		at hudson.remoting.Channel.attachCallSiteStackTrace(Channel.java:1741)
		at hudson.remoting.UserRequest$ExceptionResponse.retrieve(UserRequest.java:357)
		at hudson.remoting.Channel.call(Channel.java:955)
		at hudson.FilePath.act(FilePath.java:1070)
		at hudson.FilePath.act(FilePath.java:1059)
		at hudson.FilePath.validateAntFileMask(FilePath.java:2703)
		at hudson.tasks.ArtifactArchiver.perform(ArtifactArchiver.java:243)
		at hudson.tasks.BuildStepCompatibilityLayer.perform(BuildStepCompatibilityLayer.java:81)
		at hudson.tasks.BuildStepMonitor$1.perform(BuildStepMonitor.java:20)
		at hudson.model.AbstractBuild$AbstractBuildExecution.perform(AbstractBuild.java:744)
		at hudson.model.AbstractBuild$AbstractBuildExecution.performAllBuildSteps(AbstractBuild.java:690)
		at hudson.model.Build$BuildExecution.post2(Build.java:186)
		at hudson.model.AbstractBuild$AbstractBuildExecution.post(AbstractBuild.java:635)
		at hudson.model.Run.execute(Run.java:1835)
		at hudson.model.FreeStyleBuild.run(FreeStyleBuild.java:43)
		at hudson.model.ResourceController.execute(ResourceController.java:97)
		at hudson.model.Executor.run(Executor.java:429)
Caused: hudson.FilePath$TunneledInterruptedException
	at hudson.FilePath$FileCallableWrapper.call(FilePath.java:3086)
	at hudson.remoting.UserRequest.perform(UserRequest.java:212)
	at hudson.remoting.UserRequest.perform(UserRequest.java:54)
	at hudson.remoting.Request$2.run(Request.java:369)
	at hudson.remoting.InterceptingExecutorService$1.call(InterceptingExecutorService.java:72)
	at java.util.concurrent.FutureTask.run(FutureTask.java:266)
	at java.util.concurrent.ThreadPoolExecutor.runWorker(ThreadPoolExecutor.java:1149)
	at java.util.concurrent.ThreadPoolExecutor$Worker.run(ThreadPoolExecutor.java:624)
	at java.lang.Thread.run(Thread.java:748)
Caused: java.lang.InterruptedException: java.lang.InterruptedException: no matches found within 10000
	at hudson.FilePath.act(FilePath.java:1072)
	at hudson.FilePath.act(FilePath.java:1059)
	at hudson.FilePath.validateAntFileMask(FilePath.java:2703)
	at hudson.tasks.ArtifactArchiver.perform(ArtifactArchiver.java:243)
	at hudson.tasks.BuildStepCompatibilityLayer.perform(BuildStepCompatibilityLayer.java:81)
	at hudson.tasks.BuildStepMonitor$1.perform(BuildStepMonitor.java:20)
	at hudson.model.AbstractBuild$AbstractBuildExecution.perform(AbstractBuild.java:744)
	at hudson.model.AbstractBuild$AbstractBuildExecution.performAllBuildSteps(AbstractBuild.java:690)
	at hudson.model.Build$BuildExecution.post2(Build.java:186)
	at hudson.model.AbstractBuild$AbstractBuildExecution.post(AbstractBuild.java:635)
	at hudson.model.Run.execute(Run.java:1835)
	at hudson.model.FreeStyleBuild.run(FreeStyleBuild.java:43)
	at hudson.model.ResourceController.execute(ResourceController.java:97)
	at hudson.model.Executor.run(Executor.java:429)
No artifacts found that match the file pattern "**/*.events,heapdumps/**,**/*_pid*.log". Configuration error?
[WARNINGS] Parsing warnings in console log with parser Java Compiler (javac)
Setting ANT_1_8_2_HOME=/export/home/jenkins/tools/hudson.tasks.Ant_AntInstallation/ANT_1.8.2
Setting ANT_1_8_2_HOME=/export/home/jenkins/tools/hudson.tasks.Ant_AntInstallation/ANT_1.8.2
<Git Blamer> Using GitBlamer to create author and commit information for all warnings.
<Git Blamer> GIT_COMMIT=efae53e5e910aa1c44b201f861db856db492837d, workspace=/export/home/jenkins/workspace/Lucene-Solr-7.x-Solaris
[WARNINGS] Computing warning deltas based on reference build #907
Recording test results
Setting ANT_1_8_2_HOME=/export/home/jenkins/tools/hudson.tasks.Ant_AntInstallation/ANT_1.8.2
Build step 'Publish JUnit test result report' changed build result to UNSTABLE
Email was triggered for: Unstable (Test Failures)
Sending email for trigger: Unstable (Test Failures)
Setting ANT_1_8_2_HOME=/export/home/jenkins/tools/hudson.tasks.Ant_AntInstallation/ANT_1.8.2
Setting ANT_1_8_2_HOME=/export/home/jenkins/tools/hudson.tasks.Ant_AntInstallation/ANT_1.8.2
Setting ANT_1_8_2_HOME=/export/home/jenkins/tools/hudson.tasks.Ant_AntInstallation/ANT_1.8.2
Setting ANT_1_8_2_HOME=/export/home/jenkins/tools/hudson.tasks.Ant_AntInstallation/ANT_1.8.2

Mime
View raw message