lucene-dev mailing list archives

Site index · List index
Message view « Date » · « Thread »
Top « Date » · « Thread »
From Apache Jenkins Server <jenk...@builds.apache.org>
Subject [JENKINS] Lucene-Solr-repro - Build # 1865 - Unstable
Date Mon, 05 Nov 2018 12:23:52 GMT
Build: https://builds.apache.org/job/Lucene-Solr-repro/1865/

[...truncated 28 lines...]
[repro] Jenkins log URL: https://builds.apache.org/job/Lucene-Solr-NightlyTests-master/1689/consoleText

[repro] Revision: 45b772f4a995c618b48ff05c6129c5683df92f88

[repro] Ant options: -Dtests.multiplier=2 -Dtests.linedocsfile=/home/jenkins/jenkins-slave/workspace/Lucene-Solr-NightlyTests-master/test-data/enwiki.random.lines.txt
[repro] Repro line:  ant test  -Dtestcase=FullSolrCloudDistribCmdsTest -Dtests.method=test -Dtests.seed=436B9276AB629A12 -Dtests.multiplier=2 -Dtests.nightly=true -Dtests.slow=true -Dtests.linedocsfile=/home/jenkins/jenkins-slave/workspace/Lucene-Solr-NightlyTests-master/test-data/enwiki.random.lines.txt -Dtests.locale=id-ID -Dtests.timezone=America/Porto_Velho -Dtests.asserts=true -Dtests.file.encoding=ISO-8859-1

[repro] Repro line:  ant test  -Dtestcase=CloudSolrClientTest -Dtests.method=testRouting -Dtests.seed=5630E8C5E6A4B819 -Dtests.multiplier=2 -Dtests.nightly=true -Dtests.slow=true -Dtests.linedocsfile=/home/jenkins/jenkins-slave/workspace/Lucene-Solr-NightlyTests-master/test-data/enwiki.random.lines.txt -Dtests.locale=es -Dtests.timezone=Asia/Qyzylorda -Dtests.asserts=true -Dtests.file.encoding=US-ASCII

[repro] git rev-parse --abbrev-ref HEAD
[repro] git rev-parse HEAD
[repro] Initial local git branch/revision: 45b772f4a995c618b48ff05c6129c5683df92f88
[repro] git fetch
[repro] git checkout 45b772f4a995c618b48ff05c6129c5683df92f88

[...truncated 1 lines...]
[repro] git merge --ff-only

[...truncated 1 lines...]
[repro] ant clean

[...truncated 6 lines...]
[repro] Test suites by module:
[repro]    solr/core
[repro]       FullSolrCloudDistribCmdsTest
[repro]    solr/solrj
[repro]       CloudSolrClientTest
[repro] ant compile-test

[...truncated 3567 lines...]
[repro] ant test-nocompile -Dtests.dups=5 -Dtests.maxfailures=5 -Dtests.class="*.FullSolrCloudDistribCmdsTest" -Dtests.showOutput=onerror -Dtests.multiplier=2 -Dtests.linedocsfile=/home/jenkins/jenkins-slave/workspace/Lucene-Solr-NightlyTests-master/test-data/enwiki.random.lines.txt -Dtests.seed=436B9276AB629A12 -Dtests.multiplier=2 -Dtests.nightly=true -Dtests.slow=true -Dtests.linedocsfile=/home/jenkins/jenkins-slave/workspace/Lucene-Solr-NightlyTests-master/test-data/enwiki.random.lines.txt -Dtests.locale=id-ID -Dtests.timezone=America/Porto_Velho -Dtests.asserts=true -Dtests.file.encoding=ISO-8859-1

[...truncated 46416 lines...]
   [junit4] ERROR: JVM J0 ended with an exception, command line: /usr/local/asfpackages/java/jdk1.8.0_191/jre/bin/java -ea -esa -Dtests.prefix=tests -Dtests.seed=436B9276AB629A12 -Xmx512M -Dtests.iters= -Dtests.verbose=false -Dtests.infostream=false -Dtests.codec=random -Dtests.postingsformat=random -Dtests.docvaluesformat=random -Dtests.locale=id-ID -Dtests.timezone=America/Porto_Velho -Dtests.directory=random -Dtests.linedocsfile=/home/jenkins/jenkins-slave/workspace/Lucene-Solr-NightlyTests-master/test-data/enwiki.random.lines.txt -Dtests.luceneMatchVersion=8.0.0 -Dtests.cleanthreads=perClass -Djava.util.logging.config.file=/x1/jenkins/jenkins-slave/workspace/Lucene-Solr-repro/lucene/tools/junit4/logging.properties -Dtests.nightly=true -Dtests.weekly=false -Dtests.monster=false -Dtests.slow=true -Dtests.asserts=true -Dtests.multiplier=2 -DtempDir=./temp -Djava.io.tmpdir=./temp -Dcommon.dir=/x1/jenkins/jenkins-slave/workspace/Lucene-Solr-repro/lucene -Dclover.db.dir=/x1/jenkins/jenkins-slave/workspace/Lucene-Solr-repro/lucene/build/clover/db -Djava.security.policy=/x1/jenkins/jenkins-slave/workspace/Lucene-Solr-repro/lucene/tools/junit4/solr-tests.policy -Dtests.LUCENE_VERSION=8.0.0 -Djetty.testMode=1 -Djetty.insecurerandom=1 -Dsolr.directoryFactory=org.apache.solr.core.MockDirectoryFactory -Djava.awt.headless=true -Djdk.map.althashing.threshold=0 -Dtests.src.home=/x1/jenkins/jenkins-slave/workspace/Lucene-Solr-repro/solr/core -Djava.security.egd=file:/dev/./urandom -Djunit4.childvm.cwd=/x1/jenkins/jenkins-slave/workspace/Lucene-Solr-repro/solr/build/solr-core/test/J0 -Djunit4.tempDir=/x1/jenkins/jenkins-slave/workspace/Lucene-Solr-repro/solr/build/solr-core/test/temp -Djunit4.childvm.id=0 -Djunit4.childvm.count=3 -Dtests.leaveTemporary=false -Dtests.filterstacks=true -Dtests.maxfailures=5 -Djava.security.manager=org.apache.lucene.util.TestSecurityManager -Dfile.encoding=ISO-8859-1 -classpath /x1/jenkins/jenkins-slave/workspace/Lucene-Solr-repro/solr/build/solr-core/classes/test:/x1/jenkins/jenkins-slave/workspace/Lucene-Solr-repro/solr/build/solr-test-framework/classes/java:/x1/jenkins/jenkins-slave/workspace/Lucene-Solr-repro/solr/test-framework/lib/junit4-ant-2.6.4.jar:/x1/jenkins/jenkins-slave/workspace/Lucene-Solr-repro/solr/core/src/test-files:/x1/jenkins/jenkins-slave/workspace/Lucene-Solr-repro/lucene/build/test-framework/classes/java:/x1/jenkins/jenkins-slave/workspace/Lucene-Solr-repro/lucene/build/codecs/classes/java:/x1/jenkins/jenkins-slave/workspace/Lucene-Solr-repro/solr/build/solr-solrj/classes/java:/x1/jenkins/jenkins-slave/workspace/Lucene-Solr-repro/solr/build/solr-core/classes/java:/x1/jenkins/jenkins-slave/workspace/Lucene-Solr-repro/lucene/build/analysis/common/lucene-analyzers-common-8.0.0-SNAPSHOT.jar:/x1/jenkins/jenkins-slave/workspace/Lucene-Solr-repro/lucene/build/analysis/kuromoji/lucene-analyzers-kuromoji-8.0.0-SNAPSHOT.jar:/x1/jenkins/jenkins-slave/workspace/Lucene-Solr-repro/lucene/build/analysis/nori/lucene-analyzers-nori-8.0.0-SNAPSHOT.jar:/x1/jenkins/jenkins-slave/workspace/Lucene-Solr-repro/lucene/build/analysis/phonetic/lucene-analyzers-phonetic-8.0.0-SNAPSHOT.jar:/x1/jenkins/jenkins-slave/workspace/Lucene-Solr-repro/lucene/build/codecs/lucene-codecs-8.0.0-SNAPSHOT.jar:/x1/jenkins/jenkins-slave/workspace/Lucene-Solr-repro/lucene/build/backward-codecs/lucene-backward-codecs-8.0.0-SNAPSHOT.jar:/x1/jenkins/jenkins-slave/workspace/Lucene-Solr-repro/lucene/build/highlighter/lucene-highlighter-8.0.0-SNAPSHOT.jar:/x1/jenkins/jenkins-slave/workspace/Lucene-Solr-repro/lucene/build/memory/lucene-memory-8.0.0-SNAPSHOT.jar:/x1/jenkins/jenkins-slave/workspace/Lucene-Solr-repro/lucene/build/misc/lucene-misc-8.0.0-SNAPSHOT.jar:/x1/jenkins/jenkins-slave/workspace/Lucene-Solr-repro/lucene/build/spatial-extras/lucene-spatial-extras-8.0.0-SNAPSHOT.jar:/x1/jenkins/jenkins-slave/workspace/Lucene-Solr-repro/lucene/build/spatial3d/lucene-spatial3d-8.0.0-SNAPSHOT.jar:/x1/jenkins/jenkins-slave/workspace/Lucene-Solr-repro/lucene/build/expressions/lucene-expressions-8.0.0-SNAPSHOT.jar:/x1/jenkins/jenkins-slave/workspace/Lucene-Solr-repro/lucene/build/suggest/lucene-suggest-8.0.0-SNAPSHOT.jar:/x1/jenkins/jenkins-slave/workspace/Lucene-Solr-repro/lucene/build/grouping/lucene-grouping-8.0.0-SNAPSHOT.jar:/x1/jenkins/jenkins-slave/workspace/Lucene-Solr-repro/lucene/build/queries/lucene-queries-8.0.0-SNAPSHOT.jar:/x1/jenkins/jenkins-slave/workspace/Lucene-Solr-repro/lucene/build/queryparser/lucene-queryparser-8.0.0-SNAPSHOT.jar:/x1/jenkins/jenkins-slave/workspace/Lucene-Solr-repro/lucene/build/join/lucene-join-8.0.0-SNAPSHOT.jar:/x1/jenkins/jenkins-slave/workspace/Lucene-Solr-repro/lucene/build/sandbox/lucene-sandbox-8.0.0-SNAPSHOT.jar:/x1/jenkins/jenkins-slave/workspace/Lucene-Solr-repro/lucene/build/classification/lucene-classification-8.0.0-SNAPSHOT.jar:/x1/jenkins/jenkins-slave/workspace/Lucene-Solr-repro/solr/core/lib/antlr4-runtime-4.5.1-1.jar:/x1/jenkins/jenkins-slave/workspace/Lucene-Solr-repro/solr/core/lib/asm-5.1.jar:/x1/jenkins/jenkins-slave/workspace/Lucene-Solr-repro/solr/core/lib/asm-commons-5.1.jar:/x1/jenkins/jenkins-slave/workspace/Lucene-Solr-repro/solr/core/lib/avatica-core-1.10.0.jar:/x1/jenkins/jenkins-slave/workspace/Lucene-Solr-repro/solr/core/lib/caffeine-2.4.0.jar:/x1/jenkins/jenkins-slave/workspace/Lucene-Solr-repro/solr/core/lib/calcite-core-1.13.0.jar:/x1/jenkins/jenkins-slave/workspace/Lucene-Solr-repro/solr/core/lib/calcite-linq4j-1.13.0.jar:/x1/jenkins/jenkins-slave/workspace/Lucene-Solr-repro/solr/core/lib/commons-cli-1.2.jar:/x1/jenkins/jenkins-slave/workspace/Lucene-Solr-repro/solr/core/lib/commons-codec-1.11.jar:/x1/jenkins/jenkins-slave/workspace/Lucene-Solr-repro/solr/core/lib/commons-collections-3.2.2.jar:/x1/jenkins/jenkins-slave/workspace/Lucene-Solr-repro/solr/core/lib/commons-compiler-2.7.6.jar:/x1/jenkins/jenkins-slave/workspace/Lucene-Solr-repro/solr/core/lib/commons-configuration-1.6.jar:/x1/jenkins/jenkins-slave/workspace/Lucene-Solr-repro/solr/core/lib/commons-exec-1.3.jar:/x1/jenkins/jenkins-slave/workspace/Lucene-Solr-repro/solr/core/lib/commons-fileupload-1.3.3.jar:/x1/jenkins/jenkins-slave/workspace/Lucene-Solr-repro/solr/core/lib/commons-io-2.5.jar:/x1/jenkins/jenkins-slave/workspace/Lucene-Solr-repro/solr/core/lib/commons-lang-2.6.jar:/x1/jenkins/jenkins-slave/workspace/Lucene-Solr-repro/solr/core/lib/commons-lang3-3.6.jar:/x1/jenkins/jenkins-slave/workspace/Lucene-Solr-repro/solr/core/lib/commons-math3-3.6.1.jar:/x1/jenkins/jenkins-slave/workspace/Lucene-Solr-repro/solr/core/lib/curator-client-2.8.0.jar:/x1/jenkins/jenkins-slave/workspace/Lucene-Solr-repro/solr/core/lib/curator-framework-2.8.0.jar:/x1/jenkins/jenkins-slave/workspace/Lucene-Solr-repro/solr/core/lib/curator-recipes-2.8.0.jar:/x1/jenkins/jenkins-slave/workspace/Lucene-Solr-repro/solr/core/lib/disruptor-3.4.0.jar:/x1/jenkins/jenkins-slave/workspace/Lucene-Solr-repro/solr/core/lib/dom4j-1.6.1.jar:/x1/jenkins/jenkins-slave/workspace/Lucene-Solr-repro/solr/core/lib/eigenbase-properties-1.1.5.jar:/x1/jenkins/jenkins-slave/workspace/Lucene-Solr-repro/solr/core/lib/guava-14.0.1.jar:/x1/jenkins/jenkins-slave/workspace/Lucene-Solr-repro/solr/core/lib/hadoop-annotations-2.7.4.jar:/x1/jenkins/jenkins-slave/workspace/Lucene-Solr-repro/solr/core/lib/hadoop-auth-2.7.4.jar:/x1/jenkins/jenkins-slave/workspace/Lucene-Solr-repro/solr/core/lib/hadoop-common-2.7.4.jar:/x1/jenkins/jenkins-slave/workspace/Lucene-Solr-repro/solr/core/lib/hadoop-hdfs-2.7.4.jar:/x1/jenkins/jenkins-slave/workspace/Lucene-Solr-repro/solr/core/lib/hppc-0.8.1.jar:/x1/jenkins/jenkins-slave/workspace/Lucene-Solr-repro/solr/core/lib/htrace-core-3.2.0-incubating.jar:/x1/jenkins/jenkins-slave/workspace/Lucene-Solr-repro/solr/core/lib/jackson-annotations-2.9.6.jar:/x1/jenkins/jenkins-slave/workspace/Lucene-Solr-repro/solr/core/lib/jackson-core-2.9.6.jar:/x1/jenkins/jenkins-slave/workspace/Lucene-Solr-repro/solr/core/lib/jackson-core-asl-1.9.13.jar:/x1/jenkins/jenkins-slave/workspace/Lucene-Solr-repro/solr/core/lib/jackson-databind-2.9.6.jar:/x1/jenkins/jenkins-slave/workspace/Lucene-Solr-repro/solr/core/lib/jackson-dataformat-smile-2.9.6.jar:/x1/jenkins/jenkins-slave/workspace/Lucene-Solr-repro/solr/core/lib/jackson-mapper-asl-1.9.13.jar:/x1/jenkins/jenkins-slave/workspace/Lucene-Solr-repro/solr/core/lib/janino-2.7.6.jar:/x1/jenkins/jenkins-slave/workspace/Lucene-Solr-repro/solr/core/lib/jcl-over-slf4j-1.7.24.jar:/x1/jenkins/jenkins-slave/workspace/Lucene-Solr-repro/solr/core/lib/log4j-1.2-api-2.11.0.jar:/x1/jenkins/jenkins-slave/workspace/Lucene-Solr-repro/solr/core/lib/log4j-api-2.11.0.jar:/x1/jenkins/jenkins-slave/workspace/Lucene-Solr-repro/solr/core/lib/log4j-core-2.11.0.jar:/x1/jenkins/jenkins-slave/workspace/Lucene-Solr-repro/solr/core/lib/log4j-slf4j-impl-2.11.0.jar:/x1/jenkins/jenkins-slave/workspace/Lucene-Solr-repro/solr/core/lib/org.restlet-2.3.0.jar:/x1/jenkins/jenkins-slave/workspace/Lucene-Solr-repro/solr/core/lib/org.restlet.ext.servlet-2.3.0.jar:/x1/jenkins/jenkins-slave/workspace/Lucene-Solr-repro/solr/core/lib/protobuf-java-3.1.0.jar:/x1/jenkins/jenkins-slave/workspace/Lucene-Solr-repro/solr/core/lib/rrd4j-3.2.jar:/x1/jenkins/jenkins-slave/workspace/Lucene-Solr-repro/solr/core/lib/spatial4j-0.7.jar:/x1/jenkins/jenkins-slave/workspace/Lucene-Solr-repro/solr/core/lib/t-digest-3.1.jar:/x1/jenkins/jenkins-slave/workspace/Lucene-Solr-repro/solr/solrj/lib/commons-io-2.5.jar:/x1/jenkins/jenkins-slave/workspace/Lucene-Solr-repro/solr/solrj/lib/commons-math3-3.6.1.jar:/x1/jenkins/jenkins-slave/workspace/Lucene-Solr-repro/solr/solrj/lib/httpclient-4.5.3.jar:/x1/jenkins/jenkins-slave/workspace/Lucene-Solr-repro/solr/solrj/lib/httpcore-4.4.6.jar:/x1/jenkins/jenkins-slave/workspace/Lucene-Solr-repro/solr/solrj/lib/httpmime-4.5.3.jar:/x1/jenkins/jenkins-slave/workspace/Lucene-Solr-repro/solr/solrj/lib/jcl-over-slf4j-1.7.24.jar:/x1/jenkins/jenkins-slave/workspace/Lucene-Solr-repro/solr/solrj/lib/noggit-0.8.jar:/x1/jenkins/jenkins-slave/workspace/Lucene-Solr-repro/solr/solrj/lib/slf4j-api-1.7.24.jar:/x1/jenkins/jenkins-slave/workspace/Lucene-Solr-repro/solr/solrj/lib/stax2-api-3.1.4.jar:/x1/jenkins/jenkins-slave/workspace/Lucene-Solr-repro/solr/solrj/lib/woodstox-core-asl-4.4.1.jar:/x1/jenkins/jenkins-slave/workspace/Lucene-Solr-repro/solr/solrj/lib/zookeeper-3.4.11.jar:/x1/jenkins/jenkins-slave/workspace/Lucene-Solr-repro/solr/server/lib/gmetric4j-1.0.7.jar:/x1/jenkins/jenkins-slave/workspace/Lucene-Solr-repro/solr/server/lib/javax.servlet-api-3.1.0.jar:/x1/jenkins/jenkins-slave/workspace/Lucene-Solr-repro/solr/server/lib/jetty-continuation-9.4.11.v20180605.jar:/x1/jenkins/jenkins-slave/workspace/Lucene-Solr-repro/solr/server/lib/jetty-deploy-9.4.11.v20180605.jar:/x1/jenkins/jenkins-slave/workspace/Lucene-Solr-repro/solr/server/lib/jetty-http-9.4.11.v20180605.jar:/x1/jenkins/jenkins-slave/workspace/Lucene-Solr-repro/solr/server/lib/jetty-io-9.4.11.v20180605.jar:/x1/jenkins/jenkins-slave/workspace/Lucene-Solr-repro/solr/server/lib/jetty-jmx-9.4.11.v20180605.jar:/x1/jenkins/jenkins-slave/workspace/Lucene-Solr-repro/solr/server/lib/jetty-rewrite-9.4.11.v20180605.jar:/x1/jenkins/jenkins-slave/workspace/Lucene-Solr-repro/solr/server/lib/jetty-security-9.4.11.v20180605.jar:/x1/jenkins/jenkins-slave/workspace/Lucene-Solr-repro/solr/server/lib/jetty-server-9.4.11.v20180605.jar:/x1/jenkins/jenkins-slave/workspace/Lucene-Solr-repro/solr/server/lib/jetty-servlet-9.4.11.v20180605.jar:/x1/jenkins/jenkins-slave/workspace/Lucene-Solr-repro/solr/server/lib/jetty-servlets-9.4.11.v20180605.jar:/x1/jenkins/jenkins-slave/workspace/Lucene-Solr-repro/solr/server/lib/jetty-util-9.4.11.v20180605.jar:/x1/jenkins/jenkins-slave/workspace/Lucene-Solr-repro/solr/server/lib/jetty-webapp-9.4.11.v20180605.jar:/x1/jenkins/jenkins-slave/workspace/Lucene-Solr-repro/solr/server/lib/jetty-xml-9.4.11.v20180605.jar:/x1/jenkins/jenkins-slave/workspace/Lucene-Solr-repro/solr/server/lib/metrics-core-3.2.6.jar:/x1/jenkins/jenkins-slave/workspace/Lucene-Solr-repro/solr/server/lib/metrics-ganglia-3.2.6.jar:/x1/jenkins/jenkins-slave/workspace/Lucene-Solr-repro/solr/server/lib/metrics-graphite-3.2.6.jar:/x1/jenkins/jenkins-slave/workspace/Lucene-Solr-repro/solr/server/lib/metrics-jetty9-3.2.6.jar:/x1/jenkins/jenkins-slave/workspace/Lucene-Solr-repro/solr/server/lib/metrics-jvm-3.2.6.jar:/x1/jenkins/jenkins-slave/workspace/Lucene-Solr-repro/solr/example/example-DIH/solr/db/lib/derby-10.9.1.0.jar:/x1/jenkins/jenkins-slave/workspace/Lucene-Solr-repro/solr/example/example-DIH/solr/db/lib/hsqldb-2.4.0.jar:/x1/jenkins/jenkins-slave/workspace/Lucene-Solr-repro/lucene/build/core/classes/java:/x1/jenkins/jenkins-slave/workspace/Lucene-Solr-repro/lucene/test-framework/lib/junit-4.10.jar:/x1/jenkins/jenkins-slave/workspace/Lucene-Solr-repro/lucene/test-framework/lib/randomizedtesting-runner-2.6.4.jar:/x1/jenkins/jenkins-slave/workspace/Lucene-Solr-repro/solr/core/test-lib/antlr-2.7.7.jar:/x1/jenkins/jenkins-slave/workspace/Lucene-Solr-repro/solr/core/test-lib/antlr4-runtime-4.5.1-1.jar:/x1/jenkins/jenkins-slave/workspace/Lucene-Solr-repro/solr/core/test-lib/apacheds-core-2.0.0-M15.jar:/x1/jenkins/jenkins-slave/workspace/Lucene-Solr-repro/solr/core/test-lib/apacheds-core-api-2.0.0-M15.jar:/x1/jenkins/jenkins-slave/workspace/Lucene-Solr-repro/solr/core/test-lib/apacheds-core-avl-2.0.0-M15.jar:/x1/jenkins/jenkins-slave/workspace/Lucene-Solr-repro/solr/core/test-lib/apacheds-core-shared-2.0.0-M15.jar:/x1/jenkins/jenkins-slave/workspace/Lucene-Solr-repro/solr/core/test-lib/apacheds-i18n-2.0.0-M15.jar:/x1/jenkins/jenkins-slave/workspace/Lucene-Solr-repro/solr/core/test-lib/apacheds-interceptor-kerberos-2.0.0-M15.jar:/x1/jenkins/jenkins-slave/workspace/Lucene-Solr-repro/solr/core/test-lib/apacheds-interceptors-admin-2.0.0-M15.jar:/x1/jenkins/jenkins-slave/workspace/Lucene-Solr-repro/solr/core/test-lib/apacheds-interceptors-authn-2.0.0-M15.jar:/x1/jenkins/jenkins-slave/workspace/Lucene-Solr-repro/solr/core/test-lib/apacheds-interceptors-authz-2.0.0-M15.jar:/x1/jenkins/jenkins-slave/workspace/Lucene-Solr-repro/solr/core/test-lib/apacheds-interceptors-changelog-2.0.0-M15.jar:/x1/jenkins/jenkins-slave/workspace/Lucene-Solr-repro/solr/core/test-lib/apacheds-interceptors-collective-2.0.0-M15.jar:/x1/jenkins/jenkins-slave/workspace/Lucene-Solr-repro/solr/core/test-lib/apacheds-interceptors-event-2.0.0-M15.jar:/x1/jenkins/jenkins-slave/workspace/Lucene-Solr-repro/solr/core/test-lib/apacheds-interceptors-exception-2.0.0-M15.jar:/x1/jenkins/jenkins-slave/workspace/Lucene-Solr-repro/solr/core/test-lib/apacheds-interceptors-journal-2.0.0-M15.jar:/x1/jenkins/jenkins-slave/workspace/Lucene-Solr-repro/solr/core/test-lib/apacheds-interceptors-normalization-2.0.0-M15.jar:/x1/jenkins/jenkins-slave/workspace/Lucene-Solr-repro/solr/core/test-lib/apacheds-interceptors-operational-2.0.0-M15.jar:/x1/jenkins/jenkins-slave/workspace/Lucene-Solr-repro/solr/core/test-lib/apacheds-interceptors-referral-2.0.0-M15.jar:/x1/jenkins/jenkins-slave/workspace/Lucene-Solr-repro/solr/core/test-lib/apacheds-interceptors-schema-2.0.0-M15.jar:/x1/jenkins/jenkins-slave/workspace/Lucene-Solr-repro/solr/core/test-lib/apacheds-interceptors-subtree-2.0.0-M15.jar:/x1/jenkins/jenkins-slave/workspace/Lucene-Solr-repro/solr/core/test-lib/apacheds-interceptors-trigger-2.0.0-M15.jar:/x1/jenkins/jenkins-slave/workspace/Lucene-Solr-repro/solr/core/test-lib/apacheds-jdbm-partition-2.0.0-M15.jar:/x1/jenkins/jenkins-slave/workspace/Lucene-Solr-repro/solr/core/test-lib/apacheds-jdbm1-2.0.0-M2.jar:/x1/jenkins/jenkins-slave/workspace/Lucene-Solr-repro/solr/core/test-lib/apacheds-kerberos-codec-2.0.0-M15.jar:/x1/jenkins/jenkins-slave/workspace/Lucene-Solr-repro/solr/core/test-lib/apacheds-ldif-partition-2.0.0-M15.jar:/x1/jenkins/jenkins-slave/workspace/Lucene-Solr-repro/solr/core/test-lib/apacheds-mavibot-partition-2.0.0-M15.jar:/x1/jenkins/jenkins-slave/workspace/Lucene-Solr-repro/solr/core/test-lib/apacheds-protocol-kerberos-2.0.0-M15.jar:/x1/jenkins/jenkins-slave/workspace/Lucene-Solr-repro/solr/core/test-lib/apacheds-protocol-ldap-2.0.0-M15.jar:/x1/jenkins/jenkins-slave/workspace/Lucene-Solr-repro/solr/core/test-lib/apacheds-protocol-shared-2.0.0-M15.jar:/x1/jenkins/jenkins-slave/workspace/Lucene-Solr-repro/solr/core/test-lib/apacheds-xdbm-partition-2.0.0-M15.jar:/x1/jenkins/jenkins-slave/workspace/Lucene-Solr-repro/solr/core/test-lib/api-all-1.0.0-M20.jar:/x1/jenkins/jenkins-slave/workspace/Lucene-Solr-repro/solr/core/test-lib/bcprov-jdk15on-1.60.jar:/x1/jenkins/jenkins-slave/workspace/Lucene-Solr-repro/solr/core/test-lib/byte-buddy-1.6.2.jar:/x1/jenkins/jenkins-slave/workspace/Lucene-Solr-repro/solr/core/test-lib/commons-collections-3.2.2.jar:/x1/jenkins/jenkins-slave/workspace/Lucene-Solr-repro/solr/core/test-lib/ehcache-core-2.4.4.jar:/x1/jenkins/jenkins-slave/workspace/Lucene-Solr-repro/solr/core/test-lib/hadoop-common-2.7.4-tests.jar:/x1/jenkins/jenkins-slave/workspace/Lucene-Solr-repro/solr/core/test-lib/hadoop-hdfs-2.7.4-tests.jar:/x1/jenkins/jenkins-slave/workspace/Lucene-Solr-repro/solr/core/test-lib/hadoop-minikdc-2.7.4.jar:/x1/jenkins/jenkins-slave/workspace/Lucene-Solr-repro/solr/core/test-lib/htrace-core-3.2.0-incubating.jar:/x1/jenkins/jenkins-slave/workspace/Lucene-Solr-repro/solr/core/test-lib/jersey-core-1.9.jar:/x1/jenkins/jenkins-slave/workspace/Lucene-Solr-repro/solr/core/test-lib/jersey-server-1.9.jar:/x1/jenkins/jenkins-slave/workspace/Lucene-Solr-repro/solr/core/test-lib/jetty-6.1.26.jar:/x1/jenkins/jenkins-slave/workspace/Lucene-Solr-repro/solr/core/test-lib/jetty-sslengine-6.1.26.jar:/x1/jenkins/jenkins-slave/workspace/Lucene-Solr-repro/solr/core/test-lib/jetty-util-6.1.26.jar:/x1/jenkins/jenkins-slave/workspace/Lucene-Solr-repro/solr/core/test-lib/mina-core-2.0.0-M5.jar:/x1/jenkins/jenkins-slave/workspace/Lucene-Solr-repro/solr/core/test-lib/mockito-core-2.6.2.jar:/x1/jenkins/jenkins-slave/workspace/Lucene-Solr-repro/solr/core/test-lib/netty-all-4.0.36.Final.jar:/x1/jenkins/jenkins-slave/workspace/Lucene-Solr-repro/solr/core/test-lib/objenesis-2.5.jar:/x1/jenkins/jenkins-slave/workspace/Lucene-Solr-repro/lucene/build/analysis/icu/lucene-analyzers-icu-8.0.0-SNAPSHOT.jar:/x1/jenkins/jenkins-slave/workspace/Lucene-Solr-repro/solr/build/contrib/solr-analysis-extras/classes/java:/x1/jenkins/jenkins-slave/workspace/Lucene-Solr-repro/lucene/build/queryparser/classes/test:/x1/jenkins/jenkins-slave/workspace/Lucene-Solr-repro/lucene/build/backward-codecs/classes/test:/x1/jenkins/jenkins-slave/workspace/Lucene-Solr-repro/solr/contrib/analysis-extras/lib/icu4j-62.1.jar:/usr/share/ant/lib/ant-launcher.jar:/usr/share/java/xmlParserAPIs.jar:/usr/share/java/xercesImpl.jar:/x1/jenkins/.ant/lib/ivy-2.4.0.jar:/usr/share/ant/lib/ant-junit.jar:/usr/share/ant/lib/ant-apache-log4j.jar:/usr/share/ant/lib/ant-junit4.jar:/usr/share/ant/lib/ant-javamail.jar:/usr/share/ant/lib/ant-apache-bsf.jar:/usr/share/ant/lib/ant-commons-net.jar:/usr/share/ant/lib/ant-antlr.jar:/usr/share/ant/lib/ant-jsch.jar:/usr/share/ant/lib/ant-apache-oro.jar:/usr/share/ant/lib/ant-commons-logging.jar:/usr/share/ant/lib/ant.jar:/usr/share/ant/lib/ant-testutil.jar:/usr/share/ant/lib/ant-jdepend.jar:/usr/share/ant/lib/ant-apache-bcel.jar:/usr/share/ant/lib/ant-apache-xalan2.jar:/usr/share/ant/lib/ant-apache-resolver.jar:/usr/share/ant/lib/ant-jmf.jar:/usr/share/ant/lib/ant-apache-regexp.jar:/usr/share/ant/lib/ant-swing.jar:/usr/local/asfpackages/java/jdk1.8.0_191/lib/tools.jar:/x1/jenkins/.ivy2/cache/com.carrotsearch.randomizedtesting/junit4-ant/jars/junit4-ant-2.6.4.jar com.carrotsearch.ant.tasks.junit4.slave.SlaveMainSafe -eventsfile /x1/jenkins/jenkins-slave/workspace/Lucene-Solr-repro/solr/build/solr-core/test/temp/junit4-J0-20181105_115105_1441483235598881958933.events @/x1/jenkins/jenkins-slave/workspace/Lucene-Solr-repro/solr/build/solr-core/test/temp/junit4-J0-20181105_115105_1442305526134245724242.suites -stdin
   [junit4] ERROR: JVM J0 ended with an exception: Quit event not received from the forked process? This may indicate JVM crash or runner bugs.
   [junit4] 	at com.carrotsearch.ant.tasks.junit4.JUnit4.executeSlave(JUnit4.java:1563)
   [junit4] 	at com.carrotsearch.ant.tasks.junit4.JUnit4.access$000(JUnit4.java:123)
   [junit4] 	at com.carrotsearch.ant.tasks.junit4.JUnit4$2.call(JUnit4.java:997)
   [junit4] 	at com.carrotsearch.ant.tasks.junit4.JUnit4$2.call(JUnit4.java:994)
   [junit4] 	at java.util.concurrent.FutureTask.run(FutureTask.java:266)
   [junit4] 	at java.util.concurrent.ThreadPoolExecutor.runWorker(ThreadPoolExecutor.java:1149)
   [junit4] 	at java.util.concurrent.ThreadPoolExecutor$Worker.run(ThreadPoolExecutor.java:624)
   [junit4] 	at java.lang.Thread.run(Thread.java:748)
   [junit4] ERROR: JVM J2 ended with an exception, command line: /usr/local/asfpackages/java/jdk1.8.0_191/jre/bin/java -ea -esa -Dtests.prefix=tests -Dtests.seed=436B9276AB629A12 -Xmx512M -Dtests.iters= -Dtests.verbose=false -Dtests.infostream=false -Dtests.codec=random -Dtests.postingsformat=random -Dtests.docvaluesformat=random -Dtests.locale=id-ID -Dtests.timezone=America/Porto_Velho -Dtests.directory=random -Dtests.linedocsfile=/home/jenkins/jenkins-slave/workspace/Lucene-Solr-NightlyTests-master/test-data/enwiki.random.lines.txt -Dtests.luceneMatchVersion=8.0.0 -Dtests.cleanthreads=perClass -Djava.util.logging.config.file=/x1/jenkins/jenkins-slave/workspace/Lucene-Solr-repro/lucene/tools/junit4/logging.properties -Dtests.nightly=true -Dtests.weekly=false -Dtests.monster=false -Dtests.slow=true -Dtests.asserts=true -Dtests.multiplier=2 -DtempDir=./temp -Djava.io.tmpdir=./temp -Dcommon.dir=/x1/jenkins/jenkins-slave/workspace/Lucene-Solr-repro/lucene -Dclover.db.dir=/x1/jenkins/jenkins-slave/workspace/Lucene-Solr-repro/lucene/build/clover/db -Djava.security.policy=/x1/jenkins/jenkins-slave/workspace/Lucene-Solr-repro/lucene/tools/junit4/solr-tests.policy -Dtests.LUCENE_VERSION=8.0.0 -Djetty.testMode=1 -Djetty.insecurerandom=1 -Dsolr.directoryFactory=org.apache.solr.core.MockDirectoryFactory -Djava.awt.headless=true -Djdk.map.althashing.threshold=0 -Dtests.src.home=/x1/jenkins/jenkins-slave/workspace/Lucene-Solr-repro/solr/core -Djava.security.egd=file:/dev/./urandom -Djunit4.childvm.cwd=/x1/jenkins/jenkins-slave/workspace/Lucene-Solr-repro/solr/build/solr-core/test/J2 -Djunit4.tempDir=/x1/jenkins/jenkins-slave/workspace/Lucene-Solr-repro/solr/build/solr-core/test/temp -Djunit4.childvm.id=2 -Djunit4.childvm.count=3 -Dtests.leaveTemporary=false -Dtests.filterstacks=true -Dtests.maxfailures=5 -Djava.security.manager=org.apache.lucene.util.TestSecurityManager -Dfile.encoding=ISO-8859-1 -classpath /x1/jenkins/jenkins-slave/workspace/Lucene-Solr-repro/solr/build/solr-core/classes/test:/x1/jenkins/jenkins-slave/workspace/Lucene-Solr-repro/solr/build/solr-test-framework/classes/java:/x1/jenkins/jenkins-slave/workspace/Lucene-Solr-repro/solr/test-framework/lib/junit4-ant-2.6.4.jar:/x1/jenkins/jenkins-slave/workspace/Lucene-Solr-repro/solr/core/src/test-files:/x1/jenkins/jenkins-slave/workspace/Lucene-Solr-repro/lucene/build/test-framework/classes/java:/x1/jenkins/jenkins-slave/workspace/Lucene-Solr-repro/lucene/build/codecs/classes/java:/x1/jenkins/jenkins-slave/workspace/Lucene-Solr-repro/solr/build/solr-solrj/classes/java:/x1/jenkins/jenkins-slave/workspace/Lucene-Solr-repro/solr/build/solr-core/classes/java:/x1/jenkins/jenkins-slave/workspace/Lucene-Solr-repro/lucene/build/analysis/common/lucene-analyzers-common-8.0.0-SNAPSHOT.jar:/x1/jenkins/jenkins-slave/workspace/Lucene-Solr-repro/lucene/build/analysis/kuromoji/lucene-analyzers-kuromoji-8.0.0-SNAPSHOT.jar:/x1/jenkins/jenkins-slave/workspace/Lucene-Solr-repro/lucene/build/analysis/nori/lucene-analyzers-nori-8.0.0-SNAPSHOT.jar:/x1/jenkins/jenkins-slave/workspace/Lucene-Solr-repro/lucene/build/analysis/phonetic/lucene-analyzers-phonetic-8.0.0-SNAPSHOT.jar:/x1/jenkins/jenkins-slave/workspace/Lucene-Solr-repro/lucene/build/codecs/lucene-codecs-8.0.0-SNAPSHOT.jar:/x1/jenkins/jenkins-slave/workspace/Lucene-Solr-repro/lucene/build/backward-codecs/lucene-backward-codecs-8.0.0-SNAPSHOT.jar:/x1/jenkins/jenkins-slave/workspace/Lucene-Solr-repro/lucene/build/highlighter/lucene-highlighter-8.0.0-SNAPSHOT.jar:/x1/jenkins/jenkins-slave/workspace/Lucene-Solr-repro/lucene/build/memory/lucene-memory-8.0.0-SNAPSHOT.jar:/x1/jenkins/jenkins-slave/workspace/Lucene-Solr-repro/lucene/build/misc/lucene-misc-8.0.0-SNAPSHOT.jar:/x1/jenkins/jenkins-slave/workspace/Lucene-Solr-repro/lucene/build/spatial-extras/lucene-spatial-extras-8.0.0-SNAPSHOT.jar:/x1/jenkins/jenkins-slave/workspace/Lucene-Solr-repro/lucene/build/spatial3d/lucene-spatial3d-8.0.0-SNAPSHOT.jar:/x1/jenkins/jenkins-slave/workspace/Lucene-Solr-repro/lucene/build/expressions/lucene-expressions-8.0.0-SNAPSHOT.jar:/x1/jenkins/jenkins-slave/workspace/Lucene-Solr-repro/lucene/build/suggest/lucene-suggest-8.0.0-SNAPSHOT.jar:/x1/jenkins/jenkins-slave/workspace/Lucene-Solr-repro/lucene/build/grouping/lucene-grouping-8.0.0-SNAPSHOT.jar:/x1/jenkins/jenkins-slave/workspace/Lucene-Solr-repro/lucene/build/queries/lucene-queries-8.0.0-SNAPSHOT.jar:/x1/jenkins/jenkins-slave/workspace/Lucene-Solr-repro/lucene/build/queryparser/lucene-queryparser-8.0.0-SNAPSHOT.jar:/x1/jenkins/jenkins-slave/workspace/Lucene-Solr-repro/lucene/build/join/lucene-join-8.0.0-SNAPSHOT.jar:/x1/jenkins/jenkins-slave/workspace/Lucene-Solr-repro/lucene/build/sandbox/lucene-sandbox-8.0.0-SNAPSHOT.jar:/x1/jenkins/jenkins-slave/workspace/Lucene-Solr-repro/lucene/build/classification/lucene-classification-8.0.0-SNAPSHOT.jar:/x1/jenkins/jenkins-slave/workspace/Lucene-Solr-repro/solr/core/lib/antlr4-runtime-4.5.1-1.jar:/x1/jenkins/jenkins-slave/workspace/Lucene-Solr-repro/solr/core/lib/asm-5.1.jar:/x1/jenkins/jenkins-slave/workspace/Lucene-Solr-repro/solr/core/lib/asm-commons-5.1.jar:/x1/jenkins/jenkins-slave/workspace/Lucene-Solr-repro/solr/core/lib/avatica-core-1.10.0.jar:/x1/jenkins/jenkins-slave/workspace/Lucene-Solr-repro/solr/core/lib/caffeine-2.4.0.jar:/x1/jenkins/jenkins-slave/workspace/Lucene-Solr-repro/solr/core/lib/calcite-core-1.13.0.jar:/x1/jenkins/jenkins-slave/workspace/Lucene-Solr-repro/solr/core/lib/calcite-linq4j-1.13.0.jar:/x1/jenkins/jenkins-slave/workspace/Lucene-Solr-repro/solr/core/lib/commons-cli-1.2.jar:/x1/jenkins/jenkins-slave/workspace/Lucene-Solr-repro/solr/core/lib/commons-codec-1.11.jar:/x1/jenkins/jenkins-slave/workspace/Lucene-Solr-repro/solr/core/lib/commons-collections-3.2.2.jar:/x1/jenkins/jenkins-slave/workspace/Lucene-Solr-repro/solr/core/lib/commons-compiler-2.7.6.jar:/x1/jenkins/jenkins-slave/workspace/Lucene-Solr-repro/solr/core/lib/commons-configuration-1.6.jar:/x1/jenkins/jenkins-slave/workspace/Lucene-Solr-repro/solr/core/lib/commons-exec-1.3.jar:/x1/jenkins/jenkins-slave/workspace/Lucene-Solr-repro/solr/core/lib/commons-fileupload-1.3.3.jar:/x1/jenkins/jenkins-slave/workspace/Lucene-Solr-repro/solr/core/lib/commons-io-2.5.jar:/x1/jenkins/jenkins-slave/workspace/Lucene-Solr-repro/solr/core/lib/commons-lang-2.6.jar:/x1/jenkins/jenkins-slave/workspace/Lucene-Solr-repro/solr/core/lib/commons-lang3-3.6.jar:/x1/jenkins/jenkins-slave/workspace/Lucene-Solr-repro/solr/core/lib/commons-math3-3.6.1.jar:/x1/jenkins/jenkins-slave/workspace/Lucene-Solr-repro/solr/core/lib/curator-client-2.8.0.jar:/x1/jenkins/jenkins-slave/workspace/Lucene-Solr-repro/solr/core/lib/curator-framework-2.8.0.jar:/x1/jenkins/jenkins-slave/workspace/Lucene-Solr-repro/solr/core/lib/curator-recipes-2.8.0.jar:/x1/jenkins/jenkins-slave/workspace/Lucene-Solr-repro/solr/core/lib/disruptor-3.4.0.jar:/x1/jenkins/jenkins-slave/workspace/Lucene-Solr-repro/solr/core/lib/dom4j-1.6.1.jar:/x1/jenkins/jenkins-slave/workspace/Lucene-Solr-repro/solr/core/lib/eigenbase-properties-1.1.5.jar:/x1/jenkins/jenkins-slave/workspace/Lucene-Solr-repro/solr/core/lib/guava-14.0.1.jar:/x1/jenkins/jenkins-slave/workspace/Lucene-Solr-repro/solr/core/lib/hadoop-annotations-2.7.4.jar:/x1/jenkins/jenkins-slave/workspace/Lucene-Solr-repro/solr/core/lib/hadoop-auth-2.7.4.jar:/x1/jenkins/jenkins-slave/workspace/Lucene-Solr-repro/solr/core/lib/hadoop-common-2.7.4.jar:/x1/jenkins/jenkins-slave/workspace/Lucene-Solr-repro/solr/core/lib/hadoop-hdfs-2.7.4.jar:/x1/jenkins/jenkins-slave/workspace/Lucene-Solr-repro/solr/core/lib/hppc-0.8.1.jar:/x1/jenkins/jenkins-slave/workspace/Lucene-Solr-repro/solr/core/lib/htrace-core-3.2.0-incubating.jar:/x1/jenkins/jenkins-slave/workspace/Lucene-Solr-repro/solr/core/lib/jackson-annotations-2.9.6.jar:/x1/jenkins/jenkins-slave/workspace/Lucene-Solr-repro/solr/core/lib/jackson-core-2.9.6.jar:/x1/jenkins/jenkins-slave/workspace/Lucene-Solr-repro/solr/core/lib/jackson-core-asl-1.9.13.jar:/x1/jenkins/jenkins-slave/workspace/Lucene-Solr-repro/solr/core/lib/jackson-databind-2.9.6.jar:/x1/jenkins/jenkins-slave/workspace/Lucene-Solr-repro/solr/core/lib/jackson-dataformat-smile-2.9.6.jar:/x1/jenkins/jenkins-slave/workspace/Lucene-Solr-repro/solr/core/lib/jackson-mapper-asl-1.9.13.jar:/x1/jenkins/jenkins-slave/workspace/Lucene-Solr-repro/solr/core/lib/janino-2.7.6.jar:/x1/jenkins/jenkins-slave/workspace/Lucene-Solr-repro/solr/core/lib/jcl-over-slf4j-1.7.24.jar:/x1/jenkins/jenkins-slave/workspace/Lucene-Solr-repro/solr/core/lib/log4j-1.2-api-2.11.0.jar:/x1/jenkins/jenkins-slave/workspace/Lucene-Solr-repro/solr/core/lib/log4j-api-2.11.0.jar:/x1/jenkins/jenkins-slave/workspace/Lucene-Solr-repro/solr/core/lib/log4j-core-2.11.0.jar:/x1/jenkins/jenkins-slave/workspace/Lucene-Solr-repro/solr/core/lib/log4j-slf4j-impl-2.11.0.jar:/x1/jenkins/jenkins-slave/workspace/Lucene-Solr-repro/solr/core/lib/org.restlet-2.3.0.jar:/x1/jenkins/jenkins-slave/workspace/Lucene-Solr-repro/solr/core/lib/org.restlet.ext.servlet-2.3.0.jar:/x1/jenkins/jenkins-slave/workspace/Lucene-Solr-repro/solr/core/lib/protobuf-java-3.1.0.jar:/x1/jenkins/jenkins-slave/workspace/Lucene-Solr-repro/solr/core/lib/rrd4j-3.2.jar:/x1/jenkins/jenkins-slave/workspace/Lucene-Solr-repro/solr/core/lib/spatial4j-0.7.jar:/x1/jenkins/jenkins-slave/workspace/Lucene-Solr-repro/solr/core/lib/t-digest-3.1.jar:/x1/jenkins/jenkins-slave/workspace/Lucene-Solr-repro/solr/solrj/lib/commons-io-2.5.jar:/x1/jenkins/jenkins-slave/workspace/Lucene-Solr-repro/solr/solrj/lib/commons-math3-3.6.1.jar:/x1/jenkins/jenkins-slave/workspace/Lucene-Solr-repro/solr/solrj/lib/httpclient-4.5.3.jar:/x1/jenkins/jenkins-slave/workspace/Lucene-Solr-repro/solr/solrj/lib/httpcore-4.4.6.jar:/x1/jenkins/jenkins-slave/workspace/Lucene-Solr-repro/solr/solrj/lib/httpmime-4.5.3.jar:/x1/jenkins/jenkins-slave/workspace/Lucene-Solr-repro/solr/solrj/lib/jcl-over-slf4j-1.7.24.jar:/x1/jenkins/jenkins-slave/workspace/Lucene-Solr-repro/solr/solrj/lib/noggit-0.8.jar:/x1/jenkins/jenkins-slave/workspace/Lucene-Solr-repro/solr/solrj/lib/slf4j-api-1.7.24.jar:/x1/jenkins/jenkins-slave/workspace/Lucene-Solr-repro/solr/solrj/lib/stax2-api-3.1.4.jar:/x1/jenkins/jenkins-slave/workspace/Lucene-Solr-repro/solr/solrj/lib/woodstox-core-asl-4.4.1.jar:/x1/jenkins/jenkins-slave/workspace/Lucene-Solr-repro/solr/solrj/lib/zookeeper-3.4.11.jar:/x1/jenkins/jenkins-slave/workspace/Lucene-Solr-repro/solr/server/lib/gmetric4j-1.0.7.jar:/x1/jenkins/jenkins-slave/workspace/Lucene-Solr-repro/solr/server/lib/javax.servlet-api-3.1.0.jar:/x1/jenkins/jenkins-slave/workspace/Lucene-Solr-repro/solr/server/lib/jetty-continuation-9.4.11.v20180605.jar:/x1/jenkins/jenkins-slave/workspace/Lucene-Solr-repro/solr/server/lib/jetty-deploy-9.4.11.v20180605.jar:/x1/jenkins/jenkins-slave/workspace/Lucene-Solr-repro/solr/server/lib/jetty-http-9.4.11.v20180605.jar:/x1/jenkins/jenkins-slave/workspace/Lucene-Solr-repro/solr/server/lib/jetty-io-9.4.11.v20180605.jar:/x1/jenkins/jenkins-slave/workspace/Lucene-Solr-repro/solr/server/lib/jetty-jmx-9.4.11.v20180605.jar:/x1/jenkins/jenkins-slave/workspace/Lucene-Solr-repro/solr/server/lib/jetty-rewrite-9.4.11.v20180605.jar:/x1/jenkins/jenkins-slave/workspace/Lucene-Solr-repro/solr/server/lib/jetty-security-9.4.11.v20180605.jar:/x1/jenkins/jenkins-slave/workspace/Lucene-Solr-repro/solr/server/lib/jetty-server-9.4.11.v20180605.jar:/x1/jenkins/jenkins-slave/workspace/Lucene-Solr-repro/solr/server/lib/jetty-servlet-9.4.11.v20180605.jar:/x1/jenkins/jenkins-slave/workspace/Lucene-Solr-repro/solr/server/lib/jetty-servlets-9.4.11.v20180605.jar:/x1/jenkins/jenkins-slave/workspace/Lucene-Solr-repro/solr/server/lib/jetty-util-9.4.11.v20180605.jar:/x1/jenkins/jenkins-slave/workspace/Lucene-Solr-repro/solr/server/lib/jetty-webapp-9.4.11.v20180605.jar:/x1/jenkins/jenkins-slave/workspace/Lucene-Solr-repro/solr/server/lib/jetty-xml-9.4.11.v20180605.jar:/x1/jenkins/jenkins-slave/workspace/Lucene-Solr-repro/solr/server/lib/metrics-core-3.2.6.jar:/x1/jenkins/jenkins-slave/workspace/Lucene-Solr-repro/solr/server/lib/metrics-ganglia-3.2.6.jar:/x1/jenkins/jenkins-slave/workspace/Lucene-Solr-repro/solr/server/lib/metrics-graphite-3.2.6.jar:/x1/jenkins/jenkins-slave/workspace/Lucene-Solr-repro/solr/server/lib/metrics-jetty9-3.2.6.jar:/x1/jenkins/jenkins-slave/workspace/Lucene-Solr-repro/solr/server/lib/metrics-jvm-3.2.6.jar:/x1/jenkins/jenkins-slave/workspace/Lucene-Solr-repro/solr/example/example-DIH/solr/db/lib/derby-10.9.1.0.jar:/x1/jenkins/jenkins-slave/workspace/Lucene-Solr-repro/solr/example/example-DIH/solr/db/lib/hsqldb-2.4.0.jar:/x1/jenkins/jenkins-slave/workspace/Lucene-Solr-repro/lucene/build/core/classes/java:/x1/jenkins/jenkins-slave/workspace/Lucene-Solr-repro/lucene/test-framework/lib/junit-4.10.jar:/x1/jenkins/jenkins-slave/workspace/Lucene-Solr-repro/lucene/test-framework/lib/randomizedtesting-runner-2.6.4.jar:/x1/jenkins/jenkins-slave/workspace/Lucene-Solr-repro/solr/core/test-lib/antlr-2.7.7.jar:/x1/jenkins/jenkins-slave/workspace/Lucene-Solr-repro/solr/core/test-lib/antlr4-runtime-4.5.1-1.jar:/x1/jenkins/jenkins-slave/workspace/Lucene-Solr-repro/solr/core/test-lib/apacheds-core-2.0.0-M15.jar:/x1/jenkins/jenkins-slave/workspace/Lucene-Solr-repro/solr/core/test-lib/apacheds-core-api-2.0.0-M15.jar:/x1/jenkins/jenkins-slave/workspace/Lucene-Solr-repro/solr/core/test-lib/apacheds-core-avl-2.0.0-M15.jar:/x1/jenkins/jenkins-slave/workspace/Lucene-Solr-repro/solr/core/test-lib/apacheds-core-shared-2.0.0-M15.jar:/x1/jenkins/jenkins-slave/workspace/Lucene-Solr-repro/solr/core/test-lib/apacheds-i18n-2.0.0-M15.jar:/x1/jenkins/jenkins-slave/workspace/Lucene-Solr-repro/solr/core/test-lib/apacheds-interceptor-kerberos-2.0.0-M15.jar:/x1/jenkins/jenkins-slave/workspace/Lucene-Solr-repro/solr/core/test-lib/apacheds-interceptors-admin-2.0.0-M15.jar:/x1/jenkins/jenkins-slave/workspace/Lucene-Solr-repro/solr/core/test-lib/apacheds-interceptors-authn-2.0.0-M15.jar:/x1/jenkins/jenkins-slave/workspace/Lucene-Solr-repro/solr/core/test-lib/apacheds-interceptors-authz-2.0.0-M15.jar:/x1/jenkins/jenkins-slave/workspace/Lucene-Solr-repro/solr/core/test-lib/apacheds-interceptors-changelog-2.0.0-M15.jar:/x1/jenkins/jenkins-slave/workspace/Lucene-Solr-repro/solr/core/test-lib/apacheds-interceptors-collective-2.0.0-M15.jar:/x1/jenkins/jenkins-slave/workspace/Lucene-Solr-repro/solr/core/test-lib/apacheds-interceptors-event-2.0.0-M15.jar:/x1/jenkins/jenkins-slave/workspace/Lucene-Solr-repro/solr/core/test-lib/apacheds-interceptors-exception-2.0.0-M15.jar:/x1/jenkins/jenkins-slave/workspace/Lucene-Solr-repro/solr/core/test-lib/apacheds-interceptors-journal-2.0.0-M15.jar:/x1/jenkins/jenkins-slave/workspace/Lucene-Solr-repro/solr/core/test-lib/apacheds-interceptors-normalization-2.0.0-M15.jar:/x1/jenkins/jenkins-slave/workspace/Lucene-Solr-repro/solr/core/test-lib/apacheds-interceptors-operational-2.0.0-M15.jar:/x1/jenkins/jenkins-slave/workspace/Lucene-Solr-repro/solr/core/test-lib/apacheds-interceptors-referral-2.0.0-M15.jar:/x1/jenkins/jenkins-slave/workspace/Lucene-Solr-repro/solr/core/test-lib/apacheds-interceptors-schema-2.0.0-M15.jar:/x1/jenkins/jenkins-slave/workspace/Lucene-Solr-repro/solr/core/test-lib/apacheds-interceptors-subtree-2.0.0-M15.jar:/x1/jenkins/jenkins-slave/workspace/Lucene-Solr-repro/solr/core/test-lib/apacheds-interceptors-trigger-2.0.0-M15.jar:/x1/jenkins/jenkins-slave/workspace/Lucene-Solr-repro/solr/core/test-lib/apacheds-jdbm-partition-2.0.0-M15.jar:/x1/jenkins/jenkins-slave/workspace/Lucene-Solr-repro/solr/core/test-lib/apacheds-jdbm1-2.0.0-M2.jar:/x1/jenkins/jenkins-slave/workspace/Lucene-Solr-repro/solr/core/test-lib/apacheds-kerberos-codec-2.0.0-M15.jar:/x1/jenkins/jenkins-slave/workspace/Lucene-Solr-repro/solr/core/test-lib/apacheds-ldif-partition-2.0.0-M15.jar:/x1/jenkins/jenkins-slave/workspace/Lucene-Solr-repro/solr/core/test-lib/apacheds-mavibot-partition-2.0.0-M15.jar:/x1/jenkins/jenkins-slave/workspace/Lucene-Solr-repro/solr/core/test-lib/apacheds-protocol-kerberos-2.0.0-M15.jar:/x1/jenkins/jenkins-slave/workspace/Lucene-Solr-repro/solr/core/test-lib/apacheds-protocol-ldap-2.0.0-M15.jar:/x1/jenkins/jenkins-slave/workspace/Lucene-Solr-repro/solr/core/test-lib/apacheds-protocol-shared-2.0.0-M15.jar:/x1/jenkins/jenkins-slave/workspace/Lucene-Solr-repro/solr/core/test-lib/apacheds-xdbm-partition-2.0.0-M15.jar:/x1/jenkins/jenkins-slave/workspace/Lucene-Solr-repro/solr/core/test-lib/api-all-1.0.0-M20.jar:/x1/jenkins/jenkins-slave/workspace/Lucene-Solr-repro/solr/core/test-lib/bcprov-jdk15on-1.60.jar:/x1/jenkins/jenkins-slave/workspace/Lucene-Solr-repro/solr/core/test-lib/byte-buddy-1.6.2.jar:/x1/jenkins/jenkins-slave/workspace/Lucene-Solr-repro/solr/core/test-lib/commons-collections-3.2.2.jar:/x1/jenkins/jenkins-slave/workspace/Lucene-Solr-repro/solr/core/test-lib/ehcache-core-2.4.4.jar:/x1/jenkins/jenkins-slave/workspace/Lucene-Solr-repro/solr/core/test-lib/hadoop-common-2.7.4-tests.jar:/x1/jenkins/jenkins-slave/workspace/Lucene-Solr-repro/solr/core/test-lib/hadoop-hdfs-2.7.4-tests.jar:/x1/jenkins/jenkins-slave/workspace/Lucene-Solr-repro/solr/core/test-lib/hadoop-minikdc-2.7.4.jar:/x1/jenkins/jenkins-slave/workspace/Lucene-Solr-repro/solr/core/test-lib/htrace-core-3.2.0-incubating.jar:/x1/jenkins/jenkins-slave/workspace/Lucene-Solr-repro/solr/core/test-lib/jersey-core-1.9.jar:/x1/jenkins/jenkins-slave/workspace/Lucene-Solr-repro/solr/core/test-lib/jersey-server-1.9.jar:/x1/jenkins/jenkins-slave/workspace/Lucene-Solr-repro/solr/core/test-lib/jetty-6.1.26.jar:/x1/jenkins/jenkins-slave/workspace/Lucene-Solr-repro/solr/core/test-lib/jetty-sslengine-6.1.26.jar:/x1/jenkins/jenkins-slave/workspace/Lucene-Solr-repro/solr/core/test-lib/jetty-util-6.1.26.jar:/x1/jenkins/jenkins-slave/workspace/Lucene-Solr-repro/solr/core/test-lib/mina-core-2.0.0-M5.jar:/x1/jenkins/jenkins-slave/workspace/Lucene-Solr-repro/solr/core/test-lib/mockito-core-2.6.2.jar:/x1/jenkins/jenkins-slave/workspace/Lucene-Solr-repro/solr/core/test-lib/netty-all-4.0.36.Final.jar:/x1/jenkins/jenkins-slave/workspace/Lucene-Solr-repro/solr/core/test-lib/objenesis-2.5.jar:/x1/jenkins/jenkins-slave/workspace/Lucene-Solr-repro/lucene/build/analysis/icu/lucene-analyzers-icu-8.0.0-SNAPSHOT.jar:/x1/jenkins/jenkins-slave/workspace/Lucene-Solr-repro/solr/build/contrib/solr-analysis-extras/classes/java:/x1/jenkins/jenkins-slave/workspace/Lucene-Solr-repro/lucene/build/queryparser/classes/test:/x1/jenkins/jenkins-slave/workspace/Lucene-Solr-repro/lucene/build/backward-codecs/classes/test:/x1/jenkins/jenkins-slave/workspace/Lucene-Solr-repro/solr/contrib/analysis-extras/lib/icu4j-62.1.jar:/usr/share/ant/lib/ant-launcher.jar:/usr/share/java/xmlParserAPIs.jar:/usr/share/java/xercesImpl.jar:/x1/jenkins/.ant/lib/ivy-2.4.0.jar:/usr/share/ant/lib/ant-junit.jar:/usr/share/ant/lib/ant-apache-log4j.jar:/usr/share/ant/lib/ant-junit4.jar:/usr/share/ant/lib/ant-javamail.jar:/usr/share/ant/lib/ant-apache-bsf.jar:/usr/share/ant/lib/ant-commons-net.jar:/usr/share/ant/lib/ant-antlr.jar:/usr/share/ant/lib/ant-jsch.jar:/usr/share/ant/lib/ant-apache-oro.jar:/usr/share/ant/lib/ant-commons-logging.jar:/usr/share/ant/lib/ant.jar:/usr/share/ant/lib/ant-testutil.jar:/usr/share/ant/lib/ant-jdepend.jar:/usr/share/ant/lib/ant-apache-bcel.jar:/usr/share/ant/lib/ant-apache-xalan2.jar:/usr/share/ant/lib/ant-apache-resolver.jar:/usr/share/ant/lib/ant-jmf.jar:/usr/share/ant/lib/ant-apache-regexp.jar:/usr/share/ant/lib/ant-swing.jar:/usr/local/asfpackages/java/jdk1.8.0_191/lib/tools.jar:/x1/jenkins/.ivy2/cache/com.carrotsearch.randomizedtesting/junit4-ant/jars/junit4-ant-2.6.4.jar com.carrotsearch.ant.tasks.junit4.slave.SlaveMainSafe -eventsfile /x1/jenkins/jenkins-slave/workspace/Lucene-Solr-repro/solr/build/solr-core/test/temp/junit4-J2-20181105_115105_1474455143383925872783.events @/x1/jenkins/jenkins-slave/workspace/Lucene-Solr-repro/solr/build/solr-core/test/temp/junit4-J2-20181105_115105_1474014779647608507073.suites -stdin
   [junit4] ERROR: JVM J2 ended with an exception: Quit event not received from the forked process? This may indicate JVM crash or runner bugs.
   [junit4] 	at com.carrotsearch.ant.tasks.junit4.JUnit4.executeSlave(JUnit4.java:1563)
   [junit4] 	at com.carrotsearch.ant.tasks.junit4.JUnit4.access$000(JUnit4.java:123)
   [junit4] 	at com.carrotsearch.ant.tasks.junit4.JUnit4$2.call(JUnit4.java:997)
   [junit4] 	at com.carrotsearch.ant.tasks.junit4.JUnit4$2.call(JUnit4.java:994)
   [junit4] 	at java.util.concurrent.FutureTask.run(FutureTask.java:266)
   [junit4] 	at java.util.concurrent.ThreadPoolExecutor.runWorker(ThreadPoolExecutor.java:1149)
   [junit4] 	at java.util.concurrent.ThreadPoolExecutor$Worker.run(ThreadPoolExecutor.java:624)
   [junit4] 	at java.lang.Thread.run(Thread.java:748)

BUILD FAILED
/x1/jenkins/jenkins-slave/workspace/Lucene-Solr-repro/lucene/common-build.xml:1567: The following error occurred while executing this line:
/x1/jenkins/jenkins-slave/workspace/Lucene-Solr-repro/lucene/common-build.xml:1092: At least one slave process threw an exception, first: Quit event not received from the forked process? This may indicate JVM crash or runner bugs.

Total time: 29 minutes 33 seconds

[repro] Setting last failure code to 256

[repro] ant compile-test
Buildfile: /x1/jenkins/jenkins-slave/workspace/Lucene-Solr-repro/solr/solrj/build.xml

compile-solr-test-framework:

ivy-availability-check:
[loadresource] Do not set property disallowed.ivy.jars.list as its length is 0.

-ivy-fail-disallowed-ivy-version:

ivy-fail:

ivy-configure:
[ivy:configure] :: Apache Ivy 2.4.0 - 20141213170938 :: http://ant.apache.org/ivy/ ::
[ivy:configure] :: loading settings :: file = /x1/jenkins/jenkins-slave/workspace/Lucene-Solr-repro/lucene/top-level-ivy-settings.xml

resolve:

-clover.disable:

-clover.load:

-clover.classpath:

-clover.setup:

clover:

compile-solr-core:

compile-solrj:

ivy-availability-check:
[loadresource] Do not set property disallowed.ivy.jars.list as its length is 0.

-ivy-fail-disallowed-ivy-version:

ivy-fail:

ivy-configure:
[ivy:configure] :: loading settings :: file = /x1/jenkins/jenkins-slave/workspace/Lucene-Solr-repro/lucene/top-level-ivy-settings.xml

resolve-groovy:
[ivy:cachepath] :: resolving dependencies :: org.codehaus.groovy#groovy-all-caller;working
[ivy:cachepath] 	confs: [default]
[ivy:cachepath] 	found org.codehaus.groovy#groovy-all;2.4.15 in public
[ivy:cachepath] :: resolution report :: resolve 27ms :: artifacts dl 1ms
	---------------------------------------------------------------------
	|                  |            modules            ||   artifacts   |
	|       conf       | number| search|dwnlded|evicted|| number|dwnlded|
	---------------------------------------------------------------------
	|      default     |   1   |   0   |   0   |   0   ||   1   |   0   |
	---------------------------------------------------------------------

check-lucene-core-uptodate:

jar-lucene-core:

check-backward-codecs-uptodate:

jar-backward-codecs:

check-analyzers-phonetic-uptodate:

jar-analyzers-phonetic:

check-analyzers-kuromoji-uptodate:

jar-analyzers-kuromoji:

check-analyzers-nori-uptodate:

jar-analyzers-nori:

check-codecs-uptodate:

jar-codecs:

check-expressions-uptodate:

jar-expressions:

check-suggest-uptodate:

jar-suggest:

check-highlighter-uptodate:

jar-highlighter:

check-memory-uptodate:

jar-memory:

check-misc-uptodate:

jar-misc:

check-spatial-extras-uptodate:

jar-spatial-extras:

check-spatial3d-uptodate:

jar-spatial3d:

check-grouping-uptodate:

jar-grouping:

check-queries-uptodate:

jar-queries:

check-queryparser-uptodate:

jar-queryparser:

check-join-uptodate:

jar-join:

check-sandbox-uptodate:

jar-sandbox:

check-classification-uptodate:

jar-classification:

prep-lucene-jars:

resolve-example:

ivy-availability-check:
[loadresource] Do not set property disallowed.ivy.jars.list as its length is 0.

-ivy-fail-disallowed-ivy-version:

ivy-fail:

ivy-configure:
[ivy:configure] :: loading settings :: file = /x1/jenkins/jenkins-slave/workspace/Lucene-Solr-repro/lucene/top-level-ivy-settings.xml

resolve:

resolve-server:

ivy-availability-check:
[loadresource] Do not set property disallowed.ivy.jars.list as its length is 0.

-ivy-fail-disallowed-ivy-version:

ivy-fail:

ivy-fail:

ivy-configure:
[ivy:configure] :: loading settings :: file = /x1/jenkins/jenkins-slave/workspace/Lucene-Solr-repro/lucene/top-level-ivy-settings.xml

resolve:

-check-git-state:

-git-cleanroot:

-copy-git-state:

git-autoclean:

ivy-fail:

resolve:

common.init:

compile-lucene-core:

-check-git-state:

-git-cleanroot:

-copy-git-state:

git-autoclean:

ivy-availability-check:
[loadresource] Do not set property disallowed.ivy.jars.list as its length is 0.

-ivy-fail-disallowed-ivy-version:

ivy-fail:

ivy-configure:
[ivy:configure] :: loading settings :: file = /x1/jenkins/jenkins-slave/workspace/Lucene-Solr-repro/lucene/top-level-ivy-settings.xml

resolve:

init:

-clover.disable:

-clover.load:

-clover.classpath:

-clover.setup:

clover:

compile-core:

init:

-clover.disable:

-clover.load:

-clover.classpath:

-clover.setup:

clover:

common.compile-core:

compile-core:

ivy-availability-check:
[loadresource] Do not set property disallowed.ivy.jars.list as its length is 0.

-ivy-fail-disallowed-ivy-version:

ivy-fail:

ivy-configure:
[ivy:configure] :: loading settings :: file = /x1/jenkins/jenkins-slave/workspace/Lucene-Solr-repro/lucene/top-level-ivy-settings.xml

resolve-groovy:
[ivy:cachepath] :: resolving dependencies :: org.codehaus.groovy#groovy-all-caller;working
[ivy:cachepath] 	confs: [default]
[ivy:cachepath] 	found org.codehaus.groovy#groovy-all;2.4.15 in public
[ivy:cachepath] :: resolution report :: resolve 14ms :: artifacts dl 1ms
	---------------------------------------------------------------------
	|                  |            modules            ||   artifacts   |
	|       conf       | number| search|dwnlded|evicted|| number|dwnlded|
	---------------------------------------------------------------------
	|      default     |   1   |   0   |   0   |   0   ||   1   |   0   |
	---------------------------------------------------------------------

check-lucene-core-uptodate:

jar-lucene-core:

check-backward-codecs-uptodate:

jar-backward-codecs:

check-analyzers-phonetic-uptodate:

jar-analyzers-phonetic:

check-analyzers-kuromoji-uptodate:

jar-analyzers-kuromoji:

check-analyzers-nori-uptodate:

jar-analyzers-nori:

check-codecs-uptodate:

jar-codecs:

check-expressions-uptodate:

jar-expressions:

check-suggest-uptodate:

jar-suggest:

check-highlighter-uptodate:

jar-highlighter:

check-memory-uptodate:

jar-memory:

check-misc-uptodate:

jar-misc:

check-spatial-extras-uptodate:

jar-spatial-extras:

check-spatial3d-uptodate:

jar-spatial3d:

check-grouping-uptodate:

jar-grouping:

check-queries-uptodate:

jar-queries:

check-queryparser-uptodate:

jar-queryparser:

check-join-uptodate:

jar-join:

check-sandbox-uptodate:

jar-sandbox:

check-classification-uptodate:

jar-classification:

prep-lucene-jars:

resolve-example:

ivy-availability-check:
[loadresource] Do not set property disallowed.ivy.jars.list as its length is 0.

-ivy-fail-disallowed-ivy-version:

ivy-fail:

ivy-configure:
[ivy:configure] :: loading settings :: file = /x1/jenkins/jenkins-slave/workspace/Lucene-Solr-repro/lucene/top-level-ivy-settings.xml

resolve:

resolve-server:

ivy-availability-check:
[loadresource] Do not set property disallowed.ivy.jars.list as its length is 0.

-ivy-fail-disallowed-ivy-version:

ivy-fail:

ivy-fail:

ivy-configure:
[ivy:configure] :: loading settings :: file = /x1/jenkins/jenkins-slave/workspace/Lucene-Solr-repro/lucene/top-level-ivy-settings.xml

resolve:

-check-git-state:

-git-cleanroot:

-copy-git-state:

git-autoclean:

ivy-fail:

resolve:

common.init:

compile-lucene-core:

-check-git-state:

-git-cleanroot:

-copy-git-state:

git-autoclean:

ivy-availability-check:
[loadresource] Do not set property disallowed.ivy.jars.list as its length is 0.

-ivy-fail-disallowed-ivy-version:

ivy-fail:

ivy-configure:
[ivy:configure] :: loading settings :: file = /x1/jenkins/jenkins-slave/workspace/Lucene-Solr-repro/lucene/top-level-ivy-settings.xml

resolve:

init:

-clover.disable:

-clover.load:

-clover.classpath:

-clover.setup:

clover:

compile-core:

init:

-clover.disable:

-clover.load:

-clover.classpath:

-clover.setup:

clover:

common.compile-core:
    [javac] Compiling 3 source files to /x1/jenkins/jenkins-slave/workspace/Lucene-Solr-repro/solr/build/solr-core/classes/java

common-solr.compile-core:

compile-core:

compile-test-framework:

compile-test-framework:

-check-git-state:

-git-cleanroot:

-copy-git-state:

git-autoclean:

ivy-availability-check:
[loadresource] Do not set property disallowed.ivy.jars.list as its length is 0.

-ivy-fail-disallowed-ivy-version:

ivy-fail:

ivy-configure:
[ivy:configure] :: loading settings :: file = /x1/jenkins/jenkins-slave/workspace/Lucene-Solr-repro/lucene/top-level-ivy-settings.xml

resolve:

init:

compile-lucene-core:

-check-git-state:

-git-cleanroot:

-copy-git-state:

git-autoclean:

ivy-availability-check:
[loadresource] Do not set property disallowed.ivy.jars.list as its length is 0.

-ivy-fail-disallowed-ivy-version:

ivy-fail:

ivy-configure:
[ivy:configure] :: loading settings :: file = /x1/jenkins/jenkins-slave/workspace/Lucene-Solr-repro/lucene/top-level-ivy-settings.xml

resolve:

init:

-clover.disable:

-clover.load:

-clover.classpath:

-clover.setup:

clover:

compile-core:

compile-codecs:

-check-git-state:

-git-cleanroot:

-copy-git-state:

git-autoclean:

ivy-availability-check:
[loadresource] Do not set property disallowed.ivy.jars.list as its length is 0.

-ivy-fail-disallowed-ivy-version:

ivy-fail:

ivy-configure:
[ivy:configure] :: loading settings :: file = /x1/jenkins/jenkins-slave/workspace/Lucene-Solr-repro/lucene/top-level-ivy-settings.xml

resolve:

common.init:

compile-lucene-core:

init:

-clover.disable:

-clover.load:

-clover.classpath:

-clover.setup:

clover:

compile-core:

-clover.disable:

-clover.load:

-clover.classpath:

-clover.setup:

clover:

common.compile-core:

compile-core:

compile-core:

ivy-availability-check:
[loadresource] Do not set property disallowed.ivy.jars.list as its length is 0.

-ivy-fail-disallowed-ivy-version:

ivy-fail:

ivy-configure:
[ivy:configure] :: loading settings :: file = /x1/jenkins/jenkins-slave/workspace/Lucene-Solr-repro/lucene/top-level-ivy-settings.xml

resolve-groovy:
[ivy:cachepath] :: resolving dependencies :: org.codehaus.groovy#groovy-all-caller;working
[ivy:cachepath] 	confs: [default]
[ivy:cachepath] 	found org.codehaus.groovy#groovy-all;2.4.15 in public
[ivy:cachepath] :: resolution report :: resolve 9ms :: artifacts dl 0ms
	---------------------------------------------------------------------
	|                  |            modules            ||   artifacts   |
	|       conf       | number| search|dwnlded|evicted|| number|dwnlded|
	---------------------------------------------------------------------
	|      default     |   1   |   0   |   0   |   0   ||   1   |   0   |
	---------------------------------------------------------------------

check-lucene-core-uptodate:

jar-lucene-core:

check-backward-codecs-uptodate:

jar-backward-codecs:

check-analyzers-phonetic-uptodate:

jar-analyzers-phonetic:

check-analyzers-kuromoji-uptodate:

jar-analyzers-kuromoji:

check-analyzers-nori-uptodate:

jar-analyzers-nori:

check-codecs-uptodate:

jar-codecs:

check-expressions-uptodate:

jar-expressions:

check-suggest-uptodate:

jar-suggest:

check-highlighter-uptodate:

jar-highlighter:

check-memory-uptodate:

jar-memory:

check-misc-uptodate:

jar-misc:

check-spatial-extras-uptodate:

jar-spatial-extras:

check-spatial3d-uptodate:

jar-spatial3d:

check-grouping-uptodate:

jar-grouping:

check-queries-uptodate:

jar-queries:

check-queryparser-uptodate:

jar-queryparser:

check-join-uptodate:

jar-join:

check-sandbox-uptodate:

jar-sandbox:

check-classification-uptodate:

jar-classification:

prep-lucene-jars:

resolve-example:

ivy-availability-check:
[loadresource] Do not set property disallowed.ivy.jars.list as its length is 0.

-ivy-fail-disallowed-ivy-version:

ivy-fail:

ivy-configure:
[ivy:configure] :: loading settings :: file = /x1/jenkins/jenkins-slave/workspace/Lucene-Solr-repro/lucene/top-level-ivy-settings.xml

resolve:

resolve-server:

ivy-availability-check:
[loadresource] Do not set property disallowed.ivy.jars.list as its length is 0.

-ivy-fail-disallowed-ivy-version:

ivy-fail:

ivy-fail:

ivy-configure:
[ivy:configure] :: loading settings :: file = /x1/jenkins/jenkins-slave/workspace/Lucene-Solr-repro/lucene/top-level-ivy-settings.xml

resolve:

-check-git-state:

-git-cleanroot:

-copy-git-state:

git-autoclean:

ivy-fail:

resolve:

common.init:

compile-lucene-core:

-check-git-state:

-git-cleanroot:

-copy-git-state:

git-autoclean:

ivy-availability-check:
[loadresource] Do not set property disallowed.ivy.jars.list as its length is 0.

-ivy-fail-disallowed-ivy-version:

ivy-fail:

ivy-configure:
[ivy:configure] :: loading settings :: file = /x1/jenkins/jenkins-slave/workspace/Lucene-Solr-repro/lucene/top-level-ivy-settings.xml

resolve:

init:

-clover.disable:

-clover.load:

-clover.classpath:

-clover.setup:

clover:

compile-core:

init:

-clover.disable:

-clover.load:

-clover.classpath:

-clover.setup:

clover:

common.compile-core:

compile-core:

compile-test-framework:

-check-git-state:

-git-cleanroot:

-copy-git-state:

git-autoclean:

ivy-availability-check:
[loadresource] Do not set property disallowed.ivy.jars.list as its length is 0.

-ivy-fail-disallowed-ivy-version:

ivy-fail:

ivy-configure:
[ivy:configure] :: loading settings :: file = /x1/jenkins/jenkins-slave/workspace/Lucene-Solr-repro/lucene/top-level-ivy-settings.xml

resolve:

init:

compile-lucene-core:

compile-codecs:

-check-git-state:

-git-cleanroot:

-copy-git-state:

git-autoclean:

ivy-availability-check:
[loadresource] Do not set property disallowed.ivy.jars.list as its length is 0.

-ivy-fail-disallowed-ivy-version:

ivy-fail:

ivy-configure:
[ivy:configure] :: loading settings :: file = /x1/jenkins/jenkins-slave/workspace/Lucene-Solr-repro/lucene/top-level-ivy-settings.xml

resolve:

common.init:

compile-lucene-core:

init:

-clover.disable:

-clover.load:

-clover.classpath:

-clover.setup:

clover:

compile-core:

-clover.disable:

-clover.load:

-clover.classpath:

-clover.setup:

clover:

common.compile-core:

compile-core:

common.compile-test:
    [mkdir] Created dir: /x1/jenkins/jenkins-slave/workspace/Lucene-Solr-repro/solr/build/solr-solrj/classes/test
    [javac] Compiling 169 source files to /x1/jenkins/jenkins-slave/workspace/Lucene-Solr-repro/solr/build/solr-solrj/classes/test
    [javac] Note: Some input files use or override a deprecated API.
    [javac] Note: Recompile with -Xlint:deprecation for details.
    [javac] Note: Some input files use unchecked or unsafe operations.
    [javac] Note: Recompile with -Xlint:unchecked for details.

compile-test:

BUILD SUCCESSFUL
Total time: 15 seconds
[repro] ant test-nocompile -Dtests.dups=5 -Dtests.maxfailures=5 -Dtests.class="*.CloudSolrClientTest" -Dtests.showOutput=onerror -Dtests.multiplier=2 -Dtests.linedocsfile=/home/jenkins/jenkins-slave/workspace/Lucene-Solr-NightlyTests-master/test-data/enwiki.random.lines.txt -Dtests.seed=5630E8C5E6A4B819 -Dtests.multiplier=2 -Dtests.nightly=true -Dtests.slow=true -Dtests.linedocsfile=/home/jenkins/jenkins-slave/workspace/Lucene-Solr-NightlyTests-master/test-data/enwiki.random.lines.txt -Dtests.locale=es -Dtests.timezone=Asia/Qyzylorda -Dtests.asserts=true -Dtests.file.encoding=US-ASCII
Buildfile: /x1/jenkins/jenkins-slave/workspace/Lucene-Solr-repro/solr/solrj/build.xml

-clover.disable:

ivy-configure:
[ivy:configure] :: Apache Ivy 2.4.0 - 20141213170938 :: http://ant.apache.org/ivy/ ::
[ivy:configure] :: loading settings :: file = /x1/jenkins/jenkins-slave/workspace/Lucene-Solr-repro/lucene/top-level-ivy-settings.xml

install-junit4-taskdef:

ivy-availability-check:
[loadresource] Do not set property disallowed.ivy.jars.list as its length is 0.

-ivy-fail-disallowed-ivy-version:

ivy-fail:

resolve-groovy:
[ivy:cachepath] :: resolving dependencies :: org.codehaus.groovy#groovy-all-caller;working
[ivy:cachepath] 	confs: [default]
[ivy:cachepath] 	found org.codehaus.groovy#groovy-all;2.4.15 in public
[ivy:cachepath] :: resolution report :: resolve 19ms :: artifacts dl 1ms
	---------------------------------------------------------------------
	|                  |            modules            ||   artifacts   |
	|       conf       | number| search|dwnlded|evicted|| number|dwnlded|
	---------------------------------------------------------------------
	|      default     |   1   |   0   |   0   |   0   ||   1   |   0   |
	---------------------------------------------------------------------

-init-totals:

-test:
    [mkdir] Created dir: /x1/jenkins/jenkins-slave/workspace/Lucene-Solr-repro/solr/build/solr-solrj/test
[junit4:pickseed] Seed property 'tests.seed' already defined: 5630E8C5E6A4B819
    [mkdir] Created dir: /x1/jenkins/jenkins-slave/workspace/Lucene-Solr-repro/solr/build/solr-solrj/test/temp
    [mkdir] Created dir: /x1/jenkins/jenkins-slave/workspace/Lucene-Solr-repro/.caches/test-stats/solr-solrj
   [junit4] <JUnit4> says 今日は! Master seed: 5630E8C5E6A4B819
   [junit4] Executing 5 suites with 3 JVMs.
   [junit4] 
   [junit4] Started J1 PID(11073@lucene1-us-west).
   [junit4] Started J0 PID(11074@lucene1-us-west).
   [junit4] Started J2 PID(11075@lucene1-us-west).
   [junit4] Suite: org.apache.solr.client.solrj.impl.CloudSolrClientTest
   [junit4]   2> ERROR StatusLogger No Log4j 2 configuration file found. Using default configuration (logging only errors to the console), or user programmatically provided configurations. Set system property 'log4j2.debug' to show Log4j 2 internal initialization logging. See https://logging.apache.org/log4j/2.x/manual/configuration.html for instructions on how to configure Log4j 2
   [junit4]   2> Creating dataDir: /x1/jenkins/jenkins-slave/workspace/Lucene-Solr-repro/solr/build/solr-solrj/test/J0/temp/solr.client.solrj.impl.CloudSolrClientTest_5630E8C5E6A4B819-001/init-core-data-001
   [junit4]   1> 12:21:00.053 [Thread-1] ERROR org.apache.zookeeper.server.ZooKeeperServer - ZKShutdownHandler is not registered, so ZooKeeper server won't take any action on ERROR or SHUTDOWN server state changes
   [junit4]   1> 12:21:01.643 [jetty-launcher-1-thread-2] ERROR org.apache.solr.util.StartupLoggingUtils - Missing Java Option solr.log.dir. Logging may be missing or incomplete.
   [junit4]   1> 12:21:01.644 [jetty-launcher-1-thread-1] ERROR org.apache.solr.util.StartupLoggingUtils - Missing Java Option solr.log.dir. Logging may be missing or incomplete.
   [junit4]   1> 12:21:01.643 [jetty-launcher-1-thread-3] ERROR org.apache.solr.util.StartupLoggingUtils - Missing Java Option solr.log.dir. Logging may be missing or incomplete.
   [junit4] OK      10.8s J0 | CloudSolrClientTest.checkCollectionParameters
   [junit4]   1> -
   [junit4]   1> replica:core_node2 rstate:active live:true
   [junit4]   1> no one is recoverying
   [junit4]   1> -
   [junit4]   1> replica:core_node2 rstate:active live:true
   [junit4]   1> replica:core_node4 rstate:down live:true
   [junit4]   1> -
   [junit4]   1> replica:core_node2 rstate:active live:true
   [junit4]   1> replica:core_node4 rstate:recovering live:true
   [junit4]   1> -
   [junit4]   1> replica:core_node2 rstate:active live:true
   [junit4]   1> replica:core_node4 rstate:active live:true
   [junit4]   1> no one is recoverying
   [junit4]   1> -
   [junit4]   1> replica:core_node4 rstate:active live:true
   [junit4]   1> no one is recoverying
   [junit4]   1> 12:21:29.951 [TEST-CloudSolrClientTest.testRetryUpdatesWhenClusterStateIsStale-seed#[5630E8C5E6A4B819]] ERROR org.apache.solr.client.solrj.impl.CloudSolrClient - Request to collection [stale_state_test_col] failed due to (404) org.apache.solr.client.solrj.impl.HttpSolrClient$RemoteSolrException: Error from server at https://127.0.0.1:38064/solr/stale_state_test_col_shard1_replica_n1: Expected mime type application/octet-stream but got text/html. <html>
   [junit4]   1> <head>
   [junit4]   1> <meta http-equiv="Content-Type" content="text/html;charset=utf-8"/>
   [junit4]   1> <title>Error 404 Can not find: /solr/stale_state_test_col_shard1_replica_n1/update</title>
   [junit4]   1> </head>
   [junit4]   1> <body><h2>HTTP ERROR 404</h2>
   [junit4]   1> <p>Problem accessing /solr/stale_state_test_col_shard1_replica_n1/update. Reason:
   [junit4]   1> <pre>    Can not find: /solr/stale_state_test_col_shard1_replica_n1/update</pre></p><hr><a href="http://eclipse.org/jetty">Powered by Jetty:// 9.4.11.v20180605</a><hr/>
   [junit4]   1> 
   [junit4]   1> </body>
   [junit4]   1> </html>
   [junit4]   1> , retry? 0
   [junit4] OK      10.8s J0 | CloudSolrClientTest.testRetryUpdatesWhenClusterStateIsStale
   [junit4] OK      8.27s J0 | CloudSolrClientTest.testAliasHandling
   [junit4] OK      4.88s J0 | CloudSolrClientTest.testOverwriteOption
   [junit4] OK      4.06s J0 | CloudSolrClientTest.testParallelUpdateQTime
   [junit4] OK      0.90s J0 | CloudSolrClientTest.customHttpClientTest
   [junit4] OK      0.08s J0 | CloudSolrClientTest.testWrongZkChrootTest
   [junit4] OK      0.06s J0 | CloudSolrClientTest.testCollectionDoesntExist
   [junit4] OK      7.85s J0 | CloudSolrClientTest.preferReplicaTypesTest
   [junit4] OK      4.90s J0 | CloudSolrClientTest.testVersionsAreReturned
   [junit4]   1> 12:22:07.497 [TEST-CloudSolrClientTest.testRouting-seed#[5630E8C5E6A4B819]] ERROR org.apache.solr.client.solrj.impl.CloudSolrClient - Request to collection [collection1] failed due to (404) org.apache.solr.client.solrj.impl.HttpSolrClient$RemoteSolrException: Error from server at https://127.0.0.1:45447/solr/collection1_shard2_replica_n2: Expected mime type application/octet-stream but got text/html. <html>
   [junit4]   1> <head>
   [junit4]   1> <meta http-equiv="Content-Type" content="text/html;charset=utf-8"/>
   [junit4]   1> <title>Error 404 Can not find: /solr/collection1_shard2_replica_n2/update</title>
   [junit4]   1> </head>
   [junit4]   1> <body><h2>HTTP ERROR 404</h2>
   [junit4]   1> <p>Problem accessing /solr/collection1_shard2_replica_n2/update. Reason:
   [junit4]   1> <pre>    Can not find: /solr/collection1_shard2_replica_n2/update</pre></p><hr><a href="http://eclipse.org/jetty">Powered by Jetty:// 9.4.11.v20180605</a><hr/>
   [junit4]   1> 
   [junit4]   1> </body>
   [junit4]   1> </html>
   [junit4]   1> , retry? 0
   [junit4]   1> 12:22:07.506 [TEST-CloudSolrClientTest.testRouting-seed#[5630E8C5E6A4B819]] ERROR org.apache.solr.client.solrj.impl.CloudSolrClient - Request to collection [collection1] failed due to (404) org.apache.solr.client.solrj.impl.HttpSolrClient$RemoteSolrException: Error from server at https://127.0.0.1:45447/solr/collection1_shard2_replica_n2: Expected mime type application/octet-stream but got text/html. <html>
   [junit4]   1> <head>
   [junit4]   1> <meta http-equiv="Content-Type" content="text/html;charset=utf-8"/>
   [junit4]   1> <title>Error 404 Can not find: /solr/collection1_shard2_replica_n2/update</title>
   [junit4]   1> </head>
   [junit4]   1> <body><h2>HTTP ERROR 404</h2>
   [junit4]   1> <p>Problem accessing /solr/collection1_shard2_replica_n2/update. Reason:
   [junit4]   1> <pre>    Can not find: /solr/collection1_shard2_replica_n2/update</pre></p><hr><a href="http://eclipse.org/jetty">Powered by Jetty:// 9.4.11.v20180605</a><hr/>
   [junit4]   1> 
   [junit4]   1> </body>
   [junit4]   1> </html>
   [junit4]   1> , retry? 1
   [junit4]   1> 12:22:07.512 [TEST-CloudSolrClientTest.testRouting-seed#[5630E8C5E6A4B819]] ERROR org.apache.solr.client.solrj.impl.CloudSolrClient - Request to collection [collection1] failed due to (404) org.apache.solr.client.solrj.impl.HttpSolrClient$RemoteSolrException: Error from server at https://127.0.0.1:45447/solr/collection1_shard2_replica_n2: Expected mime type application/octet-stream but got text/html. <html>
   [junit4]   1> <head>
   [junit4]   1> <meta http-equiv="Content-Type" content="text/html;charset=utf-8"/>
   [junit4]   1> <title>Error 404 Can not find: /solr/collection1_shard2_replica_n2/update</title>
   [junit4]   1> </head>
   [junit4]   1> <body><h2>HTTP ERROR 404</h2>
   [junit4]   1> <p>Problem accessing /solr/collection1_shard2_replica_n2/update. Reason:
   [junit4]   1> <pre>    Can not find: /solr/collection1_shard2_replica_n2/update</pre></p><hr><a href="http://eclipse.org/jetty">Powered by Jetty:// 9.4.11.v20180605</a><hr/>
   [junit4]   1> 
   [junit4]   1> </body>
   [junit4]   1> </html>
   [junit4]   1> , retry? 2
   [junit4]   1> 12:22:07.516 [TEST-CloudSolrClientTest.testRouting-seed#[5630E8C5E6A4B819]] ERROR org.apache.solr.client.solrj.impl.CloudSolrClient - Request to collection [collection1] failed due to (404) org.apache.solr.client.solrj.impl.HttpSolrClient$RemoteSolrException: Error from server at https://127.0.0.1:45447/solr/collection1_shard2_replica_n2: Expected mime type application/octet-stream but got text/html. <html>
   [junit4]   1> <head>
   [junit4]   1> <meta http-equiv="Content-Type" content="text/html;charset=utf-8"/>
   [junit4]   1> <title>Error 404 Can not find: /solr/collection1_shard2_replica_n2/update</title>
   [junit4]   1> </head>
   [junit4]   1> <body><h2>HTTP ERROR 404</h2>
   [junit4]   1> <p>Problem accessing /solr/collection1_shard2_replica_n2/update. Reason:
   [junit4]   1> <pre>    Can not find: /solr/collection1_shard2_replica_n2/update</pre></p><hr><a href="http://eclipse.org/jetty">Powered by Jetty:// 9.4.11.v20180605</a><hr/>
   [junit4]   1> 
   [junit4]   1> </body>
   [junit4]   1> </html>
   [junit4]   1> , retry? 3
   [junit4]   1> 12:22:07.520 [TEST-CloudSolrClientTest.testRouting-seed#[5630E8C5E6A4B819]] ERROR org.apache.solr.client.solrj.impl.CloudSolrClient - Request to collection [collection1] failed due to (404) org.apache.solr.client.solrj.impl.HttpSolrClient$RemoteSolrException: Error from server at https://127.0.0.1:45447/solr/collection1_shard2_replica_n2: Expected mime type application/octet-stream but got text/html. <html>
   [junit4]   1> <head>
   [junit4]   1> <meta http-equiv="Content-Type" content="text/html;charset=utf-8"/>
   [junit4]   1> <title>Error 404 Can not find: /solr/collection1_shard2_replica_n2/update</title>
   [junit4]   1> </head>
   [junit4]   1> <body><h2>HTTP ERROR 404</h2>
   [junit4]   1> <p>Problem accessing /solr/collection1_shard2_replica_n2/update. Reason:
   [junit4]   1> <pre>    Can not find: /solr/collection1_shard2_replica_n2/update</pre></p><hr><a href="http://eclipse.org/jetty">Powered by Jetty:// 9.4.11.v20180605</a><hr/>
   [junit4]   1> 
   [junit4]   1> </body>
   [junit4]   1> </html>
   [junit4]   1> , retry? 4
   [junit4]   1> 12:22:07.524 [TEST-CloudSolrClientTest.testRouting-seed#[5630E8C5E6A4B819]] ERROR org.apache.solr.client.solrj.impl.CloudSolrClient - Request to collection [collection1] failed due to (404) org.apache.solr.client.solrj.impl.HttpSolrClient$RemoteSolrException: Error from server at https://127.0.0.1:45447/solr/collection1_shard2_replica_n2: Expected mime type application/octet-stream but got text/html. <html>
   [junit4]   1> <head>
   [junit4]   1> <meta http-equiv="Content-Type" content="text/html;charset=utf-8"/>
   [junit4]   1> <title>Error 404 Can not find: /solr/collection1_shard2_replica_n2/update</title>
   [junit4]   1> </head>
   [junit4]   1> <body><h2>HTTP ERROR 404</h2>
   [junit4]   1> <p>Problem accessing /solr/collection1_shard2_replica_n2/update. Reason:
   [junit4]   1> <pre>    Can not find: /solr/collection1_shard2_replica_n2/update</pre></p><hr><a href="http://eclipse.org/jetty">Powered by Jetty:// 9.4.11.v20180605</a><hr/>
   [junit4]   1> 
   [junit4]   1> </body>
   [junit4]   1> </html>
   [junit4]   1> , retry? 5
   [junit4]   2> NOTE: download the large Jenkins line-docs file by running 'ant get-jenkins-line-docs' in the lucene directory.
   [junit4]   2> NOTE: reproduce with: ant test  -Dtestcase=CloudSolrClientTest -Dtests.method=testRouting -Dtests.seed=5630E8C5E6A4B819 -Dtests.multiplier=2 -Dtests.nightly=true -Dtests.slow=true -Dtests.badapples=true -Dtests.linedocsfile=/home/jenkins/jenkins-slave/workspace/Lucene-Solr-NightlyTests-master/test-data/enwiki.random.lines.txt -Dtests.locale=es -Dtests.timezone=Asia/Qyzylorda -Dtests.asserts=true -Dtests.file.encoding=US-ASCII
   [junit4] ERROR   4.25s J0 | CloudSolrClientTest.testRouting <<<
   [junit4]    > Throwable #1: org.apache.solr.client.solrj.impl.CloudSolrClient$RouteException: Error from server at https://127.0.0.1:45447/solr/collection1_shard2_replica_n2: Expected mime type application/octet-stream but got text/html. <html>
   [junit4]    > <head>
   [junit4]    > <meta http-equiv="Content-Type" content="text/html;charset=utf-8"/>
   [junit4]    > <title>Error 404 Can not find: /solr/collection1_shard2_replica_n2/update</title>
   [junit4]    > </head>
   [junit4]    > <body><h2>HTTP ERROR 404</h2>
   [junit4]    > <p>Problem accessing /solr/collection1_shard2_replica_n2/update. Reason:
   [junit4]    > <pre>    Can not find: /solr/collection1_shard2_replica_n2/update</pre></p><hr><a href="http://eclipse.org/jetty">Powered by Jetty:// 9.4.11.v20180605</a><hr/>
   [junit4]    > </body>
   [junit4]    > </html>
   [junit4]    > 	at __randomizedtesting.SeedInfo.seed([5630E8C5E6A4B819:9487D4ADE5E44861]:0)
   [junit4]    > 	at org.apache.solr.client.solrj.impl.CloudSolrClient.directUpdate(CloudSolrClient.java:551)
   [junit4]    > 	at org.apache.solr.client.solrj.impl.CloudSolrClient.sendRequest(CloudSolrClient.java:1016)
   [junit4]    > 	at org.apache.solr.client.solrj.impl.CloudSolrClient.requestWithRetryOnStaleState(CloudSolrClient.java:884)
   [junit4]    > 	at org.apache.solr.client.solrj.impl.CloudSolrClient.requestWithRetryOnStaleState(CloudSolrClient.java:949)
   [junit4]    > 	at org.apache.solr.client.solrj.impl.CloudSolrClient.requestWithRetryOnStaleState(CloudSolrClient.java:949)
   [junit4]    > 	at org.apache.solr.client.solrj.impl.CloudSolrClient.requestWithRetryOnStaleState(CloudSolrClient.java:949)
   [junit4]    > 	at org.apache.solr.client.solrj.impl.CloudSolrClient.requestWithRetryOnStaleState(CloudSolrClient.java:949)
   [junit4]    > 	at org.apache.solr.client.solrj.impl.CloudSolrClient.requestWithRetryOnStaleState(CloudSolrClient.java:949)
   [junit4]    > 	at org.apache.solr.client.solrj.impl.CloudSolrClient.request(CloudSolrClient.java:817)
   [junit4]    > 	at org.apache.solr.client.solrj.SolrRequest.process(SolrRequest.java:194)
   [junit4]    > 	at org.apache.solr.client.solrj.request.UpdateRequest.commit(UpdateRequest.java:237)
   [junit4]    > 	at org.apache.solr.client.solrj.impl.CloudSolrClientTest.testRouting(CloudSolrClientTest.java:269)
   [junit4]    > 	at java.lang.Thread.run(Thread.java:748)
   [junit4]    > Caused by: org.apache.solr.client.solrj.impl.HttpSolrClient$RemoteSolrException: Error from server at https://127.0.0.1:45447/solr/collection1_shard2_replica_n2: Expected mime type application/octet-stream but got text/html. <html>
   [junit4]    > <head>
   [junit4]    > <meta http-equiv="Content-Type" content="text/html;charset=utf-8"/>
   [junit4]    > <title>Error 404 Can not find: /solr/collection1_shard2_replica_n2/update</title>
   [junit4]    > </head>
   [junit4]    > <body><h2>HTTP ERROR 404</h2>
   [junit4]    > <p>Problem accessing /solr/collection1_shard2_replica_n2/update. Reason:
   [junit4]    > <pre>    Can not find: /solr/collection1_shard2_replica_n2/update</pre></p><hr><a href="http://eclipse.org/jetty">Powered by Jetty:// 9.4.11.v20180605</a><hr/>
   [junit4]    > </body>
   [junit4]    > </html>
   [junit4]    > 	at org.apache.solr.client.solrj.impl.HttpSolrClient.executeMethod(HttpSolrClient.java:607)
   [junit4]    > 	at org.apache.solr.client.solrj.impl.HttpSolrClient.request(HttpSolrClient.java:255)
   [junit4]    > 	at org.apache.solr.client.solrj.impl.HttpSolrClient.request(HttpSolrClient.java:244)
   [junit4]    > 	at org.apache.solr.client.solrj.impl.LBHttpSolrClient.doRequest(LBHttpSolrClient.java:483)
   [junit4]    > 	at org.apache.solr.client.solrj.impl.LBHttpSolrClient.request(LBHttpSolrClient.java:413)
   [junit4]    > 	at org.apache.solr.client.solrj.impl.CloudSolrClient.lambda$directUpdate$0(CloudSolrClient.java:528)
   [junit4]    > 	at java.util.concurrent.FutureTask.run(FutureTask.java:266)
   [junit4]    > 	at org.apache.solr.common.util.ExecutorUtil$MDCAwareThreadPoolExecutor.lambda$execute$0(ExecutorUtil.java:209)
   [junit4]    > 	at java.util.concurrent.ThreadPoolExecutor.runWorker(ThreadPoolExecutor.java:1149)
   [junit4]    > 	at java.util.concurrent.ThreadPoolExecutor$Worker.run(ThreadPoolExecutor.java:624)
   [junit4]    > 	... 1 more
   [junit4] OK      4.04s J0 | CloudSolrClientTest.testInitializationWithSolrUrls
   [junit4]   1> 12:22:12.534 [TEST-CloudSolrClientTest.testShutdown-seed#[5630E8C5E6A4B819]-SendThread(ff01::114:33332)] ERROR org.apache.zookeeper.ClientCnxnSocketNIO - Unable to open socket to ff01::114/ff01:0:0:0:0:0:0:114:33332
   [junit4]   1> 12:22:13.671 [TEST-CloudSolrClientTest.testShutdown-seed#[5630E8C5E6A4B819]-SendThread(ff01::114:33332)] ERROR org.apache.zookeeper.ClientCnxnSocketNIO - Unable to open socket to ff01::114/ff01:0:0:0:0:0:0:114:33332
   [junit4] OK      2.17s J0 | CloudSolrClientTest.testShutdown
   [junit4]   1> -
   [junit4]   1> replica:core_node3 rstate:active live:true
   [junit4]   1> replica:core_node5 rstate:active live:true
   [junit4]   1> replica:core_node6 rstate:active live:true
   [junit4]   1> no one is recoverying
   [junit4]   1> 12:22:17.952 [qtp1025896484-32] ERROR org.apache.solr.handler.RequestHandlerBase - org.apache.solr.common.SolrException: Unknown action: foobar
   [junit4]   1> 	at org.apache.solr.handler.admin.ConfigSetsHandler.handleRequestBody(ConfigSetsHandler.java:109)
   [junit4]   1> 	at org.apache.solr.handler.RequestHandlerBase.handleRequest(RequestHandlerBase.java:199)
   [junit4]   1> 	at org.apache.solr.servlet.HttpSolrCall.handleAdmin(HttpSolrCall.java:734)
   [junit4]   1> 	at org.apache.solr.servlet.HttpSolrCall.handleAdminRequest(HttpSolrCall.java:715)
   [junit4]   1> 	at org.apache.solr.servlet.HttpSolrCall.call(HttpSolrCall.java:496)
   [junit4]   1> 	at org.apache.solr.servlet.SolrDispatchFilter.doFilter(SolrDispatchFilter.java:377)
   [junit4]   1> 	at org.apache.solr.servlet.SolrDispatchFilter.doFilter(SolrDispatchFilter.java:323)
   [junit4]   1> 	at org.eclipse.jetty.servlet.ServletHandler$CachedChain.doFilter(ServletHandler.java:1642)
   [junit4]   1> 	at org.apache.solr.client.solrj.embedded.JettySolrRunner$DebugFilter.doFilter(JettySolrRunner.java:139)
   [junit4]   1> 	at org.eclipse.jetty.servlet.ServletHandler$CachedChain.doFilter(ServletHandler.java:1642)
   [junit4]   1> 	at org.eclipse.jetty.servlet.ServletHandler.doHandle(ServletHandler.java:533)
   [junit4]   1> 	at org.eclipse.jetty.server.handler.ScopedHandler.nextHandle(ScopedHandler.java:255)
   [junit4]   1> 	at org.eclipse.jetty.server.session.SessionHandler.doHandle(SessionHandler.java:1595)
   [junit4]   1> 	at org.eclipse.jetty.server.handler.ScopedHandler.nextHandle(ScopedHandler.java:255)
   [junit4]   1> 	at org.eclipse.jetty.server.handler.ContextHandler.doHandle(ContextHandler.java:1317)
   [junit4]   1> 	at org.eclipse.jetty.server.handler.ScopedHandler.nextScope(ScopedHandler.java:203)
   [junit4]   1> 	at org.eclipse.jetty.servlet.ServletHandler.doScope(ServletHandler.java:473)
   [junit4]   1> 	at org.eclipse.jetty.server.session.SessionHandler.doScope(SessionHandler.java:1564)
   [junit4]   1> 	at org.eclipse.jetty.server.handler.ScopedHandler.nextScope(ScopedHandler.java:201)
   [junit4]   1> 	at org.eclipse.jetty.server.handler.ContextHandler.doScope(ContextHandler.java:1219)
   [junit4]   1> 	at org.eclipse.jetty.server.handler.ScopedHandler.handle(ScopedHandler.java:144)
   [junit4]   1> 	at org.eclipse.jetty.server.handler.gzip.GzipHandler.handle(GzipHandler.java:724)
   [junit4]   1> 	at org.eclipse.jetty.server.handler.HandlerWrapper.handle(HandlerWrapper.java:132)
   [junit4]   1> 	at org.eclipse.jetty.server.Server.handle(Server.java:531)
   [junit4]   1> 	at org.eclipse.jetty.server.HttpChannel.handle(HttpChannel.java:352)
   [junit4]   1> 	at org.eclipse.jetty.server.HttpConnection.onFillable(HttpConnection.java:260)
   [junit4]   1> 	at org.eclipse.jetty.io.AbstractConnection$ReadCallback.succeeded(AbstractConnection.java:281)
   [junit4]   1> 	at org.eclipse.jetty.io.FillInterest.fillable(FillInterest.java:102)
   [junit4]   1> 	at org.eclipse.jetty.io.ssl.SslConnection.onFillable(SslConnection.java:291)
   [junit4]   1> 	at org.eclipse.jetty.io.ssl.SslConnection$3.succeeded(SslConnection.java:151)
   [junit4]   1> 	at org.eclipse.jetty.io.FillInterest.fillable(FillInterest.java:102)
   [junit4]   1> 	at org.eclipse.jetty.io.ChannelEndPoint$2.run(ChannelEndPoint.java:118)
   [junit4]   1> 	at org.eclipse.jetty.util.thread.strategy.EatWhatYouKill.runTask(EatWhatYouKill.java:333)
   [junit4]   1> 	at org.eclipse.jetty.util.thread.strategy.EatWhatYouKill.doProduce(EatWhatYouKill.java:310)
   [junit4]   1> 	at org.eclipse.jetty.util.thread.strategy.EatWhatYouKill.tryProduce(EatWhatYouKill.java:168)
   [junit4]   1> 	at org.eclipse.jetty.util.thread.strategy.EatWhatYouKill.run(EatWhatYouKill.java:126)
   [junit4]   1> 	at org.eclipse.jetty.util.thread.ReservedThreadExecutor$ReservedThread.run(ReservedThreadExecutor.java:366)
   [junit4]   1> 	at org.eclipse.jetty.util.thread.QueuedThreadPool.runJob(QueuedThreadPool.java:762)
   [junit4]   1> 	at org.eclipse.jetty.util.thread.QueuedThreadPool$2.run(QueuedThreadPool.java:680)
   [junit4]   1> 	at java.lang.Thread.run(Thread.java:748)
   [junit4]   1> 
   [junit4]   1> 12:22:18.030 [qtp1025896484-25] ERROR org.apache.solr.handler.RequestHandlerBase - org.apache.solr.common.SolrException: Unknown action: foobar
   [junit4]   1> 	at org.apache.solr.handler.admin.CollectionsHandler.handleRequestBody(CollectionsHandler.java:241)
   [junit4]   1> 	at org.apache.solr.handler.RequestHandlerBase.handleRequest(RequestHandlerBase.java:199)
   [junit4]   1> 	at org.apache.solr.servlet.HttpSolrCall.handleAdmin(HttpSolrCall.java:734)
   [junit4]   1> 	at org.apache.solr.servlet.HttpSolrCall.handleAdminRequest(HttpSolrCall.java:715)
   [junit4]   1> 	at org.apache.solr.servlet.HttpSolrCall.call(HttpSolrCall.java:496)
   [junit4]   1> 	at org.apache.solr.servlet.SolrDispatchFilter.doFilter(SolrDispatchFilter.java:377)
   [junit4]   1> 	at org.apache.solr.servlet.SolrDispatchFilter.doFilter(SolrDispatchFilter.java:323)
   [junit4]   1> 	at org.eclipse.jetty.servlet.ServletHandler$CachedChain.doFilter(ServletHandler.java:1642)
   [junit4]   1> 	at org.apache.solr.client.solrj.embedded.JettySolrRunner$DebugFilter.doFilter(JettySolrRunner.java:139)
   [junit4]   1> 	at org.eclipse.jetty.servlet.ServletHandler$CachedChain.doFilter(ServletHandler.java:1642)
   [junit4]   1> 	at org.eclipse.jetty.servlet.ServletHandler.doHandle(ServletHandler.java:533)
   [junit4]   1> 	at org.eclipse.jetty.server.handler.ScopedHandler.nextHandle(ScopedHandler.java:255)
   [junit4]   1> 	at org.eclipse.jetty.server.session.SessionHandler.doHandle(SessionHandler.java:1595)
   [junit4]   1> 	at org.eclipse.jetty.server.handler.ScopedHandler.nextHandle(ScopedHandler.java:255)
   [junit4]   1> 	at org.eclipse.jetty.server.handler.ContextHandler.doHandle(ContextHandler.java:1317)
   [junit4]   1> 	at org.eclipse.jetty.server.handler.ScopedHandler.nextScope(ScopedHandler.java:203)
   [junit4]   1> 	at org.eclipse.jetty.servlet.ServletHandler.doScope(ServletHandler.java:473)
   [junit4]   1> 	at org.eclipse.jetty.server.session.SessionHandler.doScope(SessionHandler.java:1564)
   [junit4]   1> 	at org.eclipse.jetty.server.handler.ScopedHandler.nextScope(ScopedHandler.java:201)
   [junit4]   1> 	at org.eclipse.jetty.server.handler.ContextHandler.doScope(ContextHandler.java:1219)
   [junit4]   1> 	at org.eclipse.jetty.server.handler.ScopedHandler.handle(ScopedHandler.java:144)
   [junit4]   1> 	at org.eclipse.jetty.server.handler.gzip.GzipHandler.handle(GzipHandler.java:724)
   [junit4]   1> 	at org.eclipse.jetty.server.handler.HandlerWrapper.handle(HandlerWrapper.java:132)
   [junit4]   1> 	at org.eclipse.jetty.server.Server.handle(Server.java:531)
   [junit4]   1> 	at org.eclipse.jetty.server.HttpChannel.handle(HttpChannel.java:352)
   [junit4]   1> 	at org.eclipse.jetty.server.HttpConnection.onFillable(HttpConnection.java:260)
   [junit4]   1> 	at org.eclipse.jetty.io.AbstractConnection$ReadCallback.succeeded(AbstractConnection.java:281)
   [junit4]   1> 	at org.eclipse.jetty.io.FillInterest.fillable(FillInterest.java:102)
   [junit4]   1> 	at org.eclipse.jetty.io.ssl.SslConnection.onFillable(SslConnection.java:291)
   [junit4]   1> 	at org.eclipse.jetty.io.ssl.SslConnection$3.succeeded(SslConnection.java:151)
   [junit4]   1> 	at org.eclipse.jetty.io.FillInterest.fillable(FillInterest.java:102)
   [junit4]   1> 	at org.eclipse.jetty.io.ChannelEndPoint$2.run(ChannelEndPoint.java:118)
   [junit4]   1> 	at org.eclipse.jetty.util.thread.strategy.EatWhatYouKill.runTask(EatWhatYouKill.java:333)
   [junit4]   1> 	at org.eclipse.jetty.util.thread.strategy.EatWhatYouKill.doProduce(EatWhatYouKill.java:310)
   [junit4]   1> 	at org.eclipse.jetty.util.thread.strategy.EatWhatYouKill.tryProduce(EatWhatYouKill.java:168)
   [junit4]   1> 	at org.eclipse.jetty.util.thread.strategy.EatWhatYouKill.run(EatWhatYouKill.java:126)
   [junit4]   1> 	at org.eclipse.jetty.util.thread.ReservedThreadExecutor$ReservedThread.run(ReservedThreadExecutor.java:366)
   [junit4]   1> 	at org.eclipse.jetty.util.thread.QueuedThreadPool.runJob(QueuedThreadPool.java:762)
   [junit4]   1> 	at org.eclipse.jetty.util.thread.QueuedThreadPool$2.run(QueuedThreadPool.java:680)
   [junit4]   1> 	at java.lang.Thread.run(Thread.java:748)
   [junit4]   1> 
   [junit4]   1> 12:22:18.084 [qtp1025896484-25] ERROR org.apache.solr.handler.RequestHandlerBase - org.apache.solr.common.SolrException: Unsupported operation: foobar
   [junit4]   1> 	at org.apache.solr.handler.admin.CoreAdminHandler.handleCustomAction(CoreAdminHandler.java:220)
   [junit4]   1> 	at org.apache.solr.handler.admin.CoreAdminHandler.handleRequestBody(CoreAdminHandler.java:169)
   [junit4]   1> 	at org.apache.solr.handler.RequestHandlerBase.handleRequest(RequestHandlerBase.java:199)
   [junit4]   1> 	at org.apache.solr.servlet.HttpSolrCall.handleAdmin(HttpSolrCall.java:734)
   [junit4]   1> 	at org.apache.solr.servlet.HttpSolrCall.handleAdminRequest(HttpSolrCall.java:715)
   [junit4]   1> 	at org.apache.solr.servlet.HttpSolrCall.call(HttpSolrCall.java:496)
   [junit4]   1> 	at org.apache.solr.servlet.SolrDispatchFilter.doFilter(SolrDispatchFilter.java:377)
   [junit4]   1> 	at org.apache.solr.servlet.SolrDispatchFilter.doFilter(SolrDispatchFilter.java:323)
   [junit4]   1> 	at org.eclipse.jetty.servlet.ServletHandler$CachedChain.doFilter(ServletHandler.java:1642)
   [junit4]   1> 	at org.apache.solr.client.solrj.embedded.JettySolrRunner$DebugFilter.doFilter(JettySolrRunner.java:139)
   [junit4]   1> 	at org.eclipse.jetty.servlet.ServletHandler$CachedChain.doFilter(ServletHandler.java:1642)
   [junit4]   1> 	at org.eclipse.jetty.servlet.ServletHandler.doHandle(ServletHandler.java:533)
   [junit4]   1> 	at org.eclipse.jetty.server.handler.ScopedHandler.nextHandle(ScopedHandler.java:255)
   [junit4]   1> 	at org.eclipse.jetty.server.session.SessionHandler.doHandle(SessionHandler.java:1595)
   [junit4]   1> 	at org.eclipse.jetty.server.handler.ScopedHandler.nextHandle(ScopedHandler.java:255)
   [junit4]   1> 	at org.eclipse.jetty.server.handler.ContextHandler.doHandle(ContextHandler.java:1317)
   [junit4]   1> 	at org.eclipse.jetty.server.handler.ScopedHandler.nextScope(ScopedHandler.java:203)
   [junit4]   1> 	at org.eclipse.jetty.servlet.ServletHandler.doScope(ServletHandler.java:473)
   [junit4]   1> 	at org.eclipse.jetty.server.session.SessionHandler.doScope(SessionHandler.java:1564)
   [junit4]   1> 	at org.eclipse.jetty.server.handler.ScopedHandler.nextScope(ScopedHandler.java:201)
   [junit4]   1> 	at org.eclipse.jetty.server.handler.ContextHandler.doScope(ContextHandler.java:1219)
   [junit4]   1> 	at org.eclipse.jetty.server.handler.ScopedHandler.handle(ScopedHandler.java:144)
   [junit4]   1> 	at org.eclipse.jetty.server.handler.gzip.GzipHandler.handle(GzipHandler.java:724)
   [junit4]   1> 	at org.eclipse.jetty.server.handler.HandlerWrapper.handle(HandlerWrapper.java:132)
   [junit4]   1> 	at org.eclipse.jetty.server.Server.handle(Server.java:531)
   [junit4]   1> 	at org.eclipse.jetty.server.HttpChannel.handle(HttpChannel.java:352)
   [junit4]   1> 	at org.eclipse.jetty.server.HttpConnection.onFillable(HttpConnection.java:260)
   [junit4]   1> 	at org.eclipse.jetty.io.AbstractConnection$ReadCallback.succeeded(AbstractConnection.java:281)
   [junit4]   1> 	at org.eclipse.jetty.io.FillInterest.fillable(FillInterest.java:102)
   [junit4]   1> 	at org.eclipse.jetty.io.ssl.SslConnection.onFillable(SslConnection.java:291)
   [junit4]   1> 	at org.eclipse.jetty.io.ssl.SslConnection$3.succeeded(SslConnection.java:151)
   [junit4]   1> 	at org.eclipse.jetty.io.FillInterest.fillable(FillInterest.java:102)
   [junit4]   1> 	at org.eclipse.jetty.io.ChannelEndPoint$2.run(ChannelEndPoint.java:118)
   [junit4]   1> 	at org.eclipse.jetty.util.thread.strategy.EatWhatYouKill.runTask(EatWhatYouKill.java:333)
   [junit4]   1> 	at org.eclipse.jetty.util.thread.strategy.EatWhatYouKill.doProduce(EatWhatYouKill.java:310)
   [junit4]   1> 	at org.eclipse.jetty.util.thread.strategy.EatWhatYouKill.tryProduce(EatWhatYouKill.java:168)
   [junit4]   1> 	at org.eclipse.jetty.util.thread.strategy.EatWhatYouKill.run(EatWhatYouKill.java:126)
   [junit4]   1> 	at org.eclipse.jetty.util.thread.ReservedThreadExecutor$ReservedThread.run(ReservedThreadExecutor.java:366)
   [junit4]   1> 	at org.eclipse.jetty.util.thread.QueuedThreadPool.runJob(QueuedThreadPool.java:762)
   [junit4]   1> 	at org.eclipse.jetty.util.thread.QueuedThreadPool$2.run(QueuedThreadPool.java:680)
   [junit4]   1> 	at java.lang.Thread.run(Thread.java:748)
   [junit4]   1> 
   [junit4] OK      4.35s J0 | CloudSolrClientTest.testNonRetryableRequests
   [junit4] OK      6.20s J0 | CloudSolrClientTest.preferLocalShardsTest
   [junit4] OK      4.88s J0 | CloudS

[...truncated too long message...]

nection.onFillable(SslConnection.java:291)
   [junit4]   1> 	at org.eclipse.jetty.io.ssl.SslConnection$3.succeeded(SslConnection.java:151)
   [junit4]   1> 	at org.eclipse.jetty.io.FillInterest.fillable(FillInterest.java:102)
   [junit4]   1> 	at org.eclipse.jetty.io.ChannelEndPoint$2.run(ChannelEndPoint.java:118)
   [junit4]   1> 	at org.eclipse.jetty.util.thread.strategy.EatWhatYouKill.runTask(EatWhatYouKill.java:333)
   [junit4]   1> 	at org.eclipse.jetty.util.thread.strategy.EatWhatYouKill.doProduce(EatWhatYouKill.java:310)
   [junit4]   1> 	at org.eclipse.jetty.util.thread.strategy.EatWhatYouKill.tryProduce(EatWhatYouKill.java:168)
   [junit4]   1> 	at org.eclipse.jetty.util.thread.strategy.EatWhatYouKill.run(EatWhatYouKill.java:126)
   [junit4]   1> 	at org.eclipse.jetty.util.thread.ReservedThreadExecutor$ReservedThread.run(ReservedThreadExecutor.java:366)
   [junit4]   1> 	at org.eclipse.jetty.util.thread.QueuedThreadPool.runJob(QueuedThreadPool.java:762)
   [junit4]   1> 	at org.eclipse.jetty.util.thread.QueuedThreadPool$2.run(QueuedThreadPool.java:680)
   [junit4]   1> 	at java.lang.Thread.run(Thread.java:748)
   [junit4]   1> 
   [junit4]   1> 12:23:25.140 [qtp562606305-500] ERROR org.apache.solr.handler.RequestHandlerBase - org.apache.solr.common.SolrException: Unsupported operation: foobar
   [junit4]   1> 	at org.apache.solr.handler.admin.CoreAdminHandler.handleCustomAction(CoreAdminHandler.java:220)
   [junit4]   1> 	at org.apache.solr.handler.admin.CoreAdminHandler.handleRequestBody(CoreAdminHandler.java:169)
   [junit4]   1> 	at org.apache.solr.handler.RequestHandlerBase.handleRequest(RequestHandlerBase.java:199)
   [junit4]   1> 	at org.apache.solr.servlet.HttpSolrCall.handleAdmin(HttpSolrCall.java:734)
   [junit4]   1> 	at org.apache.solr.servlet.HttpSolrCall.handleAdminRequest(HttpSolrCall.java:715)
   [junit4]   1> 	at org.apache.solr.servlet.HttpSolrCall.call(HttpSolrCall.java:496)
   [junit4]   1> 	at org.apache.solr.servlet.SolrDispatchFilter.doFilter(SolrDispatchFilter.java:377)
   [junit4]   1> 	at org.apache.solr.servlet.SolrDispatchFilter.doFilter(SolrDispatchFilter.java:323)
   [junit4]   1> 	at org.eclipse.jetty.servlet.ServletHandler$CachedChain.doFilter(ServletHandler.java:1642)
   [junit4]   1> 	at org.apache.solr.client.solrj.embedded.JettySolrRunner$DebugFilter.doFilter(JettySolrRunner.java:139)
   [junit4]   1> 	at org.eclipse.jetty.servlet.ServletHandler$CachedChain.doFilter(ServletHandler.java:1642)
   [junit4]   1> 	at org.eclipse.jetty.servlet.ServletHandler.doHandle(ServletHandler.java:533)
   [junit4]   1> 	at org.eclipse.jetty.server.handler.ScopedHandler.nextHandle(ScopedHandler.java:255)
   [junit4]   1> 	at org.eclipse.jetty.server.session.SessionHandler.doHandle(SessionHandler.java:1595)
   [junit4]   1> 	at org.eclipse.jetty.server.handler.ScopedHandler.nextHandle(ScopedHandler.java:255)
   [junit4]   1> 	at org.eclipse.jetty.server.handler.ContextHandler.doHandle(ContextHandler.java:1317)
   [junit4]   1> 	at org.eclipse.jetty.server.handler.ScopedHandler.nextScope(ScopedHandler.java:203)
   [junit4]   1> 	at org.eclipse.jetty.servlet.ServletHandler.doScope(ServletHandler.java:473)
   [junit4]   1> 	at org.eclipse.jetty.server.session.SessionHandler.doScope(SessionHandler.java:1564)
   [junit4]   1> 	at org.eclipse.jetty.server.handler.ScopedHandler.nextScope(ScopedHandler.java:201)
   [junit4]   1> 	at org.eclipse.jetty.server.handler.ContextHandler.doScope(ContextHandler.java:1219)
   [junit4]   1> 	at org.eclipse.jetty.server.handler.ScopedHandler.handle(ScopedHandler.java:144)
   [junit4]   1> 	at org.eclipse.jetty.server.handler.gzip.GzipHandler.handle(GzipHandler.java:724)
   [junit4]   1> 	at org.eclipse.jetty.server.handler.HandlerWrapper.handle(HandlerWrapper.java:132)
   [junit4]   1> 	at org.eclipse.jetty.server.Server.handle(Server.java:531)
   [junit4]   1> 	at org.eclipse.jetty.server.HttpChannel.handle(HttpChannel.java:352)
   [junit4]   1> 	at org.eclipse.jetty.server.HttpConnection.onFillable(HttpConnection.java:260)
   [junit4]   1> 	at org.eclipse.jetty.io.AbstractConnection$ReadCallback.succeeded(AbstractConnection.java:281)
   [junit4]   1> 	at org.eclipse.jetty.io.FillInterest.fillable(FillInterest.java:102)
   [junit4]   1> 	at org.eclipse.jetty.io.ssl.SslConnection.onFillable(SslConnection.java:291)
   [junit4]   1> 	at org.eclipse.jetty.io.ssl.SslConnection$3.succeeded(SslConnection.java:151)
   [junit4]   1> 	at org.eclipse.jetty.io.FillInterest.fillable(FillInterest.java:102)
   [junit4]   1> 	at org.eclipse.jetty.io.ChannelEndPoint$2.run(ChannelEndPoint.java:118)
   [junit4]   1> 	at org.eclipse.jetty.util.thread.strategy.EatWhatYouKill.runTask(EatWhatYouKill.java:333)
   [junit4]   1> 	at org.eclipse.jetty.util.thread.strategy.EatWhatYouKill.doProduce(EatWhatYouKill.java:310)
   [junit4]   1> 	at org.eclipse.jetty.util.thread.strategy.EatWhatYouKill.tryProduce(EatWhatYouKill.java:168)
   [junit4]   1> 	at org.eclipse.jetty.util.thread.strategy.EatWhatYouKill.run(EatWhatYouKill.java:126)
   [junit4]   1> 	at org.eclipse.jetty.util.thread.ReservedThreadExecutor$ReservedThread.run(ReservedThreadExecutor.java:366)
   [junit4]   1> 	at org.eclipse.jetty.util.thread.QueuedThreadPool.runJob(QueuedThreadPool.java:762)
   [junit4]   1> 	at org.eclipse.jetty.util.thread.QueuedThreadPool$2.run(QueuedThreadPool.java:680)
   [junit4]   1> 	at java.lang.Thread.run(Thread.java:748)
   [junit4]   1> 
   [junit4] OK      4.23s J1 | CloudSolrClientTest.testNonRetryableRequests
   [junit4] OK      5.13s J1 | CloudSolrClientTest.preferLocalShardsTest
   [junit4] OK      3.89s J1 | CloudSolrClientTest.stateVersionParamTest
   [junit4]   1> 12:23:34.330 [SUITE-CloudSolrClientTest-seed#[5630E8C5E6A4B819]-worker] ERROR org.apache.zookeeper.server.ZooKeeperServer - ZKShutdownHandler is not registered, so ZooKeeper server won't take any action on ERROR or SHUTDOWN server state changes
   [junit4]   2> NOTE: leaving temporary files on disk at: /x1/jenkins/jenkins-slave/workspace/Lucene-Solr-repro/solr/build/solr-solrj/test/J1/temp/solr.client.solrj.impl.CloudSolrClientTest_5630E8C5E6A4B819-002
   [junit4]   2> Nov 05, 2018 12:23:34 PM com.carrotsearch.randomizedtesting.ThreadLeakControl checkThreadLeaks
   [junit4]   2> WARNING: Will linger awaiting termination of 1 leaked thread(s).
   [junit4]   2> NOTE: test params are: codec=CheapBastard, sim=Asserting(org.apache.lucene.search.similarities.AssertingSimilarity@bcea825), locale=es, timezone=Asia/Qyzylorda
   [junit4]   2> NOTE: Linux 4.4.0-137-generic amd64/Oracle Corporation 1.8.0_191 (64-bit)/cpus=4,threads=1,free=142361456,total=508035072
   [junit4]   2> NOTE: All tests run in this JVM: [CloudSolrClientTest, CloudSolrClientTest]
   [junit4] Completed [4/5 (3!)] on J1 in 64.77s, 16 tests, 2 errors <<< FAILURES!
   [junit4] 
   [junit4] Suite: org.apache.solr.client.solrj.impl.CloudSolrClientTest
   [junit4] OK      3.40s J0 | CloudSolrClientTest.checkCollectionParameters
   [junit4] OK      9.75s J0 | CloudSolrClientTest.testRetryUpdatesWhenClusterStateIsStale
   [junit4] OK      7.39s J0 | CloudSolrClientTest.testAliasHandling
   [junit4] OK      4.69s J0 | CloudSolrClientTest.testOverwriteOption
   [junit4] OK      3.65s J0 | CloudSolrClientTest.testParallelUpdateQTime
   [junit4] OK      0.83s J0 | CloudSolrClientTest.customHttpClientTest
   [junit4] OK      0.06s J0 | CloudSolrClientTest.testWrongZkChrootTest
   [junit4] OK      0.05s J0 | CloudSolrClientTest.testCollectionDoesntExist
   [junit4] OK      7.36s J0 | CloudSolrClientTest.preferReplicaTypesTest
   [junit4] OK      4.00s J0 | CloudSolrClientTest.testVersionsAreReturned
   [junit4] OK      5.01s J0 | CloudSolrClientTest.testRouting
   [junit4] OK      3.72s J0 | CloudSolrClientTest.testInitializationWithSolrUrls
   [junit4] OK      2.11s J0 | CloudSolrClientTest.testShutdown
   [junit4] OK      4.25s J0 | CloudSolrClientTest.testNonRetryableRequests
   [junit4] OK      5.00s J0 | CloudSolrClientTest.preferLocalShardsTest
   [junit4] OK      3.94s J0 | CloudSolrClientTest.stateVersionParamTest
   [junit4] Completed [5/5 (3!)] on J0 in 67.67s, 16 tests
   [junit4] 
   [junit4] 
   [junit4] Tests with failures [seed: 5630E8C5E6A4B819]:
   [junit4]   - org.apache.solr.client.solrj.impl.CloudSolrClientTest.testVersionsAreReturned
   [junit4]   - org.apache.solr.client.solrj.impl.CloudSolrClientTest.testRouting
   [junit4]   - org.apache.solr.client.solrj.impl.CloudSolrClientTest.testVersionsAreReturned
   [junit4]   - org.apache.solr.client.solrj.impl.CloudSolrClientTest.testRouting
   [junit4] 
   [junit4] 
   [junit4] JVM J0:     1.00 ..   164.29 =   163.29s
   [junit4] JVM J1:     0.76 ..   161.24 =   160.48s
   [junit4] JVM J2:     1.01 ..    97.52 =    96.51s
   [junit4] Execution time total: 2 minutes 44 seconds
   [junit4] Tests summary: 5 suites, 80 tests, 4 errors

BUILD FAILED
/x1/jenkins/jenkins-slave/workspace/Lucene-Solr-repro/lucene/common-build.xml:1567: The following error occurred while executing this line:
/x1/jenkins/jenkins-slave/workspace/Lucene-Solr-repro/lucene/common-build.xml:1092: There were test failures: 5 suites, 80 tests, 4 errors [seed: 5630E8C5E6A4B819]

Total time: 2 minutes 46 seconds

[repro] Setting last failure code to 256

[repro] Failures:
[repro]   2/5 failed: org.apache.solr.cloud.FullSolrCloudDistribCmdsTest
[repro]   3/5 failed: org.apache.solr.client.solrj.impl.CloudSolrClientTest
[repro] git checkout 45b772f4a995c618b48ff05c6129c5683df92f88
HEAD is now at 45b772f... SOLR-12938 - Cluster status now returns results for aliases instead of throwing an exception
[repro] Exiting with code 256
Archiving artifacts
Recording test results
Build step 'Publish JUnit test result report' changed build result to UNSTABLE
Email was triggered for: Unstable (Test Failures)
Sending email for trigger: Unstable (Test Failures)
Repro-Lucene-Solr-NightlyTests-7.x#368 is still in progress; ignoring for purposes of comparison

Mime
View raw message