lucene-dev mailing list archives

Site index · List index
Message view « Date » · « Thread »
Top « Date » · « Thread »
From Policeman Jenkins Server <jenk...@thetaphi.de>
Subject [JENKINS] Lucene-Solr-master-Windows (32bit/jdk1.8.0_172) - Build # 7548 - Unstable!
Date Wed, 03 Oct 2018 05:35:13 GMT
Build: https://jenkins.thetaphi.de/job/Lucene-Solr-master-Windows/7548/
Java: 32bit/jdk1.8.0_172 -server -XX:+UseConcMarkSweepGC

3 tests failed.
FAILED:  org.apache.solr.cloud.autoscaling.sim.TestSimGenericDistributedQueue.testDistributedQueueBlocking

Error Message:


Stack Trace:
java.util.concurrent.TimeoutException
	at __randomizedtesting.SeedInfo.seed([F7DDF47E965C56E2:B2778607D20EEA96]:0)
	at java.util.concurrent.FutureTask.get(FutureTask.java:205)
	at org.apache.solr.cloud.autoscaling.sim.TestSimDistributedQueue.testDistributedQueueBlocking(TestSimDistributedQueue.java:102)
	at sun.reflect.NativeMethodAccessorImpl.invoke0(Native Method)
	at sun.reflect.NativeMethodAccessorImpl.invoke(NativeMethodAccessorImpl.java:62)
	at sun.reflect.DelegatingMethodAccessorImpl.invoke(DelegatingMethodAccessorImpl.java:43)
	at java.lang.reflect.Method.invoke(Method.java:498)
	at com.carrotsearch.randomizedtesting.RandomizedRunner.invoke(RandomizedRunner.java:1742)
	at com.carrotsearch.randomizedtesting.RandomizedRunner$8.evaluate(RandomizedRunner.java:935)
	at com.carrotsearch.randomizedtesting.RandomizedRunner$9.evaluate(RandomizedRunner.java:971)
	at com.carrotsearch.randomizedtesting.RandomizedRunner$10.evaluate(RandomizedRunner.java:985)
	at com.carrotsearch.randomizedtesting.rules.SystemPropertiesRestoreRule$1.evaluate(SystemPropertiesRestoreRule.java:57)
	at org.apache.lucene.util.TestRuleSetupTeardownChained$1.evaluate(TestRuleSetupTeardownChained.java:49)
	at org.apache.lucene.util.AbstractBeforeAfterRule$1.evaluate(AbstractBeforeAfterRule.java:45)
	at org.apache.lucene.util.TestRuleThreadAndTestName$1.evaluate(TestRuleThreadAndTestName.java:48)
	at org.apache.lucene.util.TestRuleIgnoreAfterMaxFailures$1.evaluate(TestRuleIgnoreAfterMaxFailures.java:64)
	at org.apache.lucene.util.TestRuleMarkFailure$1.evaluate(TestRuleMarkFailure.java:47)
	at com.carrotsearch.randomizedtesting.rules.StatementAdapter.evaluate(StatementAdapter.java:36)
	at com.carrotsearch.randomizedtesting.ThreadLeakControl$StatementRunner.run(ThreadLeakControl.java:368)
	at com.carrotsearch.randomizedtesting.ThreadLeakControl.forkTimeoutingTask(ThreadLeakControl.java:817)
	at com.carrotsearch.randomizedtesting.ThreadLeakControl$3.evaluate(ThreadLeakControl.java:468)
	at com.carrotsearch.randomizedtesting.RandomizedRunner.runSingleTest(RandomizedRunner.java:944)
	at com.carrotsearch.randomizedtesting.RandomizedRunner$5.evaluate(RandomizedRunner.java:830)
	at com.carrotsearch.randomizedtesting.RandomizedRunner$6.evaluate(RandomizedRunner.java:880)
	at com.carrotsearch.randomizedtesting.RandomizedRunner$7.evaluate(RandomizedRunner.java:891)
	at com.carrotsearch.randomizedtesting.rules.StatementAdapter.evaluate(StatementAdapter.java:36)
	at com.carrotsearch.randomizedtesting.rules.SystemPropertiesRestoreRule$1.evaluate(SystemPropertiesRestoreRule.java:57)
	at org.apache.lucene.util.AbstractBeforeAfterRule$1.evaluate(AbstractBeforeAfterRule.java:45)
	at com.carrotsearch.randomizedtesting.rules.StatementAdapter.evaluate(StatementAdapter.java:36)
	at org.apache.lucene.util.TestRuleStoreClassName$1.evaluate(TestRuleStoreClassName.java:41)
	at com.carrotsearch.randomizedtesting.rules.NoShadowingOrOverridesOnMethodsRule$1.evaluate(NoShadowingOrOverridesOnMethodsRule.java:40)
	at com.carrotsearch.randomizedtesting.rules.NoShadowingOrOverridesOnMethodsRule$1.evaluate(NoShadowingOrOverridesOnMethodsRule.java:40)
	at com.carrotsearch.randomizedtesting.rules.StatementAdapter.evaluate(StatementAdapter.java:36)
	at com.carrotsearch.randomizedtesting.rules.StatementAdapter.evaluate(StatementAdapter.java:36)
	at com.carrotsearch.randomizedtesting.rules.StatementAdapter.evaluate(StatementAdapter.java:36)
	at org.apache.lucene.util.TestRuleAssertionsRequired$1.evaluate(TestRuleAssertionsRequired.java:53)
	at org.apache.lucene.util.TestRuleMarkFailure$1.evaluate(TestRuleMarkFailure.java:47)
	at org.apache.lucene.util.TestRuleIgnoreAfterMaxFailures$1.evaluate(TestRuleIgnoreAfterMaxFailures.java:64)
	at org.apache.lucene.util.TestRuleIgnoreTestSuites$1.evaluate(TestRuleIgnoreTestSuites.java:54)
	at com.carrotsearch.randomizedtesting.rules.StatementAdapter.evaluate(StatementAdapter.java:36)
	at com.carrotsearch.randomizedtesting.ThreadLeakControl$StatementRunner.run(ThreadLeakControl.java:368)
	at java.lang.Thread.run(Thread.java:748)


FAILED:  org.apache.solr.cloud.autoscaling.sim.TestSimGenericDistributedQueue.testDistributedQueue

Error Message:
Test abandoned because suite timeout was reached.

Stack Trace:
java.lang.Exception: Test abandoned because suite timeout was reached.
	at __randomizedtesting.SeedInfo.seed([F7DDF47E965C56E2]:0)


FAILED:  junit.framework.TestSuite.org.apache.solr.cloud.autoscaling.sim.TestSimGenericDistributedQueue

Error Message:
Suite timeout exceeded (>= 7200000 msec).

Stack Trace:
java.lang.Exception: Suite timeout exceeded (>= 7200000 msec).
	at __randomizedtesting.SeedInfo.seed([F7DDF47E965C56E2]:0)




Build Log:
[...truncated 15240 lines...]
   [junit4] Suite: org.apache.solr.cloud.autoscaling.sim.TestSimGenericDistributedQueue
   [junit4]   2> Creating dataDir: C:\Users\jenkins\workspace\Lucene-Solr-master-Windows\solr\build\solr-core\test\J1\temp\solr.cloud.autoscaling.sim.TestSimGenericDistributedQueue_F7DDF47E965C56E2-001\init-core-data-001
   [junit4]   2> 1437531 WARN  (SUITE-TestSimGenericDistributedQueue-seed#[F7DDF47E965C56E2]-worker)
[    ] o.a.s.SolrTestCaseJ4 startTrackingSearchers: numOpens=32 numCloses=32
   [junit4]   2> 1437531 INFO  (SUITE-TestSimGenericDistributedQueue-seed#[F7DDF47E965C56E2]-worker)
[    ] o.a.s.SolrTestCaseJ4 Using PointFields (NUMERIC_POINTS_SYSPROP=true) w/NUMERIC_DOCVALUES_SYSPROP=true
   [junit4]   2> 1437538 INFO  (SUITE-TestSimGenericDistributedQueue-seed#[F7DDF47E965C56E2]-worker)
[    ] o.a.s.SolrTestCaseJ4 Randomized ssl (false) and clientAuth (false) via: @org.apache.solr.util.RandomizeSSL(reason=,
value=NaN, ssl=NaN, clientAuth=NaN)
   [junit4]   2> 1437539 INFO  (SUITE-TestSimGenericDistributedQueue-seed#[F7DDF47E965C56E2]-worker)
[    ] o.a.s.SolrTestCaseJ4 SecureRandom sanity checks: test.solr.allowed.securerandom=null
& java.security.egd=file:/dev/./urandom
   [junit4]   2> 1437541 INFO  (TEST-TestSimGenericDistributedQueue.testLocallyOffer-seed#[F7DDF47E965C56E2])
[    ] o.a.s.SolrTestCaseJ4 ###Starting testLocallyOffer
   [junit4]   2> 1437800 INFO  (TEST-TestSimGenericDistributedQueue.testLocallyOffer-seed#[F7DDF47E965C56E2])
[    ] o.a.s.SolrTestCaseJ4 ###Ending testLocallyOffer
   [junit4]   2> 1437801 INFO  (TEST-TestSimGenericDistributedQueue.testDistributedQueueBlocking-seed#[F7DDF47E965C56E2])
[    ] o.a.s.SolrTestCaseJ4 ###Starting testDistributedQueueBlocking
   [junit4]   2> 1439804 INFO  (TEST-TestSimGenericDistributedQueue.testDistributedQueueBlocking-seed#[F7DDF47E965C56E2])
[    ] o.a.s.SolrTestCaseJ4 ###Ending testDistributedQueueBlocking
   [junit4]   2> NOTE: reproduce with: ant test  -Dtestcase=TestSimGenericDistributedQueue
-Dtests.method=testDistributedQueueBlocking -Dtests.seed=F7DDF47E965C56E2 -Dtests.slow=true
-Dtests.locale=de-CH -Dtests.timezone=Australia/North -Dtests.asserts=true -Dtests.file.encoding=US-ASCII
   [junit4] ERROR   2.00s J1 | TestSimGenericDistributedQueue.testDistributedQueueBlocking
<<<
   [junit4]    > Throwable #1: java.util.concurrent.TimeoutException
   [junit4]    > 	at __randomizedtesting.SeedInfo.seed([F7DDF47E965C56E2:B2778607D20EEA96]:0)
   [junit4]    > 	at java.util.concurrent.FutureTask.get(FutureTask.java:205)
   [junit4]    > 	at org.apache.solr.cloud.autoscaling.sim.TestSimDistributedQueue.testDistributedQueueBlocking(TestSimDistributedQueue.java:102)
   [junit4]    > 	at java.lang.Thread.run(Thread.java:748)
   [junit4]   2> 1439809 INFO  (TEST-TestSimGenericDistributedQueue.testDistributedQueue-seed#[F7DDF47E965C56E2])
[    ] o.a.s.SolrTestCaseJ4 ###Starting testDistributedQueue
   [junit4]   2> Okt 03, 2018 2:31:37 PM com.carrotsearch.randomizedtesting.ThreadLeakControl$2
evaluate
   [junit4]   2> WARNUNG: Suite execution timed out: org.apache.solr.cloud.autoscaling.sim.TestSimGenericDistributedQueue
   [junit4]   2> ==== jstack at approximately timeout time ====
   [junit4]   2> "sdqtest--3504-thread-1" ID=12227 TIMED_WAITING on java.util.concurrent.locks.AbstractQueuedSynchronizer$ConditionObject@7af55d
   [junit4]   2> 	at sun.misc.Unsafe.park(Native Method)
   [junit4]   2> 	- timed waiting on java.util.concurrent.locks.AbstractQueuedSynchronizer$ConditionObject@7af55d
   [junit4]   2> 	at java.util.concurrent.locks.LockSupport.parkNanos(LockSupport.java:215)
   [junit4]   2> 	at java.util.concurrent.locks.AbstractQueuedSynchronizer$ConditionObject.awaitNanos(AbstractQueuedSynchronizer.java:2078)
   [junit4]   2> 	at org.apache.solr.cloud.autoscaling.sim.GenericDistributedQueue.peek(GenericDistributedQueue.java:194)
   [junit4]   2> 	at org.apache.solr.cloud.autoscaling.sim.GenericDistributedQueue.peek(GenericDistributedQueue.java:167)
   [junit4]   2> 	at org.apache.solr.cloud.autoscaling.sim.TestSimDistributedQueue.lambda$testDistributedQueueBlocking$0(TestSimDistributedQueue.java:93)
   [junit4]   2> 	at org.apache.solr.cloud.autoscaling.sim.TestSimDistributedQueue$$Lambda$1115/22239300.call(Unknown
Source)
   [junit4]   2> 	at java.util.concurrent.FutureTask.run(FutureTask.java:266)
   [junit4]   2> 	at org.apache.solr.common.util.ExecutorUtil$MDCAwareThreadPoolExecutor.lambda$execute$0(ExecutorUtil.java:209)
   [junit4]   2> 	at org.apache.solr.common.util.ExecutorUtil$MDCAwareThreadPoolExecutor$$Lambda$169/14919482.run(Unknown
Source)
   [junit4]   2> 	at java.util.concurrent.ThreadPoolExecutor.runWorker(ThreadPoolExecutor.java:1149)
   [junit4]   2> 	at java.util.concurrent.ThreadPoolExecutor$Worker.run(ThreadPoolExecutor.java:624)
   [junit4]   2> 	at java.lang.Thread.run(Thread.java:748)
   [junit4]   2> 	Locked synchronizers:
   [junit4]   2> 	- java.util.concurrent.ThreadPoolExecutor$Worker@f05a1e
   [junit4]   2> 
   [junit4]   2> "TEST-TestSimGenericDistributedQueue.testDistributedQueue-seed#[F7DDF47E965C56E2]"
ID=12226 TIMED_WAITING on java.util.concurrent.locks.AbstractQueuedSynchronizer$ConditionObject@1f21a8c
   [junit4]   2> 	at sun.misc.Unsafe.park(Native Method)
   [junit4]   2> 	- timed waiting on java.util.concurrent.locks.AbstractQueuedSynchronizer$ConditionObject@1f21a8c
   [junit4]   2> 	at java.util.concurrent.locks.LockSupport.parkNanos(LockSupport.java:215)
   [junit4]   2> 	at java.util.concurrent.locks.AbstractQueuedSynchronizer$ConditionObject.awaitNanos(AbstractQueuedSynchronizer.java:2078)
   [junit4]   2> 	at org.apache.solr.cloud.autoscaling.sim.GenericDistributedQueue.peek(GenericDistributedQueue.java:194)
   [junit4]   2> 	at org.apache.solr.cloud.autoscaling.sim.GenericDistributedQueue.peek(GenericDistributedQueue.java:167)
   [junit4]   2> 	at org.apache.solr.cloud.autoscaling.sim.TestSimDistributedQueue.testDistributedQueue(TestSimDistributedQueue.java:74)
   [junit4]   2> 	at org.apache.solr.cloud.autoscaling.sim.TestSimGenericDistributedQueue.testDistributedQueue(TestSimGenericDistributedQueue.java:36)
   [junit4]   2> 	at sun.reflect.NativeMethodAccessorImpl.invoke0(Native Method)
   [junit4]   2> 	at sun.reflect.NativeMethodAccessorImpl.invoke(NativeMethodAccessorImpl.java:62)
   [junit4]   2> 	at sun.reflect.DelegatingMethodAccessorImpl.invoke(DelegatingMethodAccessorImpl.java:43)
   [junit4]   2> 	at java.lang.reflect.Method.invoke(Method.java:498)
   [junit4]   2> 	at com.carrotsearch.randomizedtesting.RandomizedRunner.invoke(RandomizedRunner.java:1742)
   [junit4]   2> 	at com.carrotsearch.randomizedtesting.RandomizedRunner$8.evaluate(RandomizedRunner.java:935)
   [junit4]   2> 	at com.carrotsearch.randomizedtesting.RandomizedRunner$9.evaluate(RandomizedRunner.java:971)
   [junit4]   2> 	at com.carrotsearch.randomizedtesting.RandomizedRunner$10.evaluate(RandomizedRunner.java:985)
   [junit4]   2> 	at com.carrotsearch.randomizedtesting.rules.SystemPropertiesRestoreRule$1.evaluate(SystemPropertiesRestoreRule.java:57)
   [junit4]   2> 	at org.apache.lucene.util.TestRuleSetupTeardownChained$1.evaluate(TestRuleSetupTeardownChained.java:49)
   [junit4]   2> 	at org.apache.lucene.util.AbstractBeforeAfterRule$1.evaluate(AbstractBeforeAfterRule.java:45)
   [junit4]   2> 	at org.apache.lucene.util.TestRuleThreadAndTestName$1.evaluate(TestRuleThreadAndTestName.java:48)
   [junit4]   2> 	at org.apache.lucene.util.TestRuleIgnoreAfterMaxFailures$1.evaluate(TestRuleIgnoreAfterMaxFailures.java:64)
   [junit4]   2> 	at org.apache.lucene.util.TestRuleMarkFailure$1.evaluate(TestRuleMarkFailure.java:47)
   [junit4]   2> 	at com.carrotsearch.randomizedtesting.rules.StatementAdapter.evaluate(StatementAdapter.java:36)
   [junit4]   2> 	at com.carrotsearch.randomizedtesting.ThreadLeakControl$StatementRunner.run(ThreadLeakControl.java:368)
   [junit4]   2> 	at com.carrotsearch.randomizedtesting.ThreadLeakControl.forkTimeoutingTask(ThreadLeakControl.java:817)
   [junit4]   2> 	at com.carrotsearch.randomizedtesting.ThreadLeakControl$3.evaluate(ThreadLeakControl.java:468)
   [junit4]   2> 	at com.carrotsearch.randomizedtesting.RandomizedRunner.runSingleTest(RandomizedRunner.java:944)
   [junit4]   2> 	at com.carrotsearch.randomizedtesting.RandomizedRunner$5.evaluate(RandomizedRunner.java:830)
   [junit4]   2> 	at com.carrotsearch.randomizedtesting.RandomizedRunner$6.evaluate(RandomizedRunner.java:880)
   [junit4]   2> 	at com.carrotsearch.randomizedtesting.RandomizedRunner$7.evaluate(RandomizedRunner.java:891)
   [junit4]   2> 	at com.carrotsearch.randomizedtesting.rules.StatementAdapter.evaluate(StatementAdapter.java:36)
   [junit4]   2> 	at com.carrotsearch.randomizedtesting.rules.SystemPropertiesRestoreRule$1.evaluate(SystemPropertiesRestoreRule.java:57)
   [junit4]   2> 	at org.apache.lucene.util.AbstractBeforeAfterRule$1.evaluate(AbstractBeforeAfterRule.java:45)
   [junit4]   2> 	at com.carrotsearch.randomizedtesting.rules.StatementAdapter.evaluate(StatementAdapter.java:36)
   [junit4]   2> 	at org.apache.lucene.util.TestRuleStoreClassName$1.evaluate(TestRuleStoreClassName.java:41)
   [junit4]   2> 	at com.carrotsearch.randomizedtesting.rules.NoShadowingOrOverridesOnMethodsRule$1.evaluate(NoShadowingOrOverridesOnMethodsRule.java:40)
   [junit4]   2> 	at com.carrotsearch.randomizedtesting.rules.NoShadowingOrOverridesOnMethodsRule$1.evaluate(NoShadowingOrOverridesOnMethodsRule.java:40)
   [junit4]   2> 	at com.carrotsearch.randomizedtesting.rules.StatementAdapter.evaluate(StatementAdapter.java:36)
   [junit4]   2> 	at com.carrotsearch.randomizedtesting.rules.StatementAdapter.evaluate(StatementAdapter.java:36)
   [junit4]   2> 	at com.carrotsearch.randomizedtesting.rules.StatementAdapter.evaluate(StatementAdapter.java:36)
   [junit4]   2> 	at org.apache.lucene.util.TestRuleAssertionsRequired$1.evaluate(TestRuleAssertionsRequired.java:53)
   [junit4]   2> 	at org.apache.lucene.util.TestRuleMarkFailure$1.evaluate(TestRuleMarkFailure.java:47)
   [junit4]   2> 	at org.apache.lucene.util.TestRuleIgnoreAfterMaxFailures$1.evaluate(TestRuleIgnoreAfterMaxFailures.java:64)
   [junit4]   2> 	at org.apache.lucene.util.TestRuleIgnoreTestSuites$1.evaluate(TestRuleIgnoreTestSuites.java:54)
   [junit4]   2> 	at com.carrotsearch.randomizedtesting.rules.StatementAdapter.evaluate(StatementAdapter.java:36)
   [junit4]   2> 	at com.carrotsearch.randomizedtesting.ThreadLeakControl$StatementRunner.run(ThreadLeakControl.java:368)
   [junit4]   2> 	at java.lang.Thread.run(Thread.java:748)
   [junit4]   2> 
   [junit4]   2> "SUITE-TestSimGenericDistributedQueue-seed#[F7DDF47E965C56E2]" ID=12225
RUNNABLE
   [junit4]   2> 	at sun.management.ThreadImpl.dumpThreads0(Native Method)
   [junit4]   2> 	at sun.management.ThreadImpl.dumpAllThreads(ThreadImpl.java:454)
   [junit4]   2> 	at com.carrotsearch.randomizedtesting.ThreadLeakControl.formatThreadStacksFull(ThreadLeakControl.java:681)
   [junit4]   2> 	at com.carrotsearch.randomizedtesting.ThreadLeakControl.access$1000(ThreadLeakControl.java:65)
   [junit4]   2> 	at com.carrotsearch.randomizedtesting.ThreadLeakControl$2.evaluate(ThreadLeakControl.java:415)
   [junit4]   2> 	- locked java.lang.Object@1b070db
   [junit4]   2> 	at com.carrotsearch.randomizedtesting.RandomizedRunner.runSuite(RandomizedRunner.java:706)
   [junit4]   2> 	at com.carrotsearch.randomizedtesting.RandomizedRunner.access$200(RandomizedRunner.java:140)
   [junit4]   2> 	at com.carrotsearch.randomizedtesting.RandomizedRunner$2.run(RandomizedRunner.java:627)
   [junit4]   2> 
   [junit4]   2> "TimeLimitedCollector timer thread" ID=1013 TIMED_WAITING
   [junit4]   2> 	at java.lang.Thread.sleep(Native Method)
   [junit4]   2> 	at org.apache.lucene.search.TimeLimitingCollector$TimerThread.run(TimeLimitingCollector.java:261)
   [junit4]   2> 
   [junit4]   2> "SeedGenerator Thread" ID=16 WAITING on sun.security.provider.SeedGenerator$ThreadedSeedGenerator@1d2c1a8
   [junit4]   2> 	at java.lang.Object.wait(Native Method)
   [junit4]   2> 	- waiting on sun.security.provider.SeedGenerator$ThreadedSeedGenerator@1d2c1a8
   [junit4]   2> 	at java.lang.Object.wait(Object.java:502)
   [junit4]   2> 	at sun.security.provider.SeedGenerator$ThreadedSeedGenerator.run(SeedGenerator.java:334)
   [junit4]   2> 	at java.lang.Thread.run(Thread.java:748)
   [junit4]   2> 
   [junit4]   2> "JUnit4-serializer-daemon" ID=10 TIMED_WAITING
   [junit4]   2> 	at java.lang.Thread.sleep(Native Method)
   [junit4]   2> 	at com.carrotsearch.ant.tasks.junit4.events.Serializer$1.run(Serializer.java:50)
   [junit4]   2> 
   [junit4]   2> "Attach Listener" ID=6 RUNNABLE
   [junit4]   2> 
   [junit4]   2> "Signal Dispatcher" ID=5 RUNNABLE
   [junit4]   2> 
   [junit4]   2> "Finalizer" ID=3 WAITING on java.lang.ref.ReferenceQueue$Lock@550a12
   [junit4]   2> 	at java.lang.Object.wait(Native Method)
   [junit4]   2> 	- waiting on java.lang.ref.ReferenceQueue$Lock@550a12
   [junit4]   2> 	at java.lang.ref.ReferenceQueue.remove(ReferenceQueue.java:144)
   [junit4]   2> 	at java.lang.ref.ReferenceQueue.remove(ReferenceQueue.java:165)
   [junit4]   2> 	at java.lang.ref.Finalizer$FinalizerThread.run(Finalizer.java:216)
   [junit4]   2> 
   [junit4]   2> "Reference Handler" ID=2 WAITING on java.lang.ref.Reference$Lock@12c5aee
   [junit4]   2> 	at java.lang.Object.wait(Native Method)
   [junit4]   2> 	- waiting on java.lang.ref.Reference$Lock@12c5aee
   [junit4]   2> 	at java.lang.Object.wait(Object.java:502)
   [junit4]   2> 	at java.lang.ref.Reference.tryHandlePending(Reference.java:191)
   [junit4]   2> 	at java.lang.ref.Reference$ReferenceHandler.run(Reference.java:153)
   [junit4]   2> 
   [junit4]   2> "main" ID=1 WAITING on com.carrotsearch.randomizedtesting.RandomizedRunner$2@147ff66
   [junit4]   2> 	at java.lang.Object.wait(Native Method)
   [junit4]   2> 	- waiting on com.carrotsearch.randomizedtesting.RandomizedRunner$2@147ff66
   [junit4]   2> 	at java.lang.Thread.join(Thread.java:1252)
   [junit4]   2> 	at java.lang.Thread.join(Thread.java:1326)
   [junit4]   2> 	at com.carrotsearch.randomizedtesting.RandomizedRunner.runSuite(RandomizedRunner.java:637)
   [junit4]   2> 	at com.carrotsearch.randomizedtesting.RandomizedRunner.run(RandomizedRunner.java:494)
   [junit4]   2> 	at com.carrotsearch.ant.tasks.junit4.slave.SlaveMain.execute(SlaveMain.java:269)
   [junit4]   2> 	at com.carrotsearch.ant.tasks.junit4.slave.SlaveMain.main(SlaveMain.java:394)
   [junit4]   2> 	at com.carrotsearch.ant.tasks.junit4.slave.SlaveMainSafe.main(SlaveMainSafe.java:13)
   [junit4]   2> 
   [junit4]   2> ^^==============================================
   [junit4]   2> 
   [junit4]   2> NOTE: reproduce with: ant test  -Dtestcase=TestSimGenericDistributedQueue
-Dtests.method=testDistributedQueue -Dtests.seed=F7DDF47E965C56E2 -Dtests.slow=true -Dtests.locale=de-CH
-Dtests.timezone=Australia/North -Dtests.asserts=true -Dtests.file.encoding=US-ASCII
   [junit4] ERROR   7198s J1 | TestSimGenericDistributedQueue.testDistributedQueue <<<
   [junit4]    > Throwable #1: java.lang.Exception: Test abandoned because suite timeout
was reached.
   [junit4]    > 	at __randomizedtesting.SeedInfo.seed([F7DDF47E965C56E2]:0)
   [junit4]   2> Okt 03, 2018 2:31:37 PM com.carrotsearch.randomizedtesting.ThreadLeakControl
checkThreadLeaks
   [junit4]   2> WARNUNG: Will linger awaiting termination of 2 leaked thread(s).
   [junit4]   2> Okt 03, 2018 2:32:57 PM com.carrotsearch.randomizedtesting.ThreadLeakControl
checkThreadLeaks
   [junit4]   2> SCHWERWIEGEND: 2 threads leaked from SUITE scope at org.apache.solr.cloud.autoscaling.sim.TestSimGenericDistributedQueue:

   [junit4]   2>    1) Thread[id=12227, name=sdqtest--3504-thread-1, state=TIMED_WAITING,
group=TGRP-TestSimGenericDistributedQueue]
   [junit4]   2>         at sun.misc.Unsafe.park(Native Method)
   [junit4]   2>         at java.util.concurrent.locks.LockSupport.parkNanos(LockSupport.java:215)
   [junit4]   2>         at java.util.concurrent.locks.AbstractQueuedSynchronizer$ConditionObject.awaitNanos(AbstractQueuedSynchronizer.java:2078)
   [junit4]   2>         at org.apache.solr.cloud.autoscaling.sim.GenericDistributedQueue.peek(GenericDistributedQueue.java:194)
   [junit4]   2>         at org.apache.solr.cloud.autoscaling.sim.GenericDistributedQueue.peek(GenericDistributedQueue.java:167)
   [junit4]   2>         at org.apache.solr.cloud.autoscaling.sim.TestSimDistributedQueue.lambda$testDistributedQueueBlocking$0(TestSimDistributedQueue.java:93)
   [junit4]   2>         at org.apache.solr.cloud.autoscaling.sim.TestSimDistributedQueue$$Lambda$1115/22239300.call(Unknown
Source)
   [junit4]   2>         at java.util.concurrent.FutureTask.run(FutureTask.java:266)
   [junit4]   2>         at org.apache.solr.common.util.ExecutorUtil$MDCAwareThreadPoolExecutor.lambda$execute$0(ExecutorUtil.java:209)
   [junit4]   2>         at org.apache.solr.common.util.ExecutorUtil$MDCAwareThreadPoolExecutor$$Lambda$169/14919482.run(Unknown
Source)
   [junit4]   2>         at java.util.concurrent.ThreadPoolExecutor.runWorker(ThreadPoolExecutor.java:1149)
   [junit4]   2>         at java.util.concurrent.ThreadPoolExecutor$Worker.run(ThreadPoolExecutor.java:624)
   [junit4]   2>         at java.lang.Thread.run(Thread.java:748)
   [junit4]   2>    2) Thread[id=12226, name=TEST-TestSimGenericDistributedQueue.testDistributedQueue-seed#[F7DDF47E965C56E2],
state=TIMED_WAITING, group=TGRP-TestSimGenericDistributedQueue]
   [junit4]   2>         at sun.misc.Unsafe.park(Native Method)
   [junit4]   2>         at java.util.concurrent.locks.LockSupport.parkNanos(LockSupport.java:215)
   [junit4]   2>         at java.util.concurrent.locks.AbstractQueuedSynchronizer$ConditionObject.awaitNanos(AbstractQueuedSynchronizer.java:2078)
   [junit4]   2>         at org.apache.solr.cloud.autoscaling.sim.GenericDistributedQueue.peek(GenericDistributedQueue.java:194)
   [junit4]   2>         at org.apache.solr.cloud.autoscaling.sim.GenericDistributedQueue.peek(GenericDistributedQueue.java:167)
   [junit4]   2>         at org.apache.solr.cloud.autoscaling.sim.TestSimDistributedQueue.testDistributedQueue(TestSimDistributedQueue.java:74)
   [junit4]   2>         at org.apache.solr.cloud.autoscaling.sim.TestSimGenericDistributedQueue.testDistributedQueue(TestSimGenericDistributedQueue.java:36)
   [junit4]   2>         at sun.reflect.NativeMethodAccessorImpl.invoke0(Native Method)
   [junit4]   2>         at sun.reflect.NativeMethodAccessorImpl.invoke(NativeMethodAccessorImpl.java:62)
   [junit4]   2>         at sun.reflect.DelegatingMethodAccessorImpl.invoke(DelegatingMethodAccessorImpl.java:43)
   [junit4]   2>         at java.lang.reflect.Method.invoke(Method.java:498)
   [junit4]   2>         at com.carrotsearch.randomizedtesting.RandomizedRunner.invoke(RandomizedRunner.java:1742)
   [junit4]   2>         at com.carrotsearch.randomizedtesting.RandomizedRunner$8.evaluate(RandomizedRunner.java:935)
   [junit4]   2>         at com.carrotsearch.randomizedtesting.RandomizedRunner$9.evaluate(RandomizedRunner.java:971)
   [junit4]   2>         at com.carrotsearch.randomizedtesting.RandomizedRunner$10.evaluate(RandomizedRunner.java:985)
   [junit4]   2>         at com.carrotsearch.randomizedtesting.rules.SystemPropertiesRestoreRule$1.evaluate(SystemPropertiesRestoreRule.java:57)
   [junit4]   2>         at org.apache.lucene.util.TestRuleSetupTeardownChained$1.evaluate(TestRuleSetupTeardownChained.java:49)
   [junit4]   2>         at org.apache.lucene.util.AbstractBeforeAfterRule$1.evaluate(AbstractBeforeAfterRule.java:45)
   [junit4]   2>         at org.apache.lucene.util.TestRuleThreadAndTestName$1.evaluate(TestRuleThreadAndTestName.java:48)
   [junit4]   2>         at org.apache.lucene.util.TestRuleIgnoreAfterMaxFailures$1.evaluate(TestRuleIgnoreAfterMaxFailures.java:64)
   [junit4]   2>         at org.apache.lucene.util.TestRuleMarkFailure$1.evaluate(TestRuleMarkFailure.java:47)
   [junit4]   2>         at com.carrotsearch.randomizedtesting.rules.StatementAdapter.evaluate(StatementAdapter.java:36)
   [junit4]   2>         at com.carrotsearch.randomizedtesting.ThreadLeakControl$StatementRunner.run(ThreadLeakControl.java:368)
   [junit4]   2>         at com.carrotsearch.randomizedtesting.ThreadLeakControl.forkTimeoutingTask(ThreadLeakControl.java:817)
   [junit4]   2>         at com.carrotsearch.randomizedtesting.ThreadLeakControl$3.evaluate(ThreadLeakControl.java:468)
   [junit4]   2>         at com.carrotsearch.randomizedtesting.RandomizedRunner.runSingleTest(RandomizedRunner.java:944)
   [junit4]   2>         at com.carrotsearch.randomizedtesting.RandomizedRunner$5.evaluate(RandomizedRunner.java:830)
   [junit4]   2>         at com.carrotsearch.randomizedtesting.RandomizedRunner$6.evaluate(RandomizedRunner.java:880)
   [junit4]   2>         at com.carrotsearch.randomizedtesting.RandomizedRunner$7.evaluate(RandomizedRunner.java:891)
   [junit4]   2>         at com.carrotsearch.randomizedtesting.rules.StatementAdapter.evaluate(StatementAdapter.java:36)
   [junit4]   2>         at com.carrotsearch.randomizedtesting.rules.SystemPropertiesRestoreRule$1.evaluate(SystemPropertiesRestoreRule.java:57)
   [junit4]   2>         at org.apache.lucene.util.AbstractBeforeAfterRule$1.evaluate(AbstractBeforeAfterRule.java:45)
   [junit4]   2>         at com.carrotsearch.randomizedtesting.rules.StatementAdapter.evaluate(StatementAdapter.java:36)
   [junit4]   2>         at org.apache.lucene.util.TestRuleStoreClassName$1.evaluate(TestRuleStoreClassName.java:41)
   [junit4]   2>         at com.carrotsearch.randomizedtesting.rules.NoShadowingOrOverridesOnMethodsRule$1.evaluate(NoShadowingOrOverridesOnMethodsRule.java:40)
   [junit4]   2>         at com.carrotsearch.randomizedtesting.rules.NoShadowingOrOverridesOnMethodsRule$1.evaluate(NoShadowingOrOverridesOnMethodsRule.java:40)
   [junit4]   2>         at com.carrotsearch.randomizedtesting.rules.StatementAdapter.evaluate(StatementAdapter.java:36)
   [junit4]   2>         at com.carrotsearch.randomizedtesting.rules.StatementAdapter.evaluate(StatementAdapter.java:36)
   [junit4]   2>         at com.carrotsearch.randomizedtesting.rules.StatementAdapter.evaluate(StatementAdapter.java:36)
   [junit4]   2>         at org.apache.lucene.util.TestRuleAssertionsRequired$1.evaluate(TestRuleAssertionsRequired.java:53)
   [junit4]   2>         at org.apache.lucene.util.TestRuleMarkFailure$1.evaluate(TestRuleMarkFailure.java:47)
   [junit4]   2>         at org.apache.lucene.util.TestRuleIgnoreAfterMaxFailures$1.evaluate(TestRuleIgnoreAfterMaxFailures.java:64)
   [junit4]   2>         at org.apache.lucene.util.TestRuleIgnoreTestSuites$1.evaluate(TestRuleIgnoreTestSuites.java:54)
   [junit4]   2>         at com.carrotsearch.randomizedtesting.rules.StatementAdapter.evaluate(StatementAdapter.java:36)
   [junit4]   2>         at com.carrotsearch.randomizedtesting.ThreadLeakControl$StatementRunner.run(ThreadLeakControl.java:368)
   [junit4]   2>         at java.lang.Thread.run(Thread.java:748)
   [junit4]   2> Okt 03, 2018 2:32:57 PM com.carrotsearch.randomizedtesting.ThreadLeakControl
tryToInterruptAll
   [junit4]   2> INFORMATION: Starting to interrupt leaked threads:
   [junit4]   2>    1) Thread[id=12227, name=sdqtest--3504-thread-1, state=TIMED_WAITING,
group=TGRP-TestSimGenericDistributedQueue]
   [junit4]   2>    2) Thread[id=12226, name=TEST-TestSimGenericDistributedQueue.testDistributedQueue-seed#[F7DDF47E965C56E2],
state=TIMED_WAITING, group=TGRP-TestSimGenericDistributedQueue]
   [junit4]   2> 8717602 INFO  (TEST-TestSimGenericDistributedQueue.testDistributedQueue-seed#[F7DDF47E965C56E2])
[    ] o.a.s.SolrTestCaseJ4 ###Ending testDistributedQueue
   [junit4]   2> NOTE: leaving temporary files on disk at: C:\Users\jenkins\workspace\Lucene-Solr-master-Windows\solr\build\solr-core\test\J1\temp\solr.cloud.autoscaling.sim.TestSimGenericDistributedQueue_F7DDF47E965C56E2-001
   [junit4]   2> Oct 03, 2018 5:02:57 AM com.carrotsearch.randomizedtesting.ThreadLeakControl
tryToInterruptAll
   [junit4]   2> INFO: All leaked threads terminated.
   [junit4]   2> NOTE: test params are: codec=Asserting(Lucene80): {}, docValues:{}, maxPointsInLeafNode=1708,
maxMBSortInHeap=6.7846508046534195, sim=Asserting(org.apache.lucene.search.similarities.AssertingSimilarity@c57cfd),
locale=de-CH, timezone=Australia/North
   [junit4]   2> NOTE: Windows 10 10.0 x86/Oracle Corporation 1.8.0_172 (32-bit)/cpus=3,threads=1,free=53184840,total=204279808
   [junit4]   2> NOTE: All tests run in this JVM: [TestSlowCompositeReaderWrapper, TestMaxTokenLenTokenizer,
TestConfigSetsAPIExclusivity, VMParamsZkACLAndCredentialsProvidersTest, ComputePlanActionTest,
TestJsonRequest, ExitableDirectoryReaderTest, CoreAdminCreateDiscoverTest, TestRequestStatusCollectionAPI,
SOLR749Test, TestSimpleTrackingShardHandler, SoftAutoCommitTest, LegacyCloudClusterPropTest,
CollectionPropsTest, TestPerFieldSimilarityWithDefaultOverride, TestFieldResource, V2ApiIntegrationTest,
TestExactStatsCache, TestManagedSynonymFilterFactory, TestDownShardTolerantSearch, HdfsDirectoryTest,
TestDFRSimilarityFactory, TestSolrCloudSnapshots, TestStressLucene, ClassificationUpdateProcessorIntegrationTest,
TestElisionMultitermQuery, TestDistribIDF, DocValuesTest, TestShardHandlerFactory, PeerSyncReplicationTest,
NumericFieldsTest, QueryResultKeyTest, TestReRankQParserPlugin, TestSimDistribStateManager,
TestInPlaceUpdatesStandalone, ZkControllerTest, ShowFileRequestHandlerTest, TestPostingsSolrHighlighter,
MaxSizeAutoCommitTest, PhrasesIdentificationComponentTest, TestCloudManagedSchema, TestPayloadScoreQParserPlugin,
DistanceUnitsTest, TestCollapseQParserPlugin, TestConfigReload, TokenizerChainTest, PathHierarchyTokenizerFactoryTest,
MoveReplicaHDFSFailoverTest, DirectSolrConnectionTest, TestJavabinTupleStreamParser, LeaderFailoverAfterPartitionTest,
MigrateRouteKeyTest, AssignBackwardCompatibilityTest, ShardRoutingTest, TestMultiWordSynonyms,
BooleanFieldTest, PreAnalyzedUpdateProcessorTest, ImplicitSnitchTest, CoreSorterTest, CachingDirectoryFactoryTest,
SliceStateTest, TestSkipOverseerOperations, DocumentAnalysisRequestHandlerTest, IndexSizeTriggerTest,
SchemaVersionSpecificBehaviorTest, DistributedFacetSimpleRefinementLongTailTest, CdcrReplicationHandlerTest,
DistributedFacetPivotSmallAdvancedTest, TestRecovery, XmlUpdateRequestHandlerTest, SuggesterTSTTest,
TriggerIntegrationTest, TestTrieFacet, TestFoldingMultitermQuery, TestEmbeddedSolrServerAdminHandler,
PingRequestHandlerTest, TestOrdValues, MBeansHandlerTest, PreAnalyzedFieldTest, TestRestoreCore,
DistanceFunctionTest, SystemLogListenerTest, IndexSchemaTest, TestStressReorder, Tagger2Test,
DirectUpdateHandlerTest, TestTolerantUpdateProcessorCloud, TestSolrCoreParser, SystemInfoHandlerTest,
MetricsHistoryHandlerTest, TestHashQParserPlugin, TestExportWriter, CleanupOldIndexTest, DeleteInactiveReplicaTest,
DeleteShardTest, TestOverriddenPrefixQueryForCustomFieldType, TestLeaderElectionZkExpiry,
CurrencyRangeFacetCloudTest, PeerSyncWithBufferUpdatesTest, TestCryptoKeys, TestLMDirichletSimilarityFactory,
TestTestInjection, MinimalSchemaTest, TestXmlQParser, UpdateRequestProcessorFactoryTest, ZkSolrClientTest,
FieldMutatingUpdateProcessorTest, DistributedUpdateProcessorTest, TestSQLHandlerNonCloud,
TestRandomFlRTGCloud, TestCustomStream, MoveReplicaTest, TestPushWriter, DeleteNodeTest, TestSearchPerf,
SyncSliceTest, LargeFieldTest, RestoreTriggerStateTest, TestDistribDocBasedVersion, LeaderTragicEventTest,
DistributedExpandComponentTest, DebugComponentTest, TestRangeQuery, TestSimGenericDistributedQueue]
   [junit4]   2> NOTE: reproduce with: ant test  -Dtestcase=TestSimGenericDistributedQueue
-Dtests.seed=F7DDF47E965C56E2 -Dtests.slow=true -Dtests.locale=de-CH -Dtests.timezone=Australia/North
-Dtests.asserts=true -Dtests.file.encoding=US-ASCII
   [junit4] ERROR   0.00s J1 | TestSimGenericDistributedQueue (suite) <<<
   [junit4]    > Throwable #1: java.lang.Exception: Suite timeout exceeded (>= 7200000
msec).
   [junit4]    > 	at __randomizedtesting.SeedInfo.seed([F7DDF47E965C56E2]:0)
   [junit4] Completed [753/835 (1!)] on J1 in 7280.10s, 3 tests, 3 errors <<< FAILURES!

[...truncated 45054 lines...]
[repro] Jenkins log URL: https://jenkins.thetaphi.de/job/Lucene-Solr-master-Windows/7548/consoleText

[repro] Revision: 2201b6526635597aba170bc8f39a4bb438d16b93

[repro] Ant options: "-Dargs=-server -XX:+UseConcMarkSweepGC"

[repro] ant clean

[...truncated 6 lines...]
[repro] Test suites by module:
[repro]    solr\core
[repro]       TestSimGenericDistributedQueue
[repro] ant compile-test

[...truncated 3446 lines...]
[repro] ant test-nocompile -Dtests.dups=5 -Dtests.maxfailures=5 -Dtests.class="*.TestSimGenericDistributedQueue"
-Dtests.showOutput=onerror "-Dargs=-server -XX:+UseConcMarkSweepGC" -Dtests.seed=F7DDF47E965C56E2
-Dtests.slow=true -Dtests.locale=de-CH -Dtests.timezone=Australia/North -Dtests.asserts=true
-Dtests.file.encoding=US-ASCII

[...truncated 89 lines...]
[repro] Failures:
[repro]   0/5 failed: org.apache.solr.cloud.autoscaling.sim.TestSimGenericDistributedQueue
[repro] Exiting with code 0

[...truncated 75 lines...]

Mime
View raw message