lucene-dev mailing list archives

Site index · List index
Message view « Date » · « Thread »
Top « Date » · « Thread »
From Policeman Jenkins Server <jenk...@thetaphi.de>
Subject [JENKINS] Lucene-Solr-7.x-Linux (64bit/jdk-9.0.4) - Build # 2909 - Unstable!
Date Sun, 14 Oct 2018 03:50:32 GMT
Build: https://jenkins.thetaphi.de/job/Lucene-Solr-7.x-Linux/2909/
Java: 64bit/jdk-9.0.4 -XX:-UseCompressedOops -XX:+UseParallelGC

4 tests failed.
FAILED:  org.apache.solr.cloud.TestTlogReplica.testRecovery

Error Message:
Can not find doc 7 in https://127.0.0.1:37953/solr

Stack Trace:
java.lang.AssertionError: Can not find doc 7 in https://127.0.0.1:37953/solr
	at __randomizedtesting.SeedInfo.seed([C2C6D1FC13CE2AC4:336A8503E9EE063]:0)
	at org.junit.Assert.fail(Assert.java:93)
	at org.junit.Assert.assertTrue(Assert.java:43)
	at org.junit.Assert.assertNotNull(Assert.java:526)
	at org.apache.solr.cloud.TestTlogReplica.checkRTG(TestTlogReplica.java:901)
	at org.apache.solr.cloud.TestTlogReplica.testRecovery(TestTlogReplica.java:566)
	at java.base/jdk.internal.reflect.NativeMethodAccessorImpl.invoke0(Native Method)
	at java.base/jdk.internal.reflect.NativeMethodAccessorImpl.invoke(NativeMethodAccessorImpl.java:62)
	at java.base/jdk.internal.reflect.DelegatingMethodAccessorImpl.invoke(DelegatingMethodAccessorImpl.java:43)
	at java.base/java.lang.reflect.Method.invoke(Method.java:564)
	at com.carrotsearch.randomizedtesting.RandomizedRunner.invoke(RandomizedRunner.java:1742)
	at com.carrotsearch.randomizedtesting.RandomizedRunner$8.evaluate(RandomizedRunner.java:935)
	at com.carrotsearch.randomizedtesting.RandomizedRunner$9.evaluate(RandomizedRunner.java:971)
	at com.carrotsearch.randomizedtesting.RandomizedRunner$10.evaluate(RandomizedRunner.java:985)
	at com.carrotsearch.randomizedtesting.rules.SystemPropertiesRestoreRule$1.evaluate(SystemPropertiesRestoreRule.java:57)
	at org.apache.lucene.util.TestRuleSetupTeardownChained$1.evaluate(TestRuleSetupTeardownChained.java:49)
	at org.apache.lucene.util.AbstractBeforeAfterRule$1.evaluate(AbstractBeforeAfterRule.java:45)
	at org.apache.lucene.util.TestRuleThreadAndTestName$1.evaluate(TestRuleThreadAndTestName.java:48)
	at org.apache.lucene.util.TestRuleIgnoreAfterMaxFailures$1.evaluate(TestRuleIgnoreAfterMaxFailures.java:64)
	at org.apache.lucene.util.TestRuleMarkFailure$1.evaluate(TestRuleMarkFailure.java:47)
	at com.carrotsearch.randomizedtesting.rules.StatementAdapter.evaluate(StatementAdapter.java:36)
	at com.carrotsearch.randomizedtesting.ThreadLeakControl$StatementRunner.run(ThreadLeakControl.java:368)
	at com.carrotsearch.randomizedtesting.ThreadLeakControl.forkTimeoutingTask(ThreadLeakControl.java:817)
	at com.carrotsearch.randomizedtesting.ThreadLeakControl$3.evaluate(ThreadLeakControl.java:468)
	at com.carrotsearch.randomizedtesting.RandomizedRunner.runSingleTest(RandomizedRunner.java:944)
	at com.carrotsearch.randomizedtesting.RandomizedRunner$5.evaluate(RandomizedRunner.java:830)
	at com.carrotsearch.randomizedtesting.RandomizedRunner$6.evaluate(RandomizedRunner.java:880)
	at com.carrotsearch.randomizedtesting.RandomizedRunner$7.evaluate(RandomizedRunner.java:891)
	at com.carrotsearch.randomizedtesting.rules.StatementAdapter.evaluate(StatementAdapter.java:36)
	at com.carrotsearch.randomizedtesting.rules.SystemPropertiesRestoreRule$1.evaluate(SystemPropertiesRestoreRule.java:57)
	at org.apache.lucene.util.AbstractBeforeAfterRule$1.evaluate(AbstractBeforeAfterRule.java:45)
	at com.carrotsearch.randomizedtesting.rules.StatementAdapter.evaluate(StatementAdapter.java:36)
	at org.apache.lucene.util.TestRuleStoreClassName$1.evaluate(TestRuleStoreClassName.java:41)
	at com.carrotsearch.randomizedtesting.rules.NoShadowingOrOverridesOnMethodsRule$1.evaluate(NoShadowingOrOverridesOnMethodsRule.java:40)
	at com.carrotsearch.randomizedtesting.rules.NoShadowingOrOverridesOnMethodsRule$1.evaluate(NoShadowingOrOverridesOnMethodsRule.java:40)
	at com.carrotsearch.randomizedtesting.rules.StatementAdapter.evaluate(StatementAdapter.java:36)
	at com.carrotsearch.randomizedtesting.rules.StatementAdapter.evaluate(StatementAdapter.java:36)
	at org.apache.lucene.util.TestRuleAssertionsRequired$1.evaluate(TestRuleAssertionsRequired.java:53)
	at org.apache.lucene.util.TestRuleMarkFailure$1.evaluate(TestRuleMarkFailure.java:47)
	at org.apache.lucene.util.TestRuleIgnoreAfterMaxFailures$1.evaluate(TestRuleIgnoreAfterMaxFailures.java:64)
	at org.apache.lucene.util.TestRuleIgnoreTestSuites$1.evaluate(TestRuleIgnoreTestSuites.java:54)
	at com.carrotsearch.randomizedtesting.rules.StatementAdapter.evaluate(StatementAdapter.java:36)
	at com.carrotsearch.randomizedtesting.ThreadLeakControl$StatementRunner.run(ThreadLeakControl.java:368)
	at java.base/java.lang.Thread.run(Thread.java:844)


FAILED:  org.apache.solr.cloud.TestTlogReplica.testRecovery

Error Message:
Can not find doc 7 in https://127.0.0.1:34441/solr

Stack Trace:
java.lang.AssertionError: Can not find doc 7 in https://127.0.0.1:34441/solr
	at __randomizedtesting.SeedInfo.seed([C2C6D1FC13CE2AC4:336A8503E9EE063]:0)
	at org.junit.Assert.fail(Assert.java:93)
	at org.junit.Assert.assertTrue(Assert.java:43)
	at org.junit.Assert.assertNotNull(Assert.java:526)
	at org.apache.solr.cloud.TestTlogReplica.checkRTG(TestTlogReplica.java:901)
	at org.apache.solr.cloud.TestTlogReplica.testRecovery(TestTlogReplica.java:566)
	at java.base/jdk.internal.reflect.NativeMethodAccessorImpl.invoke0(Native Method)
	at java.base/jdk.internal.reflect.NativeMethodAccessorImpl.invoke(NativeMethodAccessorImpl.java:62)
	at java.base/jdk.internal.reflect.DelegatingMethodAccessorImpl.invoke(DelegatingMethodAccessorImpl.java:43)
	at java.base/java.lang.reflect.Method.invoke(Method.java:564)
	at com.carrotsearch.randomizedtesting.RandomizedRunner.invoke(RandomizedRunner.java:1742)
	at com.carrotsearch.randomizedtesting.RandomizedRunner$8.evaluate(RandomizedRunner.java:935)
	at com.carrotsearch.randomizedtesting.RandomizedRunner$9.evaluate(RandomizedRunner.java:971)
	at com.carrotsearch.randomizedtesting.RandomizedRunner$10.evaluate(RandomizedRunner.java:985)
	at com.carrotsearch.randomizedtesting.rules.SystemPropertiesRestoreRule$1.evaluate(SystemPropertiesRestoreRule.java:57)
	at org.apache.lucene.util.TestRuleSetupTeardownChained$1.evaluate(TestRuleSetupTeardownChained.java:49)
	at org.apache.lucene.util.AbstractBeforeAfterRule$1.evaluate(AbstractBeforeAfterRule.java:45)
	at org.apache.lucene.util.TestRuleThreadAndTestName$1.evaluate(TestRuleThreadAndTestName.java:48)
	at org.apache.lucene.util.TestRuleIgnoreAfterMaxFailures$1.evaluate(TestRuleIgnoreAfterMaxFailures.java:64)
	at org.apache.lucene.util.TestRuleMarkFailure$1.evaluate(TestRuleMarkFailure.java:47)
	at com.carrotsearch.randomizedtesting.rules.StatementAdapter.evaluate(StatementAdapter.java:36)
	at com.carrotsearch.randomizedtesting.ThreadLeakControl$StatementRunner.run(ThreadLeakControl.java:368)
	at com.carrotsearch.randomizedtesting.ThreadLeakControl.forkTimeoutingTask(ThreadLeakControl.java:817)
	at com.carrotsearch.randomizedtesting.ThreadLeakControl$3.evaluate(ThreadLeakControl.java:468)
	at com.carrotsearch.randomizedtesting.RandomizedRunner.runSingleTest(RandomizedRunner.java:944)
	at com.carrotsearch.randomizedtesting.RandomizedRunner$5.evaluate(RandomizedRunner.java:830)
	at com.carrotsearch.randomizedtesting.RandomizedRunner$6.evaluate(RandomizedRunner.java:880)
	at com.carrotsearch.randomizedtesting.RandomizedRunner$7.evaluate(RandomizedRunner.java:891)
	at com.carrotsearch.randomizedtesting.rules.StatementAdapter.evaluate(StatementAdapter.java:36)
	at com.carrotsearch.randomizedtesting.rules.SystemPropertiesRestoreRule$1.evaluate(SystemPropertiesRestoreRule.java:57)
	at org.apache.lucene.util.AbstractBeforeAfterRule$1.evaluate(AbstractBeforeAfterRule.java:45)
	at com.carrotsearch.randomizedtesting.rules.StatementAdapter.evaluate(StatementAdapter.java:36)
	at org.apache.lucene.util.TestRuleStoreClassName$1.evaluate(TestRuleStoreClassName.java:41)
	at com.carrotsearch.randomizedtesting.rules.NoShadowingOrOverridesOnMethodsRule$1.evaluate(NoShadowingOrOverridesOnMethodsRule.java:40)
	at com.carrotsearch.randomizedtesting.rules.NoShadowingOrOverridesOnMethodsRule$1.evaluate(NoShadowingOrOverridesOnMethodsRule.java:40)
	at com.carrotsearch.randomizedtesting.rules.StatementAdapter.evaluate(StatementAdapter.java:36)
	at com.carrotsearch.randomizedtesting.rules.StatementAdapter.evaluate(StatementAdapter.java:36)
	at org.apache.lucene.util.TestRuleAssertionsRequired$1.evaluate(TestRuleAssertionsRequired.java:53)
	at org.apache.lucene.util.TestRuleMarkFailure$1.evaluate(TestRuleMarkFailure.java:47)
	at org.apache.lucene.util.TestRuleIgnoreAfterMaxFailures$1.evaluate(TestRuleIgnoreAfterMaxFailures.java:64)
	at org.apache.lucene.util.TestRuleIgnoreTestSuites$1.evaluate(TestRuleIgnoreTestSuites.java:54)
	at com.carrotsearch.randomizedtesting.rules.StatementAdapter.evaluate(StatementAdapter.java:36)
	at com.carrotsearch.randomizedtesting.ThreadLeakControl$StatementRunner.run(ThreadLeakControl.java:368)
	at java.base/java.lang.Thread.run(Thread.java:844)


FAILED:  org.apache.solr.cloud.TestTlogReplica.testRecovery

Error Message:
Can not find doc 7 in https://127.0.0.1:41791/solr

Stack Trace:
java.lang.AssertionError: Can not find doc 7 in https://127.0.0.1:41791/solr
	at __randomizedtesting.SeedInfo.seed([C2C6D1FC13CE2AC4:336A8503E9EE063]:0)
	at org.junit.Assert.fail(Assert.java:93)
	at org.junit.Assert.assertTrue(Assert.java:43)
	at org.junit.Assert.assertNotNull(Assert.java:526)
	at org.apache.solr.cloud.TestTlogReplica.checkRTG(TestTlogReplica.java:901)
	at org.apache.solr.cloud.TestTlogReplica.testRecovery(TestTlogReplica.java:566)
	at java.base/jdk.internal.reflect.NativeMethodAccessorImpl.invoke0(Native Method)
	at java.base/jdk.internal.reflect.NativeMethodAccessorImpl.invoke(NativeMethodAccessorImpl.java:62)
	at java.base/jdk.internal.reflect.DelegatingMethodAccessorImpl.invoke(DelegatingMethodAccessorImpl.java:43)
	at java.base/java.lang.reflect.Method.invoke(Method.java:564)
	at com.carrotsearch.randomizedtesting.RandomizedRunner.invoke(RandomizedRunner.java:1742)
	at com.carrotsearch.randomizedtesting.RandomizedRunner$8.evaluate(RandomizedRunner.java:935)
	at com.carrotsearch.randomizedtesting.RandomizedRunner$9.evaluate(RandomizedRunner.java:971)
	at com.carrotsearch.randomizedtesting.RandomizedRunner$10.evaluate(RandomizedRunner.java:985)
	at com.carrotsearch.randomizedtesting.rules.SystemPropertiesRestoreRule$1.evaluate(SystemPropertiesRestoreRule.java:57)
	at org.apache.lucene.util.TestRuleSetupTeardownChained$1.evaluate(TestRuleSetupTeardownChained.java:49)
	at org.apache.lucene.util.AbstractBeforeAfterRule$1.evaluate(AbstractBeforeAfterRule.java:45)
	at org.apache.lucene.util.TestRuleThreadAndTestName$1.evaluate(TestRuleThreadAndTestName.java:48)
	at org.apache.lucene.util.TestRuleIgnoreAfterMaxFailures$1.evaluate(TestRuleIgnoreAfterMaxFailures.java:64)
	at org.apache.lucene.util.TestRuleMarkFailure$1.evaluate(TestRuleMarkFailure.java:47)
	at com.carrotsearch.randomizedtesting.rules.StatementAdapter.evaluate(StatementAdapter.java:36)
	at com.carrotsearch.randomizedtesting.ThreadLeakControl$StatementRunner.run(ThreadLeakControl.java:368)
	at com.carrotsearch.randomizedtesting.ThreadLeakControl.forkTimeoutingTask(ThreadLeakControl.java:817)
	at com.carrotsearch.randomizedtesting.ThreadLeakControl$3.evaluate(ThreadLeakControl.java:468)
	at com.carrotsearch.randomizedtesting.RandomizedRunner.runSingleTest(RandomizedRunner.java:944)
	at com.carrotsearch.randomizedtesting.RandomizedRunner$5.evaluate(RandomizedRunner.java:830)
	at com.carrotsearch.randomizedtesting.RandomizedRunner$6.evaluate(RandomizedRunner.java:880)
	at com.carrotsearch.randomizedtesting.RandomizedRunner$7.evaluate(RandomizedRunner.java:891)
	at com.carrotsearch.randomizedtesting.rules.StatementAdapter.evaluate(StatementAdapter.java:36)
	at com.carrotsearch.randomizedtesting.rules.SystemPropertiesRestoreRule$1.evaluate(SystemPropertiesRestoreRule.java:57)
	at org.apache.lucene.util.AbstractBeforeAfterRule$1.evaluate(AbstractBeforeAfterRule.java:45)
	at com.carrotsearch.randomizedtesting.rules.StatementAdapter.evaluate(StatementAdapter.java:36)
	at org.apache.lucene.util.TestRuleStoreClassName$1.evaluate(TestRuleStoreClassName.java:41)
	at com.carrotsearch.randomizedtesting.rules.NoShadowingOrOverridesOnMethodsRule$1.evaluate(NoShadowingOrOverridesOnMethodsRule.java:40)
	at com.carrotsearch.randomizedtesting.rules.NoShadowingOrOverridesOnMethodsRule$1.evaluate(NoShadowingOrOverridesOnMethodsRule.java:40)
	at com.carrotsearch.randomizedtesting.rules.StatementAdapter.evaluate(StatementAdapter.java:36)
	at com.carrotsearch.randomizedtesting.rules.StatementAdapter.evaluate(StatementAdapter.java:36)
	at org.apache.lucene.util.TestRuleAssertionsRequired$1.evaluate(TestRuleAssertionsRequired.java:53)
	at org.apache.lucene.util.TestRuleMarkFailure$1.evaluate(TestRuleMarkFailure.java:47)
	at org.apache.lucene.util.TestRuleIgnoreAfterMaxFailures$1.evaluate(TestRuleIgnoreAfterMaxFailures.java:64)
	at org.apache.lucene.util.TestRuleIgnoreTestSuites$1.evaluate(TestRuleIgnoreTestSuites.java:54)
	at com.carrotsearch.randomizedtesting.rules.StatementAdapter.evaluate(StatementAdapter.java:36)
	at com.carrotsearch.randomizedtesting.ThreadLeakControl$StatementRunner.run(ThreadLeakControl.java:368)
	at java.base/java.lang.Thread.run(Thread.java:844)


FAILED:  org.apache.solr.cloud.TestTlogReplica.testRecovery

Error Message:
Can not find doc 7 in https://127.0.0.1:42807/solr

Stack Trace:
java.lang.AssertionError: Can not find doc 7 in https://127.0.0.1:42807/solr
	at __randomizedtesting.SeedInfo.seed([C2C6D1FC13CE2AC4:336A8503E9EE063]:0)
	at org.junit.Assert.fail(Assert.java:93)
	at org.junit.Assert.assertTrue(Assert.java:43)
	at org.junit.Assert.assertNotNull(Assert.java:526)
	at org.apache.solr.cloud.TestTlogReplica.checkRTG(TestTlogReplica.java:901)
	at org.apache.solr.cloud.TestTlogReplica.testRecovery(TestTlogReplica.java:566)
	at java.base/jdk.internal.reflect.NativeMethodAccessorImpl.invoke0(Native Method)
	at java.base/jdk.internal.reflect.NativeMethodAccessorImpl.invoke(NativeMethodAccessorImpl.java:62)
	at java.base/jdk.internal.reflect.DelegatingMethodAccessorImpl.invoke(DelegatingMethodAccessorImpl.java:43)
	at java.base/java.lang.reflect.Method.invoke(Method.java:564)
	at com.carrotsearch.randomizedtesting.RandomizedRunner.invoke(RandomizedRunner.java:1742)
	at com.carrotsearch.randomizedtesting.RandomizedRunner$8.evaluate(RandomizedRunner.java:935)
	at com.carrotsearch.randomizedtesting.RandomizedRunner$9.evaluate(RandomizedRunner.java:971)
	at com.carrotsearch.randomizedtesting.RandomizedRunner$10.evaluate(RandomizedRunner.java:985)
	at com.carrotsearch.randomizedtesting.rules.SystemPropertiesRestoreRule$1.evaluate(SystemPropertiesRestoreRule.java:57)
	at org.apache.lucene.util.TestRuleSetupTeardownChained$1.evaluate(TestRuleSetupTeardownChained.java:49)
	at org.apache.lucene.util.AbstractBeforeAfterRule$1.evaluate(AbstractBeforeAfterRule.java:45)
	at org.apache.lucene.util.TestRuleThreadAndTestName$1.evaluate(TestRuleThreadAndTestName.java:48)
	at org.apache.lucene.util.TestRuleIgnoreAfterMaxFailures$1.evaluate(TestRuleIgnoreAfterMaxFailures.java:64)
	at org.apache.lucene.util.TestRuleMarkFailure$1.evaluate(TestRuleMarkFailure.java:47)
	at com.carrotsearch.randomizedtesting.rules.StatementAdapter.evaluate(StatementAdapter.java:36)
	at com.carrotsearch.randomizedtesting.ThreadLeakControl$StatementRunner.run(ThreadLeakControl.java:368)
	at com.carrotsearch.randomizedtesting.ThreadLeakControl.forkTimeoutingTask(ThreadLeakControl.java:817)
	at com.carrotsearch.randomizedtesting.ThreadLeakControl$3.evaluate(ThreadLeakControl.java:468)
	at com.carrotsearch.randomizedtesting.RandomizedRunner.runSingleTest(RandomizedRunner.java:944)
	at com.carrotsearch.randomizedtesting.RandomizedRunner$5.evaluate(RandomizedRunner.java:830)
	at com.carrotsearch.randomizedtesting.RandomizedRunner$6.evaluate(RandomizedRunner.java:880)
	at com.carrotsearch.randomizedtesting.RandomizedRunner$7.evaluate(RandomizedRunner.java:891)
	at com.carrotsearch.randomizedtesting.rules.StatementAdapter.evaluate(StatementAdapter.java:36)
	at com.carrotsearch.randomizedtesting.rules.SystemPropertiesRestoreRule$1.evaluate(SystemPropertiesRestoreRule.java:57)
	at org.apache.lucene.util.AbstractBeforeAfterRule$1.evaluate(AbstractBeforeAfterRule.java:45)
	at com.carrotsearch.randomizedtesting.rules.StatementAdapter.evaluate(StatementAdapter.java:36)
	at org.apache.lucene.util.TestRuleStoreClassName$1.evaluate(TestRuleStoreClassName.java:41)
	at com.carrotsearch.randomizedtesting.rules.NoShadowingOrOverridesOnMethodsRule$1.evaluate(NoShadowingOrOverridesOnMethodsRule.java:40)
	at com.carrotsearch.randomizedtesting.rules.NoShadowingOrOverridesOnMethodsRule$1.evaluate(NoShadowingOrOverridesOnMethodsRule.java:40)
	at com.carrotsearch.randomizedtesting.rules.StatementAdapter.evaluate(StatementAdapter.java:36)
	at com.carrotsearch.randomizedtesting.rules.StatementAdapter.evaluate(StatementAdapter.java:36)
	at org.apache.lucene.util.TestRuleAssertionsRequired$1.evaluate(TestRuleAssertionsRequired.java:53)
	at org.apache.lucene.util.TestRuleMarkFailure$1.evaluate(TestRuleMarkFailure.java:47)
	at org.apache.lucene.util.TestRuleIgnoreAfterMaxFailures$1.evaluate(TestRuleIgnoreAfterMaxFailures.java:64)
	at org.apache.lucene.util.TestRuleIgnoreTestSuites$1.evaluate(TestRuleIgnoreTestSuites.java:54)
	at com.carrotsearch.randomizedtesting.rules.StatementAdapter.evaluate(StatementAdapter.java:36)
	at com.carrotsearch.randomizedtesting.ThreadLeakControl$StatementRunner.run(ThreadLeakControl.java:368)
	at java.base/java.lang.Thread.run(Thread.java:844)




Build Log:
[...truncated 13911 lines...]
   [junit4] Suite: org.apache.solr.cloud.TestTlogReplica
   [junit4]   2> 1630936 INFO  (SUITE-TestTlogReplica-seed#[C2C6D1FC13CE2AC4]-worker) [    ] o.a.s.SolrTestCaseJ4 SecureRandom sanity checks: test.solr.allowed.securerandom=null & java.security.egd=file:/dev/./urandom
   [junit4]   2> Creating dataDir: /home/jenkins/workspace/Lucene-Solr-7.x-Linux/solr/build/solr-core/test/J0/temp/solr.cloud.TestTlogReplica_C2C6D1FC13CE2AC4-001/init-core-data-001
   [junit4]   2> 1630936 INFO  (SUITE-TestTlogReplica-seed#[C2C6D1FC13CE2AC4]-worker) [    ] o.a.s.SolrTestCaseJ4 Using PointFields (NUMERIC_POINTS_SYSPROP=true) w/NUMERIC_DOCVALUES_SYSPROP=false
   [junit4]   2> 1630936 INFO  (SUITE-TestTlogReplica-seed#[C2C6D1FC13CE2AC4]-worker) [    ] o.a.s.SolrTestCaseJ4 Randomized ssl (true) and clientAuth (true) via: @org.apache.solr.util.RandomizeSSL(reason="", ssl=0.0/0.0, value=0.0/0.0, clientAuth=0.0/0.0)
   [junit4]   2> 1630937 INFO  (SUITE-TestTlogReplica-seed#[C2C6D1FC13CE2AC4]-worker) [    ] o.a.s.c.MiniSolrCloudCluster Starting cluster of 2 servers in /home/jenkins/workspace/Lucene-Solr-7.x-Linux/solr/build/solr-core/test/J0/temp/solr.cloud.TestTlogReplica_C2C6D1FC13CE2AC4-001/tempDir-001
   [junit4]   2> 1630937 INFO  (SUITE-TestTlogReplica-seed#[C2C6D1FC13CE2AC4]-worker) [    ] o.a.s.c.ZkTestServer STARTING ZK TEST SERVER
   [junit4]   2> 1630937 INFO  (Thread-4221) [    ] o.a.s.c.ZkTestServer client port:0.0.0.0/0.0.0.0:0
   [junit4]   2> 1630937 INFO  (Thread-4221) [    ] o.a.s.c.ZkTestServer Starting server
   [junit4]   2> 1630939 ERROR (Thread-4221) [    ] o.a.z.s.ZooKeeperServer ZKShutdownHandler is not registered, so ZooKeeper server won't take any action on ERROR or SHUTDOWN server state changes
   [junit4]   2> 1631037 INFO  (SUITE-TestTlogReplica-seed#[C2C6D1FC13CE2AC4]-worker) [    ] o.a.s.c.ZkTestServer start zk server on port:46097
   [junit4]   2> 1631039 INFO  (zkConnectionManagerCallback-9794-thread-1) [    ] o.a.s.c.c.ConnectionManager zkClient has connected
   [junit4]   2> 1631041 INFO  (jetty-launcher-9791-thread-2) [    ] o.e.j.s.Server jetty-9.4.11.v20180605; built: 2018-06-05T18:24:03.829Z; git: d5fc0523cfa96bfebfbda19606cad384d772f04c; jvm 9.0.4+11
   [junit4]   2> 1631041 INFO  (jetty-launcher-9791-thread-1) [    ] o.e.j.s.Server jetty-9.4.11.v20180605; built: 2018-06-05T18:24:03.829Z; git: d5fc0523cfa96bfebfbda19606cad384d772f04c; jvm 9.0.4+11
   [junit4]   2> 1631041 INFO  (jetty-launcher-9791-thread-2) [    ] o.e.j.s.session DefaultSessionIdManager workerName=node0
   [junit4]   2> 1631042 INFO  (jetty-launcher-9791-thread-1) [    ] o.e.j.s.session DefaultSessionIdManager workerName=node0
   [junit4]   2> 1631042 INFO  (jetty-launcher-9791-thread-2) [    ] o.e.j.s.session No SessionScavenger set, using defaults
   [junit4]   2> 1631042 INFO  (jetty-launcher-9791-thread-1) [    ] o.e.j.s.session No SessionScavenger set, using defaults
   [junit4]   2> 1631042 INFO  (jetty-launcher-9791-thread-1) [    ] o.e.j.s.session node0 Scavenging every 660000ms
   [junit4]   2> 1631042 INFO  (jetty-launcher-9791-thread-2) [    ] o.e.j.s.session node0 Scavenging every 660000ms
   [junit4]   2> 1631042 INFO  (jetty-launcher-9791-thread-2) [    ] o.e.j.s.h.ContextHandler Started o.e.j.s.ServletContextHandler@18330ddc{/solr,null,AVAILABLE}
   [junit4]   2> 1631042 INFO  (jetty-launcher-9791-thread-1) [    ] o.e.j.s.h.ContextHandler Started o.e.j.s.ServletContextHandler@2d8b7a73{/solr,null,AVAILABLE}
   [junit4]   2> 1631043 INFO  (jetty-launcher-9791-thread-1) [    ] o.e.j.s.AbstractConnector Started ServerConnector@7818a395{SSL,[ssl, http/1.1]}{127.0.0.1:42807}
   [junit4]   2> 1631043 INFO  (jetty-launcher-9791-thread-1) [    ] o.e.j.s.Server Started @1631098ms
   [junit4]   2> 1631043 INFO  (jetty-launcher-9791-thread-1) [    ] o.a.s.c.s.e.JettySolrRunner Jetty properties: {hostContext=/solr, hostPort=42807}
   [junit4]   2> 1631043 ERROR (jetty-launcher-9791-thread-1) [    ] o.a.s.u.StartupLoggingUtils Missing Java Option solr.log.dir. Logging may be missing or incomplete.
   [junit4]   2> 1631043 INFO  (jetty-launcher-9791-thread-1) [    ] o.a.s.s.SolrDispatchFilter Using logger factory org.apache.logging.slf4j.Log4jLoggerFactory
   [junit4]   2> 1631043 INFO  (jetty-launcher-9791-thread-1) [    ] o.a.s.s.SolrDispatchFilter  ___      _       Welcome to Apache Solr? version 7.6.0
   [junit4]   2> 1631043 INFO  (jetty-launcher-9791-thread-1) [    ] o.a.s.s.SolrDispatchFilter / __| ___| |_ _   Starting in cloud mode on port null
   [junit4]   2> 1631043 INFO  (jetty-launcher-9791-thread-1) [    ] o.a.s.s.SolrDispatchFilter \__ \/ _ \ | '_|  Install dir: null
   [junit4]   2> 1631043 INFO  (jetty-launcher-9791-thread-1) [    ] o.a.s.s.SolrDispatchFilter |___/\___/_|_|    Start time: 2018-10-14T02:57:54.109815Z
   [junit4]   2> 1631044 INFO  (jetty-launcher-9791-thread-2) [    ] o.e.j.s.AbstractConnector Started ServerConnector@da60da0{SSL,[ssl, http/1.1]}{127.0.0.1:35805}
   [junit4]   2> 1631044 INFO  (jetty-launcher-9791-thread-2) [    ] o.e.j.s.Server Started @1631099ms
   [junit4]   2> 1631044 INFO  (jetty-launcher-9791-thread-2) [    ] o.a.s.c.s.e.JettySolrRunner Jetty properties: {hostContext=/solr, hostPort=35805}
   [junit4]   2> 1631044 ERROR (jetty-launcher-9791-thread-2) [    ] o.a.s.u.StartupLoggingUtils Missing Java Option solr.log.dir. Logging may be missing or incomplete.
   [junit4]   2> 1631044 INFO  (jetty-launcher-9791-thread-2) [    ] o.a.s.s.SolrDispatchFilter Using logger factory org.apache.logging.slf4j.Log4jLoggerFactory
   [junit4]   2> 1631044 INFO  (jetty-launcher-9791-thread-2) [    ] o.a.s.s.SolrDispatchFilter  ___      _       Welcome to Apache Solr? version 7.6.0
   [junit4]   2> 1631044 INFO  (jetty-launcher-9791-thread-2) [    ] o.a.s.s.SolrDispatchFilter / __| ___| |_ _   Starting in cloud mode on port null
   [junit4]   2> 1631044 INFO  (jetty-launcher-9791-thread-2) [    ] o.a.s.s.SolrDispatchFilter \__ \/ _ \ | '_|  Install dir: null
   [junit4]   2> 1631044 INFO  (jetty-launcher-9791-thread-2) [    ] o.a.s.s.SolrDispatchFilter |___/\___/_|_|    Start time: 2018-10-14T02:57:54.110760Z
   [junit4]   2> 1631044 INFO  (zkConnectionManagerCallback-9796-thread-1) [    ] o.a.s.c.c.ConnectionManager zkClient has connected
   [junit4]   2> 1631045 INFO  (jetty-launcher-9791-thread-1) [    ] o.a.s.s.SolrDispatchFilter solr.xml found in ZooKeeper. Loading...
   [junit4]   2> 1631050 INFO  (zkConnectionManagerCallback-9798-thread-1) [    ] o.a.s.c.c.ConnectionManager zkClient has connected
   [junit4]   2> 1631051 INFO  (jetty-launcher-9791-thread-2) [    ] o.a.s.s.SolrDispatchFilter solr.xml found in ZooKeeper. Loading...
   [junit4]   2> 1631090 INFO  (jetty-launcher-9791-thread-1) [    ] o.a.s.c.ZkContainer Zookeeper client=127.0.0.1:46097/solr
   [junit4]   2> 1631091 INFO  (zkConnectionManagerCallback-9802-thread-1) [    ] o.a.s.c.c.ConnectionManager zkClient has connected
   [junit4]   2> 1631092 INFO  (zkConnectionManagerCallback-9804-thread-1) [    ] o.a.s.c.c.ConnectionManager zkClient has connected
   [junit4]   2> 1631123 INFO  (jetty-launcher-9791-thread-1) [n:127.0.0.1:42807_solr    ] o.a.s.c.OverseerElectionContext I am going to be the leader 127.0.0.1:42807_solr
   [junit4]   2> 1631123 INFO  (jetty-launcher-9791-thread-1) [n:127.0.0.1:42807_solr    ] o.a.s.c.Overseer Overseer (id=72092421922947076-127.0.0.1:42807_solr-n_0000000000) starting
   [junit4]   2> 1631125 INFO  (zkConnectionManagerCallback-9811-thread-1) [    ] o.a.s.c.c.ConnectionManager zkClient has connected
   [junit4]   2> 1631126 INFO  (jetty-launcher-9791-thread-1) [n:127.0.0.1:42807_solr    ] o.a.s.c.s.i.ZkClientClusterStateProvider Cluster at 127.0.0.1:46097/solr ready
   [junit4]   2> 1631126 INFO  (OverseerStateUpdate-72092421922947076-127.0.0.1:42807_solr-n_0000000000) [n:127.0.0.1:42807_solr    ] o.a.s.c.Overseer Starting to work on the main queue : 127.0.0.1:42807_solr
   [junit4]   2> 1631126 INFO  (jetty-launcher-9791-thread-1) [n:127.0.0.1:42807_solr    ] o.a.s.c.ZkController Register node as live in ZooKeeper:/live_nodes/127.0.0.1:42807_solr
   [junit4]   2> 1631127 INFO  (zkCallback-9803-thread-1) [    ] o.a.s.c.c.ZkStateReader Updated live nodes from ZooKeeper... (0) -> (1)
   [junit4]   2> 1631140 INFO  (zkCallback-9810-thread-1) [    ] o.a.s.c.c.ZkStateReader Updated live nodes from ZooKeeper... (0) -> (1)
   [junit4]   2> 1631144 INFO  (jetty-launcher-9791-thread-1) [n:127.0.0.1:42807_solr    ] o.a.s.h.a.MetricsHistoryHandler No .system collection, keeping metrics history in memory.
   [junit4]   2> 1631153 INFO  (jetty-launcher-9791-thread-1) [n:127.0.0.1:42807_solr    ] o.a.s.m.r.SolrJmxReporter JMX monitoring for 'solr_42807.solr.node' (registry 'solr.node') enabled at server: com.sun.jmx.mbeanserver.JmxMBeanServer@4f9a2c08
   [junit4]   2> 1631158 INFO  (jetty-launcher-9791-thread-1) [n:127.0.0.1:42807_solr    ] o.a.s.m.r.SolrJmxReporter JMX monitoring for 'solr_42807.solr.jvm' (registry 'solr.jvm') enabled at server: com.sun.jmx.mbeanserver.JmxMBeanServer@4f9a2c08
   [junit4]   2> 1631158 INFO  (jetty-launcher-9791-thread-1) [n:127.0.0.1:42807_solr    ] o.a.s.m.r.SolrJmxReporter JMX monitoring for 'solr_42807.solr.jetty' (registry 'solr.jetty') enabled at server: com.sun.jmx.mbeanserver.JmxMBeanServer@4f9a2c08
   [junit4]   2> 1631158 INFO  (jetty-launcher-9791-thread-1) [n:127.0.0.1:42807_solr    ] o.a.s.c.CorePropertiesLocator Found 0 core definitions underneath /home/jenkins/workspace/Lucene-Solr-7.x-Linux/solr/build/solr-core/test/J0/temp/solr.cloud.TestTlogReplica_C2C6D1FC13CE2AC4-001/tempDir-001/node1/.
   [junit4]   2> 1631187 INFO  (jetty-launcher-9791-thread-2) [    ] o.a.s.c.ZkContainer Zookeeper client=127.0.0.1:46097/solr
   [junit4]   2> 1631188 INFO  (zkConnectionManagerCallback-9816-thread-1) [    ] o.a.s.c.c.ConnectionManager zkClient has connected
   [junit4]   2> 1631189 INFO  (zkConnectionManagerCallback-9818-thread-1) [    ] o.a.s.c.c.ConnectionManager zkClient has connected
   [junit4]   2> 1631192 INFO  (jetty-launcher-9791-thread-2) [n:127.0.0.1:35805_solr    ] o.a.s.c.c.ZkStateReader Updated live nodes from ZooKeeper... (0) -> (1)
   [junit4]   2> 1631193 INFO  (jetty-launcher-9791-thread-2) [n:127.0.0.1:35805_solr    ] o.a.s.c.TransientSolrCoreCacheDefault Allocating transient cache for 2147483647 transient cores
   [junit4]   2> 1631193 INFO  (jetty-launcher-9791-thread-2) [n:127.0.0.1:35805_solr    ] o.a.s.c.ZkController Register node as live in ZooKeeper:/live_nodes/127.0.0.1:35805_solr
   [junit4]   2> 1631193 DEBUG (OverseerStateUpdate-72092421922947076-127.0.0.1:42807_solr-n_0000000000) [n:127.0.0.1:42807_solr    ] o.a.s.c.Overseer processMessage: queueSize: 1, message = {
   [junit4]   2>   "operation":"downnode",
   [junit4]   2>   "node_name":"127.0.0.1:35805_solr"} current state version: 0
   [junit4]   2> 1631193 INFO  (zkCallback-9803-thread-1) [    ] o.a.s.c.c.ZkStateReader Updated live nodes from ZooKeeper... (1) -> (2)
   [junit4]   2> 1631193 INFO  (zkCallback-9817-thread-1) [    ] o.a.s.c.c.ZkStateReader Updated live nodes from ZooKeeper... (1) -> (2)
   [junit4]   2> 1631193 INFO  (zkCallback-9810-thread-1) [    ] o.a.s.c.c.ZkStateReader Updated live nodes from ZooKeeper... (1) -> (2)
   [junit4]   2> 1631201 INFO  (zkConnectionManagerCallback-9825-thread-1) [    ] o.a.s.c.c.ConnectionManager zkClient has connected
   [junit4]   2> 1631202 INFO  (jetty-launcher-9791-thread-2) [n:127.0.0.1:35805_solr    ] o.a.s.c.c.ZkStateReader Updated live nodes from ZooKeeper... (0) -> (2)
   [junit4]   2> 1631202 INFO  (jetty-launcher-9791-thread-2) [n:127.0.0.1:35805_solr    ] o.a.s.c.s.i.ZkClientClusterStateProvider Cluster at 127.0.0.1:46097/solr ready
   [junit4]   2> 1631203 INFO  (jetty-launcher-9791-thread-2) [n:127.0.0.1:35805_solr    ] o.a.s.h.a.MetricsHistoryHandler No .system collection, keeping metrics history in memory.
   [junit4]   2> 1631211 INFO  (jetty-launcher-9791-thread-2) [n:127.0.0.1:35805_solr    ] o.a.s.m.r.SolrJmxReporter JMX monitoring for 'solr_35805.solr.node' (registry 'solr.node') enabled at server: com.sun.jmx.mbeanserver.JmxMBeanServer@4f9a2c08
   [junit4]   2> 1631216 INFO  (jetty-launcher-9791-thread-2) [n:127.0.0.1:35805_solr    ] o.a.s.m.r.SolrJmxReporter JMX monitoring for 'solr_35805.solr.jvm' (registry 'solr.jvm') enabled at server: com.sun.jmx.mbeanserver.JmxMBeanServer@4f9a2c08
   [junit4]   2> 1631216 INFO  (jetty-launcher-9791-thread-2) [n:127.0.0.1:35805_solr    ] o.a.s.m.r.SolrJmxReporter JMX monitoring for 'solr_35805.solr.jetty' (registry 'solr.jetty') enabled at server: com.sun.jmx.mbeanserver.JmxMBeanServer@4f9a2c08
   [junit4]   2> 1631217 INFO  (jetty-launcher-9791-thread-2) [n:127.0.0.1:35805_solr    ] o.a.s.c.CorePropertiesLocator Found 0 core definitions underneath /home/jenkins/workspace/Lucene-Solr-7.x-Linux/solr/build/solr-core/test/J0/temp/solr.cloud.TestTlogReplica_C2C6D1FC13CE2AC4-001/tempDir-001/node2/.
   [junit4]   2> 1631229 INFO  (zkConnectionManagerCallback-9828-thread-1) [    ] o.a.s.c.c.ConnectionManager zkClient has connected
   [junit4]   2> 1631231 INFO  (zkConnectionManagerCallback-9833-thread-1) [    ] o.a.s.c.c.ConnectionManager zkClient has connected
   [junit4]   2> 1631231 INFO  (SUITE-TestTlogReplica-seed#[C2C6D1FC13CE2AC4]-worker) [    ] o.a.s.c.c.ZkStateReader Updated live nodes from ZooKeeper... (0) -> (2)
   [junit4]   2> 1631232 INFO  (SUITE-TestTlogReplica-seed#[C2C6D1FC13CE2AC4]-worker) [    ] o.a.s.c.s.i.ZkClientClusterStateProvider Cluster at 127.0.0.1:46097/solr ready
   [junit4]   2> 1631233 INFO  (SUITE-TestTlogReplica-seed#[C2C6D1FC13CE2AC4]-worker) [    ] o.a.s.c.TestTlogReplica Using legacyCloud?: false
   [junit4]   2> 1631242 INFO  (qtp1661411584-27305) [n:127.0.0.1:35805_solr    ] o.a.s.h.a.CollectionsHandler Invoked Collection Action :clusterprop with params val=false&name=legacyCloud&action=CLUSTERPROP&wt=javabin&version=2 and sendToOCPQueue=true
   [junit4]   2> 1631243 INFO  (qtp1661411584-27305) [n:127.0.0.1:35805_solr    ] o.a.s.s.HttpSolrCall [admin] webapp=null path=/admin/collections params={val=false&name=legacyCloud&action=CLUSTERPROP&wt=javabin&version=2} status=0 QTime=0
   [junit4]   2> 1631249 INFO  (TEST-TestTlogReplica.testBasicLeaderElection-seed#[C2C6D1FC13CE2AC4]) [    ] o.a.s.SolrTestCaseJ4 ###Starting testBasicLeaderElection
   [junit4]   2> 1631250 INFO  (qtp1661411584-27307) [n:127.0.0.1:35805_solr    ] o.a.s.h.a.CollectionsHandler Invoked Collection Action :create with params pullReplicas=0&collection.configName=conf&maxShardsPerNode=100&name=tlog_replica_test_basic_leader_election&nrtReplicas=0&action=CREATE&numShards=1&tlogReplicas=2&wt=javabin&version=2 and sendToOCPQueue=true
   [junit4]   2> 1631251 INFO  (OverseerThreadFactory-8038-thread-1-processing-n:127.0.0.1:42807_solr) [n:127.0.0.1:42807_solr    ] o.a.s.c.a.c.CreateCollectionCmd Create collection tlog_replica_test_basic_leader_election
   [junit4]   2> 1631252 DEBUG (OverseerStateUpdate-72092421922947076-127.0.0.1:42807_solr-n_0000000000) [n:127.0.0.1:42807_solr    ] o.a.s.c.Overseer processMessage: queueSize: 2, message = {
   [junit4]   2>   "name":"tlog_replica_test_basic_leader_election",
   [junit4]   2>   "fromApi":"true",
   [junit4]   2>   "collection.configName":"conf",
   [junit4]   2>   "numShards":"1",
   [junit4]   2>   "maxShardsPerNode":"100",
   [junit4]   2>   "pullReplicas":"0",
   [junit4]   2>   "tlogReplicas":"2",
   [junit4]   2>   "nrtReplicas":"0",
   [junit4]   2>   "stateFormat":"2",
   [junit4]   2>   "replicationFactor":"0",
   [junit4]   2>   "operation":"create"} current state version: 0
   [junit4]   2> 1631355 INFO  (qtp1661411584-27309) [n:127.0.0.1:35805_solr    ] o.a.s.s.HttpSolrCall [admin] webapp=null path=/admin/metrics params={prefix=CONTAINER.fs.usableSpace,CONTAINER.fs.totalSpace,CORE.coreName&wt=javabin&version=2&group=solr.node,solr.core} status=0 QTime=0
   [junit4]   2> 1631367 INFO  (qtp1619837511-27306) [n:127.0.0.1:42807_solr    ] o.a.s.s.HttpSolrCall [admin] webapp=null path=/admin/metrics params={prefix=CONTAINER.fs.usableSpace,CONTAINER.fs.totalSpace,CORE.coreName&wt=javabin&version=2&group=solr.node,solr.core} status=0 QTime=0
   [junit4]   2> 1631369 DEBUG (OverseerStateUpdate-72092421922947076-127.0.0.1:42807_solr-n_0000000000) [n:127.0.0.1:42807_solr    ] o.a.s.c.Overseer processMessage: queueSize: 1, message = {
   [junit4]   2>   "operation":"ADDREPLICA",
   [junit4]   2>   "collection":"tlog_replica_test_basic_leader_election",
   [junit4]   2>   "shard":"shard1",
   [junit4]   2>   "core":"tlog_replica_test_basic_leader_election_shard1_replica_t1",
   [junit4]   2>   "state":"down",
   [junit4]   2>   "base_url":"https://127.0.0.1:42807/solr",
   [junit4]   2>   "type":"TLOG",
   [junit4]   2>   "waitForFinalState":"false"} current state version: 0
   [junit4]   2> 1631369 INFO  (OverseerStateUpdate-72092421922947076-127.0.0.1:42807_solr-n_0000000000) [n:127.0.0.1:42807_solr    ] o.a.s.c.o.SliceMutator createReplica() {
   [junit4]   2>   "operation":"ADDREPLICA",
   [junit4]   2>   "collection":"tlog_replica_test_basic_leader_election",
   [junit4]   2>   "shard":"shard1",
   [junit4]   2>   "core":"tlog_replica_test_basic_leader_election_shard1_replica_t1",
   [junit4]   2>   "state":"down",
   [junit4]   2>   "base_url":"https://127.0.0.1:42807/solr",
   [junit4]   2>   "type":"TLOG",
   [junit4]   2>   "waitForFinalState":"false"} 
   [junit4]   2> 1631370 DEBUG (OverseerStateUpdate-72092421922947076-127.0.0.1:42807_solr-n_0000000000) [n:127.0.0.1:42807_solr    ] o.a.s.c.Overseer processMessage: queueSize: 2, message = {
   [junit4]   2>   "operation":"ADDREPLICA",
   [junit4]   2>   "collection":"tlog_replica_test_basic_leader_election",
   [junit4]   2>   "shard":"shard1",
   [junit4]   2>   "core":"tlog_replica_test_basic_leader_election_shard1_replica_t2",
   [junit4]   2>   "state":"down",
   [junit4]   2>   "base_url":"https://127.0.0.1:35805/solr",
   [junit4]   2>   "type":"TLOG",
   [junit4]   2>   "waitForFinalState":"false"} current state version: 0
   [junit4]   2> 1631370 INFO  (OverseerStateUpdate-72092421922947076-127.0.0.1:42807_solr-n_0000000000) [n:127.0.0.1:42807_solr    ] o.a.s.c.o.SliceMutator createReplica() {
   [junit4]   2>   "operation":"ADDREPLICA",
   [junit4]   2>   "collection":"tlog_replica_test_basic_leader_election",
   [junit4]   2>   "shard":"shard1",
   [junit4]   2>   "core":"tlog_replica_test_basic_leader_election_shard1_replica_t2",
   [junit4]   2>   "state":"down",
   [junit4]   2>   "base_url":"https://127.0.0.1:35805/solr",
   [junit4]   2>   "type":"TLOG",
   [junit4]   2>   "waitForFinalState":"false"} 
   [junit4]   2> 1631573 INFO  (qtp1661411584-27297) [n:127.0.0.1:35805_solr    x:tlog_replica_test_basic_leader_election_shard1_replica_t2] o.a.s.h.a.CoreAdminOperation core create command qt=/admin/cores&coreNodeName=core_node4&collection.configName=conf&newCollection=true&name=tlog_replica_test_basic_leader_election_shard1_replica_t2&action=CREATE&numShards=1&collection=tlog_replica_test_basic_leader_election&shard=shard1&wt=javabin&version=2&replicaType=TLOG
   [junit4]   2> 1631573 INFO  (qtp1619837511-27310) [n:127.0.0.1:42807_solr    x:tlog_replica_test_basic_leader_election_shard1_replica_t1] o.a.s.h.a.CoreAdminOperation core create command qt=/admin/cores&coreNodeName=core_node3&collection.configName=conf&newCollection=true&name=tlog_replica_test_basic_leader_election_shard1_replica_t1&action=CREATE&numShards=1&collection=tlog_replica_test_basic_leader_election&shard=shard1&wt=javabin&version=2&replicaType=TLOG
   [junit4]   2> 1631573 INFO  (qtp1619837511-27310) [n:127.0.0.1:42807_solr    x:tlog_replica_test_basic_leader_election_shard1_replica_t1] o.a.s.c.TransientSolrCoreCacheDefault Allocating transient cache for 2147483647 transient cores
   [junit4]   2> 1631575 DEBUG (OverseerStateUpdate-72092421922947076-127.0.0.1:42807_solr-n_0000000000) [n:127.0.0.1:42807_solr    ] o.a.s.c.Overseer processMessage: queueSize: 2, message = {
   [junit4]   2>   "core":"tlog_replica_test_basic_leader_election_shard1_replica_t1",
   [junit4]   2>   "core_node_name":"core_node3",
   [junit4]   2>   "roles":null,
   [junit4]   2>   "base_url":"https://127.0.0.1:42807/solr",
   [junit4]   2>   "node_name":"127.0.0.1:42807_solr",
   [junit4]   2>   "numShards":"1",
   [junit4]   2>   "state":"down",
   [junit4]   2>   "shard":"shard1",
   [junit4]   2>   "collection":"tlog_replica_test_basic_leader_election",
   [junit4]   2>   "type":"TLOG",
   [junit4]   2>   "force_set_state":"false",
   [junit4]   2>   "operation":"state"} current state version: 0
   [junit4]   2> 1631575 DEBUG (OverseerStateUpdate-72092421922947076-127.0.0.1:42807_solr-n_0000000000) [n:127.0.0.1:42807_solr    ] o.a.s.c.Overseer processMessage: queueSize: 2, message = {
   [junit4]   2>   "core":"tlog_replica_test_basic_leader_election_shard1_replica_t2",
   [junit4]   2>   "core_node_name":"core_node4",
   [junit4]   2>   "roles":null,
   [junit4]   2>   "base_url":"https://127.0.0.1:35805/solr",
   [junit4]   2>   "node_name":"127.0.0.1:35805_solr",
   [junit4]   2>   "numShards":"1",
   [junit4]   2>   "state":"down",
   [junit4]   2>   "shard":"shard1",
   [junit4]   2>   "collection":"tlog_replica_test_basic_leader_election",
   [junit4]   2>   "type":"TLOG",
   [junit4]   2>   "force_set_state":"false",
   [junit4]   2>   "operation":"state"} current state version: 0
   [junit4]   2> 1632578 INFO  (qtp1661411584-27297) [n:127.0.0.1:35805_solr c:tlog_replica_test_basic_leader_election s:shard1 r:core_node4 x:tlog_replica_test_basic_leader_election_shard1_replica_t2] o.a.s.c.SolrConfig Using Lucene MatchVersion: 7.6.0
   [junit4]   2> 1632579 INFO  (qtp1619837511-27310) [n:127.0.0.1:42807_solr c:tlog_replica_test_basic_leader_election s:shard1 r:core_node3 x:tlog_replica_test_basic_leader_election_shard1_replica_t1] o.a.s.c.SolrConfig Using Lucene MatchVersion: 7.6.0
   [junit4]   2> 1632590 INFO  (qtp1661411584-27297) [n:127.0.0.1:35805_solr c:tlog_replica_test_basic_leader_election s:shard1 r:core_node4 x:tlog_replica_test_basic_leader_election_shard1_replica_t2] o.a.s.s.IndexSchema [tlog_replica_test_basic_leader_election_shard1_replica_t2] Schema name=minimal
   [junit4]   2> 1632590 INFO  (qtp1619837511-27310) [n:127.0.0.1:42807_solr c:tlog_replica_test_basic_leader_election s:shard1 r:core_node3 x:tlog_replica_test_basic_leader_election_shard1_replica_t1] o.a.s.s.IndexSchema [tlog_replica_test_basic_leader_election_shard1_replica_t1] Schema name=minimal
   [junit4]   2> 1632591 INFO  (qtp1661411584-27297) [n:127.0.0.1:35805_solr c:tlog_replica_test_basic_leader_election s:shard1 r:core_node4 x:tlog_replica_test_basic_leader_election_shard1_replica_t2] o.a.s.s.IndexSchema Loaded schema minimal/1.1 with uniqueid field id
   [junit4]   2> 1632591 INFO  (qtp1661411584-27297) [n:127.0.0.1:35805_solr c:tlog_replica_test_basic_leader_election s:shard1 r:core_node4 x:tlog_replica_test_basic_leader_election_shard1_replica_t2] o.a.s.c.CoreContainer Creating SolrCore 'tlog_replica_test_basic_leader_election_shard1_replica_t2' using configuration from collection tlog_replica_test_basic_leader_election, trusted=true
   [junit4]   2> 1632591 INFO  (qtp1661411584-27297) [n:127.0.0.1:35805_solr c:tlog_replica_test_basic_leader_election s:shard1 r:core_node4 x:tlog_replica_test_basic_leader_election_shard1_replica_t2] o.a.s.m.r.SolrJmxReporter JMX monitoring for 'solr_35805.solr.core.tlog_replica_test_basic_leader_election.shard1.replica_t2' (registry 'solr.core.tlog_replica_test_basic_leader_election.shard1.replica_t2') enabled at server: com.sun.jmx.mbeanserver.JmxMBeanServer@4f9a2c08
   [junit4]   2> 1632591 INFO  (qtp1661411584-27297) [n:127.0.0.1:35805_solr c:tlog_replica_test_basic_leader_election s:shard1 r:core_node4 x:tlog_replica_test_basic_leader_election_shard1_replica_t2] o.a.s.c.SolrCore [[tlog_replica_test_basic_leader_election_shard1_replica_t2] ] Opening new SolrCore at [/home/jenkins/workspace/Lucene-Solr-7.x-Linux/solr/build/solr-core/test/J0/temp/solr.cloud.TestTlogReplica_C2C6D1FC13CE2AC4-001/tempDir-001/node2/tlog_replica_test_basic_leader_election_shard1_replica_t2], dataDir=[/home/jenkins/workspace/Lucene-Solr-7.x-Linux/solr/build/solr-core/test/J0/temp/solr.cloud.TestTlogReplica_C2C6D1FC13CE2AC4-001/tempDir-001/node2/./tlog_replica_test_basic_leader_election_shard1_replica_t2/data/]
   [junit4]   2> 1632591 INFO  (qtp1619837511-27310) [n:127.0.0.1:42807_solr c:tlog_replica_test_basic_leader_election s:shard1 r:core_node3 x:tlog_replica_test_basic_leader_election_shard1_replica_t1] o.a.s.s.IndexSchema Loaded schema minimal/1.1 with uniqueid field id
   [junit4]   2> 1632591 INFO  (qtp1619837511-27310) [n:127.0.0.1:42807_solr c:tlog_replica_test_basic_leader_election s:shard1 r:core_node3 x:tlog_replica_test_basic_leader_election_shard1_replica_t1] o.a.s.c.CoreContainer Creating SolrCore 'tlog_replica_test_basic_leader_election_shard1_replica_t1' using configuration from collection tlog_replica_test_basic_leader_election, trusted=true
   [junit4]   2> 1632592 INFO  (qtp1619837511-27310) [n:127.0.0.1:42807_solr c:tlog_replica_test_basic_leader_election s:shard1 r:core_node3 x:tlog_replica_test_basic_leader_election_shard1_replica_t1] o.a.s.m.r.SolrJmxReporter JMX monitoring for 'solr_42807.solr.core.tlog_replica_test_basic_leader_election.shard1.replica_t1' (registry 'solr.core.tlog_replica_test_basic_leader_election.shard1.replica_t1') enabled at server: com.sun.jmx.mbeanserver.JmxMBeanServer@4f9a2c08
   [junit4]   2> 1632592 INFO  (qtp1619837511-27310) [n:127.0.0.1:42807_solr c:tlog_replica_test_basic_leader_election s:shard1 r:core_node3 x:tlog_replica_test_basic_leader_election_shard1_replica_t1] o.a.s.c.SolrCore [[tlog_replica_test_basic_leader_election_shard1_replica_t1] ] Opening new SolrCore at [/home/jenkins/workspace/Lucene-Solr-7.x-Linux/solr/build/solr-core/test/J0/temp/solr.cloud.TestTlogReplica_C2C6D1FC13CE2AC4-001/tempDir-001/node1/tlog_replica_test_basic_leader_election_shard1_replica_t1], dataDir=[/home/jenkins/workspace/Lucene-Solr-7.x-Linux/solr/build/solr-core/test/J0/temp/solr.cloud.TestTlogReplica_C2C6D1FC13CE2AC4-001/tempDir-001/node1/./tlog_replica_test_basic_leader_election_shard1_replica_t1/data/]
   [junit4]   2> 1632620 INFO  (qtp1661411584-27297) [n:127.0.0.1:35805_solr c:tlog_replica_test_basic_leader_election s:shard1 r:core_node4 x:tlog_replica_test_basic_leader_election_shard1_replica_t2] o.a.s.u.UpdateHandler Using UpdateLog implementation: org.apache.solr.update.UpdateLog
   [junit4]   2> 1632620 INFO  (qtp1661411584-27297) [n:127.0.0.1:35805_solr c:tlog_replica_test_basic_leader_election s:shard1 r:core_node4 x:tlog_replica_test_basic_leader_election_shard1_replica_t2] o.a.s.u.UpdateLog Initializing UpdateLog: dataDir=null defaultSyncLevel=FLUSH numRecordsToKeep=100 maxNumLogsToKeep=10 numVersionBuckets=65536
   [junit4]   2> 1632621 INFO  (qtp1661411584-27297) [n:127.0.0.1:35805_solr c:tlog_replica_test_basic_leader_election s:shard1 r:core_node4 x:tlog_replica_test_basic_leader_election_shard1_replica_t2] o.a.s.u.CommitTracker Hard AutoCommit: disabled
   [junit4]   2> 1632621 INFO  (qtp1661411584-27297) [n:127.0.0.1:35805_solr c:tlog_replica_test_basic_leader_election s:shard1 r:core_node4 x:tlog_replica_test_basic_leader_election_shard1_replica_t2] o.a.s.u.CommitTracker Soft AutoCommit: disabled
   [junit4]   2> 1632622 INFO  (qtp1661411584-27297) [n:127.0.0.1:35805_solr c:tlog_replica_test_basic_leader_election s:shard1 r:core_node4 x:tlog_replica_test_basic_leader_election_shard1_replica_t2] o.a.s.s.SolrIndexSearcher Opening [Searcher@3fc0c8b1[tlog_replica_test_basic_leader_election_shard1_replica_t2] main]
   [junit4]   2> 1632623 INFO  (qtp1661411584-27297) [n:127.0.0.1:35805_solr c:tlog_replica_test_basic_leader_election s:shard1 r:core_node4 x:tlog_replica_test_basic_leader_election_shard1_replica_t2] o.a.s.r.ManagedResourceStorage Configured ZooKeeperStorageIO with znodeBase: /configs/conf
   [junit4]   2> 1632623 INFO  (qtp1661411584-27297) [n:127.0.0.1:35805_solr c:tlog_replica_test_basic_leader_election s:shard1 r:core_node4 x:tlog_replica_test_basic_leader_election_shard1_replica_t2] o.a.s.r.ManagedResourceStorage Loaded null at path _rest_managed.json using ZooKeeperStorageIO:path=/configs/conf
   [junit4]   2> 1632624 INFO  (qtp1661411584-27297) [n:127.0.0.1:35805_solr c:tlog_replica_test_basic_leader_election s:shard1 r:core_node4 x:tlog_replica_test_basic_leader_election_shard1_replica_t2] o.a.s.h.ReplicationHandler Commits will be reserved for 10000ms.
   [junit4]   2> 1632624 INFO  (qtp1661411584-27297) [n:127.0.0.1:35805_solr c:tlog_replica_test_basic_leader_election s:shard1 r:core_node4 x:tlog_replica_test_basic_leader_election_shard1_replica_t2] o.a.s.u.UpdateLog Could not find max version in index or recent updates, using new clock 1614267941587517440
   [junit4]   2> 1632631 INFO  (searcherExecutor-8050-thread-1-processing-n:127.0.0.1:35805_solr x:tlog_replica_test_basic_leader_election_shard1_replica_t2 c:tlog_replica_test_basic_leader_election s:shard1 r:core_node4) [n:127.0.0.1:35805_solr c:tlog_replica_test_basic_leader_election s:shard1 r:core_node4 x:tlog_replica_test_basic_leader_election_shard1_replica_t2] o.a.s.c.SolrCore [tlog_replica_test_basic_leader_election_shard1_replica_t2] Registered new searcher Searcher@3fc0c8b1[tlog_replica_test_basic_leader_election_shard1_replica_t2] main{ExitableDirectoryReader(UninvertingDirectoryReader())}
   [junit4]   2> 1632635 INFO  (qtp1661411584-27297) [n:127.0.0.1:35805_solr c:tlog_replica_test_basic_leader_election s:shard1 r:core_node4 x:tlog_replica_test_basic_leader_election_shard1_replica_t2] o.a.s.c.ZkShardTerms Successful update of terms at /collections/tlog_replica_test_basic_leader_election/terms/shard1 to Terms{values={core_node4=0}, version=0}
   [junit4]   2> 1632636 INFO  (qtp1661411584-27297) [n:127.0.0.1:35805_solr c:tlog_replica_test_basic_leader_election s:shard1 r:core_node4 x:tlog_replica_test_basic_leader_election_shard1_replica_t2] o.a.s.c.ShardLeaderElectionContext Waiting until we see more replicas up for shard shard1: total=2 found=1 timeoutin=9999ms
   [junit4]   2> 1632636 DEBUG (OverseerStateUpdate-72092421922947076-127.0.0.1:42807_solr-n_0000000000) [n:127.0.0.1:42807_solr    ] o.a.s.c.Overseer processMessage: queueSize: 1, message = {
   [junit4]   2>   "operation":"leader",
   [junit4]   2>   "shard":"shard1",
   [junit4]   2>   "collection":"tlog_replica_test_basic_leader_election"} current state version: 0
   [junit4]   2> 1632639 INFO  (qtp1619837511-27310) [n:127.0.0.1:42807_solr c:tlog_replica_test_basic_leader_election s:shard1 r:core_node3 x:tlog_replica_test_basic_leader_election_shard1_replica_t1] o.a.s.u.UpdateHandler Using UpdateLog implementation: org.apache.solr.update.UpdateLog
   [junit4]   2> 1632639 INFO  (qtp1619837511-27310) [n:127.0.0.1:42807_solr c:tlog_replica_test_basic_leader_election s:shard1 r:core_node3 x:tlog_replica_test_basic_leader_election_shard1_replica_t1] o.a.s.u.UpdateLog Initializing UpdateLog: dataDir=null defaultSyncLevel=FLUSH numRecordsToKeep=100 maxNumLogsToKeep=10 numVersionBuckets=65536
   [junit4]   2> 1632640 INFO  (qtp1619837511-27310) [n:127.0.0.1:42807_solr c:tlog_replica_test_basic_leader_election s:shard1 r:core_node3 x:tlog_replica_test_basic_leader_election_shard1_replica_t1] o.a.s.u.CommitTracker Hard AutoCommit: disabled
   [junit4]   2> 1632640 INFO  (qtp1619837511-27310) [n:127.0.0.1:42807_solr c:tlog_replica_test_basic_leader_election s:shard1 r:core_node3 x:tlog_replica_test_basic_leader_election_shard1_replica_t1] o.a.s.u.CommitTracker Soft AutoCommit: disabled
   [junit4]   2> 1632641 INFO  (qtp1619837511-27310) [n:127.0.0.1:42807_solr c:tlog_replica_test_basic_leader_election s:shard1 r:core_node3 x:tlog_replica_test_basic_leader_election_shard1_replica_t1] o.a.s.s.SolrIndexSearcher Opening [Searcher@4d040f7a[tlog_replica_test_basic_leader_election_shard1_replica_t1] main]
   [junit4]   2> 1632642 INFO  (qtp1619837511-27310) [n:127.0.0.1:42807_solr c:tlog_replica_test_basic_leader_election s:shard1 r:core_node3 x:tlog_replica_test_basic_leader_election_shard1_replica_t1] o.a.s.r.ManagedResourceStorage Configured ZooKeeperStorageIO with znodeBase: /configs/conf
   [junit4]   2> 1632642 INFO  (qtp1619837511-27310) [n:127.0.0.1:42807_solr c:tlog_replica_test_basic_leader_election s:shard1 r:core_node3 x:tlog_replica_test_basic_leader_election_shard1_replica_t1] o.a.s.r.ManagedResourceStorage Loaded null at path _rest_managed.json using ZooKeeperStorageIO:path=/configs/conf
   [junit4]   2> 1632642 INFO  (qtp1619837511-27310) [n:127.0.0.1:42807_solr c:tlog_replica_test_basic_leader_election s:shard1 r:core_node3 x:tlog_replica_test_basic_leader_election_shard1_replica_t1] o.a.s.h.ReplicationHandler Commits will be reserved for 10000ms.
   [junit4]   2> 1632642 INFO  (qtp1619837511-27310) [n:127.0.0.1:42807_solr c:tlog_replica_test_basic_leader_election s:shard1 r:core_node3 x:tlog_replica_test_basic_leader_election_shard1_replica_t1] o.a.s.u.UpdateLog Could not find max version in index or recent updates, using new clock 1614267941606391808
   [junit4]   2> 1632643 INFO  (searcherExecutor-8051-thread-1-processing-n:127.0.0.1:42807_solr x:tlog_replica_test_basic_leader_election_shard1_replica_t1 c:tlog_replica_test_basic_leader_election s:shard1 r:core_node3) [n:127.0.0.1:42807_solr c:tlog_replica_test_basic_leader_election s:shard1 r:core_node3 x:tlog_replica_test_basic_leader_election_shard1_replica_t1] o.a.s.c.SolrCore [tlog_replica_test_basic_leader_election_shard1_replica_t1] Registered new searcher Searcher@4d040f7a[tlog_replica_test_basic_leader_election_shard1_replica_t1] main{ExitableDirectoryReader(UninvertingDirectoryReader())}
   [junit4]   2> 1632645 INFO  (qtp1619837511-27310) [n:127.0.0.1:42807_solr c:tlog_replica_test_basic_leader_election s:shard1 r:core_node3 x:tlog_replica_test_basic_leader_election_shard1_replica_t1] o.a.s.c.ZkShardTerms Successful update of terms at /collections/tlog_replica_test_basic_leader_election/terms/shard1 to Terms{values={core_node3=0, core_node4=0}, version=1}
   [junit4]   2> 1633137 INFO  (qtp1661411584-27297) [n:127.0.0.1:35805_solr c:tlog_replica_test_basic_leader_election s:shard1 r:core_node4 x:tlog_replica_test_basic_leader_election_shard1_replica_t2] o.a.s.c.ShardLeaderElectionContext Enough replicas found to continue.
   [junit4]   2> 1633137 INFO  (qtp1661411584-27297) [n:127.0.0.1:35805_solr c:tlog_replica_test_basic_leader_election s:shard1 r:core_node4 x:tlog_replica_test_basic_leader_election_shard1_replica_t2] o.a.s.c.ShardLeaderElectionContext I may be the new leader - try and sync
   [junit4]   2> 1633137 INFO  (qtp1661411584-27297) [n:127.0.0.1:35805_solr c:tlog_replica_test_basic_leader_election s:shard1 r:core_node4 x:tlog_replica_test_basic_leader_election_shard1_replica_t2] o.a.s.c.SyncStrategy Sync replicas to https://127.0.0.1:35805/solr/tlog_replica_test_basic_leader_election_shard1_replica_t2/
   [junit4]   2> 1633138 INFO  (qtp1661411584-27297) [n:127.0.0.1:35805_solr c:tlog_replica_test_basic_leader_election s:shard1 r:core_node4 x:tlog_replica_test_basic_leader_election_shard1_replica_t2] o.a.s.u.PeerSync PeerSync: core=tlog_replica_test_basic_leader_election_shard1_replica_t2 url=https://127.0.0.1:35805/solr START replicas=[https://127.0.0.1:42807/solr/tlog_replica_test_basic_leader_election_shard1_replica_t1/] nUpdates=100
   [junit4]   2> 1633138 INFO  (qtp1661411584-27297) [n:127.0.0.1:35805_solr c:tlog_replica_test_basic_leader_election s:shard1 r:core_node4 x:tlog_replica_test_basic_leader_election_shard1_replica_t2] o.a.s.u.PeerSync PeerSync: core=tlog_replica_test_basic_leader_election_shard1_replica_t2 url=https://127.0.0.1:35805/solr DONE.  We have no versions.  sync failed.
   [junit4]   2> 1633139 INFO  (qtp1619837511-27376) [n:127.0.0.1:42807_solr c:tlog_replica_test_basic_leader_election s:shard1 r:core_node3 x:tlog_replica_test_basic_leader_election_shard1_replica_t1] o.a.s.c.S.Request [tlog_replica_test_basic_leader_election_shard1_replica_t1]  webapp=/solr path=/get params={distrib=false&qt=/get&fingerprint=false&getVersions=100&wt=javabin&version=2} status=0 QTime=0
   [junit4]   2> 1633139 INFO  (qtp1661411584-27297) [n:127.0.0.1:35805_solr c:tlog_replica_test_basic_leader_election s:shard1 r:core_node4 x:tlog_replica_test_basic_leader_election_shard1_replica_t2] o.a.s.c.SyncStrategy Leader's attempt to sync with shard failed, moving to the next candidate
   [junit4]   2> 1633139 INFO  (qtp1661411584-27297) [n:127.0.0.1:35805_solr c:tlog_replica_test_basic_leader_election s:shard1 r:core_node4 x:tlog_replica_test_basic_leader_election_shard1_replica_t2] o.a.s.c.ShardLeaderElectionContext We failed sync, but we have no versions - we can't sync in that case - we were active before, so become leader anyway
   [junit4]   2> 1633139 INFO  (qtp1661411584-27297) [n:127.0.0.1:35805_solr c:tlog_replica_test_basic_leader_election s:shard1 r:core_node4 x:tlog_replica_test_basic_leader_election_shard1_replica_t2] o.a.s.c.ShardLeaderElectionContext Found all replicas participating in election, clear LIR
   [junit4]   2> 1633140 INFO  (qtp1661411584-27297) [n:127.0.0.1:35805_solr c:tlog_replica_test_basic_leader_election s:shard1 r:core_node4 x:tlog_replica_test_basic_leader_election_shard1_replica_t2] o.a.s.c.ZkController tlog_replica_test_basic_leader_election_shard1_replica_t2 stopping background replication from leader
   [junit4]   2> 1633141 INFO  (qtp1661411584-27297) [n:127.0.0.1:35805_solr c:tlog_replica_test_basic_leader_election s:shard1 r:core_node4 x:tlog_replica_test_basic_leader_election_shard1_replica_t2] o.a.s.c.ShardLeaderElectionContext I am the new leader: https://127.0.0.1:35805/solr/tlog_replica_test_basic_leader_election_shard1_replica_t2/ shard1
   [junit4]   2> 1633141 DEBUG (OverseerStateUpdate-72092421922947076-127.0.0.1:42807_solr-n_0000000000) [n:127.0.0.1:42807_solr    ] o.a.s.c.Overseer processMessage: queueSize: 1, message = {
   [junit4]   2>   "operation":"leader",
   [junit4]   2>   "shard":"shard1",
   [junit4]   2>   "collection":"tlog_replica_test_basic_leader_election",
   [junit4]   2>   "base_url":"https://127.0.0.1:35805/solr",
   [junit4]   2>   "core":"tlog_replica_test_basic_leader_election_shard1_replica_t2",
   [junit4]   2>   "state":"active"} current state version: 0
   [junit4]   2> 1633242 INFO  (qtp1661411584-27297) [n:127.0.0.1:35805_solr c:tlog_replica_test_basic_leader_election s:shard1 r:core_node4 x:tlog_replica_test_basic_leader_election_shard1_replica_t2] o.a.s.c.ZkController I am the leader, no recovery necessary
   [junit4]   2> 1633243 DEBUG (OverseerStateUpdate-72092421922947076-127.0.0.1:42807_solr-n_0000000000) [n:127.0.0.1:42807_solr    ] o.a.s.c.Overseer processMessage: queueSize: 1, message = {
   [junit4]   2>   "core":"tlog_replica_test_basic_leader_election_shard1_replica_t2",
   [junit4]   2>   "core_node_name":"core_node4",
   [junit4]   2>   "roles":null,
   [junit4]   2>   "base_url":"https://127.0.0.1:35805/solr",
   [junit4]   2>   "node_name":"127.0.0.1:35805_solr",
   [junit4]   2>   "numShards":"1",
   [junit4]   2>   "state":"active",
   [junit4]   2>   "shard":"shard1",
   [junit4]   2>   "collection":"tlog_replica_test_basic_leader_election",
   [junit4]   2>   "type":"TLOG",
   [junit4]   2>   "force_set_state":"false",
   [junit4]   2>   "operation":"state"} current state version: 0
   [junit4]   2> 1633344 INFO  (zkCallback-9817-thread-1) [    ] o.a.s.c.c.ZkStateReader A cluster state change: [WatchedEvent state:SyncConnected type:NodeDataChanged path:/collections/tlog_replica_test_basic_leader_election/state.json] for collection [tlog_replica_test_basic_leader_election] has occurred - updating... (live nodes size: [2])
   [junit4]   2> 1633408 INFO  (qtp1661411584-27297) [n:127.0.0.1:35805_solr c:tlog_replica_test_basic_leader_election s:shard1 r:core_node4 x:tlog_replica_test_basic_leader_election_shard1_replica_t2] o.a.s.s.HttpSolrCall [admin] webapp=null path=/admin/cores params={qt=/admin/cores&coreNodeName=core_node4&collection.configName=conf&newCollection=true&name=tlog_replica_test_basic_leader_election_shard1_replica_t2&action=CREATE&numShards=1&collection=tlog_replica_test_basic_leader_election&shard=shard1&wt=javabin&version=2&replicaType=TLOG} status=0 QTime=1835
   [junit4]   2> 1633647 INFO  (qtp1619837511-27310) [n:127.0.0.1:42807_solr c:tlog_replica_test_basic_leader_election s:shard1 r:core_node3 x:tlog_replica_test_basic_leader_election_shard1_replica_t1] o.a.s.c.ZkController tlog_replica_test_basic_leader_election_shard1_replica_t1 starting background replication from leader
   [junit4]   2> 1633647 INFO  (qtp1619837511-27310) [n:127.0.0.1:42807_solr c:tlog_replica_test_basic_leader_election s:shard1 r:core_node3 x:tlog_replica_test_basic_leader_election_shard1_replica_t1] o.a.s.c.ReplicateFromLeader Will start replication from leader with poll interval: 00:00:03
   [junit4]   2> 1633647 INFO  (qtp1619837511-27310) [n:127.0.0.1:42807_solr c:tlog_replica_test_basic_leader_election s:shard1 r:core_node3 x:tlog_replica_test_basic_leader_election_shard1_replica_t1] o.a.s.h.ReplicationHandler Poll scheduled at an interval of 3000ms
   [junit4]   2> 1633647 INFO  (qtp1619837511-27310) [n:127.0.0.1:42807_solr c:tlog_replica_test_basic_leader_election s:shard1 r:core_node3 x:tlog_replica_test_basic_leader_election_shard1_replica_t1] o.a.s.h.ReplicationHandler Commits will be reserved for 10000ms.
   [junit4]   2> 1633648 INFO  (indexFetcher-8061-thread-1) [    ] o.a.s.h.IndexFetcher Updated masterUrl to https://127.0.0.1:35805/solr/tlog_replica_test_basic_leader_election_shard1_replica_t2/
   [junit4]   2> 1633649 INFO  (qtp1661411584-27372) [n:127.0.0.1:35805_solr c:tlog_replica_test_basic_leader_election s:shard1 r:core_node4 x:tlog_replica_test_basic_leader_election_shard1_replica_t2] o.a.s.c.S.Request [tlog_replica_test_basic_leader_election_shard1_replica_t2]  webapp=/solr path=/replication params={qt=/replication&wt=javabin&version=2&command=indexversion} status=0 QTime=0
   [junit4]   2> 1633649 DEBUG (OverseerStateUpdate-72092421922947076-127.0.0.1:42807_solr-n_0000000000) [n:127.0.0.1:42807_solr    ] o.a.s.c.Overseer processMessage: queueSize: 1, message = {
   [junit4]   2>   "core":"tlog_replica_test_basic_leader_election_shard1_replica_t1",
   [junit4]   2>   "core_node_name":"core_node3",
   [junit4]   2>   "roles":null,
   [junit4]   2>   "base_url":"https://127.0.0.1:42807/solr",
   [junit4]   2>   "node_name":"127.0.0.1:42807_solr",
   [junit4]   2>   "numShards":"1",
   [junit4]   2>   "state":"active",
   [junit4]   2>   "shard":"shard1",
   [junit4]   2>   "collection":"tlog_replica_test_basic_leader_election",
   [junit4]   2>   "type":"TLOG",
   [junit4]   2>   "force_set_state":"false",
   [junit4]   2>   "operation":"state"} current state version: 0
   [junit4]   2> 1633649 INFO  (indexFetcher-8061-thread-1) [    ] o.a.s.h.IndexFetcher Master's generation: 1
   [junit4]   2> 1633649 INFO  (indexFetcher-8061-thread-1) [    ] o.a.s.h.IndexFetcher Master's version: 0
   [junit4]   2> 1633649 INFO  (indexFetcher-8061-thread-1) [    ] o.a.s.h.IndexFetcher Slave's generation: 1
   [junit4]   2> 1633649 INFO  (indexFetcher-8061-thread-1) [    ] o.a.s.h.IndexFetcher Slave's version: 0
   [junit4]   2> 1633649 INFO  (indexFetcher-8061-thread-1) [    ] o.a.s.h.IndexFetcher New index in Master. Deleting mine...
   [junit4]   2> 1633649 INFO  (indexFetcher-8061-thread-1) [    ] o.a.s.s.SolrIndexSearcher Opening [Searcher@277b56a2[tlog_replica_test_basic_leader_election_shard1_replica_t1] main]
   [junit4]   2> 1633650 INFO  (searcherExecutor-8051-thread-1) [    ] o.a.s.c.SolrCore [tlog_replica_test_basic_leader_election_shard1_replica_t1] Registered new searcher Searcher@277b56a2[tlog_replica_test_basic_leader_election_shard1_replica_t1] main{ExitableDirectoryReader(UninvertingDirectoryReader())}
   [junit4]   2> 1633669 INFO  (qtp1619837511-27310) [n:127.0.0.1:42807_solr c:tlog_replica_test_basic_leader_election s:shard1 r:core_node3 x:tlog_replica_test_basic_leader_election_shard1_replica_t1] o.a.s.s.HttpSolrCall [admin] webapp=null path=/admin/cores params={qt=/admin/cores&coreNodeName=core_node3&collection.configName=conf&newCollection=true&name=tlog_replica_test_basic_leader_election_shard1_replica_t1&action=CREATE&numShards=1&collection=tlog_replica_test_basic_leader_election&shard=shard1&wt=javabin&version=2&replicaType=TLOG} status=0 QTime=2096
   [junit4]   2> 1633671 INFO  (qtp1661411584-27307) [n:127.0.0.1:35805_solr    ] o.a.s.h.a.CollectionsHandler Wait for new collection to be active for at most 30 seconds. Check all shard replicas
   [junit4]   2> 1633750 INFO  (zkCallback-9817-thread-1) [    ] o.a.s.c.c.ZkStateReader A cluster state change: [WatchedEvent state:SyncConnected type:NodeDataChanged path:/collections/tlog_replica_test_basic_leader_election/state.json] for collection [tlog_replica_test_basic_leader_election] has occurred - updating... (live nodes size: [2])
   [junit4]   2> 1633750 INFO  (zkCallback-9803-thread-1) [    ] o.a.s.c.c.ZkStateReader A cluster state change: [WatchedEvent state:SyncConnected type:NodeDataChanged path:/collections/tlog_replica_test_basic_leader_election/state.json] for collection [tlog_replica_test_basic_leader_election] has occurred - updating... (live nodes size: [2])
   [junit4]   2> 1634671 INFO  (qtp1661411584-27307) [n:127.0.0.1:35805_solr    ] o.a.s.s.HttpSolrCall [admin] webapp=null path=/admin/collections params={pullReplicas=0&collection.configName=conf&maxShardsPerNode=100&name=tlog_replica_test_basic_leader_election&nrtReplicas=0&action=CREATE&numShards=1&tlogReplicas=2&wt=javabin&version=2} status=0 QTime=3421
   [junit4]   2> 1634676 INFO  (qtp1619837511-27310) [n:127.0.0.1:42807_solr c:tlog_replica_test_basic_leader_election s:shard1 r:core_node3 x:tlog_replica_test_basic_leader_election_shard1_replica_t1] o.a.s.u.p.LogUpdateProcessorFactory [tlog_replica_test_basic_leader_election_shard1_replica_t1]  webapp=/solr path=/update params={update.distrib=FROMLEADER&_version_=-1614267943737098240&distrib.from=https://127.0.0.1:35805/solr/tlog_replica_test_basic_leader_election_shard1_replica_t2/&wt=javabin&version=2}{deleteByQuery=*:* (-1614267943737098240)} 0 0
   [junit4]   2> 1634678 INFO  (qtp1619837511-27376) [n:127.0.0.1:42807_solr c:tlog_replica_test_basic_leader_election s:shard1 r:core_node3 x:tlog_replica_test_basic_leader_election_shard1_replica_t1] o.a.s.u.p.LogUpdateProcessorFactory [tlog_replica_test_basic_leader_election_shard1_replica_t1]  webapp=/solr path=/update params={update.distrib=FROMLEADER&waitSearcher=true&openSearcher=true&commit=true&softCommit=false&distrib.from=https://127.0.0.1:35805/solr/tlog_replica_test_basic_leader_election_shard1_replica_t2/&commit_end_point=true&wt=javabin&version=2&expungeDeletes=false}{commit=} 0 0
   [junit4]   2> 1634679 INFO  (qtp1661411584-27372) [n:127.0.0.1:35805_solr c:tlog_replica_test_basic_leader_election s:shard1 r:core_node4 x:tlog_replica_test_basic_leader_election_shard1_replica_t2] o.a.s.u.DirectUpdateHandler2 start commit{_version_=1614267943742341120,optimize=false,openSearcher=true,waitSearcher=true,expungeDeletes=false,softCommit=false,prepareCommit=false}
   [junit4]   2> 1634679 INFO  (qtp1661411584-27372) [n:127.0.0.1:35805_solr c:tlog_replica_test_basic_leader_election s:shard1 r:core_node4 x:tlog_replica_test_basic_leader_election_shard1_replica_t2] o.a.s.u.DirectUpdateHandler2 No uncommitted changes. Skipping IW.commit.
   [junit4]   2> 1634679 INFO  (qtp1661411584-27372) [n:127.0.0.1:35805_solr c:tlog_replica_test_basic_leader_election s:shard1 r:core_node4 x:tlog_replica_test_basic_leader_election_shard1_replica_t2] o.a.s.u.DirectUpdateHandler2 end_commit_flush
   [junit4]   2> 1634679 INFO  (qtp1661411584-27372) [n:127.0.0.1:35805_solr c:tlog_replica_test_basic_leader_election s:shard1 r:core_node4 x:tlog_replica_test_basic_leader_election_shard1_replica_t2] o.a.s.u.p.LogUpdateProcessorFactory [tlog_replica_test_basic_leader_election_shard1_replica_t2]  webapp=/solr path=/update params={update.distrib=FROMLEADER&waitSearcher=true&openSearcher=true&commit=true&softCommit=false&distrib.from=https://127.0.0.1:35805/solr/tlog_replica_test_basic_leader_election_shard1_replica_t2/&commit_end_point=true&wt=javabin&version=2&expungeDeletes=false}{commit=} 0 0
   [junit4]   2> 1634680 INFO  (qtp1661411584-27305) [n:127.0.0.1:35805_solr c:tlog_replica_test_basic_leader_election s:shard1 r:core_node4 x:tlog_replica_test_basic_leader_election_shard1_replica_t2] o.a.s.c.ZkShardTerms Successful update of terms at /collections/tlog_replica_test_basic_leader_election/terms/shard1 to Terms{values={core_node3=1, core_node4=1}, version=2}
   [junit4]   2> 1634680 INFO  (qtp1661411584-27305) [n:127.0.0.1:35805_solr c:tlog_replica_test_basic_leader_election s:shard1 r:core_node4 x:tlog_replica_test_basic_leader_election_shard1_replica_t2] o.a.s.u.p.LogUpdateProcessorFactory [tlog_replica_test_basic_leader_election_shard1_replica_t2]  webapp=/solr path=/update params={_stateVer_=tlog_replica_test_basic_leader_election:6&commit=true&wt=javabin&version=2}{deleteByQuery=*:* (-1614267943737098240),commit=} 0 5
   [junit4]   2> 1634683 INFO  (qtp1619837511-27310) [n:127.0.0.1:42807_solr c:tlog_replica_test_basic_leader_election s:shard1 r:core_node3 x:tlog_replica_test_basic_leader_election_shard1_replica_t1] o.a.s.u.p.LogUpdateProcessorFactory [tlog_replica_test_basic_leader_election_shard1_replica_t1]  webapp=/solr path=/update params={update.distrib=FROMLEADER&distrib.from=https://127.0.0.1:35805/solr/tlog_replica_test_basic_leader_election_shard1_replica_t2/&wt=javabin&version=2}{add=[1 (1614267943744438272), 2 (1614267943745486848)]} 0 0
   [junit4]   2> 1634683 INFO  (qtp1661411584-27307) [n:127.0.0.1:35805_solr c:tlog_replica_test_basic_leader_election s:shard1 r:core_node4 x:tlog_replica_test_basic_leader_election_shard1_replica_t2] o.a.s.u.p.LogUpdateProcessorFactory [tlog_replica_test_basic_leader_election_shard1_replica_t2]  webapp=/solr path=/update params={wt=javabin&version=2}{add=[1 (1614267943744438272), 2 (1614267943745486848)]} 0 1
   [junit4]   2> 1634683 INFO  (TEST-TestTlogReplica.testBasicLeaderElection-seed#[C2C6D1FC13CE2AC4]) [    ] o.a.s.c.ChaosMonkey monkey: kill jetty! 35805
   [junit4]   2> 1634684 INFO  (TEST-TestTlogReplica.testBasicLeaderElection-seed#[C2C6D1FC13CE2AC4]) [    ] o.e.j.s.AbstractConnector Stopped ServerConnector@da60da0{SSL,[ssl, http/1.1]}{127.0.0.1:0}
   [junit4]   2> 1634685 INFO  (TEST-TestTlogReplica.testBasicLeaderElection-seed#[C2C6D1FC13CE2AC4]) [    ] o.a.s.c.CoreContainer Shutting down CoreContainer instance=1706447854
   [junit4]   2> 1634685 INFO  (TEST-TestTlogReplica.testBasicLeaderElection-seed#[C2C6D1FC13CE2AC4]) [    ] o.a.s.m.SolrMetricManager Closing metric reporters for registry=solr.node, tag=null
   [junit4]   2> 1634685 INFO  (TEST-TestTlogReplica.testBasicLeaderElection-seed#[C2C6D1FC13CE2AC4]) [    ] o.a.s.m.r.SolrJmxReporter Closing reporter [org.apache.solr.metrics.reporters.SolrJmxReporter@7b1faf29: rootName = solr_35805, domain = solr.node, service url = null, agent id = null] for registry solr.node / com.codahale.metrics.MetricRegistry@5ed07fb2
   [junit4]   2> 1634690 INFO  (TEST-TestTlogReplica.testBasicLeaderElection-seed#[C2C6D1FC13CE2AC4]) [    ] o.a.s.m.SolrMetricManager Closing metric reporters for registry=solr.jvm, tag=null
   [junit4]   2> 1634690 INFO  (TEST-TestTlogReplica.testBasicLeaderElection-seed#[C2C6D1FC13CE2AC4]) [    ] o.a.s.m.r.SolrJmxReporter Closing reporter [org.apache.solr.metrics.reporters.SolrJmxReporter@674e8b2d: rootName = solr_35805, domain = solr.jvm, service url = null, agent id = null] for registry solr.jvm / com.codahale.metrics.MetricRegistry@44097517
   [junit4]   2> 1634693 INFO  (TEST-TestTlogReplica.testBasicLeaderElection-seed#[C2C6D1FC13CE2AC4]) [    ] o.a.s.m.SolrMetricManager Closing metric reporters for registry=solr.jetty, tag=null
   [junit4]   2> 1634693 INFO  (TEST-TestTlogReplica.testBasicLeaderElection-seed#[C2C6D1FC13CE2AC4]) [    ] o.a.s.m.r.SolrJmxReporter Closing reporter [org.apache.solr.metrics.reporters.SolrJmxReporter@85fb22e: rootName = solr_35805, domain = solr.jetty, service url = null, agent id = null] for registry solr.jetty / com.codahale.metrics.MetricRegistry@5a878eae
   [junit4]   2> 1634694 INFO  (TEST-TestTlogReplica.testBasicLeaderElection-seed#[C2C6D1FC13CE2AC4]) [    ] o.a.s.c.ZkController Remove node as live in ZooKeeper:/live_nodes/127.0.0.1:35805_solr
   [junit4]   2> 1634694 DEBUG (OverseerStateUpdate-72092421922947076-127.0.0.1:42807_solr-n_0000000000) [n:127.0.0.1:42807_solr    ] o.a.s.c.Overseer processMessage: queueSize: 1, message = {
   [junit4]   2>   "operation":"downnode",
   [junit4]   2>   "node_name":"127.0.0.1:35805_solr"} current state version: 0
   [junit4]   2> 1634694 INFO  (zkCallback-9824-thread-1) [    ] o.a.s.c.c.ZkStateReader Updated live nodes from ZooKeeper... (2) -> (1)
   [junit4]   2> 1634694 INFO  (zkCallback-9817-thread-1) [    ] o.a.s.c.c.ZkStateReader Updated live nodes from ZooKeeper... (2) -> (1)
   [junit4]   2> 1634695 INFO  (zkCallback-9832-thread-1) [    ] o.a.s.c.c.ZkStateReader Updated live nodes from ZooKeeper... (2) -> (1)
   [junit4]   2> 1634694 INFO  (zkCallback-9803-thread-2) [    ] o.a.s.c.c.ZkStateReader Updated live nodes from ZooKeeper... (2) -> (1)
   [junit4]   2> 1634694 INFO  (zkCallback-9810-thread-1) [    ] o.a.s.c.c.ZkStateReader Updated live nodes from ZooKeeper... (2) -> (1)
   [junit4]   2> 1634694 INFO  (TEST-TestTlogReplica.testBasicLeaderElection-seed#[C2C6D1FC13CE2AC4]) [    ] o.a.s.m.SolrMetricManager Closing metric reporters for registry=solr.cluster, tag=null
   [junit4]   2> 1634695 INFO  (coreCloseExecutor-8062-thread-1) [n:127.0.0.1:35805_solr c:tlog_replica_test_basic_leader_election s:shard1 r:core_node4 x:tlog_replica_test_basic_leader_election_shard1_replica_t2] o.a.s.c.SolrCore [tlog_replica_test_basic_leader_election_shard1_replica_t2]  CLOSING SolrCore org.apache.solr.core.SolrCore@14e97fad
   [junit4]   2> 1634695 INFO  (coreCloseExecutor-8062-thread-1) [n:127.0.0.1:35805_solr c:tlog_replica_test_basic_leader_election s:shard1 r:core_node4 x:tlog_replica_test_basic_leader_election_shard1_replica_t2] o.a.s.m.SolrMetricManager Closing metric reporters for registry=solr.core.tlog_replica_test_basic_leader_election.shard1.replica_t2, tag=14e97fad
   [junit4]   2> 1634695 INFO  (coreCloseExecutor-8062-thread-1) [n:127.0.0.1:35805_solr c:tlog_replica_test_basic_leader_election s:shard1 r:core_node4 x:tlog_replica_test_basic_leader_election_shard1_replica_t2] o.a.s.m.r.SolrJmxReporter Closing reporter [org.apache.solr.metrics.reporters.SolrJmxReporter@4f6c9daa: rootName = solr_35805, domain = solr.core.tlog_replica_test_basic_leader_election.shard1.replica_t2, service url = null, agent id = null] for registry solr.core.tlog_replica_test_basic_leader_election.shard1.replica_t2 / com.codahale.metrics.MetricRegistry@4bc31897
   [junit4]   2> 1634701 INFO  (coreCloseExecutor-8062-thread-1) [n:127.0.0.1:35805_solr c:tlog_replica_test_basic_leader_election s:shard1 r:core_node4 x:tlog_replica_test_basic_leader_election_shard1_replica_t2] o.a.s.m.SolrMetricManager Closing metric reporters for registry=solr.collection.tlog_replica_test_basic_leader_election.shard1.leader, tag=14e97fad
   [junit4]   2> 1634703 INFO  (TEST-TestTlogReplica.testBasicLeaderElection-seed#[C2C6D1FC13CE2AC4]) [    ] o.e.j.s.h.ContextHandler Stopped o.e.j.s.ServletContextHandler@18330ddc{/solr,null,UNAVAILABLE}
   [junit4]   2> 1634703 INFO  (TEST-TestTlogReplica.testBasicLeaderElection-seed#[C2C6D1FC13CE2AC4]) [    ] o.e.j.s.session node0 Stopped scavenging
   [junit4]   2> 1634703 INFO  (TEST-TestTlogReplica.testBasicLeaderElection-seed#[C2C6D1FC13CE2AC4]) [    ] o.a.s.c.ChaosMonkey monkey: stop jetty! 35805
   [junit4]   2> 1634704 INFO  (zkCallback-9803-thread-2) [n:127.0.0.1:42807_solr c:tlog_replica_test_basic_leader_election s:shard1 r:core_node3 x:tlog_replica_test_basic_leader_election_shard1_replica_t1] o.a.s.c.ShardLeaderElectionContext I may be the new leader - try and sync
   [junit4]   2> 1634704 DEBUG (OverseerStateUpdate-72092421922947076-127.0.0.1:42807_solr-n_0000000000) [n:127.0.0.1:42807_solr    ] o.a.s.c.Overseer processMessage: queueSize: 2, message = {
   [junit4]   2>   "operation":"leader",
   [junit4]   2>   "shard":"shard1",
   [junit4]   2>   "collection":"tlog_replica_test_basic_leader_election"} current state version: 0
   [junit4]   2> 1634705 ERROR (TEST-TestTlogReplica.testBasicLeaderElection-seed#[C2C6D1FC13CE2AC4]) [    ] o.a.s.c.s.i.CloudSolrClient Request to collection [tlog_replica_test_basic_leader_election] failed due to (0) org.apache.http.NoHttpResponseException: 127.0.0.1:35805 failed to respond, retry? 0
   [junit4]   2> 1634805 INFO  (zkCallback-9803-thread-1) [    ] o.a.s.c.c.ZkStateReader A cluster state change: [WatchedEvent state:SyncConnected type:NodeDataChanged path:/collections/tlog_replica_test_basic_leader_election/state.json] for collection [tlog_replica_test_basic_leader_election] has occurred - updating... (live nodes size: [1])
   [junit4]   2> 1635252 INFO  (OverseerCollectionConfigSetProcessor-72092421922947076-127.0.0.1:42807_solr-n_0000000000) [n:127.0.0.1:42807_solr    ] o.a.s.c.OverseerTaskQueue Response ZK path: /overseer/collection-queue-work/qnr-0000000000 doesn't exist.  Requestor may have disconnected from ZooKeeper
   [junit4]   2> 1637204 INFO  (zkCallback-9803-thread-2) [n:127.0.0.1:42807_solr c:tlog_replica_test_basic_leader_election s:shard1 r:core_node3 x:tlog_replica_test_basic_leader_election_shard1_replica_t1] o.a.s.c.SyncStrategy Sync replicas to https://127.0.0.1:42807/solr/tlog_replica_test_basic_leader_election_shard1_replica_t1/
   [junit4]   2> 1637204 INFO  (zkCallback-9803-thread-2) [n:127.0.0.1:42807_solr c:tlog_replica_test_basic_leader_election s:shard1 r:core_node3 x:tlog_replica_test_basic_leader_election_shard1_replica_t1] o.a.s.c.SyncStrategy Sync Success - now sync replicas to me
   [junit4]   2> 1637204 INFO  (zkCallback-9803-thread-2) [n:127.0.0.1:42807_solr c:tlog_replica_test_basic_leader_election s:shard1 r:core_node3 x:tlog_replica_test_basic_leader_election_shard1_replica_t1] o.a.s.c.SyncStrategy https://127.0.0.1:42807/solr/tlog_replica_test_basic_leader_election_shard1_replica_t1/ has no replicas
   [junit4]   2> 1637204 INFO  (zkCallback-9803-thread-2) [n:127.0.0.1:42807_solr c:tlog_replica_test_basic_leader_election s:shard1 r:core_node3 x:tlog_replica_test_basic_leader_election_shard1_replica_t1] o.a.s.c.ZkController tlog_replica_test_basic_leader_election_shard1_replica_t1 stopping background replication from leader
   [junit4]   2> 1637205 INFO  (zkCallback-9803-thread-2) [n:127.0.0.1:42807_solr c:tlog_replica_test_basic_leader_election s:shard1 r:core_node3 x:tlog_replica_test_basic_leader_election_shard1_replica_t1] o.a.s.c.ShardLeaderElectionContext Replaying tlog before become new leader
   [junit4]   2> 1637205 WARN  (recoveryExecutor-8057-thread-1-processing-n:127.0.0.1:42807_solr x:tlog_replica_test_basic_leader_election_shard1_replica_t1 c:tlog_replica_test_basic_leader_election s:shard1 r:core_node3) [n:127.0.0.1:42807_solr c:tlog_replica_test_basic_leader_election s:shard1 r:core_node3 x:tlog_replica_test_basic_leader_election_shard1_replica_t1] o.a.s.u.UpdateLog Starting log replay tlog{file=/home/jenkins/workspace/Lucene-Solr-7.x-Linux/solr/build/solr-core/test/J0/temp/solr.cloud.TestTlogReplica_C2C6D1FC13CE2AC4-001/tempDir-001/node1/tlog_replica_test_basic_leader_election_shard1_replica_t1/data/tlog/tlog.0000000000000000000 refcount=2} active=false starting pos=0 inSortedOrder=true
   [junit4]   2> 1637207 INFO  (recoveryExecutor-8057-thread-1-processing-n:127.0.0.1:42807_solr x:tlog_replica_test_basic_leader_election_shard1_replica_t1 c:tlog_replica_test_basic_leader_election s:shard1 r:core_node3) [n:127.0.0.1:42807_solr c:tlog_replica_test_basic_leader_election s:shard1 r:core_node3 x:tlog_replica_test_basic_leader_election_shard1_replica_t1] o.a.s.u.DirectUpdateHandler2 start commit{flags=2,optimize=false,openSearcher=true,waitSearcher=true,expungeDeletes=false,softCommit=false,prepareCommit=false}
   [junit4]   2> 1637207 INFO  (recoveryExecutor-8057-thread-1-processing-n:127.0.0.1:42807_solr x:tlog_replica_test_basic_leader_election_shard1_replica_t1 c:tlog_replica_test_basic_leader_election s:shard1 r:core_node3) [n:127.0.0.1:42807_solr c:tlog_replica_test_basic_leader_election s:shard1 r:core_node3 x:tlog_replica_test_basic_leader_election_shard1_replica_t1] o.a.s.u.SolrIndexWriter Calling setCommitData with IW:org.apache.solr.update.SolrIndexWriter@38a3892b commitCommandVersion:0
   [junit4]   2> 1637208 INFO  (recoveryExecutor-8057-thread-1-processing-n:127.0.0.1:42807_solr x:tlog_replica_test_basic_leader_election_shard1_replica_t1 c:tlog_replica_test_basic_leader_election s:shard1 r:core_node3) [n:127.0.0.1:42807_solr c:tlog_replica_test_basic_leader_election s:shard1 r:core_node3 x:tlog_replica_test_basic_leader_election_shard1_replica_t1] o.a.s.s.SolrIndexSearcher Opening [Searcher@5bdb1fb1[tlog_replica_test_basic_leader_election_shard1_replica_t1] main]
   [junit4]   2> 1637209 INFO  (searcherExecutor-8051-thread-1-processing-n:127.0.0.1:42807_solr x:tlog_replica_test_basic_leader_election_shard1_replica_t1 c:tlog_replica_test_basic_leader_election s:shard1 r:core_node3) [n:127.0.0.1:42807_solr c:tlog_replica_test_basic_leader_election s:shard1 r:core_node3 x:tlog_replica_test_basic_leader_election_shard1_replica_t1] o.a.s.c.SolrCore [tlog_replica_test_basic_leader_election_shard1_replica_t1] Registered new searcher Searcher@5bdb1fb1[tlog_replica_test_basic_leader_election_shard1_replica_t1] main{ExitableDirectoryReader(UninvertingDirectoryReader(_0(7.6.0):C2))}
   [junit4]   2> 1637281 INFO  (recoveryExecutor-8057-thread-1-processing-n:127.0.0.1:42807_solr x:tlog_replica_test_basic_leader_election_shard1_replica_t1 c:tlog_replica_test_basic_leader_election s:shard1 r:core_node3) [n:127.0.0.1:42807_solr c:tlog_replica_test_basic_leader_election s:shard1 r:core_node3 x:tlog_replica_test_basic_leader_election_shard1_replica_t1] o.a.s.u.DirectUpdateHandler2 end_commit_flush
   [junit4]   2> 1637282 INFO  (recoveryExecutor-8057-thread-1-processing-n:127.0.0.1:42807_solr x:tlog_replica_test_basic_leader_election_shard1_replica_t1 c:tlog_replica_test_basic_leader_election s:shard1 r:core_node3) [n:127.0.0.1:42807_solr c:tlog_replica_test_basic_leader_election s:shard1 r:core_node3 x:tlog_replica_test_basic_leader_election_shard1_replica_t1] o.a.s.u.p.LogUpdateProcessorFactory [tlog_replica_test_basic_leader_election_shard1_replica_t1] {deleteByQuery=*:* (-1614267943737098240),add=[1 (1614267943744438272), 2 (1614267943745486848)]} 0 76
   [junit4]   2> 1637282 WARN  (recoveryExecutor-8057-thread-1-processing-n:127.0.0.1:42807_solr x:tlog_replica_test_basic_leader_election_shard1_replica_t1 c:tlog_replica_test_basic_leader_election s:shard1 r:core_node3) [n:127.0.0.1:42807_solr c:tlog_replica_test_basic_leader_election s:shard1 r:core_node3 x:tlog_replica_test_basic_leader_election_shard1_replica_t1] o.a.s.u.UpdateLog Log replay finished. recoveryInfo=RecoveryInfo{adds=2 deletes=0 deleteByQuery=1 errors=0 positionOfStart=0}
   [junit4]   2> 1637283 INFO  (zkCallback-9803-thread-2) [n:127.0.0.1:42807_solr c:tlog_replica_test_basic_leader_election s:shard1 r:core_node3 x:tlog_replica_test_basic_leader_election_shard1_replica_t1] o.a.s.c.ShardLeaderElectionContext I am the new leader: https://127.0.0.1:42807/solr/tlog_replica_test_basic_leader_election_shard1_replica_t1/ shard1
   [junit4]   2> 1637283 DEBUG (OverseerStateUpdate-72092421922947076-127.0.0.1:42807_solr-n_0000000000) [n:127.0.0.1:42807_solr    ] o.a.s.c.Overseer processMessage: queueSize: 1, message = {
   [junit4]   2>   "operation":"leader",
   [junit4]   2>   "shard":"shard1",
   [junit4]   2>   "collection":"tlog_replica_test_basic_leader_election",
   [junit4]   2>   "base_url":"https://127.0.0.1:42807/solr",
   [junit4]   2>   "core":"tlog_replica_test_basic_leader_election_shard1_replica_t1",
   [junit4]   2>   "state":"active"} current state version: 0
   [junit4]   2> 1637284 INFO  (zkCallback-9803-thread-2) [    ] o.a.s.c.c.ZkStateReader A cluster state change: [WatchedEvent state:SyncConnected type:NodeDataChanged path:/collections/tlog_replica_test_basic_leader_election/state.json] for collection [tlog_replica_test_basic_leader_election] has occurred - updating... (live nodes size: [1])
   [junit4]   2> 1637313 INFO  (qtp1619837511-27300) [n:127.0.0.1:42807_solr c:tlog_replica_test_basic_leader_election s:shard1 r:core_node3 x:tlog_replica_test_basic_leader_election_shard1_replica_t1] o.a.s.c.ZkShardTerms Successful update of terms at /collections/tlog_replica_test_basic_leader_election/terms/shard1 to Terms{values={core_node3=2, core_node4=1}, version=3}
   [junit4]   2> 1637313 INFO  (qtp1619837511-27300) [n:127.0.0.1:42807_solr c:tlog_replica_test_basic_leader_election s:shard1 r:core_node3 x:tlog_replica_test_basic_leader_election_shard1_replica_t1] o.a.s.u.p.LogUpdateProcessorFactory [tlog_replica_test_basic_leader_election_shard1_replica_t1]  webapp=/solr path=/update params={wt=javabin&version=2}{add=[3 (1614267946503241728), 4 (1614267946504290304)]} 0 2606
   [junit4]   2> 1637314 INFO  (TEST-TestTlogReplica.testBasicLeaderElection-seed#[C2C6D1FC13CE2AC4]) [    ] o.a.s.c.ChaosMonkey monkey: starting jetty! 35805
   [junit4]   2> 1637315 INFO  (TEST-TestTlogReplica.testBasicLeaderElection-seed#[C2C6D1FC13CE2AC4]) [    ] o.e.j.s.Server jetty-9.4.11.v20180605; built: 2018-06-05T18:24:03.829Z; git: d5fc0523cfa96bfebfbda19606cad384d772f04c; jvm 9.0.4+11
   [junit4]   2> 1637315 INFO  (TEST-TestTlogReplica.testBasicLeaderElection-seed#[C2C6D1FC13CE2AC4]) [    ] o.e.j.s.session DefaultSessionIdManager workerName=node0
   [junit4]   2> 1637315 INFO  (TEST-TestTlogReplica.testBasicLeaderElection-seed#[C2C6D1FC13CE2AC4]) [    ] o.e.j.s.session No SessionScavenger set, using defaults
   [junit4]   2> 1637315 INFO  (TEST-TestTlogReplica.testBasicLeaderElection-seed#[C2C6D1FC13CE2AC4]) [    ] o.e.j.s.session node0 Scavenging every 600000ms
   [junit4]   2> 1637315 INFO  (TEST-TestTlogReplica.testBasicLeaderElection-seed#[C2C6D1FC13CE2AC4]) [    ] o.e.j.s.h.ContextHandler Started o.e.j.s.ServletContextHandler@65e1a932{/solr,null,AVAILABLE}
   [junit4]   2> 1637316 INFO  (TEST-TestTlogReplica.testBasicLeaderElection-seed#[C2C6D1FC13CE2AC4]) [    ] o.e.j.s.AbstractConnector Started ServerConnector@1d110412{SSL,[ssl, http/1.1]}{127.0.0.1:35805}
   [junit4]   2> 1637316 INFO  (TEST-TestTlogReplica.testBasicLeaderElection-seed#[C2C6D1FC13CE2AC4]) [    ] o.e.j.s.Server Started @1637371ms
   [junit4]   2> 1637316 INFO  (TEST-TestTlogReplica.testBasicLeaderElection-seed#[C2C6D1FC13CE2AC4]) [    ] o.a.s.c.s.e.JettySolrRunner Jetty properties: {hostContext=/solr, hostPort=35805}
   [junit4]   2> 1637316 ERROR (TEST-TestTlogReplica.testBasicLeaderElection-seed#[C2C6D1FC13CE2AC4]) [    ] o.a.s.u.StartupLoggingUtils Missing Java Option solr.log.dir. Logging may be missing or incomplete.
   [junit4]   2> 1637316 INFO  (TEST-TestTlogReplica.testBasicLeaderElection-seed#[C2C6D1FC13CE2AC4]) [    ] o.a.s.s.SolrDispatchFilter Using logger factory org.apache.logging.slf4j.Log4jLoggerFactory
   [junit4]   2> 1637316 INFO  (TEST-TestTlogReplica.testBasicLeaderElection-seed#[C2C6D1FC13CE2AC4]) [    ] o.a.s.s.SolrDispatchFilter  ___      _       Welcome to Apache Solr? version 7.6.0
   [junit4]   2> 1637316 INFO  (TEST-TestTlogReplica.testBasicLeaderElection-seed#[C2C6D1FC13CE2AC4]) [    ] o.a.s.s.SolrDispatchFilter / __| ___| |_ _   Starting in cloud mode on port null
   [junit4]   2> 1637316 INFO  (TEST-TestTlogReplica.testBasicLeaderElection-seed#[C2C6D1FC13CE2AC4]) [    ] o.a.s.s.SolrDispatchFilter \__ \/ _ \ | '_|  Install dir: null
   [junit4]   2> 1637316 INFO  (TEST-TestTlogReplica.testBasicLeaderElection-seed#[C2C6D1FC13CE2AC4]) [    ] o.a.s.s.SolrDispatchFilter |___/\___/_|_|    Start time: 2018-10-14T02:58:00.382895Z
   [junit4]   2> 1637317 INFO  (zkConnectionManagerCallback-9836-thread-1) [    ] o.a.s.c.c.ConnectionManager zkClient has connected
   [junit4]   2> 1637318 INFO  (TEST-TestTlogReplica.testBasicLeaderElection-seed#[C2C6D1FC13CE2AC4]) [    ] o.a.s.s.SolrDispatchFilter solr.xml found in ZooKeeper. Loading...
   [junit4]   2> 1637406 INFO  (TEST-TestTlogReplica.testBasicLeaderElection-seed#[C2C6D1FC13CE2AC4]) [    ] o.a.s.c.ZkContainer Zookeeper client=127.0.0.1:46097/solr
   [junit4]   2> 1637407 INFO  (zkConnectionManagerCallback-9840-thread-1) [    ] o.a.s.c.c.ConnectionManager zkClient has connected
   [junit4]   2> 1637408 INFO  (zkConnectionManagerCallback-9842-thread-1) [    ] o.a.s.c.c.ConnectionManager zkClient has connected
   [junit4]   2> 1637411 INFO  (TEST-TestTlogReplica.testBasicLeaderElection-seed#[C2C6D1FC13CE2AC4]) [n:127.0.0.1:35805_solr    ] o.a.s.c.c.ZkStateReader Updated live nodes from ZooKeeper... (0) -> (1)
   [junit4]   2> 1637412 INFO  (TEST-TestTlogReplica.testBasicLeaderElection-seed#[C2C6D1FC13CE2AC4]) [n:127.0.0.1:35805_solr    ] o.a.s.c.TransientSolrCoreCacheDefault Allocating transient cache for 2147483647 transient cores
   [junit4]   2> 1637412 INFO  (TEST-TestTlogReplica.testBasicLeaderElection-seed#[C2C6D1FC13CE2AC4]) [n:127.0.0.1:35805_solr    ] o.a.s.c.ZkController Register node as live in ZooKeeper:/live_nodes/127.0.0.1:35805_solr
   [junit4]   2> 1637413 DEBUG (OverseerStateUpdate-72092421922947076-127.0.0.1:42807_solr-n_0000000000) [n:127.0.0.1:42807_solr    ] o.a.s.c.Overseer processMessage: queueSize: 1, message = {
   [junit4]   2>   "operation":"downnode",
   [junit4]   2>   "node_name":"127.0.0.1:35805_solr"} current state version: 0
   [junit4]   2> 1637413 INFO  (zkCallback-9803-thread-2) [    ] o.a.s.c.c.ZkStateReader Updated live nodes from ZooKeeper... (1) -> (2)
   [junit4]   2> 1637413 INFO  (zkCallback-9832-thread-2) [    ] o.a.s.c.c.ZkStateReader Updated live nodes from ZooKeeper... (1) -> (2)
   [junit4]   2> 1637413 INFO  (zkCallback-9810-thread-1) [    ] o.a.s.c.c.ZkStateReader Updated live nodes from ZooKeeper... (1) -> (2)
   [junit4]   2> 1637418 INFO  (zkCallback-9841-thread-1) [    ] o.a.s.c.c.ZkStateReader Updated live nodes from ZooKeeper... (1) -> (2)
   [junit4]   2> 1637429 INFO  (zkConnectionManagerCallback-9849-thread-1) [    ] o.a.s.c.c.ConnectionManager zkClient has connected
   [junit4]   2> 1637430 INFO  (TEST-TestTlogReplica.testBasicLeaderElection-seed#[C2C6D1FC13CE2AC4]) [n:127.0.0.1:35805_solr    ] o.a.s.c.c.ZkStateReader Updated live nodes from ZooKeeper... (0) -> (2)
   [junit4]   2> 1637430 INFO  (TEST-TestTlogReplica.testBasicLeaderElection-seed#[C2C6D1FC13CE2AC4]) [n:127.0.0.1:35805_solr    ] o.a.s.c.s.i.ZkClientClusterStateProvider Cluster at 127.0.0.1:46097/solr ready
   [junit4]   2> 1637431 INFO  (TEST-TestTlogReplica.testBasicLeaderElection-seed#[C2C6D1FC13CE2AC4]) [n:127.0.0.1:35805_solr    ] o.a.s.h.a.MetricsHistoryHandler No .system collection, keeping metrics history in memory.
   [junit4]   2> 1637442 INFO  (TEST-TestTlogReplica.testBasicLeaderElection-seed#[C2C6D1FC13CE2AC4]) [n:127.0.0.1:35805_solr    ] o.a.s.m.r.SolrJmxReporter JMX monitoring for 'solr_35805.solr.node' (registry 'solr.node') enabled at server: com.sun.jmx.mbeanserver.JmxMBeanServer@4f9a2c08
   [junit4]   2> 1637448 INFO  (TEST-TestTlogReplica.testBasicLeaderElection-seed#[C2C6D1FC13CE2AC4]) [n:127.0.0.1:35805_solr    ] o.a.s.m.r.SolrJmxReporter JMX monitoring for 'solr_35805.solr.jvm' (registry 'solr.jvm') enabled at server: com.sun.jmx.mbeanserver.JmxMBeanServer@4f9a2c08
   [junit4]   2> 1637448 INFO  (TEST-TestTlogReplica.testBasicLeaderElection-seed#[C2C6D1FC13CE2AC4]) [n:127.0.0.1:35805_solr    ] o.a.s.m.r.SolrJmxReporter JMX monitoring for 'solr_35805.solr.jetty' (registry 'solr.jetty') enabled at server: com.sun.jmx.mbeanserver.JmxMBeanServe

[...truncated too long message...]

  ] o.a.s.m.SolrMetricManager Closing metric reporters for registry=solr.cluster, tag=null
   [junit4]   2> 203278 INFO  (zkCallback-237-thread-2) [    ] o.a.s.c.c.ZkStateReader Updated live nodes from ZooKeeper... (2) -> (0)
   [junit4]   2> 203278 INFO  (zkCallback-254-thread-2) [    ] o.a.s.c.c.ZkStateReader Updated live nodes from ZooKeeper... (2) -> (0)
   [junit4]   2> 203278 INFO  (zkCallback-261-thread-1) [    ] o.a.s.c.c.ZkStateReader Updated live nodes from ZooKeeper... (2) -> (0)
   [junit4]   2> 203278 INFO  (zkCallback-244-thread-1) [    ] o.a.s.c.c.ZkStateReader Updated live nodes from ZooKeeper... (2) -> (0)
   [junit4]   2> 203280 INFO  (jetty-closer-134-thread-2) [    ] o.a.s.c.Overseer Overseer (id=72092591736094745-127.0.0.1:41729_solr-n_0000000005) closing
   [junit4]   2> 203280 INFO  (OverseerStateUpdate-72092591736094745-127.0.0.1:41729_solr-n_0000000005) [n:127.0.0.1:41729_solr    ] o.a.s.c.Overseer Overseer Loop exiting : 127.0.0.1:41729_solr
   [junit4]   2> 203280 WARN  (OverseerAutoScalingTriggerThread-72092591736094745-127.0.0.1:41729_solr-n_0000000005) [    ] o.a.s.c.a.OverseerTriggerThread OverseerTriggerThread woken up but we are closed, exiting.
   [junit4]   2> 203281 INFO  (zkCallback-254-thread-2) [    ] o.a.s.c.OverseerElectionContext I am going to be the leader 127.0.0.1:41791_solr
   [junit4]   2> 203282 INFO  (jetty-closer-134-thread-2) [    ] o.e.j.s.h.ContextHandler Stopped o.e.j.s.ServletContextHandler@716a2490{/solr,null,UNAVAILABLE}
   [junit4]   2> 203282 INFO  (jetty-closer-134-thread-2) [    ] o.e.j.s.session node0 Stopped scavenging
   [junit4]   2> 210866 ERROR (recoveryExecutor-251-thread-1-processing-n:127.0.0.1:41791_solr x:tlog_replica_test_recovery_shard1_replica_t1 c:tlog_replica_test_recovery s:shard1 r:core_node3) [n:127.0.0.1:41791_solr c:tlog_replica_test_recovery s:shard1 r:core_node3 x:tlog_replica_test_recovery_shard1_replica_t1] o.a.s.c.RecoveryStrategy SolrCore not found - cannot recover:tlog_replica_test_recovery_shard1_replica_t1
   [junit4]   2> 210868 INFO  (jetty-closer-134-thread-1) [    ] o.e.j.s.h.ContextHandler Stopped o.e.j.s.ServletContextHandler@31d4a163{/solr,null,UNAVAILABLE}
   [junit4]   2> 210868 INFO  (jetty-closer-134-thread-1) [    ] o.e.j.s.session node0 Stopped scavenging
   [junit4]   2> 210868 ERROR (SUITE-TestTlogReplica-seed#[C2C6D1FC13CE2AC4]-worker) [    ] o.a.z.s.ZooKeeperServer ZKShutdownHandler is not registered, so ZooKeeper server won't take any action on ERROR or SHUTDOWN server state changes
   [junit4]   2> 210868 INFO  (SUITE-TestTlogReplica-seed#[C2C6D1FC13CE2AC4]-worker) [    ] o.a.s.c.ZkTestServer connecting to 127.0.0.1:41957 41957
   [junit4]   2> 210976 INFO  (Thread-97) [    ] o.a.s.c.ZkTestServer connecting to 127.0.0.1:41957 41957
   [junit4]   2> 210977 WARN  (Thread-97) [    ] o.a.s.c.ZkTestServer Watch limit violations: 
   [junit4]   2> Maximum concurrent create/delete watches above limit:
   [junit4]   2> 
   [junit4]   2> 	31	/solr/collections/tlog_replica_test_create_delete/terms/shard2
   [junit4]   2> 	30	/solr/configs/conf
   [junit4]   2> 	28	/solr/collections/tlog_replica_test_create_delete/terms/shard1
   [junit4]   2> 	20	/solr/collections/tlog_replica_test_remove_leader/terms/shard1
   [junit4]   2> 	18	/solr/collections/tlog_replica_test_recovery/terms/shard1
   [junit4]   2> 	17	/solr/collections/tlog_replica_test_basic_leader_election/terms/shard1
   [junit4]   2> 	16	/solr/collections/tlog_replica_test_kill_leader/terms/shard1
   [junit4]   2> 	16	/solr/collections/tlog_replica_test_kill_tlog_replica/terms/shard1
   [junit4]   2> 	15	/solr/aliases.json
   [junit4]   2> 	14	/solr/collections/tlog_replica_test_out_of_order_db_qwith_in_place_updates/terms/shard1
   [junit4]   2> 	10	/solr/collections/tlog_replica_test_delete_by_id/terms/shard1
   [junit4]   2> 	10	/solr/collections/tlog_replica_test_only_leader_indexes/terms/shard1
   [junit4]   2> 	8	/solr/collections/tlog_replica_test_add_remove_tlog_replica/terms/shard2
   [junit4]   2> 	7	/solr/security.json
   [junit4]   2> 	7	/solr/collections/tlog_replica_test_add_remove_tlog_replica/terms/shard1
   [junit4]   2> 	4	/solr/collections/tlog_replica_test_add_docs/terms/shard1
   [junit4]   2> 	4	/solr/collections/tlog_replica_test_real_time_get/terms/shard1
   [junit4]   2> 
   [junit4]   2> Maximum concurrent data watches above limit:
   [junit4]   2> 
   [junit4]   2> 	25	/solr/collections/tlog_replica_test_out_of_order_db_qwith_in_place_updates/state.json
   [junit4]   2> 	21	/solr/collections/tlog_replica_test_create_delete/state.json
   [junit4]   2> 	15	/solr/clusterprops.json
   [junit4]   2> 	15	/solr/clusterstate.json
   [junit4]   2> 	11	/solr/collections/tlog_replica_test_kill_leader/state.json
   [junit4]   2> 	10	/solr/collections/tlog_replica_test_kill_tlog_replica/state.json
   [junit4]   2> 	9	/solr/collections/tlog_replica_test_remove_leader/state.json
   [junit4]   2> 	8	/solr/collections/tlog_replica_test_recovery/state.json
   [junit4]   2> 	8	/solr/collections/tlog_replica_test_basic_leader_election/state.json
   [junit4]   2> 	4	/solr/autoscaling.json
   [junit4]   2> 	4	/solr/collections/tlog_replica_test_create_delete/leader_elect/shard1/election/72092591736094733-core_node5-n_0000000001
   [junit4]   2> 	3	/solr/collections/tlog_replica_test_add_remove_tlog_replica/state.json
   [junit4]   2> 	3	/solr/collections/tlog_replica_test_only_leader_indexes/state.json
   [junit4]   2> 	3	/solr/collections/tlog_replica_test_delete_by_id/state.json
   [junit4]   2> 	2	/solr/collections/tlog_replica_test_add_docs/state.json
   [junit4]   2> 	2	/solr/collections/tlog_replica_test_create_delete/leader_elect/shard2/election/72092591736094741-core_node16-n_0000000001
   [junit4]   2> 	2	/solr/overseer_elect/election/72092591736094724-127.0.0.1:41791_solr-n_0000000000
   [junit4]   2> 	2	/solr/collections/tlog_replica_test_recovery/leader_elect/shard1/election/72092591736094745-core_node4-n_0000000000
   [junit4]   2> 	2	/solr/collections/tlog_replica_test_create_delete/leader_elect/shard1/election/72092591736094733-core_node7-n_0000000000
   [junit4]   2> 	2	/solr/collections/tlog_replica_test_real_time_get/state.json
   [junit4]   2> 	2	/solr/collections/tlog_replica_test_kill_tlog_replica/leader_elect/shard1/election/72092591736094733-core_node4-n_0000000000
   [junit4]   2> 	2	/solr/overseer_elect/election/72092591736094733-127.0.0.1:41729_solr-n_0000000002
   [junit4]   2> 
   [junit4]   2> Maximum concurrent children watches above limit:
   [junit4]   2> 
   [junit4]   2> 	15	/solr/live_nodes
   [junit4]   2> 	15	/solr/collections
   [junit4]   2> 	4	/solr/overseer/queue
   [junit4]   2> 	4	/solr/autoscaling/events/.scheduled_maintenance
   [junit4]   2> 	4	/solr/autoscaling/events/.auto_add_replicas
   [junit4]   2> 	4	/solr/overseer/collection-queue-work
   [junit4]   2> 	4	/solr/overseer/queue-work
   [junit4]   2> 
   [junit4]   2> NOTE: leaving temporary files on disk at: /home/jenkins/workspace/Lucene-Solr-7.x-Linux/solr/build/solr-core/test/J0/temp/solr.cloud.TestTlogReplica_C2C6D1FC13CE2AC4-002
   [junit4]   2> Oct 14, 2018 3:42:46 AM com.carrotsearch.randomizedtesting.ThreadLeakControl checkThreadLeaks
   [junit4]   2> WARNING: Will linger awaiting termination of 1 leaked thread(s).
   [junit4]   2> NOTE: test params are: codec=Asserting(Lucene70): {foo=FSTOrd50, title_s=FSTOrd50, id=PostingsFormat(name=Memory), foo_s=FSTOrd50}, docValues:{_version_=DocValuesFormat(name=Memory), id=DocValuesFormat(name=Direct), inplace_updatable_int=DocValuesFormat(name=Lucene70)}, maxPointsInLeafNode=1672, maxMBSortInHeap=7.55268162754289, sim=RandomSimilarity(queryNorm=true): {}, locale=ksb-TZ, timezone=Asia/Macao
   [junit4]   2> NOTE: Linux 4.15.0-36-generic amd64/Oracle Corporation 9.0.4 (64-bit)/cpus=8,threads=1,free=139569976,total=523239424
   [junit4]   2> NOTE: All tests run in this JVM: [TestTlogReplica, TestTlogReplica]
   [junit4] Completed [5/5 (5!)] on J0 in 101.61s, 13 tests, 1 failure <<< FAILURES!

[...truncated 15 lines...]
BUILD FAILED
/home/jenkins/workspace/Lucene-Solr-7.x-Linux/lucene/common-build.xml:1567: The following error occurred while executing this line:
/home/jenkins/workspace/Lucene-Solr-7.x-Linux/lucene/common-build.xml:1092: There were test failures: 5 suites, 65 tests, 5 failures [seed: C2C6D1FC13CE2AC4]

Total time: 3 minutes 33 seconds

[repro] Setting last failure code to 256

[repro] Failures:
[repro]   5/5 failed: org.apache.solr.cloud.TestTlogReplica
[repro] Exiting with code 256
+ mv lucene/build lucene/build.repro
+ mv solr/build solr/build.repro
+ mv lucene/build.orig lucene/build
+ mv solr/build.orig solr/build
Archiving artifacts
Setting ANT_1_8_2_HOME=/var/lib/jenkins/tools/hudson.tasks.Ant_AntInstallation/ANT_1.8.2
[WARNINGS] Parsing warnings in console log with parser Java Compiler (javac)
Setting ANT_1_8_2_HOME=/var/lib/jenkins/tools/hudson.tasks.Ant_AntInstallation/ANT_1.8.2
Setting ANT_1_8_2_HOME=/var/lib/jenkins/tools/hudson.tasks.Ant_AntInstallation/ANT_1.8.2
<Git Blamer> Using GitBlamer to create author and commit information for all warnings.
<Git Blamer> GIT_COMMIT=37fdcb02d87ec44293ec4942c75a3cb709c45418, workspace=/var/lib/jenkins/workspace/Lucene-Solr-7.x-Linux
[WARNINGS] Computing warning deltas based on reference build #2908
Recording test results
Setting ANT_1_8_2_HOME=/var/lib/jenkins/tools/hudson.tasks.Ant_AntInstallation/ANT_1.8.2
Build step 'Publish JUnit test result report' changed build result to UNSTABLE
Email was triggered for: Unstable (Test Failures)
Sending email for trigger: Unstable (Test Failures)
Setting ANT_1_8_2_HOME=/var/lib/jenkins/tools/hudson.tasks.Ant_AntInstallation/ANT_1.8.2
Setting ANT_1_8_2_HOME=/var/lib/jenkins/tools/hudson.tasks.Ant_AntInstallation/ANT_1.8.2
Setting ANT_1_8_2_HOME=/var/lib/jenkins/tools/hudson.tasks.Ant_AntInstallation/ANT_1.8.2
Setting ANT_1_8_2_HOME=/var/lib/jenkins/tools/hudson.tasks.Ant_AntInstallation/ANT_1.8.2

Mime
View raw message