lucene-dev mailing list archives

Site index · List index
Message view « Date » · « Thread »
Top « Date » · « Thread »
From Policeman Jenkins Server <jenk...@thetaphi.de>
Subject [JENKINS] Lucene-Solr-7.x-Solaris (64bit/jdk1.8.0) - Build # 878 - Still Unstable!
Date Fri, 26 Oct 2018 16:20:47 GMT
Build: https://jenkins.thetaphi.de/job/Lucene-Solr-7.x-Solaris/878/
Java: 64bit/jdk1.8.0 -XX:+UseCompressedOops -XX:+UseG1GC

12 tests failed.
FAILED:  org.apache.solr.client.solrj.request.TestV2Request.testHttpSolrClient

Error Message:
expected:<0> but was:<1>

Stack Trace:
java.lang.AssertionError: expected:<0> but was:<1>
	at __randomizedtesting.SeedInfo.seed([C8A88DA647B3483B:10B0958CE6875A1C]:0)
	at org.junit.Assert.fail(Assert.java:93)
	at org.junit.Assert.failNotEquals(Assert.java:647)
	at org.junit.Assert.assertEquals(Assert.java:128)
	at org.junit.Assert.assertEquals(Assert.java:472)
	at org.junit.Assert.assertEquals(Assert.java:456)
	at org.apache.solr.client.solrj.request.TestV2Request.doTest(TestV2Request.java:105)
	at org.apache.solr.client.solrj.request.TestV2Request.testHttpSolrClient(TestV2Request.java:70)
	at sun.reflect.NativeMethodAccessorImpl.invoke0(Native Method)
	at sun.reflect.NativeMethodAccessorImpl.invoke(NativeMethodAccessorImpl.java:62)
	at sun.reflect.DelegatingMethodAccessorImpl.invoke(DelegatingMethodAccessorImpl.java:43)
	at java.lang.reflect.Method.invoke(Method.java:498)
	at com.carrotsearch.randomizedtesting.RandomizedRunner.invoke(RandomizedRunner.java:1742)
	at com.carrotsearch.randomizedtesting.RandomizedRunner$8.evaluate(RandomizedRunner.java:935)
	at com.carrotsearch.randomizedtesting.RandomizedRunner$9.evaluate(RandomizedRunner.java:971)
	at com.carrotsearch.randomizedtesting.RandomizedRunner$10.evaluate(RandomizedRunner.java:985)
	at com.carrotsearch.randomizedtesting.rules.SystemPropertiesRestoreRule$1.evaluate(SystemPropertiesRestoreRule.java:57)
	at org.apache.lucene.util.TestRuleSetupTeardownChained$1.evaluate(TestRuleSetupTeardownChained.java:49)
	at org.apache.lucene.util.AbstractBeforeAfterRule$1.evaluate(AbstractBeforeAfterRule.java:45)
	at org.apache.lucene.util.TestRuleThreadAndTestName$1.evaluate(TestRuleThreadAndTestName.java:48)
	at org.apache.lucene.util.TestRuleIgnoreAfterMaxFailures$1.evaluate(TestRuleIgnoreAfterMaxFailures.java:64)
	at org.apache.lucene.util.TestRuleMarkFailure$1.evaluate(TestRuleMarkFailure.java:47)
	at com.carrotsearch.randomizedtesting.rules.StatementAdapter.evaluate(StatementAdapter.java:36)
	at com.carrotsearch.randomizedtesting.ThreadLeakControl$StatementRunner.run(ThreadLeakControl.java:368)
	at com.carrotsearch.randomizedtesting.ThreadLeakControl.forkTimeoutingTask(ThreadLeakControl.java:817)
	at com.carrotsearch.randomizedtesting.ThreadLeakControl$3.evaluate(ThreadLeakControl.java:468)
	at com.carrotsearch.randomizedtesting.RandomizedRunner.runSingleTest(RandomizedRunner.java:944)
	at com.carrotsearch.randomizedtesting.RandomizedRunner$5.evaluate(RandomizedRunner.java:830)
	at com.carrotsearch.randomizedtesting.RandomizedRunner$6.evaluate(RandomizedRunner.java:880)
	at com.carrotsearch.randomizedtesting.RandomizedRunner$7.evaluate(RandomizedRunner.java:891)
	at com.carrotsearch.randomizedtesting.rules.StatementAdapter.evaluate(StatementAdapter.java:36)
	at com.carrotsearch.randomizedtesting.rules.SystemPropertiesRestoreRule$1.evaluate(SystemPropertiesRestoreRule.java:57)
	at org.apache.lucene.util.AbstractBeforeAfterRule$1.evaluate(AbstractBeforeAfterRule.java:45)
	at com.carrotsearch.randomizedtesting.rules.StatementAdapter.evaluate(StatementAdapter.java:36)
	at org.apache.lucene.util.TestRuleStoreClassName$1.evaluate(TestRuleStoreClassName.java:41)
	at com.carrotsearch.randomizedtesting.rules.NoShadowingOrOverridesOnMethodsRule$1.evaluate(NoShadowingOrOverridesOnMethodsRule.java:40)
	at com.carrotsearch.randomizedtesting.rules.NoShadowingOrOverridesOnMethodsRule$1.evaluate(NoShadowingOrOverridesOnMethodsRule.java:40)
	at com.carrotsearch.randomizedtesting.rules.StatementAdapter.evaluate(StatementAdapter.java:36)
	at com.carrotsearch.randomizedtesting.rules.StatementAdapter.evaluate(StatementAdapter.java:36)
	at com.carrotsearch.randomizedtesting.rules.StatementAdapter.evaluate(StatementAdapter.java:36)
	at org.apache.lucene.util.TestRuleAssertionsRequired$1.evaluate(TestRuleAssertionsRequired.java:53)
	at org.apache.lucene.util.TestRuleMarkFailure$1.evaluate(TestRuleMarkFailure.java:47)
	at org.apache.lucene.util.TestRuleIgnoreAfterMaxFailures$1.evaluate(TestRuleIgnoreAfterMaxFailures.java:64)
	at org.apache.lucene.util.TestRuleIgnoreTestSuites$1.evaluate(TestRuleIgnoreTestSuites.java:54)
	at com.carrotsearch.randomizedtesting.rules.StatementAdapter.evaluate(StatementAdapter.java:36)
	at com.carrotsearch.randomizedtesting.ThreadLeakControl$StatementRunner.run(ThreadLeakControl.java:368)
	at java.lang.Thread.run(Thread.java:748)


FAILED:  org.apache.solr.client.solrj.request.TestV2Request.testCloudSolrClient

Error Message:
expected:<0> but was:<1>

Stack Trace:
java.lang.AssertionError: expected:<0> but was:<1>
	at __randomizedtesting.SeedInfo.seed([C8A88DA647B3483B:515E0616E200C050]:0)
	at org.junit.Assert.fail(Assert.java:93)
	at org.junit.Assert.failNotEquals(Assert.java:647)
	at org.junit.Assert.assertEquals(Assert.java:128)
	at org.junit.Assert.assertEquals(Assert.java:472)
	at org.junit.Assert.assertEquals(Assert.java:456)
	at org.apache.solr.client.solrj.request.TestV2Request.doTest(TestV2Request.java:105)
	at org.apache.solr.client.solrj.request.TestV2Request.testCloudSolrClient(TestV2Request.java:77)
	at sun.reflect.NativeMethodAccessorImpl.invoke0(Native Method)
	at sun.reflect.NativeMethodAccessorImpl.invoke(NativeMethodAccessorImpl.java:62)
	at sun.reflect.DelegatingMethodAccessorImpl.invoke(DelegatingMethodAccessorImpl.java:43)
	at java.lang.reflect.Method.invoke(Method.java:498)
	at com.carrotsearch.randomizedtesting.RandomizedRunner.invoke(RandomizedRunner.java:1742)
	at com.carrotsearch.randomizedtesting.RandomizedRunner$8.evaluate(RandomizedRunner.java:935)
	at com.carrotsearch.randomizedtesting.RandomizedRunner$9.evaluate(RandomizedRunner.java:971)
	at com.carrotsearch.randomizedtesting.RandomizedRunner$10.evaluate(RandomizedRunner.java:985)
	at com.carrotsearch.randomizedtesting.rules.SystemPropertiesRestoreRule$1.evaluate(SystemPropertiesRestoreRule.java:57)
	at org.apache.lucene.util.TestRuleSetupTeardownChained$1.evaluate(TestRuleSetupTeardownChained.java:49)
	at org.apache.lucene.util.AbstractBeforeAfterRule$1.evaluate(AbstractBeforeAfterRule.java:45)
	at org.apache.lucene.util.TestRuleThreadAndTestName$1.evaluate(TestRuleThreadAndTestName.java:48)
	at org.apache.lucene.util.TestRuleIgnoreAfterMaxFailures$1.evaluate(TestRuleIgnoreAfterMaxFailures.java:64)
	at org.apache.lucene.util.TestRuleMarkFailure$1.evaluate(TestRuleMarkFailure.java:47)
	at com.carrotsearch.randomizedtesting.rules.StatementAdapter.evaluate(StatementAdapter.java:36)
	at com.carrotsearch.randomizedtesting.ThreadLeakControl$StatementRunner.run(ThreadLeakControl.java:368)
	at com.carrotsearch.randomizedtesting.ThreadLeakControl.forkTimeoutingTask(ThreadLeakControl.java:817)
	at com.carrotsearch.randomizedtesting.ThreadLeakControl$3.evaluate(ThreadLeakControl.java:468)
	at com.carrotsearch.randomizedtesting.RandomizedRunner.runSingleTest(RandomizedRunner.java:944)
	at com.carrotsearch.randomizedtesting.RandomizedRunner$5.evaluate(RandomizedRunner.java:830)
	at com.carrotsearch.randomizedtesting.RandomizedRunner$6.evaluate(RandomizedRunner.java:880)
	at com.carrotsearch.randomizedtesting.RandomizedRunner$7.evaluate(RandomizedRunner.java:891)
	at com.carrotsearch.randomizedtesting.rules.StatementAdapter.evaluate(StatementAdapter.java:36)
	at com.carrotsearch.randomizedtesting.rules.SystemPropertiesRestoreRule$1.evaluate(SystemPropertiesRestoreRule.java:57)
	at org.apache.lucene.util.AbstractBeforeAfterRule$1.evaluate(AbstractBeforeAfterRule.java:45)
	at com.carrotsearch.randomizedtesting.rules.StatementAdapter.evaluate(StatementAdapter.java:36)
	at org.apache.lucene.util.TestRuleStoreClassName$1.evaluate(TestRuleStoreClassName.java:41)
	at com.carrotsearch.randomizedtesting.rules.NoShadowingOrOverridesOnMethodsRule$1.evaluate(NoShadowingOrOverridesOnMethodsRule.java:40)
	at com.carrotsearch.randomizedtesting.rules.NoShadowingOrOverridesOnMethodsRule$1.evaluate(NoShadowingOrOverridesOnMethodsRule.java:40)
	at com.carrotsearch.randomizedtesting.rules.StatementAdapter.evaluate(StatementAdapter.java:36)
	at com.carrotsearch.randomizedtesting.rules.StatementAdapter.evaluate(StatementAdapter.java:36)
	at com.carrotsearch.randomizedtesting.rules.StatementAdapter.evaluate(StatementAdapter.java:36)
	at org.apache.lucene.util.TestRuleAssertionsRequired$1.evaluate(TestRuleAssertionsRequired.java:53)
	at org.apache.lucene.util.TestRuleMarkFailure$1.evaluate(TestRuleMarkFailure.java:47)
	at org.apache.lucene.util.TestRuleIgnoreAfterMaxFailures$1.evaluate(TestRuleIgnoreAfterMaxFailures.java:64)
	at org.apache.lucene.util.TestRuleIgnoreTestSuites$1.evaluate(TestRuleIgnoreTestSuites.java:54)
	at com.carrotsearch.randomizedtesting.rules.StatementAdapter.evaluate(StatementAdapter.java:36)
	at com.carrotsearch.randomizedtesting.ThreadLeakControl$StatementRunner.run(ThreadLeakControl.java:368)
	at java.lang.Thread.run(Thread.java:748)


FAILED:  junit.framework.TestSuite.org.apache.solr.client.solrj.request.TestV2Request

Error Message:
1 thread leaked from SUITE scope at org.apache.solr.client.solrj.request.TestV2Request:     1) Thread[id=171, name=Connection evictor, state=TIMED_WAITING, group=TGRP-TestV2Request]         at java.lang.Thread.sleep(Native Method)         at org.apache.http.impl.client.IdleConnectionEvictor$1.run(IdleConnectionEvictor.java:66)         at java.lang.Thread.run(Thread.java:748)

Stack Trace:
com.carrotsearch.randomizedtesting.ThreadLeakError: 1 thread leaked from SUITE scope at org.apache.solr.client.solrj.request.TestV2Request: 
   1) Thread[id=171, name=Connection evictor, state=TIMED_WAITING, group=TGRP-TestV2Request]
        at java.lang.Thread.sleep(Native Method)
        at org.apache.http.impl.client.IdleConnectionEvictor$1.run(IdleConnectionEvictor.java:66)
        at java.lang.Thread.run(Thread.java:748)
	at __randomizedtesting.SeedInfo.seed([C8A88DA647B3483B]:0)


FAILED:  org.apache.solr.client.solrj.request.TestV2Request.testHttpSolrClient

Error Message:
expected:<0> but was:<1>

Stack Trace:
java.lang.AssertionError: expected:<0> but was:<1>
	at __randomizedtesting.SeedInfo.seed([C8A88DA647B3483B:10B0958CE6875A1C]:0)
	at org.junit.Assert.fail(Assert.java:93)
	at org.junit.Assert.failNotEquals(Assert.java:647)
	at org.junit.Assert.assertEquals(Assert.java:128)
	at org.junit.Assert.assertEquals(Assert.java:472)
	at org.junit.Assert.assertEquals(Assert.java:456)
	at org.apache.solr.client.solrj.request.TestV2Request.doTest(TestV2Request.java:105)
	at org.apache.solr.client.solrj.request.TestV2Request.testHttpSolrClient(TestV2Request.java:70)
	at sun.reflect.NativeMethodAccessorImpl.invoke0(Native Method)
	at sun.reflect.NativeMethodAccessorImpl.invoke(NativeMethodAccessorImpl.java:62)
	at sun.reflect.DelegatingMethodAccessorImpl.invoke(DelegatingMethodAccessorImpl.java:43)
	at java.lang.reflect.Method.invoke(Method.java:498)
	at com.carrotsearch.randomizedtesting.RandomizedRunner.invoke(RandomizedRunner.java:1742)
	at com.carrotsearch.randomizedtesting.RandomizedRunner$8.evaluate(RandomizedRunner.java:935)
	at com.carrotsearch.randomizedtesting.RandomizedRunner$9.evaluate(RandomizedRunner.java:971)
	at com.carrotsearch.randomizedtesting.RandomizedRunner$10.evaluate(RandomizedRunner.java:985)
	at com.carrotsearch.randomizedtesting.rules.SystemPropertiesRestoreRule$1.evaluate(SystemPropertiesRestoreRule.java:57)
	at org.apache.lucene.util.TestRuleSetupTeardownChained$1.evaluate(TestRuleSetupTeardownChained.java:49)
	at org.apache.lucene.util.AbstractBeforeAfterRule$1.evaluate(AbstractBeforeAfterRule.java:45)
	at org.apache.lucene.util.TestRuleThreadAndTestName$1.evaluate(TestRuleThreadAndTestName.java:48)
	at org.apache.lucene.util.TestRuleIgnoreAfterMaxFailures$1.evaluate(TestRuleIgnoreAfterMaxFailures.java:64)
	at org.apache.lucene.util.TestRuleMarkFailure$1.evaluate(TestRuleMarkFailure.java:47)
	at com.carrotsearch.randomizedtesting.rules.StatementAdapter.evaluate(StatementAdapter.java:36)
	at com.carrotsearch.randomizedtesting.ThreadLeakControl$StatementRunner.run(ThreadLeakControl.java:368)
	at com.carrotsearch.randomizedtesting.ThreadLeakControl.forkTimeoutingTask(ThreadLeakControl.java:817)
	at com.carrotsearch.randomizedtesting.ThreadLeakControl$3.evaluate(ThreadLeakControl.java:468)
	at com.carrotsearch.randomizedtesting.RandomizedRunner.runSingleTest(RandomizedRunner.java:944)
	at com.carrotsearch.randomizedtesting.RandomizedRunner$5.evaluate(RandomizedRunner.java:830)
	at com.carrotsearch.randomizedtesting.RandomizedRunner$6.evaluate(RandomizedRunner.java:880)
	at com.carrotsearch.randomizedtesting.RandomizedRunner$7.evaluate(RandomizedRunner.java:891)
	at com.carrotsearch.randomizedtesting.rules.StatementAdapter.evaluate(StatementAdapter.java:36)
	at com.carrotsearch.randomizedtesting.rules.SystemPropertiesRestoreRule$1.evaluate(SystemPropertiesRestoreRule.java:57)
	at org.apache.lucene.util.AbstractBeforeAfterRule$1.evaluate(AbstractBeforeAfterRule.java:45)
	at com.carrotsearch.randomizedtesting.rules.StatementAdapter.evaluate(StatementAdapter.java:36)
	at org.apache.lucene.util.TestRuleStoreClassName$1.evaluate(TestRuleStoreClassName.java:41)
	at com.carrotsearch.randomizedtesting.rules.NoShadowingOrOverridesOnMethodsRule$1.evaluate(NoShadowingOrOverridesOnMethodsRule.java:40)
	at com.carrotsearch.randomizedtesting.rules.NoShadowingOrOverridesOnMethodsRule$1.evaluate(NoShadowingOrOverridesOnMethodsRule.java:40)
	at com.carrotsearch.randomizedtesting.rules.StatementAdapter.evaluate(StatementAdapter.java:36)
	at com.carrotsearch.randomizedtesting.rules.StatementAdapter.evaluate(StatementAdapter.java:36)
	at com.carrotsearch.randomizedtesting.rules.StatementAdapter.evaluate(StatementAdapter.java:36)
	at org.apache.lucene.util.TestRuleAssertionsRequired$1.evaluate(TestRuleAssertionsRequired.java:53)
	at org.apache.lucene.util.TestRuleMarkFailure$1.evaluate(TestRuleMarkFailure.java:47)
	at org.apache.lucene.util.TestRuleIgnoreAfterMaxFailures$1.evaluate(TestRuleIgnoreAfterMaxFailures.java:64)
	at org.apache.lucene.util.TestRuleIgnoreTestSuites$1.evaluate(TestRuleIgnoreTestSuites.java:54)
	at com.carrotsearch.randomizedtesting.rules.StatementAdapter.evaluate(StatementAdapter.java:36)
	at com.carrotsearch.randomizedtesting.ThreadLeakControl$StatementRunner.run(ThreadLeakControl.java:368)
	at java.lang.Thread.run(Thread.java:748)


FAILED:  org.apache.solr.client.solrj.request.TestV2Request.testCloudSolrClient

Error Message:
expected:<0> but was:<1>

Stack Trace:
java.lang.AssertionError: expected:<0> but was:<1>
	at __randomizedtesting.SeedInfo.seed([C8A88DA647B3483B:515E0616E200C050]:0)
	at org.junit.Assert.fail(Assert.java:93)
	at org.junit.Assert.failNotEquals(Assert.java:647)
	at org.junit.Assert.assertEquals(Assert.java:128)
	at org.junit.Assert.assertEquals(Assert.java:472)
	at org.junit.Assert.assertEquals(Assert.java:456)
	at org.apache.solr.client.solrj.request.TestV2Request.doTest(TestV2Request.java:105)
	at org.apache.solr.client.solrj.request.TestV2Request.testCloudSolrClient(TestV2Request.java:77)
	at sun.reflect.NativeMethodAccessorImpl.invoke0(Native Method)
	at sun.reflect.NativeMethodAccessorImpl.invoke(NativeMethodAccessorImpl.java:62)
	at sun.reflect.DelegatingMethodAccessorImpl.invoke(DelegatingMethodAccessorImpl.java:43)
	at java.lang.reflect.Method.invoke(Method.java:498)
	at com.carrotsearch.randomizedtesting.RandomizedRunner.invoke(RandomizedRunner.java:1742)
	at com.carrotsearch.randomizedtesting.RandomizedRunner$8.evaluate(RandomizedRunner.java:935)
	at com.carrotsearch.randomizedtesting.RandomizedRunner$9.evaluate(RandomizedRunner.java:971)
	at com.carrotsearch.randomizedtesting.RandomizedRunner$10.evaluate(RandomizedRunner.java:985)
	at com.carrotsearch.randomizedtesting.rules.SystemPropertiesRestoreRule$1.evaluate(SystemPropertiesRestoreRule.java:57)
	at org.apache.lucene.util.TestRuleSetupTeardownChained$1.evaluate(TestRuleSetupTeardownChained.java:49)
	at org.apache.lucene.util.AbstractBeforeAfterRule$1.evaluate(AbstractBeforeAfterRule.java:45)
	at org.apache.lucene.util.TestRuleThreadAndTestName$1.evaluate(TestRuleThreadAndTestName.java:48)
	at org.apache.lucene.util.TestRuleIgnoreAfterMaxFailures$1.evaluate(TestRuleIgnoreAfterMaxFailures.java:64)
	at org.apache.lucene.util.TestRuleMarkFailure$1.evaluate(TestRuleMarkFailure.java:47)
	at com.carrotsearch.randomizedtesting.rules.StatementAdapter.evaluate(StatementAdapter.java:36)
	at com.carrotsearch.randomizedtesting.ThreadLeakControl$StatementRunner.run(ThreadLeakControl.java:368)
	at com.carrotsearch.randomizedtesting.ThreadLeakControl.forkTimeoutingTask(ThreadLeakControl.java:817)
	at com.carrotsearch.randomizedtesting.ThreadLeakControl$3.evaluate(ThreadLeakControl.java:468)
	at com.carrotsearch.randomizedtesting.RandomizedRunner.runSingleTest(RandomizedRunner.java:944)
	at com.carrotsearch.randomizedtesting.RandomizedRunner$5.evaluate(RandomizedRunner.java:830)
	at com.carrotsearch.randomizedtesting.RandomizedRunner$6.evaluate(RandomizedRunner.java:880)
	at com.carrotsearch.randomizedtesting.RandomizedRunner$7.evaluate(RandomizedRunner.java:891)
	at com.carrotsearch.randomizedtesting.rules.StatementAdapter.evaluate(StatementAdapter.java:36)
	at com.carrotsearch.randomizedtesting.rules.SystemPropertiesRestoreRule$1.evaluate(SystemPropertiesRestoreRule.java:57)
	at org.apache.lucene.util.AbstractBeforeAfterRule$1.evaluate(AbstractBeforeAfterRule.java:45)
	at com.carrotsearch.randomizedtesting.rules.StatementAdapter.evaluate(StatementAdapter.java:36)
	at org.apache.lucene.util.TestRuleStoreClassName$1.evaluate(TestRuleStoreClassName.java:41)
	at com.carrotsearch.randomizedtesting.rules.NoShadowingOrOverridesOnMethodsRule$1.evaluate(NoShadowingOrOverridesOnMethodsRule.java:40)
	at com.carrotsearch.randomizedtesting.rules.NoShadowingOrOverridesOnMethodsRule$1.evaluate(NoShadowingOrOverridesOnMethodsRule.java:40)
	at com.carrotsearch.randomizedtesting.rules.StatementAdapter.evaluate(StatementAdapter.java:36)
	at com.carrotsearch.randomizedtesting.rules.StatementAdapter.evaluate(StatementAdapter.java:36)
	at com.carrotsearch.randomizedtesting.rules.StatementAdapter.evaluate(StatementAdapter.java:36)
	at org.apache.lucene.util.TestRuleAssertionsRequired$1.evaluate(TestRuleAssertionsRequired.java:53)
	at org.apache.lucene.util.TestRuleMarkFailure$1.evaluate(TestRuleMarkFailure.java:47)
	at org.apache.lucene.util.TestRuleIgnoreAfterMaxFailures$1.evaluate(TestRuleIgnoreAfterMaxFailures.java:64)
	at org.apache.lucene.util.TestRuleIgnoreTestSuites$1.evaluate(TestRuleIgnoreTestSuites.java:54)
	at com.carrotsearch.randomizedtesting.rules.StatementAdapter.evaluate(StatementAdapter.java:36)
	at com.carrotsearch.randomizedtesting.ThreadLeakControl$StatementRunner.run(ThreadLeakControl.java:368)
	at java.lang.Thread.run(Thread.java:748)


FAILED:  junit.framework.TestSuite.org.apache.solr.client.solrj.request.TestV2Request

Error Message:
1 thread leaked from SUITE scope at org.apache.solr.client.solrj.request.TestV2Request:     1) Thread[id=612, name=Connection evictor, state=TIMED_WAITING, group=TGRP-TestV2Request]         at java.lang.Thread.sleep(Native Method)         at org.apache.http.impl.client.IdleConnectionEvictor$1.run(IdleConnectionEvictor.java:66)         at java.lang.Thread.run(Thread.java:748)

Stack Trace:
com.carrotsearch.randomizedtesting.ThreadLeakError: 1 thread leaked from SUITE scope at org.apache.solr.client.solrj.request.TestV2Request: 
   1) Thread[id=612, name=Connection evictor, state=TIMED_WAITING, group=TGRP-TestV2Request]
        at java.lang.Thread.sleep(Native Method)
        at org.apache.http.impl.client.IdleConnectionEvictor$1.run(IdleConnectionEvictor.java:66)
        at java.lang.Thread.run(Thread.java:748)
	at __randomizedtesting.SeedInfo.seed([C8A88DA647B3483B]:0)


FAILED:  org.apache.solr.client.solrj.request.TestV2Request.testHttpSolrClient

Error Message:
expected:<0> but was:<1>

Stack Trace:
java.lang.AssertionError: expected:<0> but was:<1>
	at __randomizedtesting.SeedInfo.seed([C8A88DA647B3483B:10B0958CE6875A1C]:0)
	at org.junit.Assert.fail(Assert.java:93)
	at org.junit.Assert.failNotEquals(Assert.java:647)
	at org.junit.Assert.assertEquals(Assert.java:128)
	at org.junit.Assert.assertEquals(Assert.java:472)
	at org.junit.Assert.assertEquals(Assert.java:456)
	at org.apache.solr.client.solrj.request.TestV2Request.doTest(TestV2Request.java:105)
	at org.apache.solr.client.solrj.request.TestV2Request.testHttpSolrClient(TestV2Request.java:70)
	at sun.reflect.NativeMethodAccessorImpl.invoke0(Native Method)
	at sun.reflect.NativeMethodAccessorImpl.invoke(NativeMethodAccessorImpl.java:62)
	at sun.reflect.DelegatingMethodAccessorImpl.invoke(DelegatingMethodAccessorImpl.java:43)
	at java.lang.reflect.Method.invoke(Method.java:498)
	at com.carrotsearch.randomizedtesting.RandomizedRunner.invoke(RandomizedRunner.java:1742)
	at com.carrotsearch.randomizedtesting.RandomizedRunner$8.evaluate(RandomizedRunner.java:935)
	at com.carrotsearch.randomizedtesting.RandomizedRunner$9.evaluate(RandomizedRunner.java:971)
	at com.carrotsearch.randomizedtesting.RandomizedRunner$10.evaluate(RandomizedRunner.java:985)
	at com.carrotsearch.randomizedtesting.rules.SystemPropertiesRestoreRule$1.evaluate(SystemPropertiesRestoreRule.java:57)
	at org.apache.lucene.util.TestRuleSetupTeardownChained$1.evaluate(TestRuleSetupTeardownChained.java:49)
	at org.apache.lucene.util.AbstractBeforeAfterRule$1.evaluate(AbstractBeforeAfterRule.java:45)
	at org.apache.lucene.util.TestRuleThreadAndTestName$1.evaluate(TestRuleThreadAndTestName.java:48)
	at org.apache.lucene.util.TestRuleIgnoreAfterMaxFailures$1.evaluate(TestRuleIgnoreAfterMaxFailures.java:64)
	at org.apache.lucene.util.TestRuleMarkFailure$1.evaluate(TestRuleMarkFailure.java:47)
	at com.carrotsearch.randomizedtesting.rules.StatementAdapter.evaluate(StatementAdapter.java:36)
	at com.carrotsearch.randomizedtesting.ThreadLeakControl$StatementRunner.run(ThreadLeakControl.java:368)
	at com.carrotsearch.randomizedtesting.ThreadLeakControl.forkTimeoutingTask(ThreadLeakControl.java:817)
	at com.carrotsearch.randomizedtesting.ThreadLeakControl$3.evaluate(ThreadLeakControl.java:468)
	at com.carrotsearch.randomizedtesting.RandomizedRunner.runSingleTest(RandomizedRunner.java:944)
	at com.carrotsearch.randomizedtesting.RandomizedRunner$5.evaluate(RandomizedRunner.java:830)
	at com.carrotsearch.randomizedtesting.RandomizedRunner$6.evaluate(RandomizedRunner.java:880)
	at com.carrotsearch.randomizedtesting.RandomizedRunner$7.evaluate(RandomizedRunner.java:891)
	at com.carrotsearch.randomizedtesting.rules.StatementAdapter.evaluate(StatementAdapter.java:36)
	at com.carrotsearch.randomizedtesting.rules.SystemPropertiesRestoreRule$1.evaluate(SystemPropertiesRestoreRule.java:57)
	at org.apache.lucene.util.AbstractBeforeAfterRule$1.evaluate(AbstractBeforeAfterRule.java:45)
	at com.carrotsearch.randomizedtesting.rules.StatementAdapter.evaluate(StatementAdapter.java:36)
	at org.apache.lucene.util.TestRuleStoreClassName$1.evaluate(TestRuleStoreClassName.java:41)
	at com.carrotsearch.randomizedtesting.rules.NoShadowingOrOverridesOnMethodsRule$1.evaluate(NoShadowingOrOverridesOnMethodsRule.java:40)
	at com.carrotsearch.randomizedtesting.rules.NoShadowingOrOverridesOnMethodsRule$1.evaluate(NoShadowingOrOverridesOnMethodsRule.java:40)
	at com.carrotsearch.randomizedtesting.rules.StatementAdapter.evaluate(StatementAdapter.java:36)
	at com.carrotsearch.randomizedtesting.rules.StatementAdapter.evaluate(StatementAdapter.java:36)
	at com.carrotsearch.randomizedtesting.rules.StatementAdapter.evaluate(StatementAdapter.java:36)
	at org.apache.lucene.util.TestRuleAssertionsRequired$1.evaluate(TestRuleAssertionsRequired.java:53)
	at org.apache.lucene.util.TestRuleMarkFailure$1.evaluate(TestRuleMarkFailure.java:47)
	at org.apache.lucene.util.TestRuleIgnoreAfterMaxFailures$1.evaluate(TestRuleIgnoreAfterMaxFailures.java:64)
	at org.apache.lucene.util.TestRuleIgnoreTestSuites$1.evaluate(TestRuleIgnoreTestSuites.java:54)
	at com.carrotsearch.randomizedtesting.rules.StatementAdapter.evaluate(StatementAdapter.java:36)
	at com.carrotsearch.randomizedtesting.ThreadLeakControl$StatementRunner.run(ThreadLeakControl.java:368)
	at java.lang.Thread.run(Thread.java:748)


FAILED:  org.apache.solr.client.solrj.request.TestV2Request.testCloudSolrClient

Error Message:
expected:<0> but was:<1>

Stack Trace:
java.lang.AssertionError: expected:<0> but was:<1>
	at __randomizedtesting.SeedInfo.seed([C8A88DA647B3483B:515E0616E200C050]:0)
	at org.junit.Assert.fail(Assert.java:93)
	at org.junit.Assert.failNotEquals(Assert.java:647)
	at org.junit.Assert.assertEquals(Assert.java:128)
	at org.junit.Assert.assertEquals(Assert.java:472)
	at org.junit.Assert.assertEquals(Assert.java:456)
	at org.apache.solr.client.solrj.request.TestV2Request.doTest(TestV2Request.java:105)
	at org.apache.solr.client.solrj.request.TestV2Request.testCloudSolrClient(TestV2Request.java:77)
	at sun.reflect.NativeMethodAccessorImpl.invoke0(Native Method)
	at sun.reflect.NativeMethodAccessorImpl.invoke(NativeMethodAccessorImpl.java:62)
	at sun.reflect.DelegatingMethodAccessorImpl.invoke(DelegatingMethodAccessorImpl.java:43)
	at java.lang.reflect.Method.invoke(Method.java:498)
	at com.carrotsearch.randomizedtesting.RandomizedRunner.invoke(RandomizedRunner.java:1742)
	at com.carrotsearch.randomizedtesting.RandomizedRunner$8.evaluate(RandomizedRunner.java:935)
	at com.carrotsearch.randomizedtesting.RandomizedRunner$9.evaluate(RandomizedRunner.java:971)
	at com.carrotsearch.randomizedtesting.RandomizedRunner$10.evaluate(RandomizedRunner.java:985)
	at com.carrotsearch.randomizedtesting.rules.SystemPropertiesRestoreRule$1.evaluate(SystemPropertiesRestoreRule.java:57)
	at org.apache.lucene.util.TestRuleSetupTeardownChained$1.evaluate(TestRuleSetupTeardownChained.java:49)
	at org.apache.lucene.util.AbstractBeforeAfterRule$1.evaluate(AbstractBeforeAfterRule.java:45)
	at org.apache.lucene.util.TestRuleThreadAndTestName$1.evaluate(TestRuleThreadAndTestName.java:48)
	at org.apache.lucene.util.TestRuleIgnoreAfterMaxFailures$1.evaluate(TestRuleIgnoreAfterMaxFailures.java:64)
	at org.apache.lucene.util.TestRuleMarkFailure$1.evaluate(TestRuleMarkFailure.java:47)
	at com.carrotsearch.randomizedtesting.rules.StatementAdapter.evaluate(StatementAdapter.java:36)
	at com.carrotsearch.randomizedtesting.ThreadLeakControl$StatementRunner.run(ThreadLeakControl.java:368)
	at com.carrotsearch.randomizedtesting.ThreadLeakControl.forkTimeoutingTask(ThreadLeakControl.java:817)
	at com.carrotsearch.randomizedtesting.ThreadLeakControl$3.evaluate(ThreadLeakControl.java:468)
	at com.carrotsearch.randomizedtesting.RandomizedRunner.runSingleTest(RandomizedRunner.java:944)
	at com.carrotsearch.randomizedtesting.RandomizedRunner$5.evaluate(RandomizedRunner.java:830)
	at com.carrotsearch.randomizedtesting.RandomizedRunner$6.evaluate(RandomizedRunner.java:880)
	at com.carrotsearch.randomizedtesting.RandomizedRunner$7.evaluate(RandomizedRunner.java:891)
	at com.carrotsearch.randomizedtesting.rules.StatementAdapter.evaluate(StatementAdapter.java:36)
	at com.carrotsearch.randomizedtesting.rules.SystemPropertiesRestoreRule$1.evaluate(SystemPropertiesRestoreRule.java:57)
	at org.apache.lucene.util.AbstractBeforeAfterRule$1.evaluate(AbstractBeforeAfterRule.java:45)
	at com.carrotsearch.randomizedtesting.rules.StatementAdapter.evaluate(StatementAdapter.java:36)
	at org.apache.lucene.util.TestRuleStoreClassName$1.evaluate(TestRuleStoreClassName.java:41)
	at com.carrotsearch.randomizedtesting.rules.NoShadowingOrOverridesOnMethodsRule$1.evaluate(NoShadowingOrOverridesOnMethodsRule.java:40)
	at com.carrotsearch.randomizedtesting.rules.NoShadowingOrOverridesOnMethodsRule$1.evaluate(NoShadowingOrOverridesOnMethodsRule.java:40)
	at com.carrotsearch.randomizedtesting.rules.StatementAdapter.evaluate(StatementAdapter.java:36)
	at com.carrotsearch.randomizedtesting.rules.StatementAdapter.evaluate(StatementAdapter.java:36)
	at com.carrotsearch.randomizedtesting.rules.StatementAdapter.evaluate(StatementAdapter.java:36)
	at org.apache.lucene.util.TestRuleAssertionsRequired$1.evaluate(TestRuleAssertionsRequired.java:53)
	at org.apache.lucene.util.TestRuleMarkFailure$1.evaluate(TestRuleMarkFailure.java:47)
	at org.apache.lucene.util.TestRuleIgnoreAfterMaxFailures$1.evaluate(TestRuleIgnoreAfterMaxFailures.java:64)
	at org.apache.lucene.util.TestRuleIgnoreTestSuites$1.evaluate(TestRuleIgnoreTestSuites.java:54)
	at com.carrotsearch.randomizedtesting.rules.StatementAdapter.evaluate(StatementAdapter.java:36)
	at com.carrotsearch.randomizedtesting.ThreadLeakControl$StatementRunner.run(ThreadLeakControl.java:368)
	at java.lang.Thread.run(Thread.java:748)


FAILED:  junit.framework.TestSuite.org.apache.solr.client.solrj.request.TestV2Request

Error Message:
1 thread leaked from SUITE scope at org.apache.solr.client.solrj.request.TestV2Request:     1) Thread[id=574, name=Connection evictor, state=TIMED_WAITING, group=TGRP-TestV2Request]         at java.lang.Thread.sleep(Native Method)         at org.apache.http.impl.client.IdleConnectionEvictor$1.run(IdleConnectionEvictor.java:66)         at java.lang.Thread.run(Thread.java:748)

Stack Trace:
com.carrotsearch.randomizedtesting.ThreadLeakError: 1 thread leaked from SUITE scope at org.apache.solr.client.solrj.request.TestV2Request: 
   1) Thread[id=574, name=Connection evictor, state=TIMED_WAITING, group=TGRP-TestV2Request]
        at java.lang.Thread.sleep(Native Method)
        at org.apache.http.impl.client.IdleConnectionEvictor$1.run(IdleConnectionEvictor.java:66)
        at java.lang.Thread.run(Thread.java:748)
	at __randomizedtesting.SeedInfo.seed([C8A88DA647B3483B]:0)


FAILED:  org.apache.solr.client.solrj.request.TestV2Request.testHttpSolrClient

Error Message:
expected:<0> but was:<1>

Stack Trace:
java.lang.AssertionError: expected:<0> but was:<1>
	at __randomizedtesting.SeedInfo.seed([C8A88DA647B3483B:10B0958CE6875A1C]:0)
	at org.junit.Assert.fail(Assert.java:93)
	at org.junit.Assert.failNotEquals(Assert.java:647)
	at org.junit.Assert.assertEquals(Assert.java:128)
	at org.junit.Assert.assertEquals(Assert.java:472)
	at org.junit.Assert.assertEquals(Assert.java:456)
	at org.apache.solr.client.solrj.request.TestV2Request.doTest(TestV2Request.java:105)
	at org.apache.solr.client.solrj.request.TestV2Request.testHttpSolrClient(TestV2Request.java:70)
	at sun.reflect.NativeMethodAccessorImpl.invoke0(Native Method)
	at sun.reflect.NativeMethodAccessorImpl.invoke(NativeMethodAccessorImpl.java:62)
	at sun.reflect.DelegatingMethodAccessorImpl.invoke(DelegatingMethodAccessorImpl.java:43)
	at java.lang.reflect.Method.invoke(Method.java:498)
	at com.carrotsearch.randomizedtesting.RandomizedRunner.invoke(RandomizedRunner.java:1742)
	at com.carrotsearch.randomizedtesting.RandomizedRunner$8.evaluate(RandomizedRunner.java:935)
	at com.carrotsearch.randomizedtesting.RandomizedRunner$9.evaluate(RandomizedRunner.java:971)
	at com.carrotsearch.randomizedtesting.RandomizedRunner$10.evaluate(RandomizedRunner.java:985)
	at com.carrotsearch.randomizedtesting.rules.SystemPropertiesRestoreRule$1.evaluate(SystemPropertiesRestoreRule.java:57)
	at org.apache.lucene.util.TestRuleSetupTeardownChained$1.evaluate(TestRuleSetupTeardownChained.java:49)
	at org.apache.lucene.util.AbstractBeforeAfterRule$1.evaluate(AbstractBeforeAfterRule.java:45)
	at org.apache.lucene.util.TestRuleThreadAndTestName$1.evaluate(TestRuleThreadAndTestName.java:48)
	at org.apache.lucene.util.TestRuleIgnoreAfterMaxFailures$1.evaluate(TestRuleIgnoreAfterMaxFailures.java:64)
	at org.apache.lucene.util.TestRuleMarkFailure$1.evaluate(TestRuleMarkFailure.java:47)
	at com.carrotsearch.randomizedtesting.rules.StatementAdapter.evaluate(StatementAdapter.java:36)
	at com.carrotsearch.randomizedtesting.ThreadLeakControl$StatementRunner.run(ThreadLeakControl.java:368)
	at com.carrotsearch.randomizedtesting.ThreadLeakControl.forkTimeoutingTask(ThreadLeakControl.java:817)
	at com.carrotsearch.randomizedtesting.ThreadLeakControl$3.evaluate(ThreadLeakControl.java:468)
	at com.carrotsearch.randomizedtesting.RandomizedRunner.runSingleTest(RandomizedRunner.java:944)
	at com.carrotsearch.randomizedtesting.RandomizedRunner$5.evaluate(RandomizedRunner.java:830)
	at com.carrotsearch.randomizedtesting.RandomizedRunner$6.evaluate(RandomizedRunner.java:880)
	at com.carrotsearch.randomizedtesting.RandomizedRunner$7.evaluate(RandomizedRunner.java:891)
	at com.carrotsearch.randomizedtesting.rules.StatementAdapter.evaluate(StatementAdapter.java:36)
	at com.carrotsearch.randomizedtesting.rules.SystemPropertiesRestoreRule$1.evaluate(SystemPropertiesRestoreRule.java:57)
	at org.apache.lucene.util.AbstractBeforeAfterRule$1.evaluate(AbstractBeforeAfterRule.java:45)
	at com.carrotsearch.randomizedtesting.rules.StatementAdapter.evaluate(StatementAdapter.java:36)
	at org.apache.lucene.util.TestRuleStoreClassName$1.evaluate(TestRuleStoreClassName.java:41)
	at com.carrotsearch.randomizedtesting.rules.NoShadowingOrOverridesOnMethodsRule$1.evaluate(NoShadowingOrOverridesOnMethodsRule.java:40)
	at com.carrotsearch.randomizedtesting.rules.NoShadowingOrOverridesOnMethodsRule$1.evaluate(NoShadowingOrOverridesOnMethodsRule.java:40)
	at com.carrotsearch.randomizedtesting.rules.StatementAdapter.evaluate(StatementAdapter.java:36)
	at com.carrotsearch.randomizedtesting.rules.StatementAdapter.evaluate(StatementAdapter.java:36)
	at com.carrotsearch.randomizedtesting.rules.StatementAdapter.evaluate(StatementAdapter.java:36)
	at org.apache.lucene.util.TestRuleAssertionsRequired$1.evaluate(TestRuleAssertionsRequired.java:53)
	at org.apache.lucene.util.TestRuleMarkFailure$1.evaluate(TestRuleMarkFailure.java:47)
	at org.apache.lucene.util.TestRuleIgnoreAfterMaxFailures$1.evaluate(TestRuleIgnoreAfterMaxFailures.java:64)
	at org.apache.lucene.util.TestRuleIgnoreTestSuites$1.evaluate(TestRuleIgnoreTestSuites.java:54)
	at com.carrotsearch.randomizedtesting.rules.StatementAdapter.evaluate(StatementAdapter.java:36)
	at com.carrotsearch.randomizedtesting.ThreadLeakControl$StatementRunner.run(ThreadLeakControl.java:368)
	at java.lang.Thread.run(Thread.java:748)


FAILED:  org.apache.solr.client.solrj.request.TestV2Request.testCloudSolrClient

Error Message:
expected:<0> but was:<1>

Stack Trace:
java.lang.AssertionError: expected:<0> but was:<1>
	at __randomizedtesting.SeedInfo.seed([C8A88DA647B3483B:515E0616E200C050]:0)
	at org.junit.Assert.fail(Assert.java:93)
	at org.junit.Assert.failNotEquals(Assert.java:647)
	at org.junit.Assert.assertEquals(Assert.java:128)
	at org.junit.Assert.assertEquals(Assert.java:472)
	at org.junit.Assert.assertEquals(Assert.java:456)
	at org.apache.solr.client.solrj.request.TestV2Request.doTest(TestV2Request.java:105)
	at org.apache.solr.client.solrj.request.TestV2Request.testCloudSolrClient(TestV2Request.java:77)
	at sun.reflect.NativeMethodAccessorImpl.invoke0(Native Method)
	at sun.reflect.NativeMethodAccessorImpl.invoke(NativeMethodAccessorImpl.java:62)
	at sun.reflect.DelegatingMethodAccessorImpl.invoke(DelegatingMethodAccessorImpl.java:43)
	at java.lang.reflect.Method.invoke(Method.java:498)
	at com.carrotsearch.randomizedtesting.RandomizedRunner.invoke(RandomizedRunner.java:1742)
	at com.carrotsearch.randomizedtesting.RandomizedRunner$8.evaluate(RandomizedRunner.java:935)
	at com.carrotsearch.randomizedtesting.RandomizedRunner$9.evaluate(RandomizedRunner.java:971)
	at com.carrotsearch.randomizedtesting.RandomizedRunner$10.evaluate(RandomizedRunner.java:985)
	at com.carrotsearch.randomizedtesting.rules.SystemPropertiesRestoreRule$1.evaluate(SystemPropertiesRestoreRule.java:57)
	at org.apache.lucene.util.TestRuleSetupTeardownChained$1.evaluate(TestRuleSetupTeardownChained.java:49)
	at org.apache.lucene.util.AbstractBeforeAfterRule$1.evaluate(AbstractBeforeAfterRule.java:45)
	at org.apache.lucene.util.TestRuleThreadAndTestName$1.evaluate(TestRuleThreadAndTestName.java:48)
	at org.apache.lucene.util.TestRuleIgnoreAfterMaxFailures$1.evaluate(TestRuleIgnoreAfterMaxFailures.java:64)
	at org.apache.lucene.util.TestRuleMarkFailure$1.evaluate(TestRuleMarkFailure.java:47)
	at com.carrotsearch.randomizedtesting.rules.StatementAdapter.evaluate(StatementAdapter.java:36)
	at com.carrotsearch.randomizedtesting.ThreadLeakControl$StatementRunner.run(ThreadLeakControl.java:368)
	at com.carrotsearch.randomizedtesting.ThreadLeakControl.forkTimeoutingTask(ThreadLeakControl.java:817)
	at com.carrotsearch.randomizedtesting.ThreadLeakControl$3.evaluate(ThreadLeakControl.java:468)
	at com.carrotsearch.randomizedtesting.RandomizedRunner.runSingleTest(RandomizedRunner.java:944)
	at com.carrotsearch.randomizedtesting.RandomizedRunner$5.evaluate(RandomizedRunner.java:830)
	at com.carrotsearch.randomizedtesting.RandomizedRunner$6.evaluate(RandomizedRunner.java:880)
	at com.carrotsearch.randomizedtesting.RandomizedRunner$7.evaluate(RandomizedRunner.java:891)
	at com.carrotsearch.randomizedtesting.rules.StatementAdapter.evaluate(StatementAdapter.java:36)
	at com.carrotsearch.randomizedtesting.rules.SystemPropertiesRestoreRule$1.evaluate(SystemPropertiesRestoreRule.java:57)
	at org.apache.lucene.util.AbstractBeforeAfterRule$1.evaluate(AbstractBeforeAfterRule.java:45)
	at com.carrotsearch.randomizedtesting.rules.StatementAdapter.evaluate(StatementAdapter.java:36)
	at org.apache.lucene.util.TestRuleStoreClassName$1.evaluate(TestRuleStoreClassName.java:41)
	at com.carrotsearch.randomizedtesting.rules.NoShadowingOrOverridesOnMethodsRule$1.evaluate(NoShadowingOrOverridesOnMethodsRule.java:40)
	at com.carrotsearch.randomizedtesting.rules.NoShadowingOrOverridesOnMethodsRule$1.evaluate(NoShadowingOrOverridesOnMethodsRule.java:40)
	at com.carrotsearch.randomizedtesting.rules.StatementAdapter.evaluate(StatementAdapter.java:36)
	at com.carrotsearch.randomizedtesting.rules.StatementAdapter.evaluate(StatementAdapter.java:36)
	at com.carrotsearch.randomizedtesting.rules.StatementAdapter.evaluate(StatementAdapter.java:36)
	at org.apache.lucene.util.TestRuleAssertionsRequired$1.evaluate(TestRuleAssertionsRequired.java:53)
	at org.apache.lucene.util.TestRuleMarkFailure$1.evaluate(TestRuleMarkFailure.java:47)
	at org.apache.lucene.util.TestRuleIgnoreAfterMaxFailures$1.evaluate(TestRuleIgnoreAfterMaxFailures.java:64)
	at org.apache.lucene.util.TestRuleIgnoreTestSuites$1.evaluate(TestRuleIgnoreTestSuites.java:54)
	at com.carrotsearch.randomizedtesting.rules.StatementAdapter.evaluate(StatementAdapter.java:36)
	at com.carrotsearch.randomizedtesting.ThreadLeakControl$StatementRunner.run(ThreadLeakControl.java:368)
	at java.lang.Thread.run(Thread.java:748)


FAILED:  junit.framework.TestSuite.org.apache.solr.client.solrj.request.TestV2Request

Error Message:
1 thread leaked from SUITE scope at org.apache.solr.client.solrj.request.TestV2Request:     1) Thread[id=1621, name=Connection evictor, state=TIMED_WAITING, group=TGRP-TestV2Request]         at java.lang.Thread.sleep(Native Method)         at org.apache.http.impl.client.IdleConnectionEvictor$1.run(IdleConnectionEvictor.java:66)         at java.lang.Thread.run(Thread.java:748)

Stack Trace:
com.carrotsearch.randomizedtesting.ThreadLeakError: 1 thread leaked from SUITE scope at org.apache.solr.client.solrj.request.TestV2Request: 
   1) Thread[id=1621, name=Connection evictor, state=TIMED_WAITING, group=TGRP-TestV2Request]
        at java.lang.Thread.sleep(Native Method)
        at org.apache.http.impl.client.IdleConnectionEvictor$1.run(IdleConnectionEvictor.java:66)
        at java.lang.Thread.run(Thread.java:748)
	at __randomizedtesting.SeedInfo.seed([C8A88DA647B3483B]:0)




Build Log:
[...truncated 16281 lines...]
   [junit4] Suite: org.apache.solr.client.solrj.request.TestV2Request
   [junit4]   2> Creating dataDir: /export/home/jenkins/workspace/Lucene-Solr-7.x-Solaris/solr/build/solr-solrj/test/J0/temp/solr.client.solrj.request.TestV2Request_C8A88DA647B3483B-001/init-core-data-001
   [junit4]   1> 15:54:41.285 [Thread-271] ERROR org.apache.zookeeper.server.ZooKeeperServer - ZKShutdownHandler is not registered, so ZooKeeper server won't take any action on ERROR or SHUTDOWN server state changes
   [junit4]   1> 15:54:41.394 [jetty-launcher-515-thread-2] ERROR org.apache.solr.util.StartupLoggingUtils - Missing Java Option solr.log.dir. Logging may be missing or incomplete.
   [junit4]   1> 15:54:41.406 [jetty-launcher-515-thread-3] ERROR org.apache.solr.util.StartupLoggingUtils - Missing Java Option solr.log.dir. Logging may be missing or incomplete.
   [junit4]   1> 15:54:41.420 [jetty-launcher-515-thread-1] ERROR org.apache.solr.util.StartupLoggingUtils - Missing Java Option solr.log.dir. Logging may be missing or incomplete.
   [junit4]   1> 15:54:41.423 [jetty-launcher-515-thread-4] ERROR org.apache.solr.util.StartupLoggingUtils - Missing Java Option solr.log.dir. Logging may be missing or incomplete.
   [junit4]   1> livenodes: [127.0.0.1:50946_solr, 127.0.0.1:47124_solr, 127.0.0.1:37373_solr, 127.0.0.1:61862_solr]
   [junit4]   1> 15:54:50.892 [qtp175703866-1492] ERROR org.apache.solr.api.V2HttpCall - >> path: '/c/_introspect'
   [junit4]   2> NOTE: reproduce with: ant test  -Dtestcase=TestV2Request -Dtests.method=testHttpSolrClient -Dtests.seed=C8A88DA647B3483B -Dtests.slow=true -Dtests.locale=es-PY -Dtests.timezone=America/North_Dakota/New_Salem -Dtests.asserts=true -Dtests.file.encoding=ISO-8859-1
   [junit4] FAILURE 5.85s J0 | TestV2Request.testHttpSolrClient <<<
   [junit4]    > Throwable #1: java.lang.AssertionError: expected:<0> but was:<1>
   [junit4]    > 	at __randomizedtesting.SeedInfo.seed([C8A88DA647B3483B:10B0958CE6875A1C]:0)
   [junit4]    > 	at org.apache.solr.client.solrj.request.TestV2Request.doTest(TestV2Request.java:105)
   [junit4]    > 	at org.apache.solr.client.solrj.request.TestV2Request.testHttpSolrClient(TestV2Request.java:70)
   [junit4]    > 	at java.lang.Thread.run(Thread.java:748)
   [junit4]   1> 15:54:56.604 [qtp665656760-1510] ERROR org.apache.solr.api.V2HttpCall - >> path: '/c/_introspect'
   [junit4]   2> NOTE: reproduce with: ant test  -Dtestcase=TestV2Request -Dtests.method=testCloudSolrClient -Dtests.seed=C8A88DA647B3483B -Dtests.slow=true -Dtests.locale=es-PY -Dtests.timezone=America/North_Dakota/New_Salem -Dtests.asserts=true -Dtests.file.encoding=ISO-8859-1
   [junit4] FAILURE 5.20s J0 | TestV2Request.testCloudSolrClient <<<
   [junit4]    > Throwable #1: java.lang.AssertionError: expected:<0> but was:<1>
   [junit4]    > 	at __randomizedtesting.SeedInfo.seed([C8A88DA647B3483B:515E0616E200C050]:0)
   [junit4]    > 	at org.apache.solr.client.solrj.request.TestV2Request.doTest(TestV2Request.java:105)
   [junit4]    > 	at org.apache.solr.client.solrj.request.TestV2Request.testCloudSolrClient(TestV2Request.java:77)
   [junit4]    > 	at java.lang.Thread.run(Thread.java:748)
   [junit4]   1> 15:54:58.280 [SUITE-TestV2Request-seed#[C8A88DA647B3483B]-worker] ERROR org.apache.zookeeper.server.ZooKeeperServer - ZKShutdownHandler is not registered, so ZooKeeper server won't take any action on ERROR or SHUTDOWN server state changes
   [junit4]   2> NOTE: leaving temporary files on disk at: /export/home/jenkins/workspace/Lucene-Solr-7.x-Solaris/solr/build/solr-solrj/test/J0/temp/solr.client.solrj.request.TestV2Request_C8A88DA647B3483B-001
   [junit4]   2> Oct 26, 2018 3:54:58 PM com.carrotsearch.randomizedtesting.ThreadLeakControl checkThreadLeaks
   [junit4]   2> WARNING: Will linger awaiting termination of 2 leaked thread(s).
   [junit4]   2> Oct 26, 2018 3:56:18 PM com.carrotsearch.randomizedtesting.ThreadLeakControl checkThreadLeaks
   [junit4]   2> SEVERE: 1 thread leaked from SUITE scope at org.apache.solr.client.solrj.request.TestV2Request: 
   [junit4]   2>    1) Thread[id=1621, name=Connection evictor, state=TIMED_WAITING, group=TGRP-TestV2Request]
   [junit4]   2>         at java.lang.Thread.sleep(Native Method)
   [junit4]   2>         at org.apache.http.impl.client.IdleConnectionEvictor$1.run(IdleConnectionEvictor.java:66)
   [junit4]   2>         at java.lang.Thread.run(Thread.java:748)
   [junit4]   2> Oct 26, 2018 3:56:18 PM com.carrotsearch.randomizedtesting.ThreadLeakControl tryToInterruptAll
   [junit4]   2> INFO: Starting to interrupt leaked threads:
   [junit4]   2>    1) Thread[id=1621, name=Connection evictor, state=TIMED_WAITING, group=TGRP-TestV2Request]
   [junit4]   2> Oct 26, 2018 3:56:18 PM com.carrotsearch.randomizedtesting.ThreadLeakControl tryToInterruptAll
   [junit4]   2> INFO: All leaked threads terminated.
   [junit4]   2> NOTE: test params are: codec=Asserting(Lucene70), sim=RandomSimilarity(queryNorm=true): {}, locale=es-PY, timezone=America/North_Dakota/New_Salem
   [junit4]   2> NOTE: SunOS 5.11 amd64/Oracle Corporation 1.8.0_172 (64-bit)/cpus=3,threads=1,free=120899264,total=359661568
   [junit4]   2> NOTE: All tests run in this JVM: [SolrExampleStreamingBinaryTest, TestLBHttpSolrClient, NaturalLogEvaluatorTest, CorrelationEvaluatorTest, TestRetryUtil, ModuloEvaluatorTest, ContentStreamTest, TestConfigSetAdminRequest, TangentEvaluatorTest, DivideEvaluatorTest, TestToleratedUpdateError, LargeVolumeJettyTest, ConcurrentUpdateSolrClientBuilderTest, TestCloudCollectionsListeners, UsingSolrJRefGuideExamplesTest, JdbcDriverTest, TestDelegationTokenRequest, FieldAnalysisResponseTest, RegressionEvaluatorTest, ArcTangentEvaluatorTest, LargeVolumeBinaryJettyTest, HttpSolrClientConPoolTest, SolrExampleBinaryTest, TestJavaBinCodec, StreamExpressionTest, AbsoluteValueEvaluatorTest, TestTimeSource, TestUpdateRequestCodec, SquareRootEvaluatorTest, QueryResponseTest, TestZkConfigManager, ShardParamsTest, LBHttpSolrClientBadInputTest, HyperbolicTangentEvaluatorTest, SelectWithEvaluatorsTest, TestV2Request]
   [junit4]   2> NOTE: reproduce with: ant test  -Dtestcase=TestV2Request -Dtests.seed=C8A88DA647B3483B -Dtests.slow=true -Dtests.locale=es-PY -Dtests.timezone=America/North_Dakota/New_Salem -Dtests.asserts=true -Dtests.file.encoding=ISO-8859-1
   [junit4] ERROR   0.00s J0 | TestV2Request (suite) <<<
   [junit4]    > Throwable #1: com.carrotsearch.randomizedtesting.ThreadLeakError: 1 thread leaked from SUITE scope at org.apache.solr.client.solrj.request.TestV2Request: 
   [junit4]    >    1) Thread[id=1621, name=Connection evictor, state=TIMED_WAITING, group=TGRP-TestV2Request]
   [junit4]    >         at java.lang.Thread.sleep(Native Method)
   [junit4]    >         at org.apache.http.impl.client.IdleConnectionEvictor$1.run(IdleConnectionEvictor.java:66)
   [junit4]    >         at java.lang.Thread.run(Thread.java:748)
   [junit4]    > 	at __randomizedtesting.SeedInfo.seed([C8A88DA647B3483B]:0)
   [junit4] Completed [84/162 (1!)] on J0 in 97.18s, 4 tests, 2 failures, 1 error <<< FAILURES!

[...truncated 48097 lines...]
[asciidoctor:convert] asciidoctor: ERROR: about-this-guide.adoc: line 1: invalid part, must have at least one section (e.g., chapter, appendix, etc.)
[asciidoctor:convert] asciidoctor: ERROR: solr-glossary.adoc: line 1: invalid part, must have at least one section (e.g., chapter, appendix, etc.)
     [java] Processed 2434 links (1986 relative) to 3181 anchors in 246 files
     [echo] Validated Links & Anchors via: /export/home/jenkins/workspace/Lucene-Solr-7.x-Solaris/solr/build/solr-ref-guide/bare-bones-html/

-documentation-lint:
    [jtidy] Checking for broken html (such as invalid tags)...
   [delete] Deleting directory /export/home/jenkins/workspace/Lucene-Solr-7.x-Solaris/lucene/build/jtidy_tmp
     [echo] Checking for broken links...
     [exec] 
     [exec] Crawl/parse...
     [exec] 
     [exec] Verify...
     [echo] Checking for malformed docs...

jar-checksums:

resolve:

ivy-availability-check:
[loadresource] Do not set property disallowed.ivy.jars.list as its length is 0.

-ivy-fail-disallowed-ivy-version:

ivy-fail:

ivy-configure:
[ivy:configure] :: loading settings :: file = /export/home/jenkins/workspace/Lucene-Solr-7.x-Solaris/lucene/top-level-ivy-settings.xml

resolve:

ivy-availability-check:
[loadresource] Do not set property disallowed.ivy.jars.list as its length is 0.

-ivy-fail-disallowed-ivy-version:

ivy-fail:

ivy-configure:
[ivy:configure] :: loading settings :: file = /export/home/jenkins/workspace/Lucene-Solr-7.x-Solaris/lucene/top-level-ivy-settings.xml

resolve:

resolve:

ivy-availability-check:
[loadresource] Do not set property disallowed.ivy.jars.list as its length is 0.

-ivy-fail-disallowed-ivy-version:

ivy-fail:

ivy-configure:
[ivy:configure] :: loading settings :: file = /export/home/jenkins/workspace/Lucene-Solr-7.x-Solaris/lucene/top-level-ivy-settings.xml

resolve:

ivy-availability-check:
[loadresource] Do not set property disallowed.ivy.jars.list as its length is 0.

-ivy-fail-disallowed-ivy-version:

ivy-fail:

ivy-configure:
[ivy:configure] :: loading settings :: file = /export/home/jenkins/workspace/Lucene-Solr-7.x-Solaris/lucene/top-level-ivy-settings.xml

resolve:

ivy-availability-check:
[loadresource] Do not set property disallowed.ivy.jars.list as its length is 0.

-ivy-fail-disallowed-ivy-version:

ivy-fail:

ivy-configure:
[ivy:configure] :: loading settings :: file = /export/home/jenkins/workspace/Lucene-Solr-7.x-Solaris/lucene/top-level-ivy-settings.xml

resolve:

ivy-availability-check:
[loadresource] Do not set property disallowed.ivy.jars.list as its length is 0.

-ivy-fail-disallowed-ivy-version:

ivy-fail:

ivy-configure:
[ivy:configure] :: loading settings :: file = /export/home/jenkins/workspace/Lucene-Solr-7.x-Solaris/lucene/top-level-ivy-settings.xml

resolve:

ivy-availability-check:
[loadresource] Do not set property disallowed.ivy.jars.list as its length is 0.

-ivy-fail-disallowed-ivy-version:

ivy-fail:

ivy-configure:
[ivy:configure] :: loading settings :: file = /export/home/jenkins/workspace/Lucene-Solr-7.x-Solaris/lucene/top-level-ivy-settings.xml

resolve:

ivy-availability-check:
[loadresource] Do not set property disallowed.ivy.jars.list as its length is 0.

-ivy-fail-disallowed-ivy-version:

ivy-fail:

ivy-configure:
[ivy:configure] :: loading settings :: file = /export/home/jenkins/workspace/Lucene-Solr-7.x-Solaris/lucene/top-level-ivy-settings.xml

resolve:

ivy-availability-check:
[loadresource] Do not set property disallowed.ivy.jars.list as its length is 0.

-ivy-fail-disallowed-ivy-version:

ivy-fail:

ivy-configure:
[ivy:configure] :: loading settings :: file = /export/home/jenkins/workspace/Lucene-Solr-7.x-Solaris/lucene/top-level-ivy-settings.xml

resolve:

ivy-availability-check:
[loadresource] Do not set property disallowed.ivy.jars.list as its length is 0.

-ivy-fail-disallowed-ivy-version:

ivy-fail:

ivy-configure:
[ivy:configure] :: loading settings :: file = /export/home/jenkins/workspace/Lucene-Solr-7.x-Solaris/lucene/top-level-ivy-settings.xml

resolve:

ivy-availability-check:
[loadresource] Do not set property disallowed.ivy.jars.list as its length is 0.

-ivy-fail-disallowed-ivy-version:

ivy-fail:

ivy-configure:
[ivy:configure] :: loading settings :: file = /export/home/jenkins/workspace/Lucene-Solr-7.x-Solaris/lucene/top-level-ivy-settings.xml

resolve:

ivy-availability-check:
[loadresource] Do not set property disallowed.ivy.jars.list as its length is 0.

-ivy-fail-disallowed-ivy-version:

ivy-fail:

ivy-configure:
[ivy:configure] :: loading settings :: file = /export/home/jenkins/workspace/Lucene-Solr-7.x-Solaris/lucene/top-level-ivy-settings.xml

resolve:

ivy-availability-check:
[loadresource] Do not set property disallowed.ivy.jars.list as its length is 0.

-ivy-fail-disallowed-ivy-version:

ivy-fail:

ivy-configure:
[ivy:configure] :: loading settings :: file = /export/home/jenkins/workspace/Lucene-Solr-7.x-Solaris/lucene/top-level-ivy-settings.xml

resolve:

ivy-availability-check:
[loadresource] Do not set property disallowed.ivy.jars.list as its length is 0.

-ivy-fail-disallowed-ivy-version:

ivy-fail:

ivy-configure:
[ivy:configure] :: loading settings :: file = /export/home/jenkins/workspace/Lucene-Solr-7.x-Solaris/lucene/top-level-ivy-settings.xml

resolve:

ivy-availability-check:
[loadresource] Do not set property disallowed.ivy.jars.list as its length is 0.

-ivy-fail-disallowed-ivy-version:

ivy-fail:

ivy-configure:
[ivy:configure] :: loading settings :: file = /export/home/jenkins/workspace/Lucene-Solr-7.x-Solaris/lucene/top-level-ivy-settings.xml

resolve:

ivy-availability-check:
[loadresource] Do not set property disallowed.ivy.jars.list as its length is 0.

-ivy-fail-disallowed-ivy-version:

ivy-fail:

ivy-configure:
[ivy:configure] :: loading settings :: file = /export/home/jenkins/workspace/Lucene-Solr-7.x-Solaris/lucene/top-level-ivy-settings.xml

resolve:

ivy-availability-check:
[loadresource] Do not set property disallowed.ivy.jars.list as its length is 0.

-ivy-fail-disallowed-ivy-version:

ivy-fail:

ivy-configure:
[ivy:configure] :: loading settings :: file = /export/home/jenkins/workspace/Lucene-Solr-7.x-Solaris/lucene/top-level-ivy-settings.xml

resolve:

ivy-availability-check:
[loadresource] Do not set property disallowed.ivy.jars.list as its length is 0.

-ivy-fail-disallowed-ivy-version:

ivy-fail:

ivy-configure:
[ivy:configure] :: loading settings :: file = /export/home/jenkins/workspace/Lucene-Solr-7.x-Solaris/lucene/top-level-ivy-settings.xml

resolve:

ivy-availability-check:
[loadresource] Do not set property disallowed.ivy.jars.list as its length is 0.

-ivy-fail-disallowed-ivy-version:

ivy-fail:

ivy-configure:
[ivy:configure] :: loading settings :: file = /export/home/jenkins/workspace/Lucene-Solr-7.x-Solaris/lucene/top-level-ivy-settings.xml

resolve:

ivy-availability-check:
[loadresource] Do not set property disallowed.ivy.jars.list as its length is 0.

-ivy-fail-disallowed-ivy-version:

ivy-fail:

ivy-configure:
[ivy:configure] :: loading settings :: file = /export/home/jenkins/workspace/Lucene-Solr-7.x-Solaris/lucene/top-level-ivy-settings.xml

resolve:

ivy-availability-check:
[loadresource] Do not set property disallowed.ivy.jars.list as its length is 0.

-ivy-fail-disallowed-ivy-version:

ivy-fail:

ivy-configure:
[ivy:configure] :: loading settings :: file = /export/home/jenkins/workspace/Lucene-Solr-7.x-Solaris/lucene/top-level-ivy-settings.xml

resolve:

ivy-availability-check:
[loadresource] Do not set property disallowed.ivy.jars.list as its length is 0.

-ivy-fail-disallowed-ivy-version:

ivy-fail:

ivy-configure:
[ivy:configure] :: loading settings :: file = /export/home/jenkins/workspace/Lucene-Solr-7.x-Solaris/lucene/top-level-ivy-settings.xml

resolve:

ivy-availability-check:
[loadresource] Do not set property disallowed.ivy.jars.list as its length is 0.

-ivy-fail-disallowed-ivy-version:

ivy-fail:

ivy-configure:
[ivy:configure] :: loading settings :: file = /export/home/jenkins/workspace/Lucene-Solr-7.x-Solaris/lucene/top-level-ivy-settings.xml

resolve:

ivy-availability-check:
[loadresource] Do not set property disallowed.ivy.jars.list as its length is 0.

-ivy-fail-disallowed-ivy-version:

ivy-fail:

ivy-configure:
[ivy:configure] :: loading settings :: file = /export/home/jenkins/workspace/Lucene-Solr-7.x-Solaris/lucene/top-level-ivy-settings.xml

resolve:

ivy-availability-check:
[loadresource] Do not set property disallowed.ivy.jars.list as its length is 0.

-ivy-fail-disallowed-ivy-version:

ivy-fail:

ivy-configure:
[ivy:configure] :: loading settings :: file = /export/home/jenkins/workspace/Lucene-Solr-7.x-Solaris/lucene/top-level-ivy-settings.xml

resolve:

ivy-availability-check:
[loadresource] Do not set property disallowed.ivy.jars.list as its length is 0.

-ivy-fail-disallowed-ivy-version:

ivy-fail:

ivy-configure:
[ivy:configure] :: loading settings :: file = /export/home/jenkins/workspace/Lucene-Solr-7.x-Solaris/lucene/top-level-ivy-settings.xml

common.resolve:

resolve:

ivy-availability-check:
[loadresource] Do not set property disallowed.ivy.jars.list as its length is 0.

-ivy-fail-disallowed-ivy-version:

ivy-fail:

ivy-configure:
[ivy:configure] :: loading settings :: file = /export/home/jenkins/workspace/Lucene-Solr-7.x-Solaris/lucene/top-level-ivy-settings.xml

resolve:

ivy-availability-check:
[loadresource] Do not set property disallowed.ivy.jars.list as its length is 0.

-ivy-fail-disallowed-ivy-version:

ivy-fail:

ivy-configure:
[ivy:configure] :: loading settings :: file = /export/home/jenkins/workspace/Lucene-Solr-7.x-Solaris/lucene/top-level-ivy-settings.xml

resolve:

ivy-availability-check:
[loadresource] Do not set property disallowed.ivy.jars.list as its length is 0.

-ivy-fail-disallowed-ivy-version:

ivy-fail:

ivy-configure:
[ivy:configure] :: loading settings :: file = /export/home/jenkins/workspace/Lucene-Solr-7.x-Solaris/lucene/top-level-ivy-settings.xml

resolve:

ivy-availability-check:
[loadresource] Do not set property disallowed.ivy.jars.list as its length is 0.

-ivy-fail-disallowed-ivy-version:

ivy-fail:

ivy-configure:
[ivy:configure] :: loading settings :: file = /export/home/jenkins/workspace/Lucene-Solr-7.x-Solaris/lucene/top-level-ivy-settings.xml

resolve:

ivy-availability-check:
[loadresource] Do not set property disallowed.ivy.jars.list as its length is 0.

-ivy-fail-disallowed-ivy-version:

ivy-fail:

ivy-configure:
[ivy:configure] :: loading settings :: file = /export/home/jenkins/workspace/Lucene-Solr-7.x-Solaris/lucene/top-level-ivy-settings.xml

resolve:

jar-checksums:
    [mkdir] Created dir: /export/home/jenkins/workspace/Lucene-Solr-7.x-Solaris/lucene/null2032434790
     [copy] Copying 35 files to /export/home/jenkins/workspace/Lucene-Solr-7.x-Solaris/lucene/null2032434790
   [delete] Deleting directory /export/home/jenkins/workspace/Lucene-Solr-7.x-Solaris/lucene/null2032434790

resolve-example:

ivy-availability-check:
[loadresource] Do not set property disallowed.ivy.jars.list as its length is 0.

-ivy-fail-disallowed-ivy-version:

ivy-fail:

ivy-configure:
[ivy:configure] :: loading settings :: file = /export/home/jenkins/workspace/Lucene-Solr-7.x-Solaris/lucene/top-level-ivy-settings.xml

resolve:

resolve-server:

ivy-availability-check:
[loadresource] Do not set property disallowed.ivy.jars.list as its length is 0.

-ivy-fail-disallowed-ivy-version:

ivy-fail:

ivy-fail:

ivy-configure:
[ivy:configure] :: loading settings :: file = /export/home/jenkins/workspace/Lucene-Solr-7.x-Solaris/lucene/top-level-ivy-settings.xml

resolve:

resolve:

ivy-availability-check:
[loadresource] Do not set property disallowed.ivy.jars.list as its length is 0.

-ivy-fail-disallowed-ivy-version:

ivy-fail:

ivy-fail:

ivy-configure:
[ivy:configure] :: loading settings :: file = /export/home/jenkins/workspace/Lucene-Solr-7.x-Solaris/lucene/top-level-ivy-settings.xml

resolve:

ivy-availability-check:
[loadresource] Do not set property disallowed.ivy.jars.list as its length is 0.

-ivy-fail-disallowed-ivy-version:

ivy-fail:

ivy-fail:

ivy-configure:
[ivy:configure] :: loading settings :: file = /export/home/jenkins/workspace/Lucene-Solr-7.x-Solaris/lucene/top-level-ivy-settings.xml

resolve:

ivy-availability-check:
[loadresource] Do not set property disallowed.ivy.jars.list as its length is 0.

-ivy-fail-disallowed-ivy-version:

ivy-fail:

ivy-configure:
[ivy:configure] :: loading settings :: file = /export/home/jenkins/workspace/Lucene-Solr-7.x-Solaris/lucene/top-level-ivy-settings.xml

resolve:

ivy-availability-check:
[loadresource] Do not set property disallowed.ivy.jars.list as its length is 0.

-ivy-fail-disallowed-ivy-version:

ivy-fail:

ivy-fail:

ivy-configure:
[ivy:configure] :: loading settings :: file = /export/home/jenkins/workspace/Lucene-Solr-7.x-Solaris/lucene/top-level-ivy-settings.xml

resolve:

ivy-availability-check:
[loadresource] Do not set property disallowed.ivy.jars.list as its length is 0.

-ivy-fail-disallowed-ivy-version:

ivy-fail:

ivy-configure:
[ivy:configure] :: loading settings :: file = /export/home/jenkins/workspace/Lucene-Solr-7.x-Solaris/lucene/top-level-ivy-settings.xml

resolve:

ivy-availability-check:
[loadresource] Do not set property disallowed.ivy.jars.list as its length is 0.

-ivy-fail-disallowed-ivy-version:

ivy-fail:

ivy-fail:

ivy-configure:
[ivy:configure] :: loading settings :: file = /export/home/jenkins/workspace/Lucene-Solr-7.x-Solaris/lucene/top-level-ivy-settings.xml

resolve:

ivy-availability-check:
[loadresource] Do not set property disallowed.ivy.jars.list as its length is 0.

-ivy-fail-disallowed-ivy-version:

ivy-fail:

ivy-fail:

ivy-configure:
[ivy:configure] :: loading settings :: file = /export/home/jenkins/workspace/Lucene-Solr-7.x-Solaris/lucene/top-level-ivy-settings.xml

resolve:

ivy-availability-check:
[loadresource] Do not set property disallowed.ivy.jars.list as its length is 0.

-ivy-fail-disallowed-ivy-version:

ivy-fail:

ivy-fail:

ivy-configure:
[ivy:configure] :: loading settings :: file = /export/home/jenkins/workspace/Lucene-Solr-7.x-Solaris/lucene/top-level-ivy-settings.xml

resolve:

ivy-availability-check:
[loadresource] Do not set property disallowed.ivy.jars.list as its length is 0.

-ivy-fail-disallowed-ivy-version:

ivy-fail:

ivy-fail:

ivy-configure:
[ivy:configure] :: loading settings :: file = /export/home/jenkins/workspace/Lucene-Solr-7.x-Solaris/lucene/top-level-ivy-settings.xml

resolve:

ivy-availability-check:
[loadresource] Do not set property disallowed.ivy.jars.list as its length is 0.

-ivy-fail-disallowed-ivy-version:

ivy-fail:

ivy-fail:

ivy-configure:
[ivy:configure] :: loading settings :: file = /export/home/jenkins/workspace/Lucene-Solr-7.x-Solaris/lucene/top-level-ivy-settings.xml

resolve:

ivy-availability-check:
[loadresource] Do not set property disallowed.ivy.jars.list as its length is 0.

-ivy-fail-disallowed-ivy-version:

ivy-fail:

ivy-fail:

ivy-configure:
[ivy:configure] :: loading settings :: file = /export/home/jenkins/workspace/Lucene-Solr-7.x-Solaris/lucene/top-level-ivy-settings.xml

resolve:

ivy-availability-check:
[loadresource] Do not set property disallowed.ivy.jars.list as its length is 0.

-ivy-fail-disallowed-ivy-version:

ivy-fail:

ivy-fail:

ivy-configure:
[ivy:configure] :: loading settings :: file = /export/home/jenkins/workspace/Lucene-Solr-7.x-Solaris/lucene/top-level-ivy-settings.xml

resolve:

ivy-availability-check:
[loadresource] Do not set property disallowed.ivy.jars.list as its length is 0.

-ivy-fail-disallowed-ivy-version:

ivy-fail:

ivy-fail:

ivy-configure:
[ivy:configure] :: loading settings :: file = /export/home/jenkins/workspace/Lucene-Solr-7.x-Solaris/lucene/top-level-ivy-settings.xml

resolve:

ivy-availability-check:
[loadresource] Do not set property disallowed.ivy.jars.list as its length is 0.

-ivy-fail-disallowed-ivy-version:

ivy-fail:

ivy-fail:

ivy-configure:
[ivy:configure] :: loading settings :: file = /export/home/jenkins/workspace/Lucene-Solr-7.x-Solaris/lucene/top-level-ivy-settings.xml

resolve:

ivy-availability-check:
[loadresource] Do not set property disallowed.ivy.jars.list as its length is 0.

-ivy-fail-disallowed-ivy-version:

ivy-fail:

ivy-fail:

ivy-configure:
[ivy:configure] :: loading settings :: file = /export/home/jenkins/workspace/Lucene-Solr-7.x-Solaris/lucene/top-level-ivy-settings.xml

resolve:

jar-checksums:
    [mkdir] Created dir: /export/home/jenkins/workspace/Lucene-Solr-7.x-Solaris/solr/null76659789
     [copy] Copying 241 files to /export/home/jenkins/workspace/Lucene-Solr-7.x-Solaris/solr/null76659789
   [delete] Deleting directory /export/home/jenkins/workspace/Lucene-Solr-7.x-Solaris/solr/null76659789

check-working-copy:
[ivy:cachepath] :: resolving dependencies :: org.eclipse.jgit#org.eclipse.jgit-caller;working
[ivy:cachepath] 	confs: [default]
[ivy:cachepath] 	found org.eclipse.jgit#org.eclipse.jgit;4.6.0.201612231935-r in public
[ivy:cachepath] 	found com.jcraft#jsch;0.1.53 in public
[ivy:cachepath] 	found com.googlecode.javaewah#JavaEWAH;1.1.6 in public
[ivy:cachepath] 	found org.apache.httpcomponents#httpclient;4.3.6 in public
[ivy:cachepath] 	found org.apache.httpcomponents#httpcore;4.3.3 in public
[ivy:cachepath] 	found commons-logging#commons-logging;1.1.3 in public
[ivy:cachepath] 	found commons-codec#commons-codec;1.6 in public
[ivy:cachepath] 	found org.slf4j#slf4j-api;1.7.2 in public
[ivy:cachepath] :: resolution report :: resolve 81ms :: artifacts dl 6ms
	---------------------------------------------------------------------
	|                  |            modules            ||   artifacts   |
	|       conf       | number| search|dwnlded|evicted|| number|dwnlded|
	---------------------------------------------------------------------
	|      default     |   8   |   0   |   0   |   0   ||   8   |   0   |
	---------------------------------------------------------------------
[wc-checker] Initializing working copy...
[wc-checker] SLF4J: Failed to load class "org.slf4j.impl.StaticLoggerBinder".
[wc-checker] SLF4J: Defaulting to no-operation (NOP) logger implementation
[wc-checker] SLF4J: See http://www.slf4j.org/codes.html#StaticLoggerBinder for further details.
[wc-checker] Checking working copy status...

-jenkins-base:

BUILD SUCCESSFUL
Total time: 108 minutes 31 seconds
Setting ANT_1_8_2_HOME=/export/home/jenkins/tools/hudson.tasks.Ant_AntInstallation/ANT_1.8.2
[Lucene-Solr-7.x-Solaris] $ /bin/sh -xe /var/tmp/jenkins205442401610665924.sh
+ mv lucene/build lucene/build.orig
+ mv solr/build solr/build.orig
+ ANT_HOME=/export/home/jenkins/tools/hudson.tasks.Ant_AntInstallation/ANT_1.8.2
+ export ANT_HOME
+ PATH=/export/home/jenkins/tools/hudson.tasks.Ant_AntInstallation/ANT_1.8.2/bin:/export/home/jenkins/tools/java/64bit/jdk1.8.0/bin:/usr/bin:/usr/sbin
+ export PATH
+ python3.4 -u dev-tools/scripts/reproduceJenkinsFailures.py --no-git https://jenkins.thetaphi.de/job/Lucene-Solr-7.x-Solaris/878/consoleText
[repro] Jenkins log URL: https://jenkins.thetaphi.de/job/Lucene-Solr-7.x-Solaris/878/consoleText

[repro] Revision: c5fcae8fbd9d0f41d82cb42eb2cd92a34e0e0a92

[repro] Ant options: "-Dargs=-XX:+UseCompressedOops -XX:+UseG1GC"
[repro] Repro line:  ant test  -Dtestcase=TestV2Request -Dtests.method=testHttpSolrClient -Dtests.seed=C8A88DA647B3483B -Dtests.slow=true -Dtests.locale=es-PY -Dtests.timezone=America/North_Dakota/New_Salem -Dtests.asserts=true -Dtests.file.encoding=ISO-8859-1

[repro] Repro line:  ant test  -Dtestcase=TestV2Request -Dtests.method=testCloudSolrClient -Dtests.seed=C8A88DA647B3483B -Dtests.slow=true -Dtests.locale=es-PY -Dtests.timezone=America/North_Dakota/New_Salem -Dtests.asserts=true -Dtests.file.encoding=ISO-8859-1

[repro] Repro line:  ant test  -Dtestcase=TestV2Request -Dtests.seed=C8A88DA647B3483B -Dtests.slow=true -Dtests.locale=es-PY -Dtests.timezone=America/North_Dakota/New_Salem -Dtests.asserts=true -Dtests.file.encoding=ISO-8859-1

[repro] ant clean
Buildfile: /export/home/jenkins/workspace/Lucene-Solr-7.x-Solaris/build.xml

clean:

clean:

clean:

BUILD SUCCESSFUL
Total time: 0 seconds
[repro] Test suites by module:
[repro]    solr/solrj
[repro]       TestV2Request
[repro] ant compile-test
Buildfile: /export/home/jenkins/workspace/Lucene-Solr-7.x-Solaris/solr/solrj/build.xml

compile-solr-test-framework:

ivy-availability-check:
[loadresource] Do not set property disallowed.ivy.jars.list as its length is 0.

-ivy-fail-disallowed-ivy-version:

ivy-fail:

ivy-configure:
[ivy:configure] :: Apache Ivy 2.4.0 - 20141213170938 :: http://ant.apache.org/ivy/ ::
[ivy:configure] :: loading settings :: file = /export/home/jenkins/workspace/Lucene-Solr-7.x-Solaris/lucene/top-level-ivy-settings.xml

resolve:

-clover.disable:

-clover.load:

-clover.classpath:

-clover.setup:

clover:

compile-solr-core:

compile-solrj:

ivy-availability-check:
[loadresource] Do not set property disallowed.ivy.jars.list as its length is 0.

-ivy-fail-disallowed-ivy-version:

ivy-fail:

ivy-configure:
[ivy:configure] :: loading settings :: file = /export/home/jenkins/workspace/Lucene-Solr-7.x-Solaris/lucene/top-level-ivy-settings.xml

resolve-groovy:
[ivy:cachepath] :: resolving dependencies :: org.codehaus.groovy#groovy-all-caller;working
[ivy:cachepath] 	confs: [default]
[ivy:cachepath] 	found org.codehaus.groovy#groovy-all;2.4.15 in public
[ivy:cachepath] :: resolution report :: resolve 19ms :: artifacts dl 1ms
	---------------------------------------------------------------------
	|                  |            modules            ||   artifacts   |
	|       conf       | number| search|dwnlded|evicted|| number|dwnlded|
	---------------------------------------------------------------------
	|      default     |   1   |   0   |   0   |   0   ||   1   |   0   |
	---------------------------------------------------------------------

check-lucene-core-uptodate:

jar-lucene-core:

-mrjar-classes-uptodate:

ivy-availability-check:
[loadresource] Do not set property disallowed.ivy.jars.list as its length is 0.

-ivy-fail-disallowed-ivy-version:

ivy-fail:

ivy-configure:
[ivy:configure] :: loading settings :: file = /export/home/jenkins/workspace/Lucene-Solr-7.x-Solaris/lucene/top-level-ivy-settings.xml

resolve-groovy:

-check-git-state:

-git-cleanroot:

-copy-git-state:
     [copy] Copying 1 file to /export/home/jenkins/workspace/Lucene-Solr-7.x-Solaris/lucene/build

git-autoclean:

resolve:

init:

-clover.disable:

-clover.load:

-clover.classpath:

-clover.setup:

clover:

compile-core:
    [mkdir] Created dir: /export/home/jenkins/workspace/Lucene-Solr-7.x-Solaris/lucene/build/core/classes/java
    [javac] Compiling 857 source files to /export/home/jenkins/workspace/Lucene-Solr-7.x-Solaris/lucene/build/core/classes/java
    [javac] Note: Some input files use or override a deprecated API.
    [javac] Note: Recompile with -Xlint:deprecation for details.
    [javac] Creating empty /export/home/jenkins/workspace/Lucene-Solr-7.x-Solaris/lucene/build/core/classes/java/org/apache/lucene/util/graph/package-info.class
    [javac] Creating empty /export/home/jenkins/workspace/Lucene-Solr-7.x-Solaris/lucene/build/core/classes/java/org/apache/lucene/document/package-info.class
    [javac] Creating empty /export/home/jenkins/workspace/Lucene-Solr-7.x-Solaris/lucene/build/core/classes/java/org/apache/lucene/package-info.class
    [javac] Creating empty /export/home/jenkins/workspace/Lucene-Solr-7.x-Solaris/lucene/build/core/classes/java/org/apache/lucene/util/bkd/package-info.class
    [javac] Creating empty /export/home/jenkins/workspace/Lucene-Solr-7.x-Solaris/lucene/build/core/classes/java/org/apache/lucene/codecs/compressing/package-info.class
    [javac] Creating empty /export/home/jenkins/workspace/Lucene-Solr-7.x-Solaris/lucene/build/core/classes/java/org/apache/lucene/codecs/lucene60/package-info.class
    [javac] Creating empty /export/home/jenkins/workspace/Lucene-Solr-7.x-Solaris/lucene/build/core/classes/java/org/apache/lucene/codecs/package-info.class
    [javac] Creating empty /export/home/jenkins/workspace/Lucene-Solr-7.x-Solaris/lucene/build/core/classes/java/org/apache/lucene/util/package-info.class
    [javac] Creating empty /export/home/jenkins/workspace/Lucene-Solr-7.x-Solaris/lucene/build/core/classes/java/org/apache/lucene/index/package-info.class
    [javac] Creating empty /export/home/jenkins/workspace/Lucene-Solr-7.x-Solaris/lucene/build/core/classes/java/org/apache/lucene/util/fst/package-info.class
    [javac] Creating empty /export/home/jenkins/workspace/Lucene-Solr-7.x-Solaris/lucene/build/core/classes/java/org/apache/lucene/analysis/tokenattributes/package-info.class
    [javac] Creating empty /export/home/jenkins/workspace/Lucene-Solr-7.x-Solaris/lucene/build/core/classes/java/org/apache/lucene/search/package-info.class
    [javac] Creating empty /export/home/jenkins/workspace/Lucene-Solr-7.x-Solaris/lucene/build/core/classes/java/org/apache/lucene/codecs/lucene62/package-info.class
    [javac] Creating empty /export/home/jenkins/workspace/Lucene-Solr-7.x-Solaris/lucene/build/core/classes/java/org/apache/lucene/util/packed/package-info.class
    [javac] Creating empty /export/home/jenkins/workspace/Lucene-Solr-7.x-Solaris/lucene/build/core/classes/java/org/apache/lucene/util/mutable/package-info.class
    [javac] Creating empty /export/home/jenkins/workspace/Lucene-Solr-7.x-Solaris/lucene/build/core/classes/java/org/apache/lucene/codecs/lucene70/package-info.class
    [javac] Creating empty /export/home/jenkins/workspace/Lucene-Solr-7.x-Solaris/lucene/build/core/classes/java/org/apache/lucene/codecs/perfield/package-info.class
    [javac] Creating empty /export/home/jenkins/workspace/Lucene-Solr-7.x-Solaris/lucene/build/core/classes/java/org/apache/lucene/analysis/package-info.class
    [javac] Creating empty /export/home/jenkins/workspace/Lucene-Solr-7.x-Solaris/lucene/build/core/classes/java/org/apache/lucene/analysis/standard/package-info.class
    [javac] Creating empty /export/home/jenkins/workspace/Lucene-Solr-7.x-Solaris/lucene/build/core/classes/java/org/apache/lucene/store/package-info.class
    [javac] Creating empty /export/home/jenkins/workspace/Lucene-Solr-7.x-Solaris/lucene/build/core/classes/java/org/apache/lucene/codecs/blocktree/package-info.class
    [javac] Creating empty /export/home/jenkins/workspace/Lucene-Solr-7.x-Solaris/lucene/build/core/classes/java/org/apache/lucene/search/spans/package-info.class
    [javac] Creating empty /export/home/jenkins/workspace/Lucene-Solr-7.x-Solaris/lucene/build/core/classes/java/org/apache/lucene/search/similarities/package-info.class
    [javac] Creating empty /export/home/jenkins/workspace/Lucene-Solr-7.x-Solaris/lucene/build/core/classes/java/org/apache/lucene/util/automaton/package-info.class
    [javac] Creating empty /export/home/jenkins/workspace/Lucene-Solr-7.x-Solaris/lucene/build/core/classes/java/org/apache/lucene/codecs/lucene50/package-info.class
    [javac] Creating empty /export/home/jenkins/workspace/Lucene-Solr-7.x-Solaris/lucene/build/core/classes/java/org/apache/lucene/geo/package-info.class
     [copy] Copying 3 files to /export/home/jenkins/workspace/Lucene-Solr-7.x-Solaris/lucene/build/core/classes/java

patch-mrjar-classes:
[patch-cls] Remapped: org/apache/lucene/analysis/tokenattributes/CharTermAttributeImpl
[patch-cls] Remapped: org/apache/lucene/codecs/compressing/LZ4
[patch-cls] Remapped: org/apache/lucene/document/BinaryPoint$2
[patch-cls] Remapped: org/apache/lucene/document/DoubleRange
[patch-cls] Remapped: org/apache/lucene/document/FloatRange
[patch-cls] Remapped: org/apache/lucene/document/IntRange
[patch-cls] Remapped: org/apache/lucene/document/LatLonPointDistanceQuery$1$2
[patch-cls] Remapped: org/apache/lucene/document/LatLonPointDistanceQuery$1$3
[patch-cls] Remapped: org/apache/lucene/document/LatLonPointInPolygonQuery$1$1
[patch-cls] Remapped: org/apache/lucene/document/LongRange
[patch-cls] Remapped: org/apache/lucene/document/RangeFieldQuery$QueryType$1
[patch-cls] Remapped: org/apache/lucene/document/RangeFieldQuery$QueryType$2
[patch-cls] Remapped: org/apache/lucene/document/RangeFieldQuery$QueryType$3
[patch-cls] Remapped: org/apache/lucene/index/BitsSlice
[patch-cls] Remapped: org/apache/lucene/index/CheckIndex$VerifyPointsVisitor
[patch-cls] Remapped: org/apache/lucene/index/CodecReader
[patch-cls] Remapped: org/apache/lucene/index/MergeReaderWrapper
[patch-cls] Remapped: org/apache/lucene/index/PointValues
[patch-cls] Remapped: org/apache/lucene/search/BooleanScorer$TailPriorityQueue
[patch-cls] Remapped: org/apache/lucene/search/PointInSetQuery$SinglePointVisitor
[patch-cls] Remapped: org/apache/lucene/search/PointRangeQuery$1$1
[patch-cls] Remapped: org/apache/lucene/search/PointRangeQuery$1$2
[patch-cls] Remapped: org/apache/lucene/search/PointRangeQuery$1
[patch-cls] Remapped: org/apache/lucene/util/BytesRef
[patch-cls] Remapped: org/apache/lucene/util/BytesRefArray
[patch-cls] Remapped: org/apache/lucene/util/CharsRef$UTF16SortedAsUTF8Comparator
[patch-cls] Remapped: org/apache/lucene/util/CharsRef
[patch-cls] Remapped: org/apache/lucene/util/IntsRef
[patch-cls] Remapped: org/apache/lucene/util/LongsRef
[patch-cls] Remapped: org/apache/lucene/util/StringHelper
[patch-cls] Remapped: org/apache/lucene/util/automaton/Automaton$Builder
[patch-cls] Remapped: org/apache/lucene/util/automaton/Automaton
[patch-cls] Remapped: org/apache/lucene/util/bkd/BKDReader
[patch-cls] Remapped: org/apache/lucene/util/bkd/BKDWriter$BKDMergeQueue
[patch-cls] Remapped: org/apache/lucene/util/bkd/BKDWriter
[patch-cls] Remapped: org/apache/lucene/util/bkd/MutablePointsReaderUtils$1$1
[patch-cls] Remapped: org/apache/lucene/util/bkd/MutablePointsReaderUtils$2
[patch-cls] Remapped: org/apache/lucene/util/bkd/MutablePointsReaderUtils$3$1
[patch-cls] Remapped 38 class files for Java 9 to: /export/home/jenkins/workspace/Lucene-Solr-7.x-Solaris/lucene/build/core/classes/java9
    [touch] Creating /export/home/jenkins/workspace/Lucene-Solr-7.x-Solaris/lucene/build/core/patch-mrjar.stamp

-mrjar-check:

-mrjar-core:
     [exec] Execute failed: java.io.IOException: Cannot run program "git" (in directory "/export/home/jenkins/workspace/Lucene-Solr-7.x-Solaris/lucene/core"): error=2, No such file or directory
      [jar] Building jar: /export/home/jenkins/workspace/Lucene-Solr-7.x-Solaris/lucene/build/core/lucene-core-7.6.0-SNAPSHOT.jar

-jar-core:

jar-core:

check-backward-codecs-uptodate:

jar-backward-codecs:

-mrjar-classes-uptodate:

ivy-availability-check:
[loadresource] Do not set property disallowed.ivy.jars.list as its length is 0.

-ivy-fail-disallowed-ivy-version:

ivy-fail:

ivy-configure:
[ivy:configure] :: loading settings :: file = /export/home/jenkins/workspace/Lucene-Solr-7.x-Solaris/lucene/top-level-ivy-settings.xml

resolve-groovy:

-check-git-state:

-git-cleanroot:

-copy-git-state:

git-autoclean:

resolve:

common.init:

compile-lucene-core:

-check-git-state:

-git-cleanroot:

-copy-git-state:

git-autoclean:

ivy-availability-check:
[loadresource] Do not set property disallowed.ivy.jars.list as its length is 0.

-ivy-fail-disallowed-ivy-version:

ivy-fail:

ivy-configure:
[ivy:configure] :: loading settings :: file = /export/home/jenkins/workspace/Lucene-Solr-7.x-Solaris/lucene/top-level-ivy-settings.xml

resolve:

init:

-clover.disable:

-clover.load:

-clover.classpath:

-clover.setup:

clover:

compile-core:

init:

-clover.disable:

-clover.load:

-clover.classpath:

-clover.setup:

clover:

compile-core:
    [mkdir] Created dir: /export/home/jenkins/workspace/Lucene-Solr-7.x-Solaris/lucene/build/backward-codecs/classes/java
    [javac] Compiling 13 source files to /export/home/jenkins/workspace/Lucene-Solr-7.x-Solaris/lucene/build/backward-codecs/classes/java
    [javac] Note: Some input files use or override a deprecated API.
    [javac] Note: Recompile with -Xlint:deprecation for details.
    [javac] Creating empty /export/home/jenkins/workspace/Lucene-Solr-7.x-Solaris/lucene/build/backward-codecs/classes/java/org/apache/lucene/codecs/lucene54/package-info.class
    [javac] Creating empty /export/home/jenkins/workspace/Lucene-Solr-7.x-Solaris/lucene/build/backward-codecs/classes/java/org/apache/lucene/codecs/lucene53/package-info.class
     [copy] Copying 3 files to /export/home/jenkins/workspace/Lucene-Solr-7.x-Solaris/lucene/build/backward-codecs/classes/java

patch-mrjar-classes:
[patch-cls] Remapped 0 class files for Java 9 to: /export/home/jenkins/workspace/Lucene-Solr-7.x-Solaris/lucene/build/backward-codecs/classes/java9
    [touch] Creating /export/home/jenkins/workspace/Lucene-Solr-7.x-Solaris/lucene/build/backward-codecs/patch-mrjar.stamp

-mrjar-check:

-mrjar-core:

-jar-core:
     [exec] Execute failed: java.io.IOException: Cannot run program "git" (in directory "/export/home/jenkins/workspace/Lucene-Solr-7.x-Solaris/lucene/backward-codecs"): error=2, No such file or directory
      [jar] Building jar: /export/home/jenkins/workspace/Lucene-Solr-7.x-Solaris/lucene/build/backward-codecs/lucene-backward-codecs-7.6.0-SNAPSHOT.jar

jar-core:

check-analyzers-phonetic-uptodate:

jar-analyzers-phonetic:

-mrjar-classes-uptodate:

ivy-availability-check:
[loadresource] Do not set property disallowed.ivy.jars.list as its length is 0.

-ivy-fail-disallowed-ivy-version:

ivy-fail:

ivy-configure:
[ivy:configure] :: loading settings :: file = /export/home/jenkins/workspace/Lucene-Solr-7.x-Solaris/lucene/top-level-ivy-settings.xml

resolve-groovy:

check-analyzers-common-uptodate:

jar-analyzers-common:

-mrjar-classes-uptodate:

ivy-availability-check:
[loadresource] Do not set property disallowed.ivy.jars.list as its length is 0.

-ivy-fail-disallowed-ivy-version:

ivy-fail:

ivy-configure:
[ivy:configure] :: loading settings :: file = /export/home/jenkins/workspace/Lucene-Solr-7.x-Solaris/lucene/top-level-ivy-settings.xml

resolve-groovy:

-check-git-state:

-git-cleanroot:

-copy-git-state:

git-autoclean:

resolve:

common.init:

compile-lucene-core:

-check-git-state:

-git-cleanroot:

-copy-git-state:

git-autoclean:

ivy-availability-check:
[loadresource] Do not set property disallowed.ivy.jars.list as its length is 0.

-ivy-fail-disallowed-ivy-version:

ivy-fail:

ivy-configure:
[ivy:configure] :: loading settings :: file = /export/home/jenkins/workspace/Lucene-Solr-7.x-Solaris/lucene/top-level-ivy-settings.xml

resolve:

init:

-clover.disable:

-clover.load:

-clover.classpath:

-clover.setup:

clover:

compile-core:

init:

-clover.disable:

-clover.load:

-clover.classpath:

-clover.setup:

clover:

compile-core:
    [mkdir] Created dir: /export/home/jenkins/workspace/Lucene-Solr-7.x-Solaris/lucene/build/analysis/common/classes/java
    [javac] Compiling 476 source files to /export/home/jenkins/workspace/Lucene-Solr-7.x-Solaris/lucene/build/analysis/common/classes/java
    [javac] Note: Some input files use or override a deprecated API.
    [javac] Note: Recompile with -Xlint:deprecation for details.
    [javac] Creating empty /export/home/jenkins/workspace/Lucene-Solr-7.x-Solaris/lucene/build/analysis/common/classes/java/org/apache/lucene/analysis/hunspell/package-info.class
    [javac] Creating empty /export/home/jenkins/workspace/Lucene-Solr-7.x-Solaris/lucene/build/analysis/common/classes/java/org/apache/lucene/analysis/minhash/package-info.class
    [javac] Creating empty /export/home/jenkins/workspace/Lucene-Solr-7.x-Solaris/lucene/build/analysis/common/classes/java/org/apache/lucene/analysis/ga/package-info.class
    [javac] Creating empty /export/home/jenkins/workspace/Lucene-Solr-7.x-Solaris/lucene/build/analysis/common/classes/java/org/apache/lucene/analysis/ca/package-info.class
    [javac] Creating empty /export/home/jenkins/workspace/Lucene-Solr-7.x-Solaris/lucene/build/analysis/common/classes/java/org/apache/lucene/analysis/custom/package-info.class
    [javac] Creating empty /export/home/jenkins/workspace/Lucene-Solr-7.x-Solaris/lucene/build/analysis/common/classes/java/org/apache/lucene/analysis/sr/package-info.class
    [javac] Creating empty /export/home/jenkins/workspace/Lucene-Solr-7.x-Solaris/lucene/build/analysis/common/classes/java/org/apache/lucene/collation/package-info.class
    [javac] Creating empty /export/home/jenkins/workspace/Lucene-Solr-7.x-Solaris/lucene/build/analysis/common/classes/java/org/apache/lucene/analysis/sv/package-info.class
    [javac] Creating empty /export/home/jenkins/workspace/Lucene-Solr-7.x-Solaris/lucene/build/analysis/common/classes/java/org/apache/lucene/analysis/bg/package-info.class
    [javac] Creating empty /export/home/jenkins/workspace/Lucene-Solr-7.x-Solaris/lucene/build/analysis/common/classes/java/org/apache/lucene/analysis/payloads/package-info.class
    [javac] Creating empty /export/home/jenkins/workspace/Lucene-Solr-7.x-Solaris/lucene/build/analysis/common/classes/java/org/apache/lucene/analysis/ngram/package-info.class
    [javac] Creating empty /export/home/jenkins/workspace/Lucene-Solr-7.x-Solaris/lucene/build/analysis/common/classes/java/org/apache/lucene/analysis/core/package-info.class
    [javac] Creating empty /export/home/jenkins/workspace/Lucene-Solr-7.x-Solaris/lucene/build/analysis/common/classes/java/org/apache/lucene/analysis/bn/package-info.class
    [javac] Creating empty /export/home/jenkins/workspace/Lucene-Solr-7.x-Solaris/lucene/build/analysis/common/classes/java/org/apache/lucene/analysis/fr/package-info.class
    [javac] Creating empty /export/home/jenkins/workspace/Lucene-Solr-7.x-Solaris/lucene/build/analysis/common/classes/java/org/tartarus/snowball/ext/package-info.class
    [javac] Creating empty /export/home/jenkins/workspace/Lucene-Solr-7.x-Solaris/lucene/build/analysis/common/classes/java/org/apache/lucene/analysis/br/package-info.class
    [javac] Creating empty /export/home/jenkins/workspace/Lucene-Solr-7.x-Solaris/lucene/build/analysis/common/classes/java/org/apache/lucene/analysis/miscellaneous/package-info.class
    [javac] Creating empty /export/home/jenkins/workspace/Lucene-Solr-7.x-Solaris/lucene/build/analysis/common/classes/java/org/apache/lucene/analysis/sinks/package-info.class
    [javac] Creating empty /export/home/jenkins/workspace/Lucene-Solr-7.x-Solaris/lucene/build/analysis/common/classes/java/org/apache/lucene/analysis/cjk/package-info.class
    [javac] Creating empty /export/home/jenkins/workspace/Lucene-Solr-7.x-Solaris/lucene/build/analysis/common/classes/java/org/apache/lucene/analysis/synonym/package-info.class
    [javac] Creating empty /export/home/jenkins/workspace/Lucene-Solr-7.x-Solaris/lucene/build/analysis/common/classes/java/org/apache/lucene/analysis/wikipedia/package-info.class
    [javac] Creating empty /export/home/jenkins/workspace/Lucene-Solr-7.x-Solaris/lucene/build/analysis/common/classes/java/org/apache/lucene/analysis/fa/package-info.class
    [javac] Creating empty /export/home/jenkins/workspace/Lucene-Solr-7.x-Solaris/lucene/build/analysis/common/classes/java/org/apache/lucene/analysis/reverse/package-info.class
    [javac] Creating empty /export/home/jenkins/workspace/Lucene-Solr-7.x-Solaris/lucene/build/analysis/common/classes/java/org/apache/lucene/analysis/nl/package-info.class
    [javac] Creating empty /export/home/jenkins/workspace/Lucene-Solr-7.x-Solaris/lucene/build/analysis/common/classes/java/org/apache/lucene/analysis/ro/package-info.class
    [javac] Creating empty /export/home/jenkins/workspace/Lucene-Solr-7.x-Solaris/lucene/build/analysis/common/classes/java/org/apache/lucene/analysis/fi/package-info.class
    [javac] Creating empty /export/home/jenkins/workspace/Lucene-Solr-7.x-Solaris/lucene/build/analysis/common/classes/java/org/apache/lucene/analysis/ru/package-info.class
    [javac] Creating empty /export/home/jenkins/workspace/Lucene-Solr-7.x-Solaris/lucene/build/analysis/common/classes/java/org/apache/lucene/analysis/no/package-info.class
    [javac] Creating empty /export/home/jenkins/workspace/Lucene-Solr-7.x-Solaris/lucene/build/analysis/common/classes/java/org/apache/lucene/analysis/el/package-info.class
    [javac] Creating empty /export/home/jenkins/workspace/Lucene-Solr-7.x-Solaris/lucene/build/analysis/common/classes/java/org/apache/lucene/analysis/ckb/package-info.class
    [javac] Creating empty /export/home/jenkins/workspace/Lucene-Solr-7.x-Solaris/lucene/build/analysis/common/classes/java/org/tartarus/snowball/package-info.class
    [javac] Creating empty /export/home/jenkins/workspace/Lucene-Solr-7.x-Solaris/lucene/build/analysis/common/classes/java/org/apache/lucene/analysis/in/package-info.class
    [javac] Creating empty /export/home/jenkins/workspace/Lucene-Solr-7.x-Solaris/lucene/build/analysis/common/classes/java/org/apache/lucene/analysis/util/package-info.class
    [javac] Creating empty /export/home/jenkins/workspace/Lucene-Solr-7.x-Solaris/lucene/build/analysis/common/classes/java/org/apache/lucene/analysis/it/package-info.class
    [javac] Creating empty /export/home/jenkins/workspace/Lucene-Solr-7.x-Solaris/lucene/build/analysis/common/classes/java/org/apache/lucene/analysis/snowball/package-info.class
    [javac] Creating empty /export/home/jenkins/workspace/Lucene-Solr-7.x-Solaris/lucene/build/analysis/common/classes/java/org/apache/lucene/analysis/en/package-info.class
    [javac] Creating empty /export/home/jenkins/workspace/Lucene-Solr-7.x-Solaris/lucene/build/analysis/common/classes/java/org/apache/lucene/analysis/es/package-info.class
    [javac] Creating empty /export/home/jenkins/workspace/Lucene-Solr-7.x-Solaris/lucene/build/analysis/common/classes/java/org/apache/lucene/analysis/shingle/package-info.class
    [javac] Creating empty /export/home/jenkins/workspace/Lucene-Solr-7.x-Solaris/lucene/build/analysis/common/classes/java/org/apache/lucene/analysis/eu/package-info.class
    [javac] Creating empty /export/home/jenkins/workspace/Lucene-Solr-7.x-Solaris/lucene/build/analysis/common/classes/java/org/apache/lucene/analysis/ar/package-info.class
    [javac] Creating empty /export/home/jenkins/workspace/Lucene-Solr-7.x-Solaris/lucene/build/analysis/common/classes/java/org/apache/lucene/analysis/query/package-info.class
    [javac] Creating empty /export/home/jenkins/workspace/Lucene-Solr-7.x-Solaris/lucene/build/analysis/common/classes/java/org/apache/lucene/analysis/id/package-info.class
    [javac] Creating empty /export/home/jenkins/workspace/Lucene-Solr-7.x-Solaris/lucene/build/analysis/common/classes/java/org/apache/lucene/analysis/compound/hyphenation/package-info.class
    [javac] Creating empty /export/home/jenkins/workspace/Lucene-Solr-7.x-Solaris/lucene/build/analysis/common/classes/java/org/apache/lucene/analysis/charfilter/package-info.class
    [javac] Creating empty /export/home/jenkins/workspace/Lucene-Solr-7.x-Solaris/lucene/build/analysis/common/classes/java/org/apache/lucene/analysis/pt/package-info.class
    [javac] Creating empty /export/home/jenkins/workspace/Lucene-Solr-7.x-Solaris/lucene/build/analysis/common/classes/java/org/apache/

[...truncated too long message...]

.java:748)
   [junit4]    > 	at __randomizedtesting.SeedInfo.seed([C8A88DA647B3483B]:0)
   [junit4] Completed [3/5 (3!)] on J0 in 98.26s, 4 tests, 2 failures, 1 error <<< FAILURES!
   [junit4] 
   [junit4] Suite: org.apache.solr.client.solrj.request.TestV2Request
   [junit4] Completed [4/5 (3!)] on J0 in 0.01s, 4 tests, 4 skipped
   [junit4] 
   [junit4] Suite: org.apache.solr.client.solrj.request.TestV2Request
   [junit4]   2> Creating dataDir: /export/home/jenkins/workspace/Lucene-Solr-7.x-Solaris/solr/build/solr-solrj/test/J1/temp/solr.client.solrj.request.TestV2Request_C8A88DA647B3483B-002/init-core-data-001
   [junit4]   1> 16:15:55.595 [Thread-50] ERROR org.apache.zookeeper.server.ZooKeeperServer - ZKShutdownHandler is not registered, so ZooKeeper server won't take any action on ERROR or SHUTDOWN server state changes
   [junit4]   1> 16:15:55.703 [jetty-launcher-151-thread-1] ERROR org.apache.solr.util.StartupLoggingUtils - Missing Java Option solr.log.dir. Logging may be missing or incomplete.
   [junit4]   1> 16:15:55.706 [jetty-launcher-151-thread-4] ERROR org.apache.solr.util.StartupLoggingUtils - Missing Java Option solr.log.dir. Logging may be missing or incomplete.
   [junit4]   1> 16:15:55.712 [jetty-launcher-151-thread-2] ERROR org.apache.solr.util.StartupLoggingUtils - Missing Java Option solr.log.dir. Logging may be missing or incomplete.
   [junit4]   1> 16:15:55.715 [jetty-launcher-151-thread-3] ERROR org.apache.solr.util.StartupLoggingUtils - Missing Java Option solr.log.dir. Logging may be missing or incomplete.
   [junit4]   1> livenodes: [127.0.0.1:42727_solr, 127.0.0.1:42933_solr, 127.0.0.1:39621_solr, 127.0.0.1:64592_solr]
   [junit4] OK      2.79s J1 | TestV2Request.testV2Forwarding
   [junit4]   1> 16:16:04.658 [qtp1129877354-450] ERROR org.apache.solr.api.V2HttpCall - >> path: '/c/_introspect'
   [junit4]   2> NOTE: reproduce with: ant test  -Dtestcase=TestV2Request -Dtests.method=testHttpSolrClient -Dtests.seed=C8A88DA647B3483B -Dtests.slow=true -Dtests.badapples=true -Dtests.locale=es-PY -Dtests.timezone=America/North_Dakota/New_Salem -Dtests.asserts=true -Dtests.file.encoding=ISO-8859-1
   [junit4] FAILURE 5.81s J1 | TestV2Request.testHttpSolrClient <<<
   [junit4]    > Throwable #1: java.lang.AssertionError: expected:<0> but was:<1>
   [junit4]    > 	at __randomizedtesting.SeedInfo.seed([C8A88DA647B3483B:10B0958CE6875A1C]:0)
   [junit4]    > 	at org.apache.solr.client.solrj.request.TestV2Request.doTest(TestV2Request.java:105)
   [junit4]    > 	at org.apache.solr.client.solrj.request.TestV2Request.testHttpSolrClient(TestV2Request.java:70)
   [junit4]    > 	at java.lang.Thread.run(Thread.java:748)
   [junit4] OK      0.09s J1 | TestV2Request.testIsCollectionRequest
   [junit4]   1> 16:16:10.403 [qtp1837710088-426] ERROR org.apache.solr.api.V2HttpCall - >> path: '/c/_introspect'
   [junit4]   2> NOTE: reproduce with: ant test  -Dtestcase=TestV2Request -Dtests.method=testCloudSolrClient -Dtests.seed=C8A88DA647B3483B -Dtests.slow=true -Dtests.badapples=true -Dtests.locale=es-PY -Dtests.timezone=America/North_Dakota/New_Salem -Dtests.asserts=true -Dtests.file.encoding=ISO-8859-1
   [junit4] FAILURE 5.44s J1 | TestV2Request.testCloudSolrClient <<<
   [junit4]    > Throwable #1: java.lang.AssertionError: expected:<0> but was:<1>
   [junit4]    > 	at __randomizedtesting.SeedInfo.seed([C8A88DA647B3483B:515E0616E200C050]:0)
   [junit4]    > 	at org.apache.solr.client.solrj.request.TestV2Request.doTest(TestV2Request.java:105)
   [junit4]    > 	at org.apache.solr.client.solrj.request.TestV2Request.testCloudSolrClient(TestV2Request.java:77)
   [junit4]    > 	at java.lang.Thread.run(Thread.java:748)
   [junit4]   1> 16:16:13.579 [SUITE-TestV2Request-seed#[C8A88DA647B3483B]-worker] ERROR org.apache.zookeeper.server.ZooKeeperServer - ZKShutdownHandler is not registered, so ZooKeeper server won't take any action on ERROR or SHUTDOWN server state changes
   [junit4]   2> NOTE: leaving temporary files on disk at: /export/home/jenkins/workspace/Lucene-Solr-7.x-Solaris/solr/build/solr-solrj/test/J1/temp/solr.client.solrj.request.TestV2Request_C8A88DA647B3483B-002
   [junit4]   2> Oct 26, 2018 4:16:13 PM com.carrotsearch.randomizedtesting.ThreadLeakControl checkThreadLeaks
   [junit4]   2> WARNING: Will linger awaiting termination of 2 leaked thread(s).
   [junit4]   2> Oct 26, 2018 4:17:33 PM com.carrotsearch.randomizedtesting.ThreadLeakControl checkThreadLeaks
   [junit4]   2> SEVERE: 1 thread leaked from SUITE scope at org.apache.solr.client.solrj.request.TestV2Request: 
   [junit4]   2>    1) Thread[id=574, name=Connection evictor, state=TIMED_WAITING, group=TGRP-TestV2Request]
   [junit4]   2>         at java.lang.Thread.sleep(Native Method)
   [junit4]   2>         at org.apache.http.impl.client.IdleConnectionEvictor$1.run(IdleConnectionEvictor.java:66)
   [junit4]   2>         at java.lang.Thread.run(Thread.java:748)
   [junit4]   2> Oct 26, 2018 4:17:33 PM com.carrotsearch.randomizedtesting.ThreadLeakControl tryToInterruptAll
   [junit4]   2> INFO: Starting to interrupt leaked threads:
   [junit4]   2>    1) Thread[id=574, name=Connection evictor, state=TIMED_WAITING, group=TGRP-TestV2Request]
   [junit4]   2> Oct 26, 2018 4:17:33 PM com.carrotsearch.randomizedtesting.ThreadLeakControl tryToInterruptAll
   [junit4]   2> INFO: All leaked threads terminated.
   [junit4]   2> NOTE: test params are: codec=Asserting(Lucene70), sim=RandomSimilarity(queryNorm=true): {}, locale=es-PY, timezone=America/North_Dakota/New_Salem
   [junit4]   2> NOTE: SunOS 5.11 amd64/Oracle Corporation 1.8.0_172 (64-bit)/cpus=3,threads=1,free=268254936,total=423624704
   [junit4]   2> NOTE: All tests run in this JVM: [TestV2Request, TestV2Request]
   [junit4]   2> NOTE: reproduce with: ant test  -Dtestcase=TestV2Request -Dtests.seed=C8A88DA647B3483B -Dtests.slow=true -Dtests.badapples=true -Dtests.locale=es-PY -Dtests.timezone=America/North_Dakota/New_Salem -Dtests.asserts=true -Dtests.file.encoding=ISO-8859-1
   [junit4] ERROR   0.00s J1 | TestV2Request (suite) <<<
   [junit4]    > Throwable #1: com.carrotsearch.randomizedtesting.ThreadLeakError: 1 thread leaked from SUITE scope at org.apache.solr.client.solrj.request.TestV2Request: 
   [junit4]    >    1) Thread[id=574, name=Connection evictor, state=TIMED_WAITING, group=TGRP-TestV2Request]
   [junit4]    >         at java.lang.Thread.sleep(Native Method)
   [junit4]    >         at org.apache.http.impl.client.IdleConnectionEvictor$1.run(IdleConnectionEvictor.java:66)
   [junit4]    >         at java.lang.Thread.run(Thread.java:748)
   [junit4]    > 	at __randomizedtesting.SeedInfo.seed([C8A88DA647B3483B]:0)
   [junit4] Completed [5/5 (4!)] on J1 in 98.19s, 4 tests, 2 failures, 1 error <<< FAILURES!
   [junit4] 
   [junit4] 
   [junit4] Tests with failures [seed: C8A88DA647B3483B] (first 10 out of 12):
   [junit4]   - org.apache.solr.client.solrj.request.TestV2Request.testHttpSolrClient
   [junit4]   - org.apache.solr.client.solrj.request.TestV2Request.testHttpSolrClient
   [junit4]   - org.apache.solr.client.solrj.request.TestV2Request.testCloudSolrClient
   [junit4]   - org.apache.solr.client.solrj.request.TestV2Request (suite)
   [junit4]   - org.apache.solr.client.solrj.request.TestV2Request.testCloudSolrClient
   [junit4]   - org.apache.solr.client.solrj.request.TestV2Request (suite)
   [junit4]   - org.apache.solr.client.solrj.request.TestV2Request.testHttpSolrClient
   [junit4]   - org.apache.solr.client.solrj.request.TestV2Request.testHttpSolrClient
   [junit4]   - org.apache.solr.client.solrj.request.TestV2Request.testCloudSolrClient
   [junit4]   - org.apache.solr.client.solrj.request.TestV2Request (suite)
   [junit4] 
   [junit4] 
   [junit4] JVM J0:     0.67 ..   206.56 =   205.89s
   [junit4] JVM J1:     0.66 ..   209.59 =   208.93s
   [junit4] Execution time total: 3 minutes 29 seconds
   [junit4] Tests summary: 5 suites, 20 tests, 4 suite-level errors, 8 failures, 4 ignored

BUILD FAILED
/export/home/jenkins/workspace/Lucene-Solr-7.x-Solaris/lucene/common-build.xml:1567: The following error occurred while executing this line:
/export/home/jenkins/workspace/Lucene-Solr-7.x-Solaris/lucene/common-build.xml:1092: There were test failures: 5 suites, 20 tests, 4 suite-level errors, 8 failures, 4 ignored [seed: C8A88DA647B3483B]

Total time: 3 minutes 31 seconds

[repro] Setting last failure code to 256

[repro] Failures:
[repro]   4/5 failed: org.apache.solr.client.solrj.request.TestV2Request
[repro] Exiting with code 256
+ mv lucene/build lucene/build.repro
+ mv solr/build solr/build.repro
+ mv lucene/build.orig lucene/build
+ mv solr/build.orig solr/build
Archiving artifacts
Setting ANT_1_8_2_HOME=/export/home/jenkins/tools/hudson.tasks.Ant_AntInstallation/ANT_1.8.2
[WARNINGS] Parsing warnings in console log with parser Java Compiler (javac)
Setting ANT_1_8_2_HOME=/export/home/jenkins/tools/hudson.tasks.Ant_AntInstallation/ANT_1.8.2
Setting ANT_1_8_2_HOME=/export/home/jenkins/tools/hudson.tasks.Ant_AntInstallation/ANT_1.8.2
<Git Blamer> Using GitBlamer to create author and commit information for all warnings.
<Git Blamer> GIT_COMMIT=c5fcae8fbd9d0f41d82cb42eb2cd92a34e0e0a92, workspace=/export/home/jenkins/workspace/Lucene-Solr-7.x-Solaris
[WARNINGS] Computing warning deltas based on reference build #877
Recording test results
Setting ANT_1_8_2_HOME=/export/home/jenkins/tools/hudson.tasks.Ant_AntInstallation/ANT_1.8.2
Build step 'Publish JUnit test result report' changed build result to UNSTABLE
Email was triggered for: Unstable (Test Failures)
Sending email for trigger: Unstable (Test Failures)
Setting ANT_1_8_2_HOME=/export/home/jenkins/tools/hudson.tasks.Ant_AntInstallation/ANT_1.8.2
Setting ANT_1_8_2_HOME=/export/home/jenkins/tools/hudson.tasks.Ant_AntInstallation/ANT_1.8.2
Setting ANT_1_8_2_HOME=/export/home/jenkins/tools/hudson.tasks.Ant_AntInstallation/ANT_1.8.2
Setting ANT_1_8_2_HOME=/export/home/jenkins/tools/hudson.tasks.Ant_AntInstallation/ANT_1.8.2

Mime
View raw message