lucene-dev mailing list archives

Site index · List index
Message view « Date » · « Thread »
Top « Date » · « Thread »
From Policeman Jenkins Server <jenk...@thetaphi.de>
Subject [JENKINS] Lucene-Solr-7.x-Windows (64bit/jdk-9.0.4) - Build # 856 - Failure!
Date Sat, 27 Oct 2018 23:16:16 GMT
Build: https://jenkins.thetaphi.de/job/Lucene-Solr-7.x-Windows/856/
Java: 64bit/jdk-9.0.4 -XX:+UseCompressedOops -XX:+UseParallelGC

2 tests failed.
FAILED:  org.apache.solr.cloud.autoscaling.sim.TestSimGenericDistributedQueue.testDistributedQueueBlocking

Error Message:


Stack Trace:
java.util.concurrent.TimeoutException
	at __randomizedtesting.SeedInfo.seed([E57BFC8A9EF97A55:A0D18EF3DAABC621]:0)
	at java.base/java.util.concurrent.FutureTask.get(FutureTask.java:204)
	at org.apache.solr.cloud.autoscaling.sim.TestSimDistributedQueue.testDistributedQueueBlocking(TestSimDistributedQueue.java:102)
	at java.base/jdk.internal.reflect.NativeMethodAccessorImpl.invoke0(Native Method)
	at java.base/jdk.internal.reflect.NativeMethodAccessorImpl.invoke(NativeMethodAccessorImpl.java:62)
	at java.base/jdk.internal.reflect.DelegatingMethodAccessorImpl.invoke(DelegatingMethodAccessorImpl.java:43)
	at java.base/java.lang.reflect.Method.invoke(Method.java:564)
	at com.carrotsearch.randomizedtesting.RandomizedRunner.invoke(RandomizedRunner.java:1742)
	at com.carrotsearch.randomizedtesting.RandomizedRunner$8.evaluate(RandomizedRunner.java:935)
	at com.carrotsearch.randomizedtesting.RandomizedRunner$9.evaluate(RandomizedRunner.java:971)
	at com.carrotsearch.randomizedtesting.RandomizedRunner$10.evaluate(RandomizedRunner.java:985)
	at com.carrotsearch.randomizedtesting.rules.SystemPropertiesRestoreRule$1.evaluate(SystemPropertiesRestoreRule.java:57)
	at org.apache.lucene.util.TestRuleSetupTeardownChained$1.evaluate(TestRuleSetupTeardownChained.java:49)
	at org.apache.lucene.util.AbstractBeforeAfterRule$1.evaluate(AbstractBeforeAfterRule.java:45)
	at org.apache.lucene.util.TestRuleThreadAndTestName$1.evaluate(TestRuleThreadAndTestName.java:48)
	at org.apache.lucene.util.TestRuleIgnoreAfterMaxFailures$1.evaluate(TestRuleIgnoreAfterMaxFailures.java:64)
	at org.apache.lucene.util.TestRuleMarkFailure$1.evaluate(TestRuleMarkFailure.java:47)
	at com.carrotsearch.randomizedtesting.rules.StatementAdapter.evaluate(StatementAdapter.java:36)
	at com.carrotsearch.randomizedtesting.ThreadLeakControl$StatementRunner.run(ThreadLeakControl.java:368)
	at com.carrotsearch.randomizedtesting.ThreadLeakControl.forkTimeoutingTask(ThreadLeakControl.java:817)
	at com.carrotsearch.randomizedtesting.ThreadLeakControl$3.evaluate(ThreadLeakControl.java:468)
	at com.carrotsearch.randomizedtesting.RandomizedRunner.runSingleTest(RandomizedRunner.java:944)
	at com.carrotsearch.randomizedtesting.RandomizedRunner$5.evaluate(RandomizedRunner.java:830)
	at com.carrotsearch.randomizedtesting.RandomizedRunner$6.evaluate(RandomizedRunner.java:880)
	at com.carrotsearch.randomizedtesting.RandomizedRunner$7.evaluate(RandomizedRunner.java:891)
	at com.carrotsearch.randomizedtesting.rules.StatementAdapter.evaluate(StatementAdapter.java:36)
	at com.carrotsearch.randomizedtesting.rules.SystemPropertiesRestoreRule$1.evaluate(SystemPropertiesRestoreRule.java:57)
	at org.apache.lucene.util.AbstractBeforeAfterRule$1.evaluate(AbstractBeforeAfterRule.java:45)
	at com.carrotsearch.randomizedtesting.rules.StatementAdapter.evaluate(StatementAdapter.java:36)
	at org.apache.lucene.util.TestRuleStoreClassName$1.evaluate(TestRuleStoreClassName.java:41)
	at com.carrotsearch.randomizedtesting.rules.NoShadowingOrOverridesOnMethodsRule$1.evaluate(NoShadowingOrOverridesOnMethodsRule.java:40)
	at com.carrotsearch.randomizedtesting.rules.NoShadowingOrOverridesOnMethodsRule$1.evaluate(NoShadowingOrOverridesOnMethodsRule.java:40)
	at com.carrotsearch.randomizedtesting.rules.StatementAdapter.evaluate(StatementAdapter.java:36)
	at com.carrotsearch.randomizedtesting.rules.StatementAdapter.evaluate(StatementAdapter.java:36)
	at org.apache.lucene.util.TestRuleAssertionsRequired$1.evaluate(TestRuleAssertionsRequired.java:53)
	at org.apache.lucene.util.TestRuleMarkFailure$1.evaluate(TestRuleMarkFailure.java:47)
	at org.apache.lucene.util.TestRuleIgnoreAfterMaxFailures$1.evaluate(TestRuleIgnoreAfterMaxFailures.java:64)
	at org.apache.lucene.util.TestRuleIgnoreTestSuites$1.evaluate(TestRuleIgnoreTestSuites.java:54)
	at com.carrotsearch.randomizedtesting.rules.StatementAdapter.evaluate(StatementAdapter.java:36)
	at com.carrotsearch.randomizedtesting.ThreadLeakControl$StatementRunner.run(ThreadLeakControl.java:368)
	at java.base/java.lang.Thread.run(Thread.java:844)


FAILED:  junit.framework.TestSuite.org.apache.solr.cloud.autoscaling.sim.TestSimGenericDistributedQueue

Error Message:
1 thread leaked from SUITE scope at org.apache.solr.cloud.autoscaling.sim.TestSimGenericDistributedQueue:
    1) Thread[id=33201, name=sdqtest--10858-thread-1, state=TIMED_WAITING, group=TGRP-TestSimGenericDistributedQueue]
        at java.base@9.0.4/jdk.internal.misc.Unsafe.park(Native Method)         at java.base@9.0.4/java.util.concurrent.locks.LockSupport.parkNanos(LockSupport.java:234)
        at java.base@9.0.4/java.util.concurrent.locks.AbstractQueuedSynchronizer$ConditionObject.awaitNanos(AbstractQueuedSynchronizer.java:2104)
        at app//org.apache.solr.cloud.autoscaling.sim.GenericDistributedQueue.peek(GenericDistributedQueue.java:194)
        at app//org.apache.solr.cloud.autoscaling.sim.GenericDistributedQueue.peek(GenericDistributedQueue.java:167)
        at app//org.apache.solr.cloud.autoscaling.sim.TestSimDistributedQueue.lambda$testDistributedQueueBlocking$0(TestSimDistributedQueue.java:93)
        at app//org.apache.solr.cloud.autoscaling.sim.TestSimDistributedQueue$$Lambda$1390/2042206481.call(Unknown
Source)         at java.base@9.0.4/java.util.concurrent.FutureTask.run(FutureTask.java:264)
        at app//org.apache.solr.common.util.ExecutorUtil$MDCAwareThreadPoolExecutor.lambda$execute$0(ExecutorUtil.java:209)
        at app//org.apache.solr.common.util.ExecutorUtil$MDCAwareThreadPoolExecutor$$Lambda$263/1728514115.run(Unknown
Source)         at java.base@9.0.4/java.util.concurrent.ThreadPoolExecutor.runWorker(ThreadPoolExecutor.java:1167)
        at java.base@9.0.4/java.util.concurrent.ThreadPoolExecutor$Worker.run(ThreadPoolExecutor.java:641)
        at java.base@9.0.4/java.lang.Thread.run(Thread.java:844)

Stack Trace:
com.carrotsearch.randomizedtesting.ThreadLeakError: 1 thread leaked from SUITE scope at org.apache.solr.cloud.autoscaling.sim.TestSimGenericDistributedQueue:

   1) Thread[id=33201, name=sdqtest--10858-thread-1, state=TIMED_WAITING, group=TGRP-TestSimGenericDistributedQueue]
        at java.base@9.0.4/jdk.internal.misc.Unsafe.park(Native Method)
        at java.base@9.0.4/java.util.concurrent.locks.LockSupport.parkNanos(LockSupport.java:234)
        at java.base@9.0.4/java.util.concurrent.locks.AbstractQueuedSynchronizer$ConditionObject.awaitNanos(AbstractQueuedSynchronizer.java:2104)
        at app//org.apache.solr.cloud.autoscaling.sim.GenericDistributedQueue.peek(GenericDistributedQueue.java:194)
        at app//org.apache.solr.cloud.autoscaling.sim.GenericDistributedQueue.peek(GenericDistributedQueue.java:167)
        at app//org.apache.solr.cloud.autoscaling.sim.TestSimDistributedQueue.lambda$testDistributedQueueBlocking$0(TestSimDistributedQueue.java:93)
        at app//org.apache.solr.cloud.autoscaling.sim.TestSimDistributedQueue$$Lambda$1390/2042206481.call(Unknown
Source)
        at java.base@9.0.4/java.util.concurrent.FutureTask.run(FutureTask.java:264)
        at app//org.apache.solr.common.util.ExecutorUtil$MDCAwareThreadPoolExecutor.lambda$execute$0(ExecutorUtil.java:209)
        at app//org.apache.solr.common.util.ExecutorUtil$MDCAwareThreadPoolExecutor$$Lambda$263/1728514115.run(Unknown
Source)
        at java.base@9.0.4/java.util.concurrent.ThreadPoolExecutor.runWorker(ThreadPoolExecutor.java:1167)
        at java.base@9.0.4/java.util.concurrent.ThreadPoolExecutor$Worker.run(ThreadPoolExecutor.java:641)
        at java.base@9.0.4/java.lang.Thread.run(Thread.java:844)
	at __randomizedtesting.SeedInfo.seed([E57BFC8A9EF97A55]:0)




Build Log:
[...truncated 14616 lines...]
   [junit4] Suite: org.apache.solr.cloud.autoscaling.sim.TestSimGenericDistributedQueue
   [junit4]   2> 3113156 INFO  (SUITE-TestSimGenericDistributedQueue-seed#[E57BFC8A9EF97A55]-worker)
[    ] o.a.s.SolrTestCaseJ4 SecureRandom sanity checks: test.solr.allowed.securerandom=null
& java.security.egd=file:/dev/./urandom
   [junit4]   2> Creating dataDir: C:\Users\jenkins\workspace\Lucene-Solr-7.x-Windows\solr\build\solr-core\test\J0\temp\solr.cloud.autoscaling.sim.TestSimGenericDistributedQueue_E57BFC8A9EF97A55-001\init-core-data-001
   [junit4]   2> 3113157 WARN  (SUITE-TestSimGenericDistributedQueue-seed#[E57BFC8A9EF97A55]-worker)
[    ] o.a.s.SolrTestCaseJ4 startTrackingSearchers: numOpens=12 numCloses=12
   [junit4]   2> 3113157 INFO  (SUITE-TestSimGenericDistributedQueue-seed#[E57BFC8A9EF97A55]-worker)
[    ] o.a.s.SolrTestCaseJ4 Using PointFields (NUMERIC_POINTS_SYSPROP=true) w/NUMERIC_DOCVALUES_SYSPROP=false
   [junit4]   2> 3113158 INFO  (SUITE-TestSimGenericDistributedQueue-seed#[E57BFC8A9EF97A55]-worker)
[    ] o.a.s.SolrTestCaseJ4 Randomized ssl (false) and clientAuth (false) via: @org.apache.solr.util.RandomizeSSL(reason="",
value=0.0/0.0, ssl=0.0/0.0, clientAuth=0.0/0.0)
   [junit4]   2> 3113159 INFO  (TEST-TestSimGenericDistributedQueue.testDistributedQueue-seed#[E57BFC8A9EF97A55])
[    ] o.a.s.SolrTestCaseJ4 ###Starting testDistributedQueue
   [junit4]   2> 3115165 INFO  (TEST-TestSimGenericDistributedQueue.testDistributedQueue-seed#[E57BFC8A9EF97A55])
[    ] o.a.s.SolrTestCaseJ4 ###Ending testDistributedQueue
   [junit4]   2> 3115167 INFO  (TEST-TestSimGenericDistributedQueue.testLocallyOffer-seed#[E57BFC8A9EF97A55])
[    ] o.a.s.SolrTestCaseJ4 ###Starting testLocallyOffer
   [junit4]   2> 3115369 INFO  (TEST-TestSimGenericDistributedQueue.testLocallyOffer-seed#[E57BFC8A9EF97A55])
[    ] o.a.s.SolrTestCaseJ4 ###Ending testLocallyOffer
   [junit4]   2> 3115370 INFO  (TEST-TestSimGenericDistributedQueue.testDistributedQueueBlocking-seed#[E57BFC8A9EF97A55])
[    ] o.a.s.SolrTestCaseJ4 ###Starting testDistributedQueueBlocking
   [junit4]   2> 3117372 INFO  (TEST-TestSimGenericDistributedQueue.testDistributedQueueBlocking-seed#[E57BFC8A9EF97A55])
[    ] o.a.s.SolrTestCaseJ4 ###Ending testDistributedQueueBlocking
   [junit4]   2> NOTE: reproduce with: ant test  -Dtestcase=TestSimGenericDistributedQueue
-Dtests.method=testDistributedQueueBlocking -Dtests.seed=E57BFC8A9EF97A55 -Dtests.slow=true
-Dtests.locale=en-VG -Dtests.timezone=America/Marigot -Dtests.asserts=true -Dtests.file.encoding=ISO-8859-1
   [junit4] ERROR   2.01s J0 | TestSimGenericDistributedQueue.testDistributedQueueBlocking
<<<
   [junit4]    > Throwable #1: java.util.concurrent.TimeoutException
   [junit4]    > 	at __randomizedtesting.SeedInfo.seed([E57BFC8A9EF97A55:A0D18EF3DAABC621]:0)
   [junit4]    > 	at java.base/java.util.concurrent.FutureTask.get(FutureTask.java:204)
   [junit4]    > 	at org.apache.solr.cloud.autoscaling.sim.TestSimDistributedQueue.testDistributedQueueBlocking(TestSimDistributedQueue.java:102)
   [junit4]    > 	at java.base/jdk.internal.reflect.NativeMethodAccessorImpl.invoke0(Native
Method)
   [junit4]    > 	at java.base/jdk.internal.reflect.NativeMethodAccessorImpl.invoke(NativeMethodAccessorImpl.java:62)
   [junit4]    > 	at java.base/jdk.internal.reflect.DelegatingMethodAccessorImpl.invoke(DelegatingMethodAccessorImpl.java:43)
   [junit4]    > 	at java.base/java.lang.reflect.Method.invoke(Method.java:564)
   [junit4]    > 	at java.base/java.lang.Thread.run(Thread.java:844)
   [junit4] IGNOR/A 0.00s J0 | TestSimGenericDistributedQueue.testDistributedQueue {#2}
   [junit4]    > Assumption #1: 'badapple' test group is disabled (@BadApple(bugUrl="https://issues.apache.org/jira/browse/SOLR-12028"))
   [junit4]   2> 3117375 INFO  (TEST-TestSimGenericDistributedQueue.testPeekElements-seed#[E57BFC8A9EF97A55])
[    ] o.a.s.SolrTestCaseJ4 ###Starting testPeekElements
   [junit4]   2> 3118879 INFO  (TEST-TestSimGenericDistributedQueue.testPeekElements-seed#[E57BFC8A9EF97A55])
[    ] o.a.s.SolrTestCaseJ4 ###Ending testPeekElements
   [junit4]   2> NOTE: leaving temporary files on disk at: C:\Users\jenkins\workspace\Lucene-Solr-7.x-Windows\solr\build\solr-core\test\J0\temp\solr.cloud.autoscaling.sim.TestSimGenericDistributedQueue_E57BFC8A9EF97A55-001
   [junit4]   2> Oct 27, 2018 11:05:17 PM com.carrotsearch.randomizedtesting.ThreadLeakControl
checkThreadLeaks
   [junit4]   2> WARNING: Will linger awaiting termination of 1 leaked thread(s).
   [junit4]   2> Oct 27, 2018 11:06:37 PM com.carrotsearch.randomizedtesting.ThreadLeakControl
checkThreadLeaks
   [junit4]   2> SEVERE: 1 thread leaked from SUITE scope at org.apache.solr.cloud.autoscaling.sim.TestSimGenericDistributedQueue:

   [junit4]   2>    1) Thread[id=33201, name=sdqtest--10858-thread-1, state=TIMED_WAITING,
group=TGRP-TestSimGenericDistributedQueue]
   [junit4]   2>         at java.base@9.0.4/jdk.internal.misc.Unsafe.park(Native Method)
   [junit4]   2>         at java.base@9.0.4/java.util.concurrent.locks.LockSupport.parkNanos(LockSupport.java:234)
   [junit4]   2>         at java.base@9.0.4/java.util.concurrent.locks.AbstractQueuedSynchronizer$ConditionObject.awaitNanos(AbstractQueuedSynchronizer.java:2104)
   [junit4]   2>         at app//org.apache.solr.cloud.autoscaling.sim.GenericDistributedQueue.peek(GenericDistributedQueue.java:194)
   [junit4]   2>         at app//org.apache.solr.cloud.autoscaling.sim.GenericDistributedQueue.peek(GenericDistributedQueue.java:167)
   [junit4]   2>         at app//org.apache.solr.cloud.autoscaling.sim.TestSimDistributedQueue.lambda$testDistributedQueueBlocking$0(TestSimDistributedQueue.java:93)
   [junit4]   2>         at app//org.apache.solr.cloud.autoscaling.sim.TestSimDistributedQueue$$Lambda$1390/2042206481.call(Unknown
Source)
   [junit4]   2>         at java.base@9.0.4/java.util.concurrent.FutureTask.run(FutureTask.java:264)
   [junit4]   2>         at app//org.apache.solr.common.util.ExecutorUtil$MDCAwareThreadPoolExecutor.lambda$execute$0(ExecutorUtil.java:209)
   [junit4]   2>         at app//org.apache.solr.common.util.ExecutorUtil$MDCAwareThreadPoolExecutor$$Lambda$263/1728514115.run(Unknown
Source)
   [junit4]   2>         at java.base@9.0.4/java.util.concurrent.ThreadPoolExecutor.runWorker(ThreadPoolExecutor.java:1167)
   [junit4]   2>         at java.base@9.0.4/java.util.concurrent.ThreadPoolExecutor$Worker.run(ThreadPoolExecutor.java:641)
   [junit4]   2>         at java.base@9.0.4/java.lang.Thread.run(Thread.java:844)
   [junit4]   2> Oct 27, 2018 11:06:37 PM com.carrotsearch.randomizedtesting.ThreadLeakControl
tryToInterruptAll
   [junit4]   2> INFO: Starting to interrupt leaked threads:
   [junit4]   2>    1) Thread[id=33201, name=sdqtest--10858-thread-1, state=TIMED_WAITING,
group=TGRP-TestSimGenericDistributedQueue]
   [junit4]   2> Oct 27, 2018 11:06:37 PM com.carrotsearch.randomizedtesting.ThreadLeakControl
tryToInterruptAll
   [junit4]   2> INFO: All leaked threads terminated.
   [junit4]   2> NOTE: test params are: codec=CheapBastard, sim=RandomSimilarity(queryNorm=false):
{}, locale=en-VG, timezone=America/Marigot
   [junit4]   2> NOTE: Windows 10 10.0 amd64/Oracle Corporation 9.0.4 (64-bit)/cpus=3,threads=1,free=144987768,total=516423680
   [junit4]   2> NOTE: All tests run in this JVM: [BadIndexSchemaTest, RequestLoggingTest,
TestLFUCache, TestNumericTokenStream, ParsingFieldUpdateProcessorsTest, TestSolrCoreSnapshots,
CollectionsAPIDistributedZkTest, TestSolrCloudWithHadoopAuthPlugin, TestSolrCloudWithDelegationTokens,
TestBM25SimilarityFactory, PeerSyncWithLeaderTest, TestHdfsCloudBackupRestore, SortByFunctionTest,
TestSearcherReuse, CloudMLTQParserTest, TestStressInPlaceUpdates, TriggerSetPropertiesIntegrationTest,
NotRequiredUniqueKeyTest, TestSegmentSorting, TestCorePropertiesReload, OutputWriterTest,
SplitShardTest, TestClusterStateMutator, ResourceLoaderTest, TestFieldTypeCollectionResource,
TestDistributedStatsComponentCardinality, TestPerFieldSimilarity, SolrIndexMetricsTest, DistributedDebugComponentTest,
DefaultValueUpdateProcessorTest, StatsComponentTest, StatsReloadRaceTest, ClassificationUpdateProcessorFactoryTest,
TestExceedMaxTermLength, DistribDocExpirationUpdateProcessorTest, UpdateLogTest, TestLuceneMatchVersion,
DistributedFacetPivotSmallTest, AssignTest, TestLMJelinekMercerSimilarityFactory, TestSimLargeCluster,
RangeFacetCloudTest, TestIndexSearcher, HdfsWriteToMultipleCollectionsTest, TestSQLHandler,
TestGraphTermsQParserPlugin, TestXmlQParserPlugin, ActionThrottleTest, ExecutePlanActionTest,
FieldAnalysisRequestHandlerTest, ClusterStateUpdateTest, TestIBSimilarityFactory, CreateRoutedAliasTest,
MetricTriggerIntegrationTest, SolrJmxReporterCloudTest, TestSolrConfigHandlerCloud, HLLUtilTest,
BlockCacheTest, TestSubQueryTransformerDistrib, TestSchemalessBufferedUpdates, TestSubQueryTransformer,
RegexBytesRefFilterTest, SuggesterFSTTest, SolrCoreCheckLockOnStartupTest, TestRealTimeGet,
TestTrackingShardHandlerFactory, TestSystemCollAutoCreate, TestHttpShardHandlerFactory, RAMDirectoryFactoryTest,
TestStandardQParsers, TestEmbeddedSolrServerConstructors, TestDeleteCollectionOnDownNodes,
TestRuleBasedAuthorizationPlugin, TestLeaderInitiatedRecoveryThread, TestNestedDocsSort, SolrCoreMetricManagerTest,
BufferStoreTest, XmlInterpolationTest, TestSystemIdResolver, RegexBoostProcessorTest, ProtectedTermFilterFactoryTest,
SegmentsInfoRequestHandlerTest, AnalysisErrorHandlingTest, TestPolicyCloud, TestNamedUpdateProcessors,
RecoveryZkTest, TestMiniSolrCloudClusterSSL, TestSolrCoreProperties, TestWordDelimiterFilterFactory,
DisMaxRequestHandlerTest, TestReloadDeadlock, TestManagedSchemaThreadSafety, TestLRUStatsCache,
XsltUpdateRequestHandlerTest, DocValuesMultiTest, UUIDFieldTest, PreAnalyzedFieldManagedSchemaCloudTest,
ManagedSchemaRoundRobinCloudTest, TestJettySolrRunner, CurrencyFieldTypeTest, DocumentBuilderTest,
ConcurrentCreateRoutedAliasTest, TestLegacyNumericRangeQueryBuilder, TestLeaderElectionWithEmptyReplica,
TestObjectReleaseTracker, TestMinMaxOnMultiValuedField, TestSolrIndexConfig, TestIndexingPerformance,
DistributedQueryComponentOptimizationTest, AutoscalingHistoryHandlerTest, DateMathParserTest,
TestSuggestSpellingConverter, QueryElevationComponentTest, TestMacroExpander, HdfsChaosMonkeyNothingIsSafeTest,
TestSchemaNameResource, HdfsBasicDistributedZk2Test, TestCrossCoreJoin, LukeRequestHandlerTest,
TestNumericTerms32, InfixSuggestersTest, DistributedMLTComponentTest, TestQueryUtils, TestUtils,
TestCodecSupport, PrimitiveFieldTypeTest, OutOfBoxZkACLAndCredentialsProvidersTest, DistributedFacetExistsSmallTest,
TestUnifiedSolrHighlighter, TestDFISimilarityFactory, ClassificationUpdateProcessorTest, TestManagedSynonymGraphFilterFactory,
TestNoOpRegenerator, TestMissingGroups, TestDynamicURP, TestManagedStopFilterFactory, TestHighFrequencyDictionaryFactory,
RuleEngineTest, DeleteStatusTest, TestBinaryResponseWriter, AsyncCallRequestStatusResponseTest,
DocExpirationUpdateProcessorFactoryTest, TestRandomRequestDistribution, TestPHPSerializedResponseWriter,
TestFieldSortValues, ZkStateWriterTest, ChaosMonkeyNothingIsSafeTest, CollectionStateFormat2Test,
DistributedTermsComponentTest, MoreLikeThisHandlerTest, TestLegacyFieldReuse, TriggerEventQueueTest,
DeleteLastCustomShardedReplicaTest, TestFaceting, ZkCLITest, TestRandomCollapseQParserPlugin,
IgnoreCommitOptimizeUpdateProcessorFactoryTest, DirectoryFactoryTest, SubstringBytesRefFilterTest,
VersionInfoTest, TestSmileRequest, TestInfoStreamLogging, TestCloudJSONFacetJoinDomain, V2StandaloneTest,
ScheduledMaintenanceTriggerTest, TestConfigSetsAPIZkFailure, SolrCloudExampleTest, TestDirectoryFactory,
OrderedExecutorTest, CircularListTest, TestRemoteStreaming, AnalyticsQueryTest, StatelessScriptUpdateProcessorFactoryTest,
SchemaApiFailureTest, CloudExitableDirectoryReaderTest, TestExactSharedStatsCache, MetricUtilsTest,
TestManagedSchema, DistributedFacetPivotLongTailTest, TestCoreBackup, TimeRoutedAliasUpdateProcessorTest,
CdcrWithNodesRestartsTest, TestFieldCollectionResource, TestDocSet, ResponseHeaderTest, UnloadDistributedZkTest,
IndexSchemaRuntimeFieldTest, DocValuesNotIndexedTest, TestBulkSchemaConcurrent, BitVectorTest,
TestJoin, TestConfigOverlay, GraphQueryTest, TestXIncludeConfig, NodeMarkersRegistrationTest,
ShardRoutingTest, EchoParamsTest, TestDefaultStatsCache, BasicAuthStandaloneTest, TestValueSourceCache,
HdfsRecoveryZkTest, TestSurroundQueryParser, MinimalSchemaTest, SampleTest, SolrInfoBeanTest,
TestCursorMarkWithoutUniqueKey, TestDistributedGrouping, TestDistributedSearch, TestSimpleTrackingShardHandler,
TestEmbeddedSolrServerAdminHandler, AliasIntegrationTest, CollectionsAPISolrJTest, DeleteShardTest,
DistribJoinFromCollectionTest, DistributedQueueTest, ForceLeaderTest, FullSolrCloudDistribCmdsTest,
LeaderElectionIntegrationTest, LeaderFailoverAfterPartitionTest, LeaderFailureAfterFreshStartTest,
LeaderTragicEventTest, MoveReplicaHDFSFailoverTest, MoveReplicaHDFSTest, MoveReplicaTest,
NodeMutatorTest, OverseerCollectionConfigSetProcessorTest, OverseerRolesTest, OverseerTaskQueueTest,
PeerSyncReplicationTest, ReplaceNodeNoTargetTest, ReplaceNodeTest, SSLMigrationTest, SaslZkACLProviderTest,
SliceStateTest, SolrCLIZkUtilsTest, TestCloudInspectUtil, TestCloudPhrasesIdentificationComponent,
TestCloudRecovery, TestClusterProperties, TestConfigSetsAPI, TestHashPartitioner, TestLockTree,
TestOnReconnectListenerSupport, TestPullReplica, TestRandomFlRTGCloud, TestRebalanceLeaders,
TestRequestForwarding, TestSSLRandomization, TestSizeLimitedDistributedMap, TestSolrCloudWithKerberosAlt,
TestSolrCloudWithSecureImpersonation, TestTlogReplica, ZkFailoverTest, CollectionsAPIAsyncDistributedZkTest,
HdfsCollectionsAPIDistributedZkTest, ShardSplitTest, MetricTriggerTest, NodeAddedTriggerIntegrationTest,
RestoreTriggerStateTest, SearchRateTriggerTest, TestSimGenericDistributedQueue]
   [junit4]   2> NOTE: reproduce with: ant test  -Dtestcase=TestSimGenericDistributedQueue
-Dtests.seed=E57BFC8A9EF97A55 -Dtests.slow=true -Dtests.locale=en-VG -Dtests.timezone=America/Marigot
-Dtests.asserts=true -Dtests.file.encoding=ISO-8859-1
   [junit4] ERROR   0.00s J0 | TestSimGenericDistributedQueue (suite) <<<
   [junit4]    > Throwable #1: com.carrotsearch.randomizedtesting.ThreadLeakError: 1 thread
leaked from SUITE scope at org.apache.solr.cloud.autoscaling.sim.TestSimGenericDistributedQueue:

   [junit4]    >    1) Thread[id=33201, name=sdqtest--10858-thread-1, state=TIMED_WAITING,
group=TGRP-TestSimGenericDistributedQueue]
   [junit4]    >         at java.base@9.0.4/jdk.internal.misc.Unsafe.park(Native Method)
   [junit4]    >         at java.base@9.0.4/java.util.concurrent.locks.LockSupport.parkNanos(LockSupport.java:234)
   [junit4]    >         at java.base@9.0.4/java.util.concurrent.locks.AbstractQueuedSynchronizer$ConditionObject.awaitNanos(AbstractQueuedSynchronizer.java:2104)
   [junit4]    >         at app//org.apache.solr.cloud.autoscaling.sim.GenericDistributedQueue.peek(GenericDistributedQueue.java:194)
   [junit4]    >         at app//org.apache.solr.cloud.autoscaling.sim.GenericDistributedQueue.peek(GenericDistributedQueue.java:167)
   [junit4]    >         at app//org.apache.solr.cloud.autoscaling.sim.TestSimDistributedQueue.lambda$testDistributedQueueBlocking$0(TestSimDistributedQueue.java:93)
   [junit4]    >         at app//org.apache.solr.cloud.autoscaling.sim.TestSimDistributedQueue$$Lambda$1390/2042206481.call(Unknown
Source)
   [junit4]    >         at java.base@9.0.4/java.util.concurrent.FutureTask.run(FutureTask.java:264)
   [junit4]    >         at app//org.apache.solr.common.util.ExecutorUtil$MDCAwareThreadPoolExecutor.lambda$execute$0(ExecutorUtil.java:209)
   [junit4]    >         at app//org.apache.solr.common.util.ExecutorUtil$MDCAwareThreadPoolExecutor$$Lambda$263/1728514115.run(Unknown
Source)
   [junit4]    >         at java.base@9.0.4/java.util.concurrent.ThreadPoolExecutor.runWorker(ThreadPoolExecutor.java:1167)
   [junit4]    >         at java.base@9.0.4/java.util.concurrent.ThreadPoolExecutor$Worker.run(ThreadPoolExecutor.java:641)
   [junit4]    >         at java.base@9.0.4/java.lang.Thread.run(Thread.java:844)
   [junit4]    > 	at __randomizedtesting.SeedInfo.seed([E57BFC8A9EF97A55]:0)
   [junit4] Completed [562/835 (1!)] on J0 in 86.01s, 5 tests, 2 errors, 1 skipped <<<
FAILURES!

[...truncated 552 lines...]
   [junit4] JVM J0: stdout was not empty, see: C:\Users\jenkins\workspace\Lucene-Solr-7.x-Windows\solr\build\solr-core\test\temp\junit4-J0-20181027_221318_5394108230453854150996.sysout
   [junit4] >>> JVM J0 emitted unexpected output (verbatim) ----
   [junit4] #
   [junit4] # A fatal error has been detected by the Java Runtime Environment:
   [junit4] #
   [junit4] #  EXCEPTION_ACCESS_VIOLATION (0xc0000005) at pc=0x0000000069ca0b2f, pid=25860,
tid=24708
   [junit4] #
   [junit4] # JRE version: OpenJDK Runtime Environment (9.0+11) (build 9.0.4+11)
   [junit4] # Java VM: OpenJDK 64-Bit Server VM (9.0.4+11, mixed mode, tiered, compressed
oops, parallel gc, windows-amd64)
   [junit4] # Problematic frame:
   [junit4] # V  [jvm.dll+0x460b2f]
   [junit4] #
   [junit4] # No core dump will be written. Minidumps are not enabled by default on client
versions of Windows
   [junit4] #
   [junit4] # An error report file with more information is saved as:
   [junit4] # C:\Users\jenkins\workspace\Lucene-Solr-7.x-Windows\solr\build\solr-core\test\J0\hs_err_pid25860.log
   [junit4] #
   [junit4] # Compiler replay data is saved as:
   [junit4] # C:\Users\jenkins\workspace\Lucene-Solr-7.x-Windows\solr\build\solr-core\test\J0\replay_pid25860.log
   [junit4] #
   [junit4] # If you would like to submit a bug report, please visit:
   [junit4] #   http://bugreport.java.com/bugreport/crash.jsp
   [junit4] #
   [junit4] <<< JVM J0: EOF ----

[...truncated 437 lines...]
   [junit4] ERROR: JVM J0 ended with an exception, command line: C:\Users\jenkins\tools\java\64bit\jdk-9.0.4\bin\java.exe
-XX:+UseCompressedOops -XX:+UseParallelGC -XX:+HeapDumpOnOutOfMemoryError -XX:HeapDumpPath=C:\Users\jenkins\workspace\Lucene-Solr-7.x-Windows\heapdumps
-ea -esa --illegal-access=deny -Dtests.prefix=tests -Dtests.seed=E57BFC8A9EF97A55 -Xmx512M
-Dtests.iters= -Dtests.verbose=false -Dtests.infostream=false -Dtests.codec=random -Dtests.postingsformat=random
-Dtests.docvaluesformat=random -Dtests.locale=random -Dtests.timezone=random -Dtests.directory=random
-Dtests.linedocsfile=europarl.lines.txt.gz -Dtests.luceneMatchVersion=7.6.0 -Dtests.cleanthreads=perClass
-Djava.util.logging.config.file=C:\Users\jenkins\workspace\Lucene-Solr-7.x-Windows\lucene\tools\junit4\logging.properties
-Dtests.nightly=false -Dtests.weekly=false -Dtests.monster=false -Dtests.slow=true -Dtests.asserts=true
-Dtests.multiplier=1 -DtempDir=./temp -Djava.io.tmpdir=./temp -Dcommon.dir=C:\Users\jenkins\workspace\Lucene-Solr-7.x-Windows\lucene
-Dclover.db.dir=C:\Users\jenkins\workspace\Lucene-Solr-7.x-Windows\lucene\build\clover\db
-Djava.security.policy=C:\Users\jenkins\workspace\Lucene-Solr-7.x-Windows\lucene\tools\junit4\solr-tests.policy
-Dtests.LUCENE_VERSION=7.6.0 -Djetty.testMode=1 -Djetty.insecurerandom=1 -Dsolr.directoryFactory=org.apache.solr.core.MockDirectoryFactory
-Djava.awt.headless=true -Djdk.map.althashing.threshold=0 -Dtests.src.home=C:\Users\jenkins\workspace\Lucene-Solr-7.x-Windows
-Djava.security.egd=file:/dev/./urandom -Djunit4.childvm.cwd=C:\Users\jenkins\workspace\Lucene-Solr-7.x-Windows\solr\build\solr-core\test\J0
-Djunit4.tempDir=C:\Users\jenkins\workspace\Lucene-Solr-7.x-Windows\solr\build\solr-core\test\temp
-Djunit4.childvm.id=0 -Djunit4.childvm.count=2 -Dfile.encoding=ISO-8859-1 -Dtests.disableHdfs=true
-Djava.security.manager=org.apache.lucene.util.TestSecurityManager -Dtests.filterstacks=true
-Dtests.leaveTemporary=false -Dtests.badapples=false -classpath C:\Users\jenkins\workspace\Lucene-Solr-7.x-Windows\solr\build\solr-core\classes\test;C:\Users\jenkins\workspace\Lucene-Solr-7.x-Windows\solr\build\solr-test-framework\classes\java;C:\Users\jenkins\workspace\Lucene-Solr-7.x-Windows\solr\test-framework\lib\junit4-ant-2.6.4.jar;C:\Users\jenkins\workspace\Lucene-Solr-7.x-Windows\solr\core\src\test-files;C:\Users\jenkins\workspace\Lucene-Solr-7.x-Windows\lucene\build\test-framework\classes\java;C:\Users\jenkins\workspace\Lucene-Solr-7.x-Windows\lucene\build\codecs\classes\java;C:\Users\jenkins\workspace\Lucene-Solr-7.x-Windows\solr\build\solr-solrj\classes\java;C:\Users\jenkins\workspace\Lucene-Solr-7.x-Windows\solr\build\solr-core\classes\java;C:\Users\jenkins\workspace\Lucene-Solr-7.x-Windows\lucene\build\analysis\common\lucene-analyzers-common-7.6.0-SNAPSHOT.jar;C:\Users\jenkins\workspace\Lucene-Solr-7.x-Windows\lucene\build\analysis\kuromoji\lucene-analyzers-kuromoji-7.6.0-SNAPSHOT.jar;C:\Users\jenkins\workspace\Lucene-Solr-7.x-Windows\lucene\build\analysis\nori\lucene-analyzers-nori-7.6.0-SNAPSHOT.jar;C:\Users\jenkins\workspace\Lucene-Solr-7.x-Windows\lucene\build\analysis\phonetic\lucene-analyzers-phonetic-7.6.0-SNAPSHOT.jar;C:\Users\jenkins\workspace\Lucene-Solr-7.x-Windows\lucene\build\codecs\lucene-codecs-7.6.0-SNAPSHOT.jar;C:\Users\jenkins\workspace\Lucene-Solr-7.x-Windows\lucene\build\backward-codecs\lucene-backward-codecs-7.6.0-SNAPSHOT.jar;C:\Users\jenkins\workspace\Lucene-Solr-7.x-Windows\lucene\build\highlighter\lucene-highlighter-7.6.0-SNAPSHOT.jar;C:\Users\jenkins\workspace\Lucene-Solr-7.x-Windows\lucene\build\memory\lucene-memory-7.6.0-SNAPSHOT.jar;C:\Users\jenkins\workspace\Lucene-Solr-7.x-Windows\lucene\build\misc\lucene-misc-7.6.0-SNAPSHOT.jar;C:\Users\jenkins\workspace\Lucene-Solr-7.x-Windows\lucene\build\spatial-extras\lucene-spatial-extras-7.6.0-SNAPSHOT.jar;C:\Users\jenkins\workspace\Lucene-Solr-7.x-Windows\lucene\build\spatial3d\lucene-spatial3d-7.6.0-SNAPSHOT.jar;C:\Users\jenkins\workspace\Lucene-Solr-7.x-Windows\lucene\build\expressions\lucene-expressions-7.6.0-SNAPSHOT.jar;C:\Users\jenkins\workspace\Lucene-Solr-7.x-Windows\lucene\build\suggest\lucene-suggest-7.6.0-SNAPSHOT.jar;C:\Users\jenkins\workspace\Lucene-Solr-7.x-Windows\lucene\build\grouping\lucene-grouping-7.6.0-SNAPSHOT.jar;C:\Users\jenkins\workspace\Lucene-Solr-7.x-Windows\lucene\build\queries\lucene-queries-7.6.0-SNAPSHOT.jar;C:\Users\jenkins\workspace\Lucene-Solr-7.x-Windows\lucene\build\queryparser\lucene-queryparser-7.6.0-SNAPSHOT.jar;C:\Users\jenkins\workspace\Lucene-Solr-7.x-Windows\lucene\build\join\lucene-join-7.6.0-SNAPSHOT.jar;C:\Users\jenkins\workspace\Lucene-Solr-7.x-Windows\lucene\build\sandbox\lucene-sandbox-7.6.0-SNAPSHOT.jar;C:\Users\jenkins\workspace\Lucene-Solr-7.x-Windows\lucene\build\classification\lucene-classification-7.6.0-SNAPSHOT.jar;C:\Users\jenkins\workspace\Lucene-Solr-7.x-Windows\solr\core\lib\antlr4-runtime-4.5.1-1.jar;C:\Users\jenkins\workspace\Lucene-Solr-7.x-Windows\solr\core\lib\asm-5.1.jar;C:\Users\jenkins\workspace\Lucene-Solr-7.x-Windows\solr\core\lib\asm-commons-5.1.jar;C:\Users\jenkins\workspace\Lucene-Solr-7.x-Windows\solr\core\lib\avatica-core-1.10.0.jar;C:\Users\jenkins\workspace\Lucene-Solr-7.x-Windows\solr\core\lib\caffeine-2.4.0.jar;C:\Users\jenkins\workspace\Lucene-Solr-7.x-Windows\solr\core\lib\calcite-core-1.13.0.jar;C:\Users\jenkins\workspace\Lucene-Solr-7.x-Windows\solr\core\lib\calcite-linq4j-1.13.0.jar;C:\Users\jenkins\workspace\Lucene-Solr-7.x-Windows\solr\core\lib\commons-cli-1.2.jar;C:\Users\jenkins\workspace\Lucene-Solr-7.x-Windows\solr\core\lib\commons-codec-1.11.jar;C:\Users\jenkins\workspace\Lucene-Solr-7.x-Windows\solr\core\lib\commons-collections-3.2.2.jar;C:\Users\jenkins\workspace\Lucene-Solr-7.x-Windows\solr\core\lib\commons-compiler-2.7.6.jar;C:\Users\jenkins\workspace\Lucene-Solr-7.x-Windows\solr\core\lib\commons-configuration-1.6.jar;C:\Users\jenkins\workspace\Lucene-Solr-7.x-Windows\solr\core\lib\commons-exec-1.3.jar;C:\Users\jenkins\workspace\Lucene-Solr-7.x-Windows\solr\core\lib\commons-fileupload-1.3.3.jar;C:\Users\jenkins\workspace\Lucene-Solr-7.x-Windows\solr\core\lib\commons-io-2.5.jar;C:\Users\jenkins\workspace\Lucene-Solr-7.x-Windows\solr\core\lib\commons-lang-2.6.jar;C:\Users\jenkins\workspace\Lucene-Solr-7.x-Windows\solr\core\lib\commons-lang3-3.6.jar;C:\Users\jenkins\workspace\Lucene-Solr-7.x-Windows\solr\core\lib\commons-math3-3.6.1.jar;C:\Users\jenkins\workspace\Lucene-Solr-7.x-Windows\solr\core\lib\curator-client-2.8.0.jar;C:\Users\jenkins\workspace\Lucene-Solr-7.x-Windows\solr\core\lib\curator-framework-2.8.0.jar;C:\Users\jenkins\workspace\Lucene-Solr-7.x-Windows\solr\core\lib\curator-recipes-2.8.0.jar;C:\Users\jenkins\workspace\Lucene-Solr-7.x-Windows\solr\core\lib\disruptor-3.4.0.jar;C:\Users\jenkins\workspace\Lucene-Solr-7.x-Windows\solr\core\lib\dom4j-1.6.1.jar;C:\Users\jenkins\workspace\Lucene-Solr-7.x-Windows\solr\core\lib\eigenbase-properties-1.1.5.jar;C:\Users\jenkins\workspace\Lucene-Solr-7.x-Windows\solr\core\lib\guava-14.0.1.jar;C:\Users\jenkins\workspace\Lucene-Solr-7.x-Windows\solr\core\lib\hadoop-annotations-2.7.4.jar;C:\Users\jenkins\workspace\Lucene-Solr-7.x-Windows\solr\core\lib\hadoop-auth-2.7.4.jar;C:\Users\jenkins\workspace\Lucene-Solr-7.x-Windows\solr\core\lib\hadoop-common-2.7.4.jar;C:\Users\jenkins\workspace\Lucene-Solr-7.x-Windows\solr\core\lib\hadoop-hdfs-2.7.4.jar;C:\Users\jenkins\workspace\Lucene-Solr-7.x-Windows\solr\core\lib\hppc-0.8.1.jar;C:\Users\jenkins\workspace\Lucene-Solr-7.x-Windows\solr\core\lib\htrace-core-3.2.0-incubating.jar;C:\Users\jenkins\workspace\Lucene-Solr-7.x-Windows\solr\core\lib\jackson-annotations-2.9.6.jar;C:\Users\jenkins\workspace\Lucene-Solr-7.x-Windows\solr\core\lib\jackson-core-2.9.6.jar;C:\Users\jenkins\workspace\Lucene-Solr-7.x-Windows\solr\core\lib\jackson-core-asl-1.9.13.jar;C:\Users\jenkins\workspace\Lucene-Solr-7.x-Windows\solr\core\lib\jackson-databind-2.9.6.jar;C:\Users\jenkins\workspace\Lucene-Solr-7.x-Windows\solr\core\lib\jackson-dataformat-smile-2.9.6.jar;C:\Users\jenkins\workspace\Lucene-Solr-7.x-Windows\solr\core\lib\jackson-mapper-asl-1.9.13.jar;C:\Users\jenkins\workspace\Lucene-Solr-7.x-Windows\solr\core\lib\janino-2.7.6.jar;C:\Users\jenkins\workspace\Lucene-Solr-7.x-Windows\solr\core\lib\jcl-over-slf4j-1.7.24.jar;C:\Users\jenkins\workspace\Lucene-Solr-7.x-Windows\solr\core\lib\joda-time-2.2.jar;C:\Users\jenkins\workspace\Lucene-Solr-7.x-Windows\solr\core\lib\log4j-1.2-api-2.11.0.jar;C:\Users\jenkins\workspace\Lucene-Solr-7.x-Windows\solr\core\lib\log4j-api-2.11.0.jar;C:\Users\jenkins\workspace\Lucene-Solr-7.x-Windows\solr\core\lib\log4j-core-2.11.0.jar;C:\Users\jenkins\workspace\Lucene-Solr-7.x-Windows\solr\core\lib\log4j-slf4j-impl-2.11.0.jar;C:\Users\jenkins\workspace\Lucene-Solr-7.x-Windows\solr\core\lib\org.restlet-2.3.0.jar;C:\Users\jenkins\workspace\Lucene-Solr-7.x-Windows\solr\core\lib\org.restlet.ext.servlet-2.3.0.jar;C:\Users\jenkins\workspace\Lucene-Solr-7.x-Windows\solr\core\lib\protobuf-java-3.1.0.jar;C:\Users\jenkins\workspace\Lucene-Solr-7.x-Windows\solr\core\lib\rrd4j-3.2.jar;C:\Users\jenkins\workspace\Lucene-Solr-7.x-Windows\solr\core\lib\spatial4j-0.7.jar;C:\Users\jenkins\workspace\Lucene-Solr-7.x-Windows\solr\core\lib\t-digest-3.1.jar;C:\Users\jenkins\workspace\Lucene-Solr-7.x-Windows\solr\solrj\lib\commons-io-2.5.jar;C:\Users\jenkins\workspace\Lucene-Solr-7.x-Windows\solr\solrj\lib\commons-math3-3.6.1.jar;C:\Users\jenkins\workspace\Lucene-Solr-7.x-Windows\solr\solrj\lib\httpclient-4.5.3.jar;C:\Users\jenkins\workspace\Lucene-Solr-7.x-Windows\solr\solrj\lib\httpcore-4.4.6.jar;C:\Users\jenkins\workspace\Lucene-Solr-7.x-Windows\solr\solrj\lib\httpmime-4.5.3.jar;C:\Users\jenkins\workspace\Lucene-Solr-7.x-Windows\solr\solrj\lib\jcl-over-slf4j-1.7.24.jar;C:\Users\jenkins\workspace\Lucene-Solr-7.x-Windows\solr\solrj\lib\noggit-0.8.jar;C:\Users\jenkins\workspace\Lucene-Solr-7.x-Windows\solr\solrj\lib\slf4j-api-1.7.24.jar;C:\Users\jenkins\workspace\Lucene-Solr-7.x-Windows\solr\solrj\lib\stax2-api-3.1.4.jar;C:\Users\jenkins\workspace\Lucene-Solr-7.x-Windows\solr\solrj\lib\woodstox-core-asl-4.4.1.jar;C:\Users\jenkins\workspace\Lucene-Solr-7.x-Windows\solr\solrj\lib\zookeeper-3.4.11.jar;C:\Users\jenkins\workspace\Lucene-Solr-7.x-Windows\solr\server\lib\gmetric4j-1.0.7.jar;C:\Users\jenkins\workspace\Lucene-Solr-7.x-Windows\solr\server\lib\javax.servlet-api-3.1.0.jar;C:\Users\jenkins\workspace\Lucene-Solr-7.x-Windows\solr\server\lib\jetty-continuation-9.4.11.v20180605.jar;C:\Users\jenkins\workspace\Lucene-Solr-7.x-Windows\solr\server\lib\jetty-deploy-9.4.11.v20180605.jar;C:\Users\jenkins\workspace\Lucene-Solr-7.x-Windows\solr\server\lib\jetty-http-9.4.11.v20180605.jar;C:\Users\jenkins\workspace\Lucene-Solr-7.x-Windows\solr\server\lib\jetty-io-9.4.11.v20180605.jar;C:\Users\jenkins\workspace\Lucene-Solr-7.x-Windows\solr\server\lib\jetty-jmx-9.4.11.v20180605.jar;C:\Users\jenkins\workspace\Lucene-Solr-7.x-Windows\solr\server\lib\jetty-rewrite-9.4.11.v20180605.jar;C:\Users\jenkins\workspace\Lucene-Solr-7.x-Windows\solr\server\lib\jetty-security-9.4.11.v20180605.jar;C:\Users\jenkins\workspace\Lucene-Solr-7.x-Windows\solr\server\lib\jetty-server-9.4.11.v20180605.jar;C:\Users\jenkins\workspace\Lucene-Solr-7.x-Windows\solr\server\lib\jetty-servlet-9.4.11.v20180605.jar;C:\Users\jenkins\workspace\Lucene-Solr-7.x-Windows\solr\server\lib\jetty-servlets-9.4.11.v20180605.jar;C:\Users\jenkins\workspace\Lucene-Solr-7.x-Windows\solr\server\lib\jetty-util-9.4.11.v20180605.jar;C:\Users\jenkins\workspace\Lucene-Solr-7.x-Windows\solr\server\lib\jetty-webapp-9.4.11.v20180605.jar;C:\Users\jenkins\workspace\Lucene-Solr-7.x-Windows\solr\server\lib\jetty-xml-9.4.11.v20180605.jar;C:\Users\jenkins\workspace\Lucene-Solr-7.x-Windows\solr\server\lib\metrics-core-3.2.6.jar;C:\Users\jenkins\workspace\Lucene-Solr-7.x-Windows\solr\server\lib\metrics-ganglia-3.2.6.jar;C:\Users\jenkins\workspace\Lucene-Solr-7.x-Windows\solr\server\lib\metrics-graphite-3.2.6.jar;C:\Users\jenkins\workspace\Lucene-Solr-7.x-Windows\solr\server\lib\metrics-jetty9-3.2.6.jar;C:\Users\jenkins\workspace\Lucene-Solr-7.x-Windows\solr\server\lib\metrics-jvm-3.2.6.jar;C:\Users\jenkins\workspace\Lucene-Solr-7.x-Windows\solr\example\example-DIH\solr\db\lib\derby-10.9.1.0.jar;C:\Users\jenkins\workspace\Lucene-Solr-7.x-Windows\solr\example\example-DIH\solr\db\lib\hsqldb-2.4.0.jar;C:\Users\jenkins\workspace\Lucene-Solr-7.x-Windows\lucene\build\core\classes\java;C:\Users\jenkins\workspace\Lucene-Solr-7.x-Windows\lucene\test-framework\lib\junit-4.10.jar;C:\Users\jenkins\workspace\Lucene-Solr-7.x-Windows\lucene\test-framework\lib\randomizedtesting-runner-2.6.4.jar;C:\Users\jenkins\workspace\Lucene-Solr-7.x-Windows\solr\core\test-lib\antlr-2.7.7.jar;C:\Users\jenkins\workspace\Lucene-Solr-7.x-Windows\solr\core\test-lib\antlr4-runtime-4.5.1-1.jar;C:\Users\jenkins\workspace\Lucene-Solr-7.x-Windows\solr\core\test-lib\apacheds-core-2.0.0-M15.jar;C:\Users\jenkins\workspace\Lucene-Solr-7.x-Windows\solr\core\test-lib\apacheds-core-api-2.0.0-M15.jar;C:\Users\jenkins\workspace\Lucene-Solr-7.x-Windows\solr\core\test-lib\apacheds-core-avl-2.0.0-M15.jar;C:\Users\jenkins\workspace\Lucene-Solr-7.x-Windows\solr\core\test-lib\apacheds-core-shared-2.0.0-M15.jar;C:\Users\jenkins\workspace\Lucene-Solr-7.x-Windows\solr\core\test-lib\apacheds-i18n-2.0.0-M15.jar;C:\Users\jenkins\workspace\Lucene-Solr-7.x-Windows\solr\core\test-lib\apacheds-interceptor-kerberos-2.0.0-M15.jar;C:\Users\jenkins\workspace\Lucene-Solr-7.x-Windows\solr\core\test-lib\apacheds-interceptors-admin-2.0.0-M15.jar;C:\Users\jenkins\workspace\Lucene-Solr-7.x-Windows\solr\core\test-lib\apacheds-interceptors-authn-2.0.0-M15.jar;C:\Users\jenkins\workspace\Lucene-Solr-7.x-Windows\solr\core\test-lib\apacheds-interceptors-authz-2.0.0-M15.jar;C:\Users\jenkins\workspace\Lucene-Solr-7.x-Windows\solr\core\test-lib\apacheds-interceptors-changelog-2.0.0-M15.jar;C:\Users\jenkins\workspace\Lucene-Solr-7.x-Windows\solr\core\test-lib\apacheds-interceptors-collective-2.0.0-M15.jar;C:\Users\jenkins\workspace\Lucene-Solr-7.x-Windows\solr\core\test-lib\apacheds-interceptors-event-2.0.0-M15.jar;C:\Users\jenkins\workspace\Lucene-Solr-7.x-Windows\solr\core\test-lib\apacheds-interceptors-exception-2.0.0-M15.jar;C:\Users\jenkins\workspace\Lucene-Solr-7.x-Windows\solr\core\test-lib\apacheds-interceptors-journal-2.0.0-M15.jar;C:\Users\jenkins\workspace\Lucene-Solr-7.x-Windows\solr\core\test-lib\apacheds-interceptors-normalization-2.0.0-M15.jar;C:\Users\jenkins\workspace\Lucene-Solr-7.x-Windows\solr\core\test-lib\apacheds-interceptors-operational-2.0.0-M15.jar;C:\Users\jenkins\workspace\Lucene-Solr-7.x-Windows\solr\core\test-lib\apacheds-interceptors-referral-2.0.0-M15.jar;C:\Users\jenkins\workspace\Lucene-Solr-7.x-Windows\solr\core\test-lib\apacheds-interceptors-schema-2.0.0-M15.jar;C:\Users\jenkins\workspace\Lucene-Solr-7.x-Windows\solr\core\test-lib\apacheds-interceptors-subtree-2.0.0-M15.jar;C:\Users\jenkins\workspace\Lucene-Solr-7.x-Windows\solr\core\test-lib\apacheds-interceptors-trigger-2.0.0-M15.jar;C:\Users\jenkins\workspace\Lucene-Solr-7.x-Windows\solr\core\test-lib\apacheds-jdbm-partition-2.0.0-M15.jar;C:\Users\jenkins\workspace\Lucene-Solr-7.x-Windows\solr\core\test-lib\apacheds-jdbm1-2.0.0-M2.jar;C:\Users\jenkins\workspace\Lucene-Solr-7.x-Windows\solr\core\test-lib\apacheds-kerberos-codec-2.0.0-M15.jar;C:\Users\jenkins\workspace\Lucene-Solr-7.x-Windows\solr\core\test-lib\apacheds-ldif-partition-2.0.0-M15.jar;C:\Users\jenkins\workspace\Lucene-Solr-7.x-Windows\solr\core\test-lib\apacheds-mavibot-partition-2.0.0-M15.jar;C:\Users\jenkins\workspace\Lucene-Solr-7.x-Windows\solr\core\test-lib\apacheds-protocol-kerberos-2.0.0-M15.jar;C:\Users\jenkins\workspace\Lucene-Solr-7.x-Windows\solr\core\test-lib\apacheds-protocol-ldap-2.0.0-M15.jar;C:\Users\jenkins\workspace\Lucene-Solr-7.x-Windows\solr\core\test-lib\apacheds-protocol-shared-2.0.0-M15.jar;C:\Users\jenkins\workspace\Lucene-Solr-7.x-Windows\solr\core\test-lib\apacheds-xdbm-partition-2.0.0-M15.jar;C:\Users\jenkins\workspace\Lucene-Solr-7.x-Windows\solr\core\test-lib\api-all-1.0.0-M20.jar;C:\Users\jenkins\workspace\Lucene-Solr-7.x-Windows\solr\core\test-lib\bcprov-jdk15on-1.60.jar;C:\Users\jenkins\workspace\Lucene-Solr-7.x-Windows\solr\core\test-lib\byte-buddy-1.6.2.jar;C:\Users\jenkins\workspace\Lucene-Solr-7.x-Windows\solr\core\test-lib\commons-collections-3.2.2.jar;C:\Users\jenkins\workspace\Lucene-Solr-7.x-Windows\solr\core\test-lib\ehcache-core-2.4.4.jar;C:\Users\jenkins\workspace\Lucene-Solr-7.x-Windows\solr\core\test-lib\hadoop-common-2.7.4-tests.jar;C:\Users\jenkins\workspace\Lucene-Solr-7.x-Windows\solr\core\test-lib\hadoop-hdfs-2.7.4-tests.jar;C:\Users\jenkins\workspace\Lucene-Solr-7.x-Windows\solr\core\test-lib\hadoop-minikdc-2.7.4.jar;C:\Users\jenkins\workspace\Lucene-Solr-7.x-Windows\solr\core\test-lib\htrace-core-3.2.0-incubating.jar;C:\Users\jenkins\workspace\Lucene-Solr-7.x-Windows\solr\core\test-lib\jersey-core-1.9.jar;C:\Users\jenkins\workspace\Lucene-Solr-7.x-Windows\solr\core\test-lib\jersey-server-1.9.jar;C:\Users\jenkins\workspace\Lucene-Solr-7.x-Windows\solr\core\test-lib\jetty-6.1.26.jar;C:\Users\jenkins\workspace\Lucene-Solr-7.x-Windows\solr\core\test-lib\jetty-sslengine-6.1.26.jar;C:\Users\jenkins\workspace\Lucene-Solr-7.x-Windows\solr\core\test-lib\jetty-util-6.1.26.jar;C:\Users\jenkins\workspace\Lucene-Solr-7.x-Windows\solr\core\test-lib\mina-core-2.0.0-M5.jar;C:\Users\jenkins\workspace\Lucene-Solr-7.x-Windows\solr\core\test-lib\mockito-core-2.6.2.jar;C:\Users\jenkins\workspace\Lucene-Solr-7.x-Windows\solr\core\test-lib\netty-all-4.0.36.Final.jar;C:\Users\jenkins\workspace\Lucene-Solr-7.x-Windows\solr\core\test-lib\objenesis-2.5.jar;C:\Users\jenkins\workspace\Lucene-Solr-7.x-Windows\lucene\build\analysis\icu\lucene-analyzers-icu-7.6.0-SNAPSHOT.jar;C:\Users\jenkins\workspace\Lucene-Solr-7.x-Windows\solr\build\contrib\solr-analysis-extras\classes\java;C:\Users\jenkins\workspace\Lucene-Solr-7.x-Windows\lucene\build\queryparser\classes\test;C:\Users\jenkins\workspace\Lucene-Solr-7.x-Windows\lucene\build\backward-codecs\classes\test;C:\Users\jenkins\workspace\Lucene-Solr-7.x-Windows\solr\contrib\analysis-extras\lib\icu4j-62.1.jar;C:\Users\jenkins\tools\hudson.tasks.Ant_AntInstallation\ANT_1.8.2\lib\ant-launcher.jar;C:\Users\jenkins\.ant\lib\ivy-2.4.0.jar;C:\Users\jenkins\tools\hudson.tasks.Ant_AntInstallation\ANT_1.8.2\lib\ant-antlr.jar;C:\Users\jenkins\tools\hudson.tasks.Ant_AntInstallation\ANT_1.8.2\lib\ant-apache-bcel.jar;C:\Users\jenkins\tools\hudson.tasks.Ant_AntInstallation\ANT_1.8.2\lib\ant-apache-bsf.jar;C:\Users\jenkins\tools\hudson.tasks.Ant_AntInstallation\ANT_1.8.2\lib\ant-apache-log4j.jar;C:\Users\jenkins\tools\hudson.tasks.Ant_AntInstallation\ANT_1.8.2\lib\ant-apache-oro.jar;C:\Users\jenkins\tools\hudson.tasks.Ant_AntInstallation\ANT_1.8.2\lib\ant-apache-regexp.jar;C:\Users\jenkins\tools\hudson.tasks.Ant_AntInstallation\ANT_1.8.2\lib\ant-apache-resolver.jar;C:\Users\jenkins\tools\hudson.tasks.Ant_AntInstallation\ANT_1.8.2\lib\ant-apache-xalan2.jar;C:\Users\jenkins\tools\hudson.tasks.Ant_AntInstallation\ANT_1.8.2\lib\ant-commons-logging.jar;C:\Users\jenkins\tools\hudson.tasks.Ant_AntInstallation\ANT_1.8.2\lib\ant-commons-net.jar;C:\Users\jenkins\tools\hudson.tasks.Ant_AntInstallation\ANT_1.8.2\lib\ant-jai.jar;C:\Users\jenkins\tools\hudson.tasks.Ant_AntInstallation\ANT_1.8.2\lib\ant-javamail.jar;C:\Users\jenkins\tools\hudson.tasks.Ant_AntInstallation\ANT_1.8.2\lib\ant-jdepend.jar;C:\Users\jenkins\tools\hudson.tasks.Ant_AntInstallation\ANT_1.8.2\lib\ant-jmf.jar;C:\Users\jenkins\tools\hudson.tasks.Ant_AntInstallation\ANT_1.8.2\lib\ant-jsch.jar;C:\Users\jenkins\tools\hudson.tasks.Ant_AntInstallation\ANT_1.8.2\lib\ant-junit.jar;C:\Users\jenkins\tools\hudson.tasks.Ant_AntInstallation\ANT_1.8.2\lib\ant-junit4.jar;C:\Users\jenkins\tools\hudson.tasks.Ant_AntInstallation\ANT_1.8.2\lib\ant-netrexx.jar;C:\Users\jenkins\tools\hudson.tasks.Ant_AntInstallation\ANT_1.8.2\lib\ant-swing.jar;C:\Users\jenkins\tools\hudson.tasks.Ant_AntInstallation\ANT_1.8.2\lib\ant-testutil.jar;C:\Users\jenkins\tools\hudson.tasks.Ant_AntInstallation\ANT_1.8.2\lib\ant.jar;C:\Users\jenkins\.ivy2\cache\com.carrotsearch.randomizedtesting\junit4-ant\jars\junit4-ant-2.6.4.jar
com.carrotsearch.ant.tasks.junit4.slave.SlaveMainSafe -eventsfile C:\Users\jenkins\workspace\Lucene-Solr-7.x-Windows\solr\build\solr-core\test\temp\junit4-J0-20181027_221318_5398923746094016260907.events
@C:\Users\jenkins\workspace\Lucene-Solr-7.x-Windows\solr\build\solr-core\test\temp\junit4-J0-20181027_221318_53913113686844471101692.suites
-stdin
   [junit4] ERROR: JVM J0 ended with an exception: Forked process returned with error code:
1. Very likely a JVM crash.  See process stdout at: C:\Users\jenkins\workspace\Lucene-Solr-7.x-Windows\solr\build\solr-core\test\temp\junit4-J0-20181027_221318_5394108230453854150996.sysout
   [junit4] 	at com.carrotsearch.ant.tasks.junit4.JUnit4.executeSlave(JUnit4.java:1542)
   [junit4] 	at com.carrotsearch.ant.tasks.junit4.JUnit4.access$000(JUnit4.java:123)
   [junit4] 	at com.carrotsearch.ant.tasks.junit4.JUnit4$2.call(JUnit4.java:997)
   [junit4] 	at com.carrotsearch.ant.tasks.junit4.JUnit4$2.call(JUnit4.java:994)
   [junit4] 	at java.base/java.util.concurrent.FutureTask.run(FutureTask.java:264)
   [junit4] 	at java.base/java.util.concurrent.ThreadPoolExecutor.runWorker(ThreadPoolExecutor.java:1167)
   [junit4] 	at java.base/java.util.concurrent.ThreadPoolExecutor$Worker.run(ThreadPoolExecutor.java:641)
   [junit4] 	at java.base/java.lang.Thread.run(Thread.java:844)

BUILD FAILED
C:\Users\jenkins\workspace\Lucene-Solr-7.x-Windows\build.xml:633: The following error occurred
while executing this line:
C:\Users\jenkins\workspace\Lucene-Solr-7.x-Windows\build.xml:577: The following error occurred
while executing this line:
C:\Users\jenkins\workspace\Lucene-Solr-7.x-Windows\build.xml:59: The following error occurred
while executing this line:
C:\Users\jenkins\workspace\Lucene-Solr-7.x-Windows\solr\build.xml:267: The following error
occurred while executing this line:
C:\Users\jenkins\workspace\Lucene-Solr-7.x-Windows\solr\common-build.xml:558: The following
error occurred while executing this line:
C:\Users\jenkins\workspace\Lucene-Solr-7.x-Windows\lucene\common-build.xml:1567: The following
error occurred while executing this line:
C:\Users\jenkins\workspace\Lucene-Solr-7.x-Windows\lucene\common-build.xml:1092: At least
one slave process threw an exception, first: Forked process returned with error code: 1. Very
likely a JVM crash.  See process stdout at: C:\Users\jenkins\workspace\Lucene-Solr-7.x-Windows\solr\build\solr-core\test\temp\junit4-J0-20181027_221318_5394108230453854150996.sysout

Total time: 83 minutes 7 seconds
Build step 'Invoke Ant' marked build as failure
Archiving artifacts
Setting ANT_1_8_2_HOME=C:\Users\jenkins\tools\hudson.tasks.Ant_AntInstallation\ANT_1.8.2
[WARNINGS] Skipping publisher since build result is FAILURE
Recording test results
Setting ANT_1_8_2_HOME=C:\Users\jenkins\tools\hudson.tasks.Ant_AntInstallation\ANT_1.8.2
Email was triggered for: Failure - Any
Sending email for trigger: Failure - Any
Setting ANT_1_8_2_HOME=C:\Users\jenkins\tools\hudson.tasks.Ant_AntInstallation\ANT_1.8.2
Setting ANT_1_8_2_HOME=C:\Users\jenkins\tools\hudson.tasks.Ant_AntInstallation\ANT_1.8.2
Setting ANT_1_8_2_HOME=C:\Users\jenkins\tools\hudson.tasks.Ant_AntInstallation\ANT_1.8.2
Setting ANT_1_8_2_HOME=C:\Users\jenkins\tools\hudson.tasks.Ant_AntInstallation\ANT_1.8.2

Mime
View raw message