lucene-dev mailing list archives

Site index · List index
Message view « Date » · « Thread »
Top « Date » · « Thread »
From Policeman Jenkins Server <jenk...@thetaphi.de>
Subject [JENKINS] Lucene-Solr-master-Windows (64bit/jdk1.8.0_172) - Build # 7596 - Still Unstable!
Date Tue, 30 Oct 2018 20:11:42 GMT
Build: https://jenkins.thetaphi.de/job/Lucene-Solr-master-Windows/7596/
Java: 64bit/jdk1.8.0_172 -XX:+UseCompressedOops -XX:+UseG1GC

5 tests failed.
FAILED:  org.apache.solr.cloud.DocValuesNotIndexedTest.testGroupingDVOnly

Error Message:
Unexpected number of elements in the group for intGSF: 8

Stack Trace:
java.lang.AssertionError: Unexpected number of elements in the group for intGSF: 8
	at __randomizedtesting.SeedInfo.seed([16384BF24166E9AB:8D8325AA0C3EDBF5]:0)
	at org.junit.Assert.fail(Assert.java:93)
	at org.apache.solr.cloud.DocValuesNotIndexedTest.testGroupingDVOnly(DocValuesNotIndexedTest.java:381)
	at sun.reflect.NativeMethodAccessorImpl.invoke0(Native Method)
	at sun.reflect.NativeMethodAccessorImpl.invoke(NativeMethodAccessorImpl.java:62)
	at sun.reflect.DelegatingMethodAccessorImpl.invoke(DelegatingMethodAccessorImpl.java:43)
	at java.lang.reflect.Method.invoke(Method.java:498)
	at com.carrotsearch.randomizedtesting.RandomizedRunner.invoke(RandomizedRunner.java:1742)
	at com.carrotsearch.randomizedtesting.RandomizedRunner$8.evaluate(RandomizedRunner.java:935)
	at com.carrotsearch.randomizedtesting.RandomizedRunner$9.evaluate(RandomizedRunner.java:971)
	at com.carrotsearch.randomizedtesting.RandomizedRunner$10.evaluate(RandomizedRunner.java:985)
	at com.carrotsearch.randomizedtesting.rules.SystemPropertiesRestoreRule$1.evaluate(SystemPropertiesRestoreRule.java:57)
	at org.apache.lucene.util.TestRuleSetupTeardownChained$1.evaluate(TestRuleSetupTeardownChained.java:49)
	at org.apache.lucene.util.AbstractBeforeAfterRule$1.evaluate(AbstractBeforeAfterRule.java:45)
	at org.apache.lucene.util.TestRuleThreadAndTestName$1.evaluate(TestRuleThreadAndTestName.java:48)
	at org.apache.lucene.util.TestRuleIgnoreAfterMaxFailures$1.evaluate(TestRuleIgnoreAfterMaxFailures.java:64)
	at org.apache.lucene.util.TestRuleMarkFailure$1.evaluate(TestRuleMarkFailure.java:47)
	at com.carrotsearch.randomizedtesting.rules.StatementAdapter.evaluate(StatementAdapter.java:36)
	at com.carrotsearch.randomizedtesting.ThreadLeakControl$StatementRunner.run(ThreadLeakControl.java:368)
	at com.carrotsearch.randomizedtesting.ThreadLeakControl.forkTimeoutingTask(ThreadLeakControl.java:817)
	at com.carrotsearch.randomizedtesting.ThreadLeakControl$3.evaluate(ThreadLeakControl.java:468)
	at com.carrotsearch.randomizedtesting.RandomizedRunner.runSingleTest(RandomizedRunner.java:944)
	at com.carrotsearch.randomizedtesting.RandomizedRunner$5.evaluate(RandomizedRunner.java:830)
	at com.carrotsearch.randomizedtesting.RandomizedRunner$6.evaluate(RandomizedRunner.java:880)
	at com.carrotsearch.randomizedtesting.RandomizedRunner$7.evaluate(RandomizedRunner.java:891)
	at com.carrotsearch.randomizedtesting.rules.StatementAdapter.evaluate(StatementAdapter.java:36)
	at com.carrotsearch.randomizedtesting.rules.SystemPropertiesRestoreRule$1.evaluate(SystemPropertiesRestoreRule.java:57)
	at org.apache.lucene.util.AbstractBeforeAfterRule$1.evaluate(AbstractBeforeAfterRule.java:45)
	at com.carrotsearch.randomizedtesting.rules.StatementAdapter.evaluate(StatementAdapter.java:36)
	at org.apache.lucene.util.TestRuleStoreClassName$1.evaluate(TestRuleStoreClassName.java:41)
	at com.carrotsearch.randomizedtesting.rules.NoShadowingOrOverridesOnMethodsRule$1.evaluate(NoShadowingOrOverridesOnMethodsRule.java:40)
	at com.carrotsearch.randomizedtesting.rules.NoShadowingOrOverridesOnMethodsRule$1.evaluate(NoShadowingOrOverridesOnMethodsRule.java:40)
	at com.carrotsearch.randomizedtesting.rules.StatementAdapter.evaluate(StatementAdapter.java:36)
	at com.carrotsearch.randomizedtesting.rules.StatementAdapter.evaluate(StatementAdapter.java:36)
	at com.carrotsearch.randomizedtesting.rules.StatementAdapter.evaluate(StatementAdapter.java:36)
	at org.apache.lucene.util.TestRuleAssertionsRequired$1.evaluate(TestRuleAssertionsRequired.java:53)
	at org.apache.lucene.util.TestRuleMarkFailure$1.evaluate(TestRuleMarkFailure.java:47)
	at org.apache.lucene.util.TestRuleIgnoreAfterMaxFailures$1.evaluate(TestRuleIgnoreAfterMaxFailures.java:64)
	at org.apache.lucene.util.TestRuleIgnoreTestSuites$1.evaluate(TestRuleIgnoreTestSuites.java:54)
	at com.carrotsearch.randomizedtesting.rules.StatementAdapter.evaluate(StatementAdapter.java:36)
	at com.carrotsearch.randomizedtesting.ThreadLeakControl$StatementRunner.run(ThreadLeakControl.java:368)
	at java.lang.Thread.run(Thread.java:748)


FAILED:  org.apache.solr.cloud.TestSkipOverseerOperations.testSkipLeaderOperations

Error Message:
Expected 2x1 for collection: collection1 null Live Nodes: [127.0.0.1:62781_solr, 127.0.0.1:62784_solr, 127.0.0.1:62785_solr] Last available state: null

Stack Trace:
java.lang.AssertionError: Expected 2x1 for collection: collection1
null
Live Nodes: [127.0.0.1:62781_solr, 127.0.0.1:62784_solr, 127.0.0.1:62785_solr]
Last available state: null
	at __randomizedtesting.SeedInfo.seed([16384BF24166E9AB:E6D2980E9E4599C1]:0)
	at org.junit.Assert.fail(Assert.java:93)
	at org.apache.solr.cloud.SolrCloudTestCase.waitForState(SolrCloudTestCase.java:280)
	at org.apache.solr.cloud.TestSkipOverseerOperations.testSkipLeaderOperations(TestSkipOverseerOperations.java:70)
	at sun.reflect.NativeMethodAccessorImpl.invoke0(Native Method)
	at sun.reflect.NativeMethodAccessorImpl.invoke(NativeMethodAccessorImpl.java:62)
	at sun.reflect.DelegatingMethodAccessorImpl.invoke(DelegatingMethodAccessorImpl.java:43)
	at java.lang.reflect.Method.invoke(Method.java:498)
	at com.carrotsearch.randomizedtesting.RandomizedRunner.invoke(RandomizedRunner.java:1742)
	at com.carrotsearch.randomizedtesting.RandomizedRunner$8.evaluate(RandomizedRunner.java:935)
	at com.carrotsearch.randomizedtesting.RandomizedRunner$9.evaluate(RandomizedRunner.java:971)
	at com.carrotsearch.randomizedtesting.RandomizedRunner$10.evaluate(RandomizedRunner.java:985)
	at com.carrotsearch.randomizedtesting.rules.SystemPropertiesRestoreRule$1.evaluate(SystemPropertiesRestoreRule.java:57)
	at org.apache.lucene.util.TestRuleSetupTeardownChained$1.evaluate(TestRuleSetupTeardownChained.java:49)
	at org.apache.lucene.util.AbstractBeforeAfterRule$1.evaluate(AbstractBeforeAfterRule.java:45)
	at org.apache.lucene.util.TestRuleThreadAndTestName$1.evaluate(TestRuleThreadAndTestName.java:48)
	at org.apache.lucene.util.TestRuleIgnoreAfterMaxFailures$1.evaluate(TestRuleIgnoreAfterMaxFailures.java:64)
	at org.apache.lucene.util.TestRuleMarkFailure$1.evaluate(TestRuleMarkFailure.java:47)
	at com.carrotsearch.randomizedtesting.rules.StatementAdapter.evaluate(StatementAdapter.java:36)
	at com.carrotsearch.randomizedtesting.ThreadLeakControl$StatementRunner.run(ThreadLeakControl.java:368)
	at com.carrotsearch.randomizedtesting.ThreadLeakControl.forkTimeoutingTask(ThreadLeakControl.java:817)
	at com.carrotsearch.randomizedtesting.ThreadLeakControl$3.evaluate(ThreadLeakControl.java:468)
	at com.carrotsearch.randomizedtesting.RandomizedRunner.runSingleTest(RandomizedRunner.java:944)
	at com.carrotsearch.randomizedtesting.RandomizedRunner$5.evaluate(RandomizedRunner.java:830)
	at com.carrotsearch.randomizedtesting.RandomizedRunner$6.evaluate(RandomizedRunner.java:880)
	at com.carrotsearch.randomizedtesting.RandomizedRunner$7.evaluate(RandomizedRunner.java:891)
	at com.carrotsearch.randomizedtesting.rules.StatementAdapter.evaluate(StatementAdapter.java:36)
	at com.carrotsearch.randomizedtesting.rules.SystemPropertiesRestoreRule$1.evaluate(SystemPropertiesRestoreRule.java:57)
	at org.apache.lucene.util.AbstractBeforeAfterRule$1.evaluate(AbstractBeforeAfterRule.java:45)
	at com.carrotsearch.randomizedtesting.rules.StatementAdapter.evaluate(StatementAdapter.java:36)
	at org.apache.lucene.util.TestRuleStoreClassName$1.evaluate(TestRuleStoreClassName.java:41)
	at com.carrotsearch.randomizedtesting.rules.NoShadowingOrOverridesOnMethodsRule$1.evaluate(NoShadowingOrOverridesOnMethodsRule.java:40)
	at com.carrotsearch.randomizedtesting.rules.NoShadowingOrOverridesOnMethodsRule$1.evaluate(NoShadowingOrOverridesOnMethodsRule.java:40)
	at com.carrotsearch.randomizedtesting.rules.StatementAdapter.evaluate(StatementAdapter.java:36)
	at com.carrotsearch.randomizedtesting.rules.StatementAdapter.evaluate(StatementAdapter.java:36)
	at com.carrotsearch.randomizedtesting.rules.StatementAdapter.evaluate(StatementAdapter.java:36)
	at org.apache.lucene.util.TestRuleAssertionsRequired$1.evaluate(TestRuleAssertionsRequired.java:53)
	at org.apache.lucene.util.TestRuleMarkFailure$1.evaluate(TestRuleMarkFailure.java:47)
	at org.apache.lucene.util.TestRuleIgnoreAfterMaxFailures$1.evaluate(TestRuleIgnoreAfterMaxFailures.java:64)
	at org.apache.lucene.util.TestRuleIgnoreTestSuites$1.evaluate(TestRuleIgnoreTestSuites.java:54)
	at com.carrotsearch.randomizedtesting.rules.StatementAdapter.evaluate(StatementAdapter.java:36)
	at com.carrotsearch.randomizedtesting.ThreadLeakControl$StatementRunner.run(ThreadLeakControl.java:368)
	at java.lang.Thread.run(Thread.java:748)


FAILED:  org.apache.solr.cloud.autoscaling.TriggerIntegrationTest.testTriggerThrottling

Error Message:
Both triggers should have fired by now

Stack Trace:
java.lang.AssertionError: Both triggers should have fired by now
	at __randomizedtesting.SeedInfo.seed([16384BF24166E9AB:ED1AE3D793CC0A39]:0)
	at org.junit.Assert.fail(Assert.java:93)
	at org.apache.solr.cloud.autoscaling.TriggerIntegrationTest.testTriggerThrottling(TriggerIntegrationTest.java:222)
	at sun.reflect.NativeMethodAccessorImpl.invoke0(Native Method)
	at sun.reflect.NativeMethodAccessorImpl.invoke(NativeMethodAccessorImpl.java:62)
	at sun.reflect.DelegatingMethodAccessorImpl.invoke(DelegatingMethodAccessorImpl.java:43)
	at java.lang.reflect.Method.invoke(Method.java:498)
	at com.carrotsearch.randomizedtesting.RandomizedRunner.invoke(RandomizedRunner.java:1742)
	at com.carrotsearch.randomizedtesting.RandomizedRunner$8.evaluate(RandomizedRunner.java:935)
	at com.carrotsearch.randomizedtesting.RandomizedRunner$9.evaluate(RandomizedRunner.java:971)
	at com.carrotsearch.randomizedtesting.RandomizedRunner$10.evaluate(RandomizedRunner.java:985)
	at com.carrotsearch.randomizedtesting.rules.SystemPropertiesRestoreRule$1.evaluate(SystemPropertiesRestoreRule.java:57)
	at org.apache.lucene.util.TestRuleSetupTeardownChained$1.evaluate(TestRuleSetupTeardownChained.java:49)
	at org.apache.lucene.util.AbstractBeforeAfterRule$1.evaluate(AbstractBeforeAfterRule.java:45)
	at org.apache.lucene.util.TestRuleThreadAndTestName$1.evaluate(TestRuleThreadAndTestName.java:48)
	at org.apache.lucene.util.TestRuleIgnoreAfterMaxFailures$1.evaluate(TestRuleIgnoreAfterMaxFailures.java:64)
	at org.apache.lucene.util.TestRuleMarkFailure$1.evaluate(TestRuleMarkFailure.java:47)
	at com.carrotsearch.randomizedtesting.rules.StatementAdapter.evaluate(StatementAdapter.java:36)
	at com.carrotsearch.randomizedtesting.ThreadLeakControl$StatementRunner.run(ThreadLeakControl.java:368)
	at com.carrotsearch.randomizedtesting.ThreadLeakControl.forkTimeoutingTask(ThreadLeakControl.java:817)
	at com.carrotsearch.randomizedtesting.ThreadLeakControl$3.evaluate(ThreadLeakControl.java:468)
	at com.carrotsearch.randomizedtesting.RandomizedRunner.runSingleTest(RandomizedRunner.java:944)
	at com.carrotsearch.randomizedtesting.RandomizedRunner$5.evaluate(RandomizedRunner.java:830)
	at com.carrotsearch.randomizedtesting.RandomizedRunner$6.evaluate(RandomizedRunner.java:880)
	at com.carrotsearch.randomizedtesting.RandomizedRunner$7.evaluate(RandomizedRunner.java:891)
	at com.carrotsearch.randomizedtesting.rules.StatementAdapter.evaluate(StatementAdapter.java:36)
	at com.carrotsearch.randomizedtesting.rules.SystemPropertiesRestoreRule$1.evaluate(SystemPropertiesRestoreRule.java:57)
	at org.apache.lucene.util.AbstractBeforeAfterRule$1.evaluate(AbstractBeforeAfterRule.java:45)
	at com.carrotsearch.randomizedtesting.rules.StatementAdapter.evaluate(StatementAdapter.java:36)
	at org.apache.lucene.util.TestRuleStoreClassName$1.evaluate(TestRuleStoreClassName.java:41)
	at com.carrotsearch.randomizedtesting.rules.NoShadowingOrOverridesOnMethodsRule$1.evaluate(NoShadowingOrOverridesOnMethodsRule.java:40)
	at com.carrotsearch.randomizedtesting.rules.NoShadowingOrOverridesOnMethodsRule$1.evaluate(NoShadowingOrOverridesOnMethodsRule.java:40)
	at com.carrotsearch.randomizedtesting.rules.StatementAdapter.evaluate(StatementAdapter.java:36)
	at com.carrotsearch.randomizedtesting.rules.StatementAdapter.evaluate(StatementAdapter.java:36)
	at com.carrotsearch.randomizedtesting.rules.StatementAdapter.evaluate(StatementAdapter.java:36)
	at org.apache.lucene.util.TestRuleAssertionsRequired$1.evaluate(TestRuleAssertionsRequired.java:53)
	at org.apache.lucene.util.TestRuleMarkFailure$1.evaluate(TestRuleMarkFailure.java:47)
	at org.apache.lucene.util.TestRuleIgnoreAfterMaxFailures$1.evaluate(TestRuleIgnoreAfterMaxFailures.java:64)
	at org.apache.lucene.util.TestRuleIgnoreTestSuites$1.evaluate(TestRuleIgnoreTestSuites.java:54)
	at com.carrotsearch.randomizedtesting.rules.StatementAdapter.evaluate(StatementAdapter.java:36)
	at com.carrotsearch.randomizedtesting.ThreadLeakControl$StatementRunner.run(ThreadLeakControl.java:368)
	at java.lang.Thread.run(Thread.java:748)


FAILED:  org.apache.solr.cloud.autoscaling.TriggerIntegrationTest.testTriggerThrottling

Error Message:
Both triggers should have fired by now

Stack Trace:
java.lang.AssertionError: Both triggers should have fired by now
	at __randomizedtesting.SeedInfo.seed([16384BF24166E9AB:ED1AE3D793CC0A39]:0)
	at org.junit.Assert.fail(Assert.java:93)
	at org.apache.solr.cloud.autoscaling.TriggerIntegrationTest.testTriggerThrottling(TriggerIntegrationTest.java:270)
	at sun.reflect.NativeMethodAccessorImpl.invoke0(Native Method)
	at sun.reflect.NativeMethodAccessorImpl.invoke(NativeMethodAccessorImpl.java:62)
	at sun.reflect.DelegatingMethodAccessorImpl.invoke(DelegatingMethodAccessorImpl.java:43)
	at java.lang.reflect.Method.invoke(Method.java:498)
	at com.carrotsearch.randomizedtesting.RandomizedRunner.invoke(RandomizedRunner.java:1742)
	at com.carrotsearch.randomizedtesting.RandomizedRunner$8.evaluate(RandomizedRunner.java:935)
	at com.carrotsearch.randomizedtesting.RandomizedRunner$9.evaluate(RandomizedRunner.java:971)
	at com.carrotsearch.randomizedtesting.RandomizedRunner$10.evaluate(RandomizedRunner.java:985)
	at com.carrotsearch.randomizedtesting.rules.SystemPropertiesRestoreRule$1.evaluate(SystemPropertiesRestoreRule.java:57)
	at org.apache.lucene.util.TestRuleSetupTeardownChained$1.evaluate(TestRuleSetupTeardownChained.java:49)
	at org.apache.lucene.util.AbstractBeforeAfterRule$1.evaluate(AbstractBeforeAfterRule.java:45)
	at org.apache.lucene.util.TestRuleThreadAndTestName$1.evaluate(TestRuleThreadAndTestName.java:48)
	at org.apache.lucene.util.TestRuleIgnoreAfterMaxFailures$1.evaluate(TestRuleIgnoreAfterMaxFailures.java:64)
	at org.apache.lucene.util.TestRuleMarkFailure$1.evaluate(TestRuleMarkFailure.java:47)
	at com.carrotsearch.randomizedtesting.rules.StatementAdapter.evaluate(StatementAdapter.java:36)
	at com.carrotsearch.randomizedtesting.ThreadLeakControl$StatementRunner.run(ThreadLeakControl.java:368)
	at com.carrotsearch.randomizedtesting.ThreadLeakControl.forkTimeoutingTask(ThreadLeakControl.java:817)
	at com.carrotsearch.randomizedtesting.ThreadLeakControl$3.evaluate(ThreadLeakControl.java:468)
	at com.carrotsearch.randomizedtesting.RandomizedRunner.runSingleTest(RandomizedRunner.java:944)
	at com.carrotsearch.randomizedtesting.RandomizedRunner$5.evaluate(RandomizedRunner.java:830)
	at com.carrotsearch.randomizedtesting.RandomizedRunner$6.evaluate(RandomizedRunner.java:880)
	at com.carrotsearch.randomizedtesting.RandomizedRunner$7.evaluate(RandomizedRunner.java:891)
	at com.carrotsearch.randomizedtesting.rules.StatementAdapter.evaluate(StatementAdapter.java:36)
	at com.carrotsearch.randomizedtesting.rules.SystemPropertiesRestoreRule$1.evaluate(SystemPropertiesRestoreRule.java:57)
	at org.apache.lucene.util.AbstractBeforeAfterRule$1.evaluate(AbstractBeforeAfterRule.java:45)
	at com.carrotsearch.randomizedtesting.rules.StatementAdapter.evaluate(StatementAdapter.java:36)
	at org.apache.lucene.util.TestRuleStoreClassName$1.evaluate(TestRuleStoreClassName.java:41)
	at com.carrotsearch.randomizedtesting.rules.NoShadowingOrOverridesOnMethodsRule$1.evaluate(NoShadowingOrOverridesOnMethodsRule.java:40)
	at com.carrotsearch.randomizedtesting.rules.NoShadowingOrOverridesOnMethodsRule$1.evaluate(NoShadowingOrOverridesOnMethodsRule.java:40)
	at com.carrotsearch.randomizedtesting.rules.StatementAdapter.evaluate(StatementAdapter.java:36)
	at com.carrotsearch.randomizedtesting.rules.StatementAdapter.evaluate(StatementAdapter.java:36)
	at com.carrotsearch.randomizedtesting.rules.StatementAdapter.evaluate(StatementAdapter.java:36)
	at org.apache.lucene.util.TestRuleAssertionsRequired$1.evaluate(TestRuleAssertionsRequired.java:53)
	at org.apache.lucene.util.TestRuleMarkFailure$1.evaluate(TestRuleMarkFailure.java:47)
	at org.apache.lucene.util.TestRuleIgnoreAfterMaxFailures$1.evaluate(TestRuleIgnoreAfterMaxFailures.java:64)
	at org.apache.lucene.util.TestRuleIgnoreTestSuites$1.evaluate(TestRuleIgnoreTestSuites.java:54)
	at com.carrotsearch.randomizedtesting.rules.StatementAdapter.evaluate(StatementAdapter.java:36)
	at com.carrotsearch.randomizedtesting.ThreadLeakControl$StatementRunner.run(ThreadLeakControl.java:368)
	at java.lang.Thread.run(Thread.java:748)


FAILED:  org.apache.solr.cloud.autoscaling.TriggerIntegrationTest.testTriggerThrottling

Error Message:
Both triggers should have fired by now

Stack Trace:
java.lang.AssertionError: Both triggers should have fired by now
	at __randomizedtesting.SeedInfo.seed([16384BF24166E9AB:ED1AE3D793CC0A39]:0)
	at org.junit.Assert.fail(Assert.java:93)
	at org.apache.solr.cloud.autoscaling.TriggerIntegrationTest.testTriggerThrottling(TriggerIntegrationTest.java:270)
	at sun.reflect.NativeMethodAccessorImpl.invoke0(Native Method)
	at sun.reflect.NativeMethodAccessorImpl.invoke(NativeMethodAccessorImpl.java:62)
	at sun.reflect.DelegatingMethodAccessorImpl.invoke(DelegatingMethodAccessorImpl.java:43)
	at java.lang.reflect.Method.invoke(Method.java:498)
	at com.carrotsearch.randomizedtesting.RandomizedRunner.invoke(RandomizedRunner.java:1742)
	at com.carrotsearch.randomizedtesting.RandomizedRunner$8.evaluate(RandomizedRunner.java:935)
	at com.carrotsearch.randomizedtesting.RandomizedRunner$9.evaluate(RandomizedRunner.java:971)
	at com.carrotsearch.randomizedtesting.RandomizedRunner$10.evaluate(RandomizedRunner.java:985)
	at com.carrotsearch.randomizedtesting.rules.SystemPropertiesRestoreRule$1.evaluate(SystemPropertiesRestoreRule.java:57)
	at org.apache.lucene.util.TestRuleSetupTeardownChained$1.evaluate(TestRuleSetupTeardownChained.java:49)
	at org.apache.lucene.util.AbstractBeforeAfterRule$1.evaluate(AbstractBeforeAfterRule.java:45)
	at org.apache.lucene.util.TestRuleThreadAndTestName$1.evaluate(TestRuleThreadAndTestName.java:48)
	at org.apache.lucene.util.TestRuleIgnoreAfterMaxFailures$1.evaluate(TestRuleIgnoreAfterMaxFailures.java:64)
	at org.apache.lucene.util.TestRuleMarkFailure$1.evaluate(TestRuleMarkFailure.java:47)
	at com.carrotsearch.randomizedtesting.rules.StatementAdapter.evaluate(StatementAdapter.java:36)
	at com.carrotsearch.randomizedtesting.ThreadLeakControl$StatementRunner.run(ThreadLeakControl.java:368)
	at com.carrotsearch.randomizedtesting.ThreadLeakControl.forkTimeoutingTask(ThreadLeakControl.java:817)
	at com.carrotsearch.randomizedtesting.ThreadLeakControl$3.evaluate(ThreadLeakControl.java:468)
	at com.carrotsearch.randomizedtesting.RandomizedRunner.runSingleTest(RandomizedRunner.java:944)
	at com.carrotsearch.randomizedtesting.RandomizedRunner$5.evaluate(RandomizedRunner.java:830)
	at com.carrotsearch.randomizedtesting.RandomizedRunner$6.evaluate(RandomizedRunner.java:880)
	at com.carrotsearch.randomizedtesting.RandomizedRunner$7.evaluate(RandomizedRunner.java:891)
	at com.carrotsearch.randomizedtesting.rules.StatementAdapter.evaluate(StatementAdapter.java:36)
	at com.carrotsearch.randomizedtesting.rules.SystemPropertiesRestoreRule$1.evaluate(SystemPropertiesRestoreRule.java:57)
	at org.apache.lucene.util.AbstractBeforeAfterRule$1.evaluate(AbstractBeforeAfterRule.java:45)
	at com.carrotsearch.randomizedtesting.rules.StatementAdapter.evaluate(StatementAdapter.java:36)
	at org.apache.lucene.util.TestRuleStoreClassName$1.evaluate(TestRuleStoreClassName.java:41)
	at com.carrotsearch.randomizedtesting.rules.NoShadowingOrOverridesOnMethodsRule$1.evaluate(NoShadowingOrOverridesOnMethodsRule.java:40)
	at com.carrotsearch.randomizedtesting.rules.NoShadowingOrOverridesOnMethodsRule$1.evaluate(NoShadowingOrOverridesOnMethodsRule.java:40)
	at com.carrotsearch.randomizedtesting.rules.StatementAdapter.evaluate(StatementAdapter.java:36)
	at com.carrotsearch.randomizedtesting.rules.StatementAdapter.evaluate(StatementAdapter.java:36)
	at com.carrotsearch.randomizedtesting.rules.StatementAdapter.evaluate(StatementAdapter.java:36)
	at org.apache.lucene.util.TestRuleAssertionsRequired$1.evaluate(TestRuleAssertionsRequired.java:53)
	at org.apache.lucene.util.TestRuleMarkFailure$1.evaluate(TestRuleMarkFailure.java:47)
	at org.apache.lucene.util.TestRuleIgnoreAfterMaxFailures$1.evaluate(TestRuleIgnoreAfterMaxFailures.java:64)
	at org.apache.lucene.util.TestRuleIgnoreTestSuites$1.evaluate(TestRuleIgnoreTestSuites.java:54)
	at com.carrotsearch.randomizedtesting.rules.StatementAdapter.evaluate(StatementAdapter.java:36)
	at com.carrotsearch.randomizedtesting.ThreadLeakControl$StatementRunner.run(ThreadLeakControl.java:368)
	at java.lang.Thread.run(Thread.java:748)




Build Log:
[...truncated 12562 lines...]
   [junit4] Suite: org.apache.solr.cloud.autoscaling.TriggerIntegrationTest
   [junit4]   2> Creating dataDir: C:\Users\jenkins\workspace\Lucene-Solr-master-Windows\solr\build\solr-core\test\J1\temp\solr.cloud.autoscaling.TriggerIntegrationTest_16384BF24166E9AB-001\init-core-data-001
   [junit4]   2> 110959 INFO  (SUITE-TriggerIntegrationTest-seed#[16384BF24166E9AB]-worker) [    ] o.a.s.SolrTestCaseJ4 Using PointFields (NUMERIC_POINTS_SYSPROP=true) w/NUMERIC_DOCVALUES_SYSPROP=false
   [junit4]   2> 110965 INFO  (SUITE-TriggerIntegrationTest-seed#[16384BF24166E9AB]-worker) [    ] o.a.s.SolrTestCaseJ4 Randomized ssl (false) and clientAuth (false) via: @org.apache.solr.util.RandomizeSSL(reason=, value=NaN, ssl=NaN, clientAuth=NaN)
   [junit4]   2> 110965 INFO  (SUITE-TriggerIntegrationTest-seed#[16384BF24166E9AB]-worker) [    ] o.a.s.SolrTestCaseJ4 SecureRandom sanity checks: test.solr.allowed.securerandom=null & java.security.egd=file:/dev/./urandom
   [junit4]   2> 110967 INFO  (SUITE-TriggerIntegrationTest-seed#[16384BF24166E9AB]-worker) [    ] o.a.s.c.MiniSolrCloudCluster Starting cluster of 2 servers in C:\Users\jenkins\workspace\Lucene-Solr-master-Windows\solr\build\solr-core\test\J1\temp\solr.cloud.autoscaling.TriggerIntegrationTest_16384BF24166E9AB-001\tempDir-001
   [junit4]   2> 110967 INFO  (SUITE-TriggerIntegrationTest-seed#[16384BF24166E9AB]-worker) [    ] o.a.s.c.ZkTestServer STARTING ZK TEST SERVER
   [junit4]   2> 110967 INFO  (Thread-25) [    ] o.a.s.c.ZkTestServer client port:0.0.0.0/0.0.0.0:0
   [junit4]   2> 110967 INFO  (Thread-25) [    ] o.a.s.c.ZkTestServer Starting server
   [junit4]   2> 110972 ERROR (Thread-25) [    ] o.a.z.s.ZooKeeperServer ZKShutdownHandler is not registered, so ZooKeeper server won't take any action on ERROR or SHUTDOWN server state changes
   [junit4]   2> 111086 INFO  (SUITE-TriggerIntegrationTest-seed#[16384BF24166E9AB]-worker) [    ] o.a.s.c.ZkTestServer start zk server on port:58365
   [junit4]   2> 111091 INFO  (zkConnectionManagerCallback-96-thread-1) [    ] o.a.s.c.c.ConnectionManager zkClient has connected
   [junit4]   2> 111098 INFO  (jetty-launcher-93-thread-1) [    ] o.e.j.s.Server jetty-9.4.11.v20180605; built: 2018-06-05T18:24:03.829Z; git: d5fc0523cfa96bfebfbda19606cad384d772f04c; jvm 1.8.0_172-b11
   [junit4]   2> 111098 INFO  (jetty-launcher-93-thread-2) [    ] o.e.j.s.Server jetty-9.4.11.v20180605; built: 2018-06-05T18:24:03.829Z; git: d5fc0523cfa96bfebfbda19606cad384d772f04c; jvm 1.8.0_172-b11
   [junit4]   2> 111100 INFO  (jetty-launcher-93-thread-1) [    ] o.e.j.s.session DefaultSessionIdManager workerName=node0
   [junit4]   2> 111100 INFO  (jetty-launcher-93-thread-1) [    ] o.e.j.s.session No SessionScavenger set, using defaults
   [junit4]   2> 111100 INFO  (jetty-launcher-93-thread-1) [    ] o.e.j.s.session node0 Scavenging every 600000ms
   [junit4]   2> 111100 INFO  (jetty-launcher-93-thread-2) [    ] o.e.j.s.session DefaultSessionIdManager workerName=node0
   [junit4]   2> 111100 INFO  (jetty-launcher-93-thread-2) [    ] o.e.j.s.session No SessionScavenger set, using defaults
   [junit4]   2> 111100 INFO  (jetty-launcher-93-thread-2) [    ] o.e.j.s.session node0 Scavenging every 600000ms
   [junit4]   2> 111100 INFO  (jetty-launcher-93-thread-1) [    ] o.e.j.s.h.ContextHandler Started o.e.j.s.ServletContextHandler@646e38fd{/solr,null,AVAILABLE}
   [junit4]   2> 111100 INFO  (jetty-launcher-93-thread-2) [    ] o.e.j.s.h.ContextHandler Started o.e.j.s.ServletContextHandler@f2e060e{/solr,null,AVAILABLE}
   [junit4]   2> 111103 INFO  (jetty-launcher-93-thread-1) [    ] o.e.j.s.AbstractConnector Started ServerConnector@3e66b4ab{HTTP/1.1,[http/1.1]}{127.0.0.1:58369}
   [junit4]   2> 111103 INFO  (jetty-launcher-93-thread-1) [    ] o.e.j.s.Server Started @111154ms
   [junit4]   2> 111103 INFO  (jetty-launcher-93-thread-2) [    ] o.e.j.s.AbstractConnector Started ServerConnector@2fbd9a17{HTTP/1.1,[http/1.1]}{127.0.0.1:58370}
   [junit4]   2> 111103 INFO  (jetty-launcher-93-thread-2) [    ] o.e.j.s.Server Started @111154ms
   [junit4]   2> 111103 INFO  (jetty-launcher-93-thread-1) [    ] o.a.s.c.s.e.JettySolrRunner Jetty properties: {hostContext=/solr, hostPort=58369}
   [junit4]   2> 111103 INFO  (jetty-launcher-93-thread-2) [    ] o.a.s.c.s.e.JettySolrRunner Jetty properties: {hostContext=/solr, hostPort=58370}
   [junit4]   2> 111104 ERROR (jetty-launcher-93-thread-1) [    ] o.a.s.u.StartupLoggingUtils Missing Java Option solr.log.dir. Logging may be missing or incomplete.
   [junit4]   2> 111104 INFO  (jetty-launcher-93-thread-1) [    ] o.a.s.s.SolrDispatchFilter Using logger factory org.apache.logging.slf4j.Log4jLoggerFactory
   [junit4]   2> 111104 INFO  (jetty-launcher-93-thread-1) [    ] o.a.s.s.SolrDispatchFilter  ___      _       Welcome to Apache Solr? version 8.0.0
   [junit4]   2> 111104 INFO  (jetty-launcher-93-thread-1) [    ] o.a.s.s.SolrDispatchFilter / __| ___| |_ _   Starting in cloud mode on port null
   [junit4]   2> 111104 INFO  (jetty-launcher-93-thread-1) [    ] o.a.s.s.SolrDispatchFilter \__ \/ _ \ | '_|  Install dir: null
   [junit4]   2> 111104 ERROR (jetty-launcher-93-thread-2) [    ] o.a.s.u.StartupLoggingUtils Missing Java Option solr.log.dir. Logging may be missing or incomplete.
   [junit4]   2> 111104 INFO  (jetty-launcher-93-thread-2) [    ] o.a.s.s.SolrDispatchFilter Using logger factory org.apache.logging.slf4j.Log4jLoggerFactory
   [junit4]   2> 111104 INFO  (jetty-launcher-93-thread-1) [    ] o.a.s.s.SolrDispatchFilter |___/\___/_|_|    Start time: 2018-10-30T18:30:39.417Z
   [junit4]   2> 111104 INFO  (jetty-launcher-93-thread-2) [    ] o.a.s.s.SolrDispatchFilter  ___      _       Welcome to Apache Solr? version 8.0.0
   [junit4]   2> 111106 INFO  (jetty-launcher-93-thread-2) [    ] o.a.s.s.SolrDispatchFilter / __| ___| |_ _   Starting in cloud mode on port null
   [junit4]   2> 111106 INFO  (jetty-launcher-93-thread-2) [    ] o.a.s.s.SolrDispatchFilter \__ \/ _ \ | '_|  Install dir: null
   [junit4]   2> 111106 INFO  (jetty-launcher-93-thread-2) [    ] o.a.s.s.SolrDispatchFilter |___/\___/_|_|    Start time: 2018-10-30T18:30:39.419Z
   [junit4]   2> 111110 INFO  (zkConnectionManagerCallback-100-thread-1) [    ] o.a.s.c.c.ConnectionManager zkClient has connected
   [junit4]   2> 111110 INFO  (zkConnectionManagerCallback-98-thread-1) [    ] o.a.s.c.c.ConnectionManager zkClient has connected
   [junit4]   2> 111111 INFO  (jetty-launcher-93-thread-2) [    ] o.a.s.s.SolrDispatchFilter solr.xml found in ZooKeeper. Loading...
   [junit4]   2> 111111 INFO  (jetty-launcher-93-thread-1) [    ] o.a.s.s.SolrDispatchFilter solr.xml found in ZooKeeper. Loading...
   [junit4]   2> 111121 WARN  (NIOServerCxn.Factory:0.0.0.0/0.0.0.0:0) [    ] o.a.z.s.NIOServerCnxn Unable to read additional data from client sessionid 0x1000c4996980001, likely client has closed socket
   [junit4]   2> 111122 WARN  (NIOServerCxn.Factory:0.0.0.0/0.0.0.0:0) [    ] o.a.z.s.NIOServerCnxn Unable to read additional data from client sessionid 0x1000c4996980002, likely client has closed socket
   [junit4]   2> 111195 INFO  (jetty-launcher-93-thread-2) [    ] o.a.s.c.ZkContainer Zookeeper client=127.0.0.1:58365/solr
   [junit4]   2> 111202 INFO  (zkConnectionManagerCallback-104-thread-1) [    ] o.a.s.c.c.ConnectionManager zkClient has connected
   [junit4]   2> 111204 WARN  (NIOServerCxn.Factory:0.0.0.0/0.0.0.0:0) [    ] o.a.z.s.NIOServerCnxn Unable to read additional data from client sessionid 0x1000c4996980003, likely client has closed socket
   [junit4]   2> 111211 INFO  (zkConnectionManagerCallback-106-thread-1) [    ] o.a.s.c.c.ConnectionManager zkClient has connected
   [junit4]   2> 111244 INFO  (jetty-launcher-93-thread-1) [    ] o.a.s.c.ZkContainer Zookeeper client=127.0.0.1:58365/solr
   [junit4]   2> 111250 INFO  (zkConnectionManagerCallback-112-thread-1) [    ] o.a.s.c.c.ConnectionManager zkClient has connected
   [junit4]   2> 111252 WARN  (NIOServerCxn.Factory:0.0.0.0/0.0.0.0:0) [    ] o.a.z.s.NIOServerCnxn Unable to read additional data from client sessionid 0x1000c4996980005, likely client has closed socket
   [junit4]   2> 111256 INFO  (zkConnectionManagerCallback-114-thread-1) [    ] o.a.s.c.c.ConnectionManager zkClient has connected
   [junit4]   2> 111271 INFO  (jetty-launcher-93-thread-1) [n:127.0.0.1:58369_solr    ] o.a.s.c.OverseerElectionContext I am going to be the leader 127.0.0.1:58369_solr
   [junit4]   2> 111271 INFO  (jetty-launcher-93-thread-1) [n:127.0.0.1:58369_solr    ] o.a.s.c.Overseer Overseer (id=72071104236617734-127.0.0.1:58369_solr-n_0000000000) starting
   [junit4]   2> 111284 INFO  (zkConnectionManagerCallback-121-thread-1) [    ] o.a.s.c.c.ConnectionManager zkClient has connected
   [junit4]   2> 111288 INFO  (jetty-launcher-93-thread-1) [n:127.0.0.1:58369_solr    ] o.a.s.c.s.i.ZkClientClusterStateProvider Cluster at 127.0.0.1:58365/solr ready
   [junit4]   2> 111288 INFO  (jetty-launcher-93-thread-1) [n:127.0.0.1:58369_solr    ] o.a.s.c.ZkController Register node as live in ZooKeeper:/live_nodes/127.0.0.1:58369_solr
   [junit4]   2> 111312 INFO  (jetty-launcher-93-thread-2) [n:127.0.0.1:58370_solr    ] o.a.s.c.c.ZkStateReader Updated live nodes from ZooKeeper... (0) -> (1)
   [junit4]   2> 111321 INFO  (jetty-launcher-93-thread-2) [n:127.0.0.1:58370_solr    ] o.a.s.c.TransientSolrCoreCacheDefault Allocating transient cache for 2147483647 transient cores
   [junit4]   2> 111321 INFO  (jetty-launcher-93-thread-2) [n:127.0.0.1:58370_solr    ] o.a.s.c.ZkController Register node as live in ZooKeeper:/live_nodes/127.0.0.1:58370_solr
   [junit4]   2> 111344 INFO  (OverseerStateUpdate-72071104236617734-127.0.0.1:58369_solr-n_0000000000) [n:127.0.0.1:58369_solr    ] o.a.s.c.Overseer Starting to work on the main queue : 127.0.0.1:58369_solr
   [junit4]   2> 111345 DEBUG (OverseerAutoScalingTriggerThread-72071104236617734-127.0.0.1:58369_solr-n_0000000000) [    ] o.a.s.c.a.OverseerTriggerThread Adding .auto_add_replicas and .scheduled_maintenance triggers
   [junit4]   2> 111352 INFO  (jetty-launcher-93-thread-1) [n:127.0.0.1:58369_solr    ] o.a.s.h.a.MetricsHistoryHandler No .system collection, keeping metrics history in memory.
   [junit4]   2> 111360 INFO  (zkCallback-105-thread-1) [    ] o.a.s.c.c.ZkStateReader Updated live nodes from ZooKeeper... (1) -> (2)
   [junit4]   2> 111367 INFO  (OverseerStateUpdate-72071104236617734-127.0.0.1:58369_solr-n_0000000000) [n:127.0.0.1:58369_solr    ] o.a.s.c.c.ZkStateReader Updated live nodes from ZooKeeper... (0) -> (2)
   [junit4]   2> 111362 INFO  (zkCallback-120-thread-1) [    ] o.a.s.c.c.ZkStateReader Updated live nodes from ZooKeeper... (0) -> (2)
   [junit4]   2> 111361 DEBUG (OverseerAutoScalingTriggerThread-72071104236617734-127.0.0.1:58369_solr-n_0000000000) [    ] o.a.s.c.a.OverseerTriggerThread Refreshing /autoscaling.json with znode version 1
   [junit4]   2> 111372 DEBUG (OverseerAutoScalingTriggerThread-72071104236617734-127.0.0.1:58369_solr-n_0000000000) [    ] o.a.s.c.a.OverseerTriggerThread Current znodeVersion 1, lastZnodeVersion -1
   [junit4]   2> 111372 DEBUG (OverseerAutoScalingTriggerThread-72071104236617734-127.0.0.1:58369_solr-n_0000000000) [    ] o.a.s.c.a.OverseerTriggerThread Processed trigger updates upto znodeVersion 1
   [junit4]   2> 111378 DEBUG (OverseerAutoScalingTriggerThread-72071104236617734-127.0.0.1:58369_solr-n_0000000000) [    ] o.a.s.c.a.NodeLostTrigger NodeLostTrigger .auto_add_replicas - Initial livenodes: [127.0.0.1:58370_solr, 127.0.0.1:58369_solr]
   [junit4]   2> 111378 DEBUG (OverseerAutoScalingTriggerThread-72071104236617734-127.0.0.1:58369_solr-n_0000000000) [    ] o.a.s.c.a.OverseerTriggerThread -- clean old nodeAdded markers
   [junit4]   2> 111379 DEBUG (OverseerAutoScalingTriggerThread-72071104236617734-127.0.0.1:58369_solr-n_0000000000) [    ] o.a.s.c.a.OverseerTriggerThread Current znodeVersion 1, lastZnodeVersion 1
   [junit4]   2> 111379 INFO  (zkConnectionManagerCallback-127-thread-1) [    ] o.a.s.c.c.ConnectionManager zkClient has connected
   [junit4]   2> 111383 DEBUG (ScheduledTrigger-149-thread-1) [    ] o.a.s.c.a.NodeLostTrigger Running NodeLostTrigger: .auto_add_replicas with currently live nodes: 2
   [junit4]   2> 111386 INFO  (jetty-launcher-93-thread-2) [n:127.0.0.1:58370_solr    ] o.a.s.c.c.ZkStateReader Updated live nodes from ZooKeeper... (0) -> (2)
   [junit4]   2> 111387 INFO  (jetty-launcher-93-thread-2) [n:127.0.0.1:58370_solr    ] o.a.s.c.s.i.ZkClientClusterStateProvider Cluster at 127.0.0.1:58365/solr ready
   [junit4]   2> 111387 INFO  (jetty-launcher-93-thread-2) [n:127.0.0.1:58370_solr    ] o.a.s.h.a.MetricsHistoryHandler No .system collection, keeping metrics history in memory.
   [junit4]   2> 111423 INFO  (jetty-launcher-93-thread-1) [n:127.0.0.1:58369_solr    ] o.a.s.m.r.SolrJmxReporter JMX monitoring for 'solr_58369.solr.node' (registry 'solr.node') enabled at server: com.sun.jmx.mbeanserver.JmxMBeanServer@34ce8588
   [junit4]   2> 111428 INFO  (jetty-launcher-93-thread-2) [n:127.0.0.1:58370_solr    ] o.a.s.m.r.SolrJmxReporter JMX monitoring for 'solr_58370.solr.node' (registry 'solr.node') enabled at server: com.sun.jmx.mbeanserver.JmxMBeanServer@34ce8588
   [junit4]   2> 111434 INFO  (jetty-launcher-93-thread-1) [n:127.0.0.1:58369_solr    ] o.a.s.m.r.SolrJmxReporter JMX monitoring for 'solr_58369.solr.jvm' (registry 'solr.jvm') enabled at server: com.sun.jmx.mbeanserver.JmxMBeanServer@34ce8588
   [junit4]   2> 111434 INFO  (jetty-launcher-93-thread-1) [n:127.0.0.1:58369_solr    ] o.a.s.m.r.SolrJmxReporter JMX monitoring for 'solr_58369.solr.jetty' (registry 'solr.jetty') enabled at server: com.sun.jmx.mbeanserver.JmxMBeanServer@34ce8588
   [junit4]   2> 111434 INFO  (jetty-launcher-93-thread-2) [n:127.0.0.1:58370_solr    ] o.a.s.m.r.SolrJmxReporter JMX monitoring for 'solr_58370.solr.jvm' (registry 'solr.jvm') enabled at server: com.sun.jmx.mbeanserver.JmxMBeanServer@34ce8588
   [junit4]   2> 111436 INFO  (jetty-launcher-93-thread-2) [n:127.0.0.1:58370_solr    ] o.a.s.m.r.SolrJmxReporter JMX monitoring for 'solr_58370.solr.jetty' (registry 'solr.jetty') enabled at server: com.sun.jmx.mbeanserver.JmxMBeanServer@34ce8588
   [junit4]   2> 111436 INFO  (jetty-launcher-93-thread-1) [n:127.0.0.1:58369_solr    ] o.a.s.c.CorePropertiesLocator Found 0 core definitions underneath C:\Users\jenkins\workspace\Lucene-Solr-master-Windows\solr\build\solr-core\test\J1\temp\solr.cloud.autoscaling.TriggerIntegrationTest_16384BF24166E9AB-001\tempDir-001\node1\.
   [junit4]   2> 111438 INFO  (jetty-launcher-93-thread-2) [n:127.0.0.1:58370_solr    ] o.a.s.c.CorePropertiesLocator Found 0 core definitions underneath C:\Users\jenkins\workspace\Lucene-Solr-master-Windows\solr\build\solr-core\test\J1\temp\solr.cloud.autoscaling.TriggerIntegrationTest_16384BF24166E9AB-001\tempDir-001\node2\.
   [junit4]   2> 111497 INFO  (zkConnectionManagerCallback-130-thread-1) [    ] o.a.s.c.c.ConnectionManager zkClient has connected
   [junit4]   2> 111499 WARN  (NIOServerCxn.Factory:0.0.0.0/0.0.0.0:0) [    ] o.a.z.s.NIOServerCnxn Unable to read additional data from client sessionid 0x1000c4996980009, likely client has closed socket
   [junit4]   2> 111506 INFO  (zkConnectionManagerCallback-135-thread-1) [    ] o.a.s.c.c.ConnectionManager zkClient has connected
   [junit4]   2> 111509 INFO  (SUITE-TriggerIntegrationTest-seed#[16384BF24166E9AB]-worker) [    ] o.a.s.c.c.ZkStateReader Updated live nodes from ZooKeeper... (0) -> (2)
   [junit4]   2> 111510 INFO  (SUITE-TriggerIntegrationTest-seed#[16384BF24166E9AB]-worker) [    ] o.a.s.c.s.i.ZkClientClusterStateProvider Cluster at 127.0.0.1:58365/solr ready
   [junit4]   2> 111571 INFO  (qtp159789864-332) [n:127.0.0.1:58370_solr    ] o.a.s.s.HttpSolrCall [admin] webapp=null path=/admin/metrics params={prefix=CONTAINER.fs.usableSpace,CONTAINER.fs.totalSpace,CORE.coreName&wt=javabin&version=2&group=solr.node,solr.core} status=0 QTime=2
   [junit4]   2> 111577 INFO  (qtp494533375-338) [n:127.0.0.1:58369_solr    ] o.a.s.s.HttpSolrCall [admin] webapp=null path=/admin/metrics params={prefix=CONTAINER.fs.usableSpace,CONTAINER.fs.totalSpace,CORE.coreName&wt=javabin&version=2&group=solr.node,solr.core} status=0 QTime=2
   [junit4]   2> 111578 DEBUG (qtp159789864-341) [n:127.0.0.1:58370_solr    ] o.a.s.c.a.AutoScalingHandler Verified autoscaling configuration
   [junit4]   2> 111578 INFO  (qtp159789864-341) [n:127.0.0.1:58370_solr    ] o.a.s.s.HttpSolrCall [admin] webapp=null path=/admin/autoscaling params={wt=javabin&version=2} status=0 QTime=41
   [junit4]   2> 111581 DEBUG (zkCallback-120-thread-1) [    ] o.a.s.c.a.OverseerTriggerThread Refreshing /autoscaling.json with znode version 2
   [junit4]   2> 111594 DEBUG (OverseerAutoScalingTriggerThread-72071104236617734-127.0.0.1:58369_solr-n_0000000000) [    ] o.a.s.c.a.OverseerTriggerThread Processed trigger updates upto znodeVersion 2
   [junit4]   2> 111617 INFO  (TEST-TriggerIntegrationTest.testContinueTriggersOnOverseerRestart-seed#[16384BF24166E9AB]) [    ] o.a.s.SolrTestCaseJ4 ###Starting testContinueTriggersOnOverseerRestart
   [junit4]   2> 111619 DEBUG (OverseerAutoScalingTriggerThread-72071104236617734-127.0.0.1:58369_solr-n_0000000000) [    ] o.a.s.c.a.OverseerTriggerThread -- clean old nodeAdded markers
   [junit4]   2> 111619 DEBUG (OverseerAutoScalingTriggerThread-72071104236617734-127.0.0.1:58369_solr-n_0000000000) [    ] o.a.s.c.a.OverseerTriggerThread Current znodeVersion 2, lastZnodeVersion 2
   [junit4]   2> 111621 INFO  (zkConnectionManagerCallback-137-thread-1) [    ] o.a.s.c.c.ConnectionManager zkClient has connected
   [junit4]   2> 111622 WARN  (NIOServerCxn.Factory:0.0.0.0/0.0.0.0:0) [    ] o.a.z.s.NIOServerCnxn Unable to read additional data from client sessionid 0x1000c499698000b, likely client has closed socket
   [junit4]   2> 111625 INFO  (qtp159789864-337) [n:127.0.0.1:58370_solr    ] o.a.s.h.a.CollectionsHandler Invoked Collection Action :overseerstatus with params action=OVERSEERSTATUS&wt=javabin&version=2 and sendToOCPQueue=true
   [junit4]   2> 111638 INFO  (qtp159789864-337) [n:127.0.0.1:58370_solr    ] o.a.s.s.HttpSolrCall [admin] webapp=null path=/admin/collections params={action=OVERSEERSTATUS&wt=javabin&version=2} status=0 QTime=11
   [junit4]   2> 111639 INFO  (TEST-TriggerIntegrationTest.testContinueTriggersOnOverseerRestart-seed#[16384BF24166E9AB]) [    ] o.a.s.c.a.ScheduledTriggers -- removing trigger: .auto_add_replicas
   [junit4]   2> 111643 INFO  (TEST-TriggerIntegrationTest.testContinueTriggersOnOverseerRestart-seed#[16384BF24166E9AB]) [    ] o.a.s.c.a.TriggerIntegrationTest /autoscaling.json reset, new znode version 3
   [junit4]   2> 111644 DEBUG (zkCallback-120-thread-1) [    ] o.a.s.c.a.OverseerTriggerThread Refreshing /autoscaling.json with znode version 3
   [junit4]   2> 111644 DEBUG (OverseerAutoScalingTriggerThread-72071104236617734-127.0.0.1:58369_solr-n_0000000000) [    ] o.a.s.c.a.OverseerTriggerThread Processed trigger updates upto znodeVersion 3
   [junit4]   2> 111644 INFO  (TEST-TriggerIntegrationTest.testContinueTriggersOnOverseerRestart-seed#[16384BF24166E9AB]) [    ] o.a.s.c.c.ZkStateReader Updated live nodes from ZooKeeper... (0) -> (2)
   [junit4]   2> 111644 DEBUG (OverseerAutoScalingTriggerThread-72071104236617734-127.0.0.1:58369_solr-n_0000000000) [    ] o.a.s.c.a.OverseerTriggerThread -- clean old nodeLost markers
   [junit4]   2> 111646 DEBUG (OverseerAutoScalingTriggerThread-72071104236617734-127.0.0.1:58369_solr-n_0000000000) [    ] o.a.s.c.a.OverseerTriggerThread -- clean old nodeAdded markers
   [junit4]   2> 111648 DEBUG (OverseerAutoScalingTriggerThread-72071104236617734-127.0.0.1:58369_solr-n_0000000000) [    ] o.a.s.c.a.OverseerTriggerThread Current znodeVersion 3, lastZnodeVersion 3
   [junit4]   2> 111648 INFO  (TEST-TriggerIntegrationTest.testContinueTriggersOnOverseerRestart-seed#[16384BF24166E9AB]) [    ] o.e.j.s.AbstractConnector Stopped ServerConnector@3e66b4ab{HTTP/1.1,[http/1.1]}{127.0.0.1:0}
   [junit4]   2> 111651 INFO  (TEST-TriggerIntegrationTest.testContinueTriggersOnOverseerRestart-seed#[16384BF24166E9AB]) [    ] o.a.s.c.CoreContainer Shutting down CoreContainer instance=1265387170
   [junit4]   2> 111651 INFO  (TEST-TriggerIntegrationTest.testContinueTriggersOnOverseerRestart-seed#[16384BF24166E9AB]) [    ] o.a.s.m.SolrMetricManager Closing metric reporters for registry=solr.node, tag=null
   [junit4]   2> 111652 INFO  (TEST-TriggerIntegrationTest.testContinueTriggersOnOverseerRestart-seed#[16384BF24166E9AB]) [    ] o.a.s.m.r.SolrJmxReporter Closing reporter [org.apache.solr.metrics.reporters.SolrJmxReporter@3c8e464b: rootName = solr_58369, domain = solr.node, service url = null, agent id = null] for registry solr.node / com.codahale.metrics.MetricRegistry@8f2eca1
   [junit4]   2> 111658 INFO  (TEST-TriggerIntegrationTest.testContinueTriggersOnOverseerRestart-seed#[16384BF24166E9AB]) [    ] o.a.s.m.SolrMetricManager Closing metric reporters for registry=solr.jvm, tag=null
   [junit4]   2> 111658 INFO  (TEST-TriggerIntegrationTest.testContinueTriggersOnOverseerRestart-seed#[16384BF24166E9AB]) [    ] o.a.s.m.r.SolrJmxReporter Closing reporter [org.apache.solr.metrics.reporters.SolrJmxReporter@1b00d64: rootName = solr_58369, domain = solr.jvm, service url = null, agent id = null] for registry solr.jvm / com.codahale.metrics.MetricRegistry@884e770
   [junit4]   2> 111660 INFO  (TEST-TriggerIntegrationTest.testContinueTriggersOnOverseerRestart-seed#[16384BF24166E9AB]) [    ] o.a.s.m.SolrMetricManager Closing metric reporters for registry=solr.jetty, tag=null
   [junit4]   2> 111660 INFO  (TEST-TriggerIntegrationTest.testContinueTriggersOnOverseerRestart-seed#[16384BF24166E9AB]) [    ] o.a.s.m.r.SolrJmxReporter Closing reporter [org.apache.solr.metrics.reporters.SolrJmxReporter@2255854c: rootName = solr_58369, domain = solr.jetty, service url = null, agent id = null] for registry solr.jetty / com.codahale.metrics.MetricRegistry@540d0717
   [junit4]   2> 111663 INFO  (TEST-TriggerIntegrationTest.testContinueTriggersOnOverseerRestart-seed#[16384BF24166E9AB]) [    ] o.a.s.c.ZkController Remove node as live in ZooKeeper:/live_nodes/127.0.0.1:58369_solr
   [junit4]   2> 111664 INFO  (TEST-TriggerIntegrationTest.testContinueTriggersOnOverseerRestart-seed#[16384BF24166E9AB]) [    ] o.a.s.m.SolrMetricManager Closing metric reporters for registry=solr.cluster, tag=null
   [junit4]   2> 111665 INFO  (TEST-TriggerIntegrationTest.testContinueTriggersOnOverseerRestart-seed#[16384BF24166E9AB]) [    ] o.a.s.c.TransientSolrCoreCacheDefault Allocating transient cache for 2147483647 transient cores
   [junit4]   2> 111665 INFO  (TEST-TriggerIntegrationTest.testContinueTriggersOnOverseerRestart-seed#[16384BF24166E9AB]) [    ] o.a.s.c.Overseer Overseer (id=72071104236617734-127.0.0.1:58369_solr-n_0000000000) closing
   [junit4]   2> 111666 INFO  (OverseerStateUpdate-72071104236617734-127.0.0.1:58369_solr-n_0000000000) [n:127.0.0.1:58369_solr    ] o.a.s.c.Overseer Overseer Loop exiting : 127.0.0.1:58369_solr
   [junit4]   2> 111666 INFO  (zkCallback-126-thread-1) [    ] o.a.s.c.c.ZkStateReader Updated live nodes from ZooKeeper... (2) -> (1)
   [junit4]   2> 111666 DEBUG (TEST-TriggerIntegrationTest.testContinueTriggersOnOverseerRestart-seed#[16384BF24166E9AB]) [    ] o.a.s.c.a.ScheduledTriggers Shutting down scheduled thread pool executor now
   [junit4]   2> 111666 DEBUG (TEST-TriggerIntegrationTest.testContinueTriggersOnOverseerRestart-seed#[16384BF24166E9AB]) [    ] o.a.s.c.a.ScheduledTriggers Shutting down action executor now
   [junit4]   2> 111666 DEBUG (TEST-TriggerIntegrationTest.testContinueTriggersOnOverseerRestart-seed#[16384BF24166E9AB]) [    ] o.a.s.c.a.ScheduledTriggers Awaiting termination for action executor
   [junit4]   2> 111667 DEBUG (TEST-TriggerIntegrationTest.testContinueTriggersOnOverseerRestart-seed#[16384BF24166E9AB]) [    ] o.a.s.c.a.ScheduledTriggers Awaiting termination for scheduled thread pool executor
   [junit4]   2> 111667 INFO  (zkCallback-134-thread-1) [    ] o.a.s.c.c.ZkStateReader Updated live nodes from ZooKeeper... (2) -> (1)
   [junit4]   2> 111667 INFO  (zkCallback-134-thread-2) [    ] o.a.s.c.c.ZkStateReader Updated live nodes from ZooKeeper... (2) -> (1)
   [junit4]   2> 111667 WARN  (OverseerAutoScalingTriggerThread-72071104236617734-127.0.0.1:58369_solr-n_0000000000) [    ] o.a.s.c.a.OverseerTriggerThread OverseerTriggerThread woken up but we are closed, exiting.
   [junit4]   2> 111667 INFO  (zkCallback-105-thread-1) [    ] o.a.s.c.c.ZkStateReader Updated live nodes from ZooKeeper... (2) -> (1)
   [junit4]   2> 111669 INFO  (zkCallback-113-thread-1) [    ] o.a.s.c.c.ZkStateReader Updated live nodes from ZooKeeper... (2) -> (1)
   [junit4]   2> 111669 INFO  (zkCallback-120-thread-1) [    ] o.a.s.c.c.ZkStateReader Updated live nodes from ZooKeeper... (2) -> (1)
   [junit4]   2> 111669 DEBUG (TEST-TriggerIntegrationTest.testContinueTriggersOnOverseerRestart-seed#[16384BF24166E9AB]) [    ] o.a.s.c.a.ScheduledTriggers ScheduledTriggers closed completely
   [junit4]   2> 111669 DEBUG (TEST-TriggerIntegrationTest.testContinueTriggersOnOverseerRestart-seed#[16384BF24166E9AB]) [    ] o.a.s.c.a.OverseerTriggerThread OverseerTriggerThread has been closed explicitly
   [junit4]   2> 111670 WARN  (NIOServerCxn.Factory:0.0.0.0/0.0.0.0:0) [    ] o.a.z.s.NIOServerCnxn Unable to read additional data from client sessionid 0x1000c4996980007, likely client has closed socket
   [junit4]   2> 111670 WARN  (NIOServerCxn.Factory:0.0.0.0/0.0.0.0:0) [    ] o.a.z.s.NIOServerCnxn Unable to read additional data from client sessionid 0x1000c4996980006, likely client has closed socket
   [junit4]   2> 111671 INFO  (TEST-TriggerIntegrationTest.testContinueTriggersOnOverseerRestart-seed#[16384BF24166E9AB]) [    ] o.e.j.s.h.ContextHandler Stopped o.e.j.s.ServletContextHandler@646e38fd{/solr,null,UNAVAILABLE}
   [junit4]   2> 111672 INFO  (TEST-TriggerIntegrationTest.testContinueTriggersOnOverseerRestart-seed#[16384BF24166E9AB]) [    ] o.e.j.s.session node0 Stopped scavenging
   [junit4]   2> 111672 INFO  (zkCallback-105-thread-1) [    ] o.a.s.c.OverseerElectionContext I am going to be the leader 127.0.0.1:58370_solr
   [junit4]   2> 111674 INFO  (zkCallback-105-thread-1) [n:127.0.0.1:58370_solr    ] o.a.s.c.Overseer Overseer (id=72071104236617732-127.0.0.1:58370_solr-n_0000000001) starting
   [junit4]   2> 111680 DEBUG (OverseerAutoScalingTriggerThread-72071104236617732-127.0.0.1:58370_solr-n_0000000001) [    ] o.a.s.c.a.OverseerTriggerThread Adding .auto_add_replicas and .scheduled_maintenance triggers
   [junit4]   2> 111681 INFO  (OverseerStateUpdate-72071104236617732-127.0.0.1:58370_solr-n_0000000001) [n:127.0.0.1:58370_solr    ] o.a.s.c.Overseer Starting to work on the main queue : 127.0.0.1:58370_solr
   [junit4]   2> 111681 DEBUG (OverseerAutoScalingTriggerThread-72071104236617732-127.0.0.1:58370_solr-n_0000000001) [    ] o.a.s.c.a.OverseerTriggerThread Refreshing /autoscaling.json with znode version 4
   [junit4]   2> 111682 DEBUG (OverseerAutoScalingTriggerThread-72071104236617732-127.0.0.1:58370_solr-n_0000000001) [    ] o.a.s.c.a.OverseerTriggerThread Current znodeVersion 4, lastZnodeVersion -1
   [junit4]   2> 111682 DEBUG (OverseerAutoScalingTriggerThread-72071104236617732-127.0.0.1:58370_solr-n_0000000001) [    ] o.a.s.c.a.OverseerTriggerThread Processed trigger updates upto znodeVersion 4
   [junit4]   2> 111687 DEBUG (OverseerAutoScalingTriggerThread-72071104236617732-127.0.0.1:58370_solr-n_0000000001) [    ] o.a.s.c.a.NodeLostTrigger NodeLostTrigger .auto_add_replicas - Initial livenodes: [127.0.0.1:58370_solr]
   [junit4]   2> 111687 DEBUG (OverseerAutoScalingTriggerThread-72071104236617732-127.0.0.1:58370_solr-n_0000000001) [    ] o.a.s.c.a.OverseerTriggerThread -- clean old nodeAdded markers
   [junit4]   2> 111687 DEBUG (OverseerAutoScalingTriggerThread-72071104236617732-127.0.0.1:58370_solr-n_0000000001) [    ] o.a.s.c.a.OverseerTriggerThread Current znodeVersion 4, lastZnodeVersion 4
   [junit4]   2> 111687 DEBUG (ScheduledTrigger-162-thread-1) [    ] o.a.s.c.a.NodeLostTrigger Running NodeLostTrigger: .auto_add_replicas with currently live nodes: 1
   [junit4]   2> 112876 DEBUG (ScheduledTrigger-162-thread-3) [    ] o.a.s.c.a.NodeLostTrigger Running NodeLostTrigger: .auto_add_replicas with currently live nodes: 1
   [junit4]   2> 114063 DEBUG (ScheduledTrigger-162-thread-4) [    ] o.a.s.c.a.NodeLostTrigger Running NodeLostTrigger: .auto_add_replicas with currently live nodes: 1
   [junit4]   2> 115250 DEBUG (ScheduledTrigger-162-thread-3) [    ] o.a.s.c.a.NodeLostTrigger Running NodeLostTrigger: .auto_add_replicas with currently live nodes: 1
   [junit4]   2> 116436 DEBUG (ScheduledTrigger-162-thread-4) [    ] o.a.s.c.a.NodeLostTrigger Running NodeLostTrigger: .auto_add_replicas with currently live nodes: 1
   [junit4]   2> 117540 INFO  (TEST-TriggerIntegrationTest.testContinueTriggersOnOverseerRestart-seed#[16384BF24166E9AB]) [    ] o.e.j.s.Server jetty-9.4.11.v20180605; built: 2018-06-05T18:24:03.829Z; git: d5fc0523cfa96bfebfbda19606cad384d772f04c; jvm 1.8.0_172-b11
   [junit4]   2> 117547 INFO  (TEST-TriggerIntegrationTest.testContinueTriggersOnOverseerRestart-seed#[16384BF24166E9AB]) [    ] o.e.j.s.session DefaultSessionIdManager workerName=node0
   [junit4]   2> 117547 INFO  (TEST-TriggerIntegrationTest.testContinueTriggersOnOverseerRestart-seed#[16384BF24166E9AB]) [    ] o.e.j.s.session No SessionScavenger set, using defaults
   [junit4]   2> 117547 INFO  (TEST-TriggerIntegrationTest.testContinueTriggersOnOverseerRestart-seed#[16384BF24166E9AB]) [    ] o.e.j.s.session node0 Scavenging every 660000ms
   [junit4]   2> 117548 INFO  (TEST-TriggerIntegrationTest.testContinueTriggersOnOverseerRestart-seed#[16384BF24166E9AB]) [    ] o.e.j.s.h.ContextHandler Started o.e.j.s.ServletContextHandler@5cd30c98{/solr,null,AVAILABLE}
   [junit4]   2> 117549 INFO  (TEST-TriggerIntegrationTest.testContinueTriggersOnOverseerRestart-seed#[16384BF24166E9AB]) [    ] o.e.j.s.AbstractConnector Started ServerConnector@6fd5533f{HTTP/1.1,[http/1.1]}{127.0.0.1:58419}
   [junit4]   2> 117549 INFO  (TEST-TriggerIntegrationTest.testContinueTriggersOnOverseerRestart-seed#[16384BF24166E9AB]) [    ] o.e.j.s.Server Started @116644ms
   [junit4]   2> 117549 INFO  (TEST-TriggerIntegrationTest.testContinueTriggersOnOverseerRestart-seed#[16384BF24166E9AB]) [    ] o.a.s.c.s.e.JettySolrRunner Jetty properties: {hostContext=/solr, hostPort=58419}
   [junit4]   2> 117549 ERROR (TEST-TriggerIntegrationTest.testContinueTriggersOnOverseerRestart-seed#[16384BF24166E9AB]) [    ] o.a.s.u.StartupLoggingUtils Missing Java Option solr.log.dir. Logging may be missing or incomplete.
   [junit4]   2> 117549 INFO  (TEST-TriggerIntegrationTest.testContinueTriggersOnOverseerRestart-seed#[16384BF24166E9AB]) [    ] o.a.s.s.SolrDispatchFilter Using logger factory org.apache.logging.slf4j.Log4jLoggerFactory
   [junit4]   2> 117549 INFO  (TEST-TriggerIntegrationTest.testContinueTriggersOnOverseerRestart-seed#[16384BF24166E9AB]) [    ] o.a.s.s.SolrDispatchFilter  ___      _       Welcome to Apache Solr? version 8.0.0
   [junit4]   2> 117549 INFO  (TEST-TriggerIntegrationTest.testContinueTriggersOnOverseerRestart-seed#[16384BF24166E9AB]) [    ] o.a.s.s.SolrDispatchFilter / __| ___| |_ _   Starting in cloud mode on port null
   [junit4]   2> 117549 INFO  (TEST-TriggerIntegrationTest.testContinueTriggersOnOverseerRestart-seed#[16384BF24166E9AB]) [    ] o.a.s.s.SolrDispatchFilter \__ \/ _ \ | '_|  Install dir: null
   [junit4]   2> 117550 INFO  (TEST-TriggerIntegrationTest.testContinueTriggersOnOverseerRestart-seed#[16384BF24166E9AB]) [    ] o.a.s.s.SolrDispatchFilter |___/\___/_|_|    Start time: 2018-10-30T18:30:45.862Z
   [junit4]   2> 117553 INFO  (zkConnectionManagerCallback-141-thread-1) [    ] o.a.s.c.c.ConnectionManager zkClient has connected
   [junit4]   2> 117554 INFO  (TEST-TriggerIntegrationTest.testContinueTriggersOnOverseerRestart-seed#[16384BF24166E9AB]) [    ] o.a.s.s.SolrDispatchFilter solr.xml found in ZooKeeper. Loading...
   [junit4]   2> 117558 DEBUG (ScheduledTrigger-162-thread-1) [    ] o.a.s.c.a.NodeLostTrigger Running NodeLostTrigger: .auto_add_replicas with currently live nodes: 1
   [junit4]   2> 117564 WARN  (NIOServerCxn.Factory:0.0.0.0/0.0.0.0:0) [    ] o.a.z.s.NIOServerCnxn Unable to read additional data from client sessionid 0x1000c499698000c, likely client has closed socket
   [junit4]   2> 117754 INFO  (TEST-TriggerIntegrationTest.testContinueTriggersOnOverseerRestart-seed#[16384BF24166E9AB]) [    ] o.a.s.c.ZkContainer Zookeeper client=127.0.0.1:58365/solr
   [junit4]   2> 117757 INFO  (zkConnectionManagerCallback-145-thread-1) [    ] o.a.s.c.c.ConnectionManager zkClient has connected
   [junit4]   2> 117763 INFO  (zkConnectionManagerCallback-147-thread-1) [    ] o.a.s.c.c.ConnectionManager zkClient has connected
   [junit4]   2> 117773 INFO  (TEST-TriggerIntegrationTest.testContinueTriggersOnOverseerRestart-seed#[16384BF24166E9AB]) [n:127.0.0.1:58419_solr    ] o.a.s.c.c.ZkStateReader Updated live nodes from ZooKeeper... (0) -> (1)
   [junit4]   2> 117779 INFO  (TEST-TriggerIntegrationTest.testContinueTriggersOnOverseerRestart-seed#[16384BF24166E9AB]) [n:127.0.0.1:58419_solr    ] o.a.s.c.TransientSolrCoreCacheDefault Allocating transient cache for 2147483647 transient cores
   [junit4]   2> 117779 INFO  (TEST-TriggerIntegrationTest.testContinueTriggersOnOverseerRestart-seed#[16384BF24166E9AB]) [n:127.0.0.1:58419_solr    ] o.a.s.c.ZkController Register node as live in ZooKeeper:/live_nodes/127.0.0.1:58419_solr
   [junit4]   2> 117781 INFO  (zkCallback-126-thread-1) [    ] o.a.s.c.c.ZkStateReader Updated live nodes from ZooKeeper... (1) -> (2)
   [junit4]   2> 117781 INFO  (zkCallback-134-thread-2) [    ] o.a.s.c.c.ZkStateReader Updated live nodes from ZooKeeper... (1) -> (2)
   [junit4]   2> 117781 INFO  (zkCallback-134-thread-1) [    ] o.a.s.c.c.ZkStateReader Updated live nodes from ZooKeeper... (1) -> (2)
   [junit4]   2> 117781 INFO  (zkCallback-105-thread-1) [    ] o.a.s.c.c.ZkStateReader Updated live nodes from ZooKeeper... (1) -> (2)
   [junit4]   2> 117782 INFO  (zkCallback-146-thread-1) [    ] o.a.s.c.c.ZkStateReader Updated live nodes from ZooKeeper... (1) -> (2)
   [junit4]   2> 117833 INFO  (zkConnectionManagerCallback-154-thread-1) [    ] o.a.s.c.c.ConnectionManager zkClient has connected
   [junit4]   2> 117836 INFO  (TEST-TriggerIntegrationTest.testContinueTriggersOnOverseerRestart-seed#[16384BF24166E9AB]) [n:127.0.0.1:58419_solr    ] o.a.s.c.c.ZkStateReader Updated live nodes from ZooKeeper... (0) -> (2)
   [junit4]   2> 117837 INFO  (TEST-TriggerIntegrationTest.testContinueTriggersOnOverseerRestart-seed#[16384BF24166E9AB]) [n:127.0.0.1:58419_solr    ] o.a.s.c.s.i.ZkClientClusterStateProvider Cluster at 127.0.0.1:58365/solr ready
   [junit4]   2> 117838 INFO  (TEST-TriggerIntegrationTest.testContinueTriggersOnOverseerRestart-seed#[16384BF24166E9AB]) [n:127.0.0.1:58419_solr    ] o.a.s.h.a.MetricsHistoryHandler No .system collection, keeping metrics history in memory.
   [junit4]   2> 117865 INFO  (TEST-TriggerIntegrationTest.testContinueTriggersOnOverseerRestart-seed#[16384BF24166E9AB]) [n:127.0.0.1:58419_solr    ] o.a.s.m.r.SolrJmxReporter JMX monitoring for 'solr_58419.solr.node' (registry 'solr.node') enabled at server: com.sun.jmx.mbeanserver.JmxMBeanServer@34ce8588
   [junit4]   2> 117871 INFO  (TEST-TriggerIntegrationTest.testContinueTriggersOnOverseerRestart-seed#[16384BF24166E9AB]) [n:127.0.0.1:58419_solr    ] o.a.s.m.r.SolrJmxReporter JMX monitoring for 'solr_58419.solr.jvm' (registry 'solr.jvm') enabled at server: com.sun.jmx.mbeanserver.JmxMBeanServer@34ce8588
   [junit4]   2> 117871 INFO  (TEST-TriggerIntegrationTest.testContinueTriggersOnOverseerRestart-seed#[16384BF24166E9AB]) [n:127.0.0.1:58419_solr    ] o.a.s.m.r.SolrJmxReporter JMX monitoring for 'solr_58419.solr.jetty' (registry 'solr.jetty') enabled at server: com.sun.jmx.mbeanserver.JmxMBeanServer@34ce8588
   [junit4]   2> 117873 INFO  (TEST-TriggerIntegrationTest.testContinueTriggersOnOverseerRestart-seed#[16384BF24166E9AB]) [n:127.0.0.1:58419_solr    ] o.a.s.c.CorePropertiesLocator Found 0 core definitions underneath C:\Users\jenkins\workspace\Lucene-Solr-master-Windows\solr\build\solr-core\test\J1\temp\solr.cloud.autoscaling.TriggerIntegrationTest_16384BF24166E9AB-001\tempDir-001\node3\.
   [junit4]   2> 117911 INFO  (qtp159789864-344) [n:127.0.0.1:58370_solr    ] o.a.s.h.a.CollectionsHandler Invoked Collection Action :overseerstatus with params action=OVERSEERSTATUS&wt=javabin&version=2 and sendToOCPQueue=true
   [junit4]   2> 117918 INFO  (qtp159789864-344) [n:127.0.0.1:58370_solr    ] o.a.s.s.HttpSolrCall [admin] webapp=null path=/admin/collections params={action=OVERSEERSTATUS&wt=javabin&version=2} status=0 QTime=6
   [junit4]   2> 117939 INFO  (qtp159789864-344) [n:127.0.0.1:58370_solr    ] o.a.s.s.HttpSolrCall [admin] webapp=null path=/admin/metrics params={prefix=CONTAINER.fs.usableSpace,CONTAINER.fs.totalSpace,CORE.coreName&wt=javabin&version=2&group=solr.node,solr.core} status=0 QTime=2
   [junit4]   2> 117944 INFO  (qtp1480368182-427) [n:127.0.0.1:58419_solr    ] o.a.s.s.HttpSolrCall [admin] webapp=null path=/admin/metrics params={prefix=CONTAINER.fs.usableSpace,CONTAINER.fs.totalSpace,CORE.coreName&wt=javabin&version=2&group=solr.node,solr.core} status=0 QTime=2
   [junit4]   2> 117945 DEBUG (qtp159789864-337) [n:127.0.0.1:58370_solr    ] o.a.s.c.a.AutoScalingHandler Verified autoscaling configuration
   [junit4]   2> 117946 INFO  (qtp159789864-337) [n:127.0.0.1:58370_solr    ] o.a.s.s.HttpSolrCall [admin] webapp=null path=/admin/autoscaling params={wt=javabin&version=2} status=0 QTime=23
   [junit4]   2> 117946 DEBUG (zkCallback-126-thread-1) [    ] o.a.s.c.a.OverseerTriggerThread Refreshing /autoscaling.json with znode version 5
   [junit4]   2> 117948 DEBUG (OverseerAutoScalingTriggerThread-72071104236617732-127.0.0.1:58370_solr-n_0000000001) [    ] o.a.s.c.a.OverseerTriggerThread Processed trigger updates upto znodeVersion 5
   [junit4]   2> 117951 INFO  (OverseerAutoScalingTriggerThread-72071104236617732-127.0.0.1:58370_solr-n_0000000001) [    ] o.a.s.c.a.TriggerIntegrationTest TestTriggerAction init
   [junit4]   2> 117951 DEBUG (OverseerAutoScalingTriggerThread-72071104236617732-127.0.0.1:58370_solr-n_0000000001) [    ] o.a.s.c.a.NodeAddedTrigger NodeAddedTrigger node_added_triggerCTOOR - Initial livenodes: [127.0.0.1:58419_solr, 127.0.0.1:58370_solr]
   [junit4]   2> 117951 DEBUG (OverseerAutoScalingTriggerThread-72071104236617732-127.0.0.1:58370_solr-n_0000000001) [    ] o.a.s.c.a.NodeAddedTrigger NodeAddedTrigger node_added_triggerCTOOR instantiated with properties: {event=nodeAdded, waitFor=3, actions=[{name=test, class=org.apache.solr.cloud.autoscaling.TriggerIntegrationTest$TestTriggerAction}], enabled=true}
   [junit4]   2> 117952 INFO  (TEST-TriggerIntegrationTest.testContinueTriggersOnOverseerRestart-seed#[16384BF24166E9AB]) [    ] o.e.j.s.AbstractConnector Stopped ServerConnector@2fbd9a17{HTTP/1.1,[http/1.1]}{127.0.0.1:0}
   [junit4]   2> 117952 INFO  (TEST-TriggerIntegrationTest.testContinueTriggersOnOverseerRestart-seed#[16384BF24166E9AB]) [    ] o.a.s.c.CoreContainer Shutting down CoreContainer instance=1714673471
   [junit4]   2> 117953 INFO  (TEST-TriggerIntegrationTest.testContinueTriggersOnOverseerRestart-seed#[16384BF24166E9AB]) [    ] o.a.s.m.SolrMetricManager Closing metric reporters for registry=solr.node, tag=null
   [junit4]   2> 117953 INFO  (TEST-TriggerIntegrationTest.testContinueTriggersOnOverseerRestart-seed#[16384BF24166E9AB]) [    ] o.a.s.m.r.SolrJmxReporter Closing reporter [org.apache.solr.metrics.reporters.SolrJmxReporter@1605623e: rootName = solr_58370, domain = solr.node, service url = null, agent id = null] for registry solr.node / com.codahale.metrics.MetricRegistry@389ce7c5
   [junit4]   2> 117955 DEBUG (ScheduledTrigger-162-thread-3) [    ] o.a.s.c.a.NodeAddedTrigger Running NodeAddedTrigger node_added_triggerCTOOR
   [junit4]   2> 117955 DEBUG (ScheduledTrigger-162-thread-3) [    ] o.a.s.c.a.NodeAddedTrigger Found livenodes: 2
   [junit4]   2> 117958 DEBUG (OverseerAutoScalingTriggerThread-72071104236617732-127.0.0.1:58370_solr-n_0000000001) [    ] o.a.s.c.a.OverseerTriggerThread Current znodeVersion 5, lastZnodeVersion 5
   [junit4]   2> 117959 INFO  (TEST-TriggerIntegrationTest.testContinueTriggersOnOverseerRestart-seed#[16384BF24166E9AB]) [    ] o.a.s.m.SolrMetricManager Closing metric reporters for registry=solr.jvm, tag=null
   [junit4]   2> 117959 INFO  (TEST-TriggerIntegrationTest.testContinueTriggersOnOverseerRestart-seed#[16384BF24166E9AB]) [    ] o.a.s.m.r.SolrJmxReporter Closing reporter [org.apache.solr.metrics.reporters.SolrJmxReporter@21935b70: rootName = solr_58370, domain = solr.jvm, service url = null, agent id = null] for registry solr.jvm / com.codahale.metrics.MetricRegistry@884e770
   [junit4]   2> 117962 INFO  (TEST-TriggerIntegrationTest.testContinueTriggersOnOverseerRestart-seed#[16384BF24166E9AB]) [    ] o.a.s.m.SolrMetricManager Closing metric reporters for registry=solr.jetty, tag=null
   [junit4]   2> 117962 INFO  (TEST-TriggerIntegrationTest.testContinueTriggersOnOverseerRestart-seed#[16384BF24166E9AB]) [    ] o.a.s.m.r.SolrJmxReporter Closing reporter [org.apache.solr.metrics.reporters.SolrJmxReporter@75c33cb2: rootName = solr_58370, domain = solr.jetty, service url = null, agent id = null] for registry solr.jetty / com.codahale.metrics.MetricRegistry@540d0717
   [junit4]   2> 117964 INFO  (TEST-TriggerIntegrationTest.testContinueTriggersOnOverseerRestart-seed#[16384BF24166E9AB]) [    ] o.a.s.c.ZkController Remove node as live in ZooKeeper:/live_nodes/127.0.0.1:58370_solr
   [junit4]   2> 117965 INFO  (TEST-TriggerIntegrationTest.testContinueTriggersOnOverseerRestart-seed#[16384BF24166E9AB]) [    ] o.a.s.m.SolrMetricManager Closing metric reporters for registry=solr.cluster, tag=null
   [junit4]   2> 117967 INFO  (zkCallback-134-thread-1) [    ] o.a.s.c.c.ZkStateReader Updated live nodes from ZooKeeper... (2) -> (1)
   [junit4]   2> 117967 INFO  (zkCallback-134-thread-2) [    ] o.a.s.c.c.ZkStateReader Updated live nodes from ZooKeeper... (2) -> (1)
   [junit4]   2> 117968 INFO  (TEST-TriggerIntegrationTest.testContinueTriggersOnOverseerRestart-seed#[16384BF24166E9AB]) [    ] o.a.s.c.Overseer Overseer (id=72071104236617732-127.0.0.1:58370_solr-n_0000000001) closing
   [junit4]   2> 117968 INFO  (zkCallback-146-thread-1) [    ] o.a.s.c.c.ZkStateReader Updated live nodes from ZooKeeper... (2) -> (1)
   [junit4]   2> 117968 INFO  (zkCallback-126-thread-1) [    ] o.a.s.c.c.ZkStateReader Updated live nodes from ZooKeeper... (2) -> (1)
   [junit4]   2> 117968 INFO  (OverseerStateUpdate-72071104236617732-127.0.0.1:58370_solr-n_0000000001) [n:127.0.0.1:58370_solr    ] o.a.s.c.Overseer Overseer Loop exiting : 127.0.0.1:58370_solr
   [junit4]   2> 117968 INFO  (zkCallback-105-thread-1) [    ] o.a.s.c.c.ZkStateReader Updated live nodes from ZooKeeper... (2) -> (1)
   [junit4]   2> 117969 WARN  (OverseerAutoScalingTriggerThread-72071104236617732-127.0.0.1:58370_solr-n_0000000001) [    ] o.a.s.c.a.OverseerTriggerThread OverseerTriggerThread woken up but we are closed, exiting.
   [junit4]   2> 117970 INFO  (zkCallback-153-thread-1) [    ] o.a.s.c.c.ZkStateReader Updated live nodes from ZooKeeper... (2) -> (1)
   [junit4]   2> 117970 DEBUG (TEST-TriggerIntegrationTest.testContinueTriggersOnOverseerRestart-seed#[16384BF24166E9AB]) [    ] o.a.s.c.a.ScheduledTriggers Shutting down scheduled thread pool executor now
   [junit4]   2> 117970 DEBUG (TEST-TriggerIntegrationTest.testContinueTriggersOnOverseerRestart-seed#[16384BF24166E9AB]) [    ] o.a.s.c.a.ScheduledTriggers Shutting down action executor now
   [junit4]   2> 117971 DEBUG (TEST-TriggerIntegrationTest.testContinueTriggersOnOverseerRestart-seed#[16384BF24166E9AB]) [    ] o.a.s.c.a.ScheduledTriggers Awaiting termination for action executor
   [junit4]   2> 117971 DEBUG (TEST-TriggerIntegrationTest.testContinueTriggersOnOverseerRestart-seed#[16384BF24166E9AB]) [    ] o.a.s.c.a.ScheduledTriggers Awaiting termination for scheduled thread pool executor
   [junit4]   2> 117971 DEBUG (TEST-TriggerIntegrationTest.testContinueTriggersOnOverseerRestart-seed#[16384BF24166E9AB]) [    ] o.a.s.c.a.ScheduledTriggers ScheduledTriggers closed completely
   [junit4]   2> 117971 DEBUG (TEST-TriggerIntegrationTest.testContinueTriggersOnOverseerRestart-seed#[16384BF24166E9AB]) [    ] o.a.s.c.a.OverseerTriggerThread OverseerTriggerThread has been closed explicitly
   [junit4]   2> 117972 WARN  (NIOServerCxn.Factory:0.0.0.0/0.0.0.0:0) [    ] o.a.z.s.NIOServerCnxn Unable to read additional data from client sessionid 0x1000c4996980008, likely client has closed socket
   [junit4]   2> 117974 WARN  (NIOServerCxn.Factory:0.0.0.0/0.0.0.0:0) [    ] o.a.z.s.NIOServerCnxn Unable to read additional data from client sessionid 0x1000c4996980004, likely client has closed socket
   [junit4]   2> 117975 INFO  (TEST-TriggerIntegrationTest.testContinueTriggersOnOverseerRestart-seed#[16384BF24166E9AB]) [    ] o.e.j.s.h.ContextHandler Stopped o.e.j.s.ServletContextHandler@f2e060e{/solr,null,UNAVAILABLE}
   [junit4]   2> 117975 INFO  (TEST-TriggerIntegrationTest.testContinueTriggersOnOverseerRestart-seed#[16384BF24166E9AB]) [    ] o.e.j.s.session node0 Stopped scavenging
   [junit4]   2> 117976 INFO  (zkCallback-146-thread-1) [    ] o.a.s.c.OverseerElectionContext I am going to be the leader 127.0.0.1:58419_solr
   [junit4]   2> 117977 INFO  (zkCallback-146-thread-1) [n:127.0.0.1:58419_solr    ] o.a.s.c.Overseer Overseer (id=72071104236617742-127.0.0.1:58419_solr-n_0000000002) starting
   [junit4]   2> 117983 INFO  (OverseerStateUpdate-72071104236617742-127.0.0.1:58419_solr-n_0000000002) [n:127.0.0.1:58419_solr    ] o.a.s.c.Overseer Starting to work on the main queue : 127.0.0.1:58419_solr
   [junit4]   2> 117986 DEBUG (OverseerAutoScalingTriggerThread-72071104236617742-127.0.0.1:58419_solr-n_0000000002) [    ] o.a.s.c.a.OverseerTriggerThread Refreshing /autoscaling.json with znode version 5
   [junit4]   2> 117986 DEBUG (OverseerAutoScalingTriggerThread-72071104236617742-127.0.0.1:58419_solr-n_0000000002) [    ] o.a.s.c.a.OverseerTriggerThread Current znodeVersion 5, lastZnodeVersion -1
   [junit4]   2> 117986 DEBUG (OverseerAutoScalingTriggerThread-72071104236617742-127.0.0.1:58419_solr-n_0000000002) [    ] o.a.s.c.a.OverseerTriggerThread Processed trigger updates upto znodeVersion 5
   [junit4]   2> 117988 INFO  (OverseerAutoScalingTriggerThread-72071104236617742-127.0.0.1:58419_solr-n_0000000002) [    ] o.a.s.c.a.TriggerIntegrationTest TestTriggerAction init
   [junit4]   2> 117988 DEBUG (OverseerAutoScalingTriggerThread-72071104236617742-127.0.0.1:58419_solr-n_0000000002) [    ] o.a.s.c.a.NodeAddedTrigger NodeAddedTrigger node_added_triggerCTOOR - Initial livenodes: [127.0.0.1:58419_solr]
   [junit4]   2> 117988 DEBUG (OverseerAutoScalingTriggerThread-72071104236617742-127.0.0.1:58419_solr-n_0000000002) [    ] o.a.s.c.a.NodeAddedTrigger NodeAddedTrigger node_added_triggerCTOOR instantiated with properties: {event=nodeAdded, waitFor=3, actions=[{name=test, class=org.apache.solr.cloud.autoscaling.TriggerIntegrationTest$TestTriggerAction}], enabled=true}
   [junit4]   2> 117988 DEBUG (OverseerAutoScalingTriggerThread-72071104236617742-127.0.0.1:58419_solr-n_0000000002) [    ] o.a.s.c.a.NodeLostTrigger NodeLostTrigger .auto_add_replicas - Initial livenodes: [127.0.0.1:58419_solr]
   [junit4]   2> 117990 DEBUG (OverseerAutoScalingTriggerThread-72071104236617742-127.0.0.1:58419_solr-n_0000000002) [    ] o.a.s.c.a.NodeLostTrigger Adding lost node from marker path: 127.0.0.1:58370_solr
   [junit4]   2> 117990 DEBUG (OverseerAutoScalingTriggerThread-72071104236617742-127.0.0.1:58419_solr-n_0000000002) [    ] o.a.s.c.a.OverseerTriggerThread Current znodeVersion 5, lastZnodeVersion 5
   [junit4]   2> 117991 DEBUG (ScheduledTrigger-176-thread-1) [    ] o.a.s.c.a.NodeAddedTrigger Running NodeAddedTrigger node_added_triggerCTOOR
   [junit4]   2> 117991 DEBUG (ScheduledTrigger-176-thread-2) [    ] o.a.s.c.a.NodeLostTrigger Running NodeLostTrigger: .auto_add_replicas with currently live nodes: 1
   [junit4]   2> 117991 DEBUG (ScheduledTrigger-176-thread-1) [    ] o.a.s.c.a.NodeAddedTrigger Found livenodes: 1
   [junit4]   2> 119059 DEBUG (ScheduledTrigger-176-thread-2) [    ] o.a.s.c.a.NodeLostTrigger Running NodeLostTrigger: .auto_add_replicas with currently live nodes: 1
   [junit4]   2> 119059 DEBUG (ScheduledTrigger-176-thread-3) [    ] o.a.s.c.a.NodeAddedTrigger Running NodeAddedTrigger node_added_triggerCTOOR
   [junit4]   2> 119059 DEBUG (ScheduledTrigger-176-thread-3) [    ] o.a.s.c.a.NodeAddedTrigger Found livenodes: 1
   [junit4]   2> 120128 DEBUG (ScheduledTrigger-176-thread-2) [    ] o.a.s.c.a.NodeAddedTrigger Running NodeAddedTrigger node_added_triggerCTOOR
   [junit4]   2> 120128 DEBUG (ScheduledTrigger-176-thread-1) [    ] o.a.s.c.a.NodeLostTrigger Running NodeLostTrigger: .auto_add_replicas with currently live nodes: 1
   [junit4]   2> 120128 DEBUG (ScheduledTrigger-176-thread-2) [    ] o.a.s.c.a.NodeAddedTrigger Found livenodes: 1
   [junit4]   2> 121197 DEBUG (ScheduledTrigger-176-thread-1) [    ] o.a.s.c.a.NodeAddedTrigger Running NodeAddedTrigger node_added_triggerCTOOR
   [junit4]   2> 121197 DEBUG (ScheduledTrigger-176-thread-4) [    ] o.a.s.c.a.NodeLostTrigger Running NodeLostTrigger: .auto_add_replicas with currently live nodes: 1
   [junit4]   2> 121197 DEBUG (ScheduledTrigger-176-thread-1) [    ] o.a.s.c.a.NodeAddedTrigger Found livenodes: 1
   [junit4]   2> 122266 DEBUG (ScheduledTrigger-176-thread-3) [    ] o.a.s.c.a.NodeLostTrigger Running NodeLostTrigger: .auto_add_replicas with currently live nodes: 1
   [junit4]   2> 122266 DEBUG (ScheduledTrigger-176-thread-4) [    ] o.a.s.c.a.NodeAddedTrigger Running NodeAddedTrigger node_added_triggerCTOOR
   [junit4]   2> 122266 DEBUG (ScheduledTrigger-176-thread-4) [    ] o.a.s.c.a.NodeAddedTrigger Found livenodes: 1
   [junit4]   2> 123334 DEBUG (ScheduledTrigger-176-thread-2) [    ] o.a.s.c.a.NodeLostTrigger Running NodeLostTrigger: .auto_add_replicas with currently live nodes: 1
   [junit4]   2> 123334 DEBUG (ScheduledTrigger-176-thread-3) [    ] o.a.s.c.a.NodeAddedTrigger Running NodeAddedTrigger node_added_triggerCTOOR
   [junit4]   2> 123334 DEBUG (ScheduledTrigger-176-thread-3) [    ] o.a.s.c.a.NodeAddedTrigger Found livenodes: 1
   [junit4]   2> 124402 DEBUG (ScheduledTrigger-176-thread-1) [    ] o.a.s.c.a.NodeLostTrigger Running NodeLostTrigger: .auto_add_replicas with currently live nodes: 1
   [junit4]   2> 124402 DEBUG (ScheduledTrigger-176-thread-2) [    ] o.a.s.c.a.NodeAddedTrigger Running NodeAddedTrigger node_added_triggerCTOOR
   [junit4]   2> 124402 DEBUG (ScheduledTrigger-176-thread-2) [    ] o.a.s.c.a.NodeAddedTrigger Found livenodes: 1
   [junit4]   2> 125470 DEBUG (ScheduledTrigger-176-thread-1) [    ] o.a.s.c.a.NodeAddedTrigger Running NodeAddedTrigger node_added_triggerCTOOR
   [junit4]   2> 125470 DEBUG (ScheduledTrigger-176-thread-4) [    ] o.a.s.c.a.NodeLostTrigger Running NodeLostTrigger: .auto_add_replicas with currently live nodes: 1
   [junit4]   2> 125470 DEBUG (ScheduledTrigger-176-thread-1) [    ] o.a.s.c.a.NodeAddedTrigger Found livenodes: 1
   [junit4]   2> 126538 DEBUG (ScheduledTrigger-176-thread-3) [    ] o.a.s.c.a.NodeAddedTrigger Running NodeAddedTrigger node_added_triggerCTOOR
   [junit4]   2> 126538 DEBUG (ScheduledTrigger-176-thread-1) [    ] o.a.s.c.a.NodeLostTrigger Running NodeLostTrigger: .auto_add_replicas with currently live nodes: 1
   [junit4]   2> 126538 DEBUG (ScheduledTrigger-176-thread-3) [    ] o.a.s.c.a.NodeAddedTrigger Found livenodes: 1
   [junit4]   2> 127606 DEBUG (ScheduledTrigger-176-thread-2) [    ] o.a.s.c.a.NodeLostTrigger Running NodeLostTrigger: .auto_add_replicas with currently live nodes: 1
   [junit4]   2> 127606 DEBUG (ScheduledTrigger-176-thread-1) [    ] o.a.s.c.a.NodeAddedTrigger Running NodeAddedTrigger node_added_triggerCTOOR
   [junit4]   2> 127606 DEBUG (ScheduledTrigger-176-thread-1) [    ] o.a.s.c.a.NodeAddedTrigger Found livenodes: 1
   [junit4]   2> 128549 INFO  (TEST-TriggerIntegrationTest.testContinueTriggersOnOverseerRestart-seed#[16384BF24166E9AB]) [    ] o.e.j.s.Server jetty-9.4.11.v20180605; built: 2018-06-05T18:24:03.829Z; git: d5fc0523cfa96bfebfbda19606cad384d772f04c; jvm 1.8.0_172-b11
   [junit4]   2> 128550 INFO  (TEST-TriggerIntegrationTest.testContinueTriggersOnOverseerRestart-seed#[16384BF24166E9AB]) [    ] o.e.j.s.session DefaultSessionIdManager workerName=node0
   [junit4]   2> 128550 INFO  (TEST-TriggerIntegrationTest.testContinueTriggersOnOverseerRestart-seed#[16384BF24166E9AB]) [    ] o.e.j.s.session No SessionScavenger set, using defaults
   [junit4]   2> 128550 INFO  (TEST-TriggerIntegrationTest.testContinueTriggersOnOverseerRestart-seed#[16384BF24166E9AB]) [    ] o.e.j.s.session node0 Scavenging every 600000ms
   [junit4]   2> 128550 INFO  (TEST-TriggerIntegrationTest.testContinueTriggersOnOverseerRestart-seed#[16384BF24166E9AB]) [    ] o.e.j.s.h.ContextHandler Started o.e.j.s.ServletContextHandler@27360988{/solr,null,AVAILABLE}
   [junit4]   2> 128552 INFO  (TEST-TriggerIntegrationTest.testContinueTriggersOnOverseerRestart-seed#[16384BF24166E9AB]) [    ] o.e.j.s.AbstractConnector Started ServerConnector@30e04d1f{HTTP/1.1,[http/1.1]}{127.0.0.1:58451}
   [junit4]   2> 128552 INFO  (TEST-TriggerIntegrationTest.testContinueTriggersOnOverseerRestart-seed#[16384BF24166E9AB]) [    ] o.e.j.s.Server Started @127049ms
   [junit4]   2> 128552 INFO  (TEST-TriggerIntegrationTest.testContinueTriggersOnOverseerRestart-seed#[16384BF24166E9AB]) [    ] o.a.s.c.s.e.JettySolrRunner Jetty properties: {hostContext=/solr, hostPort=58451}
   [junit4]   2> 128552 ERROR (TEST-TriggerIntegrationTest.testContinueTriggersOnOverseerRestart-seed#[16384BF24166E9AB]) [    ] o.a.s.u.StartupLoggingUtils Missing Java Option solr.log.dir. Logging may be missing or incomplete.
   [junit4]   2> 128552 INFO  (TEST-TriggerIntegrationTest.testContinueTriggersOnOverseerRestart-seed#[16384BF24166E9AB]) [    ] o.a.s.s.SolrDispatchFilter Using logger factory org.apache.logging.slf4j.Log4jLoggerFactory
   [junit4]   2> 128553 INFO  (TEST-TriggerIntegrationTest.testContinueTriggersOnOverseerRestart-seed#[16384BF24166E9AB]) [    ] o.a.s.s.SolrDispatchFilter  ___      _       Welcome to Apache Solr? version 8.0.0
   [junit4]   2> 128553 INFO  (TEST-TriggerIntegrationTest.testContinueTriggersOnOverseerRestart-seed#[16384BF24166E9AB]) [    ] o.a.s.s.SolrDispatchFilter / __| ___| |_ _   Starting in cloud mode on port null
   [junit4]   2> 128553 INFO  (TEST-TriggerIntegrationTest.testContinueTriggersOnOverseerRestart-seed#[16384BF24166E9AB]) [    ] o.a.s.s.SolrDispatchFilter \__ \/ _ \ | '_|  Install dir: null
   [junit4]   2> 128553 INFO  (TEST-TriggerIntegrationTest.testContinueTriggersOnOverseerRestart-seed#[16384BF24166E9AB]) [    ] o.a.s.s.SolrDispatchFilter |___/\___/_|_|    Start time: 2018-10-30T18:30:56.866Z
   [junit4]   2> 128557 INFO  (zkConnectionManagerCallback-157-thread-1) [    ] o.a.s.c.c.ConnectionManager zkClient has connected
   [junit4]   2> 128557 INFO  (TEST-TriggerIntegrationTest.testContinueTriggersOnOverseerRestart-seed#[16384BF24166E9AB]) [    ] o.a.s.s.SolrDispatchFilter solr.xml found in ZooKeeper. Loading...
   [junit4]   2> 128567 WARN  (NIOServerCxn.Factory:0.0.0.0/0.0.0.0:0) [    ] o.a.z.s.NIOServerCnxn Unable to read additional data from client sessionid 0x1000c4996980010, likely client has closed socket
   [junit4]   2> 128570 DEBUG (ScheduledTrigger-176-thread-4) [    ] o.a.s.c.a.NodeLostTrigger Running NodeLostTrigger: .auto_add_replicas with currently live nodes: 1
   [junit4]   2> 128570 DEBUG (ScheduledTrigger-176-thread-4) [    ] o.a.s.c.a.NodeAddedTrigger Running NodeAddedTrigger node_added_triggerCTOOR
   [junit4]   2> 128570 DEBUG (ScheduledTrigger-176-thread-4) [    ] o.a.s.c.a.NodeAddedTrigger Found livenodes: 1
   [junit4]   2> 128684 INFO  (TEST-TriggerIntegrationTest.testContinueTriggersOnOverseerRestart-seed#[16384BF24166E9AB]) [    ] o.a.s.c.ZkContainer Zookeeper client=127.0.0.1:58365/solr
   [junit4]   2> 128686 INFO  (zkConnectionManagerCallback-161-thread-1) [    ] o.a.s.c.c.ConnectionManager zkClient has connected
   [junit4]   2> 128690 INFO  (zkConnectionManagerCallback-163-thread-1) [    ] o.a.s.c.c.ConnectionManager zkClient has connected
   [junit4]   2> 128698 INFO  (TEST-TriggerIntegrationTest.testContinueTriggersOnOverseerRestart-seed#[16384BF24166E9AB]) [    ] o.a.s.c.c.ZkStateReader Updated live nodes from ZooKeeper... (0) -> (1)
   [junit4]   2> 128703 INFO  (TEST-TriggerIntegrationTest.testContinueTriggersOnOverseerRestart-seed#[16384BF24166E9AB]) [    ] o.a.s.c.TransientSolrCoreCacheDefault Allocating transient cache for 2147483647 transient cores
   [junit4]   2> 128703 INFO  (TEST-TriggerIntegrationTest.testContinueTriggersOnOverseerRestart-seed#[16384BF24166E9AB]) [    ] o.a.s.c.ZkController Register node as live in ZooKeeper:/live_nodes/127.0.0.1:58451_solr
   [junit4]   2> 128705 INFO  (zkCallback-134-thread-2) [    ] o.a.s.c.c.ZkStateReader Updated live nodes from ZooKeeper... (1) -> (2)
   [junit4]   2> 128705 INFO  (zkCallback-134-thread-1) [    ] o.a.s.c.c.ZkStateReader Updated live nodes from ZooKeeper... (1) -> (2)
   [junit4]   2> 128705 INFO  (zkCallback-153-thread-1) [    ] o.a.s.c.c.ZkStateReader Updated live nodes from ZooKeeper... (1) -> (2)
   [junit4]   2> 128705 INFO  (zkCallback-146-thread-1) [    ] o.a.s.c.c.ZkStateReader Updated live nodes from ZooKeeper... (1) -> (2)
   [junit4]   2> 128706 INFO  (zkCallback-162-thread-1) [    ] o.a.s.c.c.ZkStateReader Updated live nodes from ZooKeeper... (1) -> (2)
   [junit4]   2> 128751 INFO  (zkConnectionManagerCallback-170-thread-1) [    ] o.a.s.c.c.ConnectionManager zkClient has connected
   [junit4]   2> 128754 INFO  (TEST-TriggerIntegrationTest.testContinueTriggersOnOverseerRestart-seed#[16384BF24166E9AB]) [    ] o.a.s.c.c.ZkStateReader Updated live nodes from ZooKeeper... (0) -> (2)
   [junit4]   2> 128755 INFO  (TEST-TriggerIntegrationTest.testContinueTriggersOnOverseerRestart-seed#[16384BF24166E9AB]) [    ] o.a.s.c.s.i.ZkClientClusterStateProvider Cluster at 127.0.0.1:58365/solr ready
   [junit4]   2> 128755 INFO  (TEST-TriggerIntegrationTest.testContinueTriggersOnOverseerRestart-seed#[16384BF24166E9AB]) [    ] o.a.s.h.a.MetricsHistoryHandler No .system collection, keeping metrics history in memory.
   [junit4]   2> 128779 INFO  (TEST-TriggerIntegrationTest.testContinueTriggersOnOverseerRestart-seed#[16384BF24166E9AB]) [    ] o.a.s.m.r.SolrJmxReporter JMX monitoring for 'solr_58451.solr.node' (registry 'solr.node') enabled at server: com.sun.jmx.mbeanserver.JmxMBeanServer@34ce8588
   [junit4]   2> 128785 INFO  (TEST-TriggerIntegrationTest.testContinueTriggersOnOverseerRestart-seed#[16384BF24166E9AB]) [    ] o.a.s.m.r.SolrJmxReporter JMX monitoring for 'solr_58451.solr.jvm' (registry 'solr.jvm') enabled at server: com.sun.jmx.mbeanserver.JmxMBeanServer@34ce8588
   [junit4]   2> 128785 INFO  (TEST-TriggerIntegrationTest.testContinueTriggersOnOverseerRestart-seed#[16384BF24166E9AB]) [    ] o.a.s.m.r.SolrJmxReporter JMX monitoring for 'solr_58451.solr.jetty' (registry 'solr.jetty') enabled at server: com.sun.jmx.mbeanserver.JmxMBeanServer@34ce8588
   [junit4]   2> 128787 INFO  (TEST-TriggerIntegrationTest.testContinueTriggersOnOverseerRestart-seed#[16384BF24166E9AB]) [    ] o.a.s.c.CorePropertiesLocator Found 0 core definitions underneath C:\Users\jenkins\workspace\Lucene-Solr-master-Windows\solr\build\solr-core\test\J1\temp\solr.cloud.autoscaling.TriggerIntegrationTest_16384BF24166E9AB-001\tempDir-001\node4\.
   [junit4]   2> 129532 DEBUG (ScheduledTrigger-176-thread-2) [    ] o.a.s.c.a.NodeAddedTrigger Running NodeAddedTrigger node_added_triggerCTOOR
   [junit4]   2> 129532 DEBUG (ScheduledTrigger-176-thread-3) [    ] o.a.s.c.a.NodeLostTrigger Running NodeLostTrigger: .auto_add_replicas with currently live nodes: 2
   [junit4]   2> 129532 DEBUG (ScheduledTrigger-176-thread-2) [    ] o.a.s.c.a.NodeAddedTrigger Found livenodes: 2
   [junit4]   2> 129532 DEBUG (ScheduledTrigger-176-thread-2) [    ] o.a.s.c.a.NodeAddedTrigger Tracking new node: 127.0.0.1:58451_solr at time 206166298816600
   [junit4]   2> 130494 DEBUG (ScheduledTrigger-176-thread-4) [    ] o.a.s.c.a.NodeLostTrigger Running NodeLostTrigger: .auto_add_replicas with currently live nodes: 2
   [junit4]   2> 130494 DEBUG (ScheduledTrigger-176-thread-3) [    ] o.a.s.c.a.NodeAddedTrigger Running NodeAddedTrigger node_added_triggerCTOOR
   [junit4]   2> 130494 DEBUG (ScheduledTrigger-176-thread-3) [    ] o.a.s.c.a.NodeAddedTrigger Found livenodes: 2
   [junit4]   2> 131455 DEBUG (ScheduledTrigger-176-thread-1) [    ] o.a.s.c.a.NodeLostTrigger Running NodeLostTrigger: .auto_add_replicas with currently live nodes: 2
   [junit4]   2> 131455 DEBUG (ScheduledTrigger-176-thread-4) [    ] o.a.s.c.a.NodeAddedTrigger Running NodeAddedTrigger node_added_triggerCTOOR
   [junit4]   2> 131455 DEBUG (ScheduledTrigger-176-thread-4) [    ] o.a.s.c.a.NodeAddedTrigger Found livenodes: 2
   [junit4]   2> 132416 DEBUG (ScheduledTrigger-176-thread-2) [    ] o.a.s.c.a.NodeAddedTrigger Running NodeAddedTrigger node_added_triggerCTOOR
   [junit4]   2> 132416 DEBUG (ScheduledTrigger-176-thread-2) [    ] o.a.s.c.a.NodeAddedTrigger Found livenodes: 2
   [junit4]   2> 132416 DEBUG (ScheduledTrigger-176-thread-1) [    ] o.a.s.c.a.NodeLostTrigger Running NodeLostTrigger: .auto_add_replicas with currently live nodes: 2
   [junit4]   2> 132416 DEBUG (ScheduledTrigger-176-thread-2) [    ] o.a.s.c.a.NodeAddedTrigger NodeAddedTrigger node_added_triggerCTOOR firing registered processor for nodes: [127.0.0.1:58451_solr] added at times [206166298816600], now=206169301648500
   [junit4]   2> 132420 DEBUG (ScheduledTrigger-176-thread-2) [    ] o.a.s.c.a.ScheduledTriggers ++++++++ Cooldown inactive - processing event: {
   [junit4]   2>   "id":"bb81d5017058Ta0gh1v5n4goqyb5cdh80hrqdr",
   [junit4]   2>   "source":"node_added_triggerCTOOR",
   [junit4]   2>   "eventTime":206166298816600,
   [junit4]   2>   "eventType":"NODEADDED",
   [junit4]   2>   "properties":{
   [junit4]   2>     "eventTimes":[206166298816600],
   [junit4]   2>     "preferredOperation":"movereplica",
   [junit4]   2>     "nodeNames":["127.0.0.1:58451_solr"]}}
   [junit4]   2> 132420 DEBUG (ScheduledTrigger-176-thread-2) [    ] o.a.s.c.a.ScheduledTriggers Pausing all triggers: [.auto_add_replicas, .scheduled_maintenance, node_added_triggerCTOOR]
   [junit4]   2> 132422 INFO  (ScheduledTrigger-176-thread-2) [    ] o.a.s.c.a.SystemLogListener Collection .system does not exist, disabling logging.
   [junit4]   2> 132423 DEBUG (ScheduledTrigger-176-thread-2) [    ] o.a.s.c.a.NodeAddedTrigger NodeAddedTrigger node_added_triggerCTOOR - removing marker path: /autoscaling/nodeAdded/127.0.0.1:58451_solr
   [junit4]   2> 132423 DEBUG (AutoscalingActionExecutor-177-thread-1) [    ] o.a.s.c.a.ScheduledTriggers -- processing actions for {
   [junit4]   2>   "id":"bb81d5017058Ta0gh1v5n4goqyb5cdh80hrqdr",
   [junit4]   2>   "source":"node_added_triggerCTOOR",
   [junit4]   2>   "eventTime":206166298816600,
   [junit4]   2>   "eventType":"NODEADDED",
   [junit4]   2>   "properties":{
   [junit4]   2>     "eventTimes":[206166298816600],
   [junit4]   2>     "preferredOperation":"movereplica",
   [junit4]   2>     "_enqueue_time_":206169306306000,
   [junit4]   2>     "nodeNames":["127.0.0.1:58451_solr"]}}
   [junit4]   2> 132427 INFO  (TEST-TriggerIntegrationTest.testContinueTriggersOnOverseerRestart-seed#[16384BF24166E9AB]) [    ] o.a.s.SolrTestCaseJ4 ###Ending testContinueTriggersOnOverseerRestart
   [junit4]   2> 132443 DEBUG (AutoscalingActionExecutor-177-thread-1) [    ] o.a.s.c.a.ScheduledTriggers Resuming trigger: .auto_add_replicas after 5000ms
   [junit4]   2> 132444 DEBUG (AutoscalingActionExecutor-177-thread-1) [    ] o.a.s.c.a.ScheduledTriggers Resuming trigger: .scheduled_maintenance after 5000ms
   [junit4]   2> 132444 DEBUG (AutoscalingActionExecutor-177-thread-1) [    ] o.a.s.c.a.ScheduledTriggers Resuming trigger: node_added_triggerCTOOR after 5000ms
   [junit4]   2> 132444 DEBUG (AutoscalingActionExecutor-177-thread-1) [    ] o.a.s.c.a.ScheduledTriggers -- processing took 21 ms for event id=bb81d5017058Ta0gh1v5n4goqyb5cdh80hrqdr
   [junit4]   2> 132445 INFO  (TEST-TriggerIntegrationTest.testEventQueue-seed#[16384BF24166E9AB]) [    ] o.a.s.SolrTestCaseJ4 ###Starting testEventQueue
   [junit4]   2> 132447 INFO  (zkConnectionManagerCallback-173-thread-1) [    ] o.a.s.c.c.ConnectionManager zkClient has connected
   [junit4]   2> 132448 WARN  (NIOServerCxn.Factory:0.0.0.0/0.0.0.0:0) [    ] o.a.z.s.NIOServerCnxn Unable to read additional data from client sessionid 0x1000c4996980014, likely client has closed socket
   [junit4]   2> 132451 INFO  (qtp1480368182-422) [n:127.0.0.1:58419_solr    ] o.a.s.h.a.CollectionsHandler Invoked Collection Action :overseerstatus with params action=OVERSEERSTATUS&wt=javabin&version=2 and sendToOCPQueue=true
   [junit4]   2> 132457 INFO  (qtp1480368182-422) [n:127.0.0.1:58419_solr    ] o.a.s.s.HttpSolrCall [admin] webapp=null path=/admin/collections params={action=OVERSEERSTATUS&wt=javabin&version=2} status=0 QTime=6
   [junit4]   2> 132458 INFO  (TEST-TriggerIntegrationTest.testEventQueue-seed#[16384BF24166E9AB]) [    ] o.a.s.c.a.ScheduledTriggers -- removing trigger: .auto_add_replicas
   [junit4]   2> 132460 INFO  (TEST-TriggerIntegrationTest.testEventQueue-seed#[16384BF24166E9AB]) [    ] o.a.s.c.a.ScheduledTriggers -- removing trigger: .scheduled_maintenance
   [junit4]   2> 132460 INFO  (TEST-TriggerIntegrationTest.testEventQueue-seed#[16384BF24166E9AB]) [    ] o.a.s.c.a.ScheduledTriggers -- removing trigger: node_added_triggerCTOOR
   [junit4]   2> 132462 INFO  (TEST-TriggerIntegrationTest.testEventQueue-seed#[16384BF24166E9AB]) [    ] o.a.s.c.a.TriggerIntegrationTest /autoscaling.json reset, new znode version 6
   [junit4]   2> 132462 DEBUG (zkCallback-153-thread-1) [    ] o.a.s.c.a.OverseerTriggerThread Refreshing /autoscaling.json with znode version 6
   [junit4]   2> 132462 DEBUG (OverseerAutoScalingTriggerThread-72071104236617742-127.0.0.1:58419_solr-n_0000000002) [    ] o.a.s.c.a.OverseerTriggerThread Processed trigger updates upto znodeVersion 6
   [junit4]   2> 132462 DEBUG (OverseerAutoScalingTriggerThread-72071104236617742-127.0.0.1:58419_solr-n_0000000002) [    ] o.a.s.c.a.OverseerTriggerThread -- clean old nodeLost markers
   [junit4]   2> 132463 DEBUG (OverseerAutoScalingTriggerThread-72071104236617742-127.0.0.1:58419_solr-n_0000000002) [    ] o.a.s.c.a.OverseerTriggerThread -- clean old nodeAdded markers
   [junit4]   2> 132463 INFO  (TEST-TriggerIntegrationTest.testEventQueue-seed#[16384BF24166E9AB]) [    ] o.a.s.c.c.ZkStateReader Updated live nodes from ZooKeeper... (0) -> (2)
   [junit4]   2> 132463 DEBUG (OverseerAutoScalingTriggerThread-72071104236617742-127.0.0.1:58419_solr-n_0000000002) [    ] o.a.s.c.a.OverseerTriggerThread Current znodeVersion 6, lastZnodeVersion 6
   [junit4]   2> 132465 INFO  (TEST-TriggerIntegrationTest.testEventQueue-seed#[16384BF24166E9AB]) [    ] o.e.j.s.AbstractConnector Stopped ServerConnector@6fd5533f{HTTP/1.1,[http/1.1]}{127.0.0.1:0}
   [junit4]   2> 132465 INFO  (TEST-TriggerIntegrationTest.testEventQueue-seed#[16384BF24166E9AB]) [    ] o.a.s.c.CoreContainer Shutting down CoreContainer instance=87818813
   [junit4]   2> 132465 INFO  (TEST-TriggerIntegrationTest.testEventQueue-seed#[16384BF24166E9AB]) [    ] o.a.s.m.SolrMetricManage

[...truncated too long message...]

 (1)
   [junit4]   2> 287714 INFO  (jetty-closer-764-thread-1) [    ] o.a.s.c.Overseer Overseer (id=72071466385735712-127.0.0.1:62307_solr-n_0000000006) closing
   [junit4]   2> 287714 DEBUG (jetty-closer-764-thread-1) [    ] o.a.s.c.a.ScheduledTriggers Shutting down scheduled thread pool executor now
   [junit4]   2> 287714 DEBUG (jetty-closer-764-thread-1) [    ] o.a.s.c.a.ScheduledTriggers Shutting down action executor now
   [junit4]   2> 287714 DEBUG (jetty-closer-764-thread-1) [    ] o.a.s.c.a.ScheduledTriggers Awaiting termination for action executor
   [junit4]   2> 287714 INFO  (OverseerStateUpdate-72071466385735712-127.0.0.1:62307_solr-n_0000000006) [n:127.0.0.1:62307_solr    ] o.a.s.c.Overseer Overseer Loop exiting : 127.0.0.1:62307_solr
   [junit4]   2> 287715 DEBUG (jetty-closer-764-thread-1) [    ] o.a.s.c.a.ScheduledTriggers Awaiting termination for scheduled thread pool executor
   [junit4]   2> 287717 WARN  (OverseerAutoScalingTriggerThread-72071466385735712-127.0.0.1:62307_solr-n_0000000006) [    ] o.a.s.c.a.OverseerTriggerThread OverseerTriggerThread woken up but we are closed, exiting.
   [junit4]   2> 287717 DEBUG (jetty-closer-764-thread-1) [    ] o.a.s.c.a.ScheduledTriggers ScheduledTriggers closed completely
   [junit4]   2> 287717 DEBUG (jetty-closer-764-thread-1) [    ] o.a.s.c.a.OverseerTriggerThread OverseerTriggerThread has been closed explicitly
   [junit4]   2> 287718 INFO  (jetty-closer-764-thread-2) [    ] o.a.s.c.ZkController Remove node as live in ZooKeeper:/live_nodes/127.0.0.1:62425_solr
   [junit4]   2> 287721 INFO  (jetty-closer-764-thread-2) [    ] o.a.s.m.SolrMetricManager Closing metric reporters for registry=solr.cluster, tag=null
   [junit4]   2> 287763 INFO  (zkCallback-947-thread-1) [    ] o.a.s.c.c.ZkStateReader Updated live nodes from ZooKeeper... (1) -> (0)
   [junit4]   2> 287763 INFO  (zkCallback-940-thread-1) [    ] o.a.s.c.c.ZkStateReader Updated live nodes from ZooKeeper... (1) -> (0)
   [junit4]   2> 287764 INFO  (zkCallback-888-thread-1) [    ] o.a.s.c.c.ZkStateReader Updated live nodes from ZooKeeper... (1) -> (0)
   [junit4]   2> 287777 WARN  (NIOServerCxn.Factory:0.0.0.0/0.0.0.0:0) [    ] o.a.z.s.NIOServerCnxn Unable to read additional data from client sessionid 0x1000c9de85d002e, likely client has closed socket
   [junit4]   2> 287849 INFO  (jetty-closer-764-thread-2) [    ] o.e.j.s.h.ContextHandler Stopped o.e.j.s.ServletContextHandler@3b7b7a2b{/solr,null,UNAVAILABLE}
   [junit4]   2> 287849 INFO  (jetty-closer-764-thread-2) [    ] o.e.j.s.session node0 Stopped scavenging
   [junit4]   2> 289339 WARN  (zkCallback-895-thread-1) [    ] o.a.s.c.c.ZkStateReader ZooKeeper watch triggered, but Solr cannot talk to ZK: [KeeperErrorCode = Session expired for /live_nodes]
   [junit4]   2> 289342 INFO  (jetty-closer-764-thread-1) [    ] o.e.j.s.h.ContextHandler Stopped o.e.j.s.ServletContextHandler@6b9ad5af{/solr,null,UNAVAILABLE}
   [junit4]   2> 289342 INFO  (jetty-closer-764-thread-1) [    ] o.e.j.s.session node0 Stopped scavenging
   [junit4]   2> 289343 ERROR (SUITE-TriggerIntegrationTest-seed#[16384BF24166E9AB]-worker) [    ] o.a.z.s.ZooKeeperServer ZKShutdownHandler is not registered, so ZooKeeper server won't take any action on ERROR or SHUTDOWN server state changes
   [junit4]   2> 289356 INFO  (SUITE-TriggerIntegrationTest-seed#[16384BF24166E9AB]-worker) [    ] o.a.s.c.ZkTestServer connecting to 127.0.0.1:62144 62144
   [junit4]   2> 289378 INFO  (Thread-449) [    ] o.a.s.c.ZkTestServer connecting to 127.0.0.1:62144 62144
   [junit4]   2> 289404 WARN  (Thread-449) [    ] o.a.s.c.ZkTestServer Watch limit violations: 
   [junit4]   2> Maximum concurrent create/delete watches above limit:
   [junit4]   2> 
   [junit4]   2> 	27	/solr/aliases.json
   [junit4]   2> 	27	/solr/clusterprops.json
   [junit4]   2> 	11	/solr/security.json
   [junit4]   2> 
   [junit4]   2> Maximum concurrent data watches above limit:
   [junit4]   2> 
   [junit4]   2> 	27	/solr/clusterstate.json
   [junit4]   2> 	10	/solr/aliases.json
   [junit4]   2> 	7	/solr/autoscaling.json
   [junit4]   2> 	3	/solr/overseer_elect/election/72071466385735712-127.0.0.1:62307_solr-n_0000000006
   [junit4]   2> 
   [junit4]   2> Maximum concurrent children watches above limit:
   [junit4]   2> 
   [junit4]   2> 	72	/solr/live_nodes
   [junit4]   2> 	27	/solr/collections
   [junit4]   2> 	7	/solr/autoscaling/events/.auto_add_replicas
   [junit4]   2> 	7	/solr/autoscaling/events/.scheduled_maintenance
   [junit4]   2> 	7	/solr/overseer/collection-queue-work
   [junit4]   2> 	7	/solr/overseer/queue-work
   [junit4]   2> 	6	/solr/overseer/queue
   [junit4]   2> 	2	/solr/autoscaling/events/node_added_triggerCTOOR
   [junit4]   2> 
   [junit4]   2> NOTE: leaving temporary files on disk at: C:\Users\jenkins\workspace\Lucene-Solr-master-Windows\solr\build\solr-core\test\J1\temp\solr.cloud.autoscaling.TriggerIntegrationTest_16384BF24166E9AB-001
   [junit4]   2> Oct 30, 2018 8:05:18 PM com.carrotsearch.randomizedtesting.ThreadLeakControl checkThreadLeaks
   [junit4]   2> WARNING: Will linger awaiting termination of 1 leaked thread(s).
   [junit4]   2> NOTE: test params are: codec=Asserting(Lucene80): {}, docValues:{}, maxPointsInLeafNode=915, maxMBSortInHeap=7.993942350118013, sim=Asserting(org.apache.lucene.search.similarities.AssertingSimilarity@34780d05), locale=sl-SI, timezone=US/Arizona
   [junit4]   2> NOTE: Windows 10 10.0 amd64/Oracle Corporation 1.8.0_172 (64-bit)/cpus=3,threads=1,free=171736368,total=283115520
   [junit4]   2> NOTE: All tests run in this JVM: [DocValuesNotIndexedTest, DocValuesNotIndexedTest, DocValuesNotIndexedTest, DocValuesNotIndexedTest, TestSkipOverseerOperations, TestSkipOverseerOperations, TestSkipOverseerOperations, TriggerIntegrationTest, TriggerIntegrationTest]
   [junit4] Completed [13/15 (2!)] on J1 in 96.39s, 4 tests, 1 failure <<< FAILURES!
   [junit4] 
   [junit4] Suite: org.apache.solr.cloud.DocValuesNotIndexedTest
   [junit4] OK      1.30s J1 | DocValuesNotIndexedTest.testDistribFaceting
   [junit4] OK      1.03s J1 | DocValuesNotIndexedTest.testGroupingDVOnly
   [junit4] OK      0.33s J1 | DocValuesNotIndexedTest.testGroupingDocAbsent
   [junit4] OK      0.75s J1 | DocValuesNotIndexedTest.testGroupingSorting
   [junit4] Completed [14/15 (2!)] on J1 in 10.57s, 4 tests
   [junit4] 
   [junit4] Suite: org.apache.solr.cloud.autoscaling.TriggerIntegrationTest
   [junit4] OK      21.2s J0 | TriggerIntegrationTest.testContinueTriggersOnOverseerRestart
   [junit4] OK      12.2s J0 | TriggerIntegrationTest.testEventQueue
   [junit4] OK      19.9s J0 | TriggerIntegrationTest.testListeners
   [junit4] OK      21.0s J0 | TriggerIntegrationTest.testTriggerThrottling
   [junit4] Completed [15/15 (2!)] on J0 in 78.41s, 4 tests
   [junit4] 
   [junit4] 
   [junit4] Tests with failures [seed: 16384BF24166E9AB]:
   [junit4]   - org.apache.solr.cloud.autoscaling.TriggerIntegrationTest.testTriggerThrottling
   [junit4]   - org.apache.solr.cloud.autoscaling.TriggerIntegrationTest.testTriggerThrottling
   [junit4] 
   [junit4] 
   [junit4] JVM J0:     0.90 ..   317.07 =   316.16s
   [junit4] JVM J1:     0.90 ..   301.53 =   300.63s
   [junit4] Execution time total: 5 minutes 17 seconds
   [junit4] Tests summary: 15 suites, 50 tests, 2 failures

BUILD FAILED
C:\Users\jenkins\workspace\Lucene-Solr-master-Windows\lucene\common-build.xml:1567: The following error occurred while executing this line:
C:\Users\jenkins\workspace\Lucene-Solr-master-Windows\lucene\common-build.xml:1092: There were test failures: 15 suites, 50 tests, 2 failures [seed: 16384BF24166E9AB]

Total time: 5 minutes 18 seconds

[repro] Setting last failure code to 1

[repro] Failures:
[repro]   0/5 failed: org.apache.solr.cloud.DocValuesNotIndexedTest
[repro]   0/5 failed: org.apache.solr.cloud.TestSkipOverseerOperations
[repro]   2/5 failed: org.apache.solr.cloud.autoscaling.TriggerIntegrationTest
[repro] Exiting with code 1

C:\Users\jenkins\workspace\Lucene-Solr-master-Windows>IF EXIST lucene\build move /y lucene\build lucene\build.repro 
        1 dir(s) moved.

C:\Users\jenkins\workspace\Lucene-Solr-master-Windows>IF EXIST solr\build move /y solr\build solr\build.repro 
        1 dir(s) moved.

C:\Users\jenkins\workspace\Lucene-Solr-master-Windows>IF EXIST lucene\build.orig move /y lucene\build.orig lucene\build 
        1 dir(s) moved.

C:\Users\jenkins\workspace\Lucene-Solr-master-Windows>IF EXIST solr\build.orig move /y solr\build.orig solr\build 
        1 dir(s) moved.

C:\Users\jenkins\workspace\Lucene-Solr-master-Windows>exit 0 
Archiving artifacts
Setting ANT_1_8_2_HOME=C:\Users\jenkins\tools\hudson.tasks.Ant_AntInstallation\ANT_1.8.2
[WARNINGS] Parsing warnings in console log with parser Java Compiler (javac)
Setting ANT_1_8_2_HOME=C:\Users\jenkins\tools\hudson.tasks.Ant_AntInstallation\ANT_1.8.2
Setting ANT_1_8_2_HOME=C:\Users\jenkins\tools\hudson.tasks.Ant_AntInstallation\ANT_1.8.2
<Git Blamer> Using GitBlamer to create author and commit information for all warnings.
<Git Blamer> GIT_COMMIT=856e28d8cf07cc34bc1361784bf00e7aceb3af97, workspace=C:\Users\jenkins\workspace\Lucene-Solr-master-Windows
[WARNINGS] Computing warning deltas based on reference build #7595
Recording test results
Setting ANT_1_8_2_HOME=C:\Users\jenkins\tools\hudson.tasks.Ant_AntInstallation\ANT_1.8.2
Build step 'Publish JUnit test result report' changed build result to UNSTABLE
Email was triggered for: Unstable (Test Failures)
Sending email for trigger: Unstable (Test Failures)
Setting ANT_1_8_2_HOME=C:\Users\jenkins\tools\hudson.tasks.Ant_AntInstallation\ANT_1.8.2
Setting ANT_1_8_2_HOME=C:\Users\jenkins\tools\hudson.tasks.Ant_AntInstallation\ANT_1.8.2
Setting ANT_1_8_2_HOME=C:\Users\jenkins\tools\hudson.tasks.Ant_AntInstallation\ANT_1.8.2
Setting ANT_1_8_2_HOME=C:\Users\jenkins\tools\hudson.tasks.Ant_AntInstallation\ANT_1.8.2

Mime
View raw message