lucene-dev mailing list archives

Site index · List index
Message view « Date » · « Thread »
Top « Date » · « Thread »
From Apache Jenkins Server <jenk...@builds.apache.org>
Subject [JENKINS] Lucene-Solr-NightlyTests-7.x - Build # 297 - Unstable
Date Tue, 21 Aug 2018 09:30:50 GMT
Build: https://builds.apache.org/job/Lucene-Solr-NightlyTests-7.x/297/

2 tests failed.
FAILED:  org.apache.solr.cloud.LIROnShardRestartTest.testAllReplicasInLIR

Error Message:
No live SolrServers available to handle this request

Stack Trace:
org.apache.solr.client.solrj.SolrServerException: No live SolrServers available to handle this request
	at __randomizedtesting.SeedInfo.seed([F9084EEA1D47C3E9:A390742C63C7A40E]:0)
	at org.apache.solr.client.solrj.impl.LBHttpSolrClient.request(LBHttpSolrClient.java:460)
	at org.apache.solr.client.solrj.impl.CloudSolrClient.sendRequest(CloudSolrClient.java:1109)
	at org.apache.solr.client.solrj.impl.CloudSolrClient.requestWithRetryOnStaleState(CloudSolrClient.java:886)
	at org.apache.solr.client.solrj.impl.CloudSolrClient.request(CloudSolrClient.java:819)
	at org.apache.solr.client.solrj.SolrRequest.process(SolrRequest.java:194)
	at org.apache.solr.client.solrj.SolrRequest.process(SolrRequest.java:211)
	at org.apache.solr.cloud.LIROnShardRestartTest.testAllReplicasInLIR(LIROnShardRestartTest.java:175)
	at sun.reflect.NativeMethodAccessorImpl.invoke0(Native Method)
	at sun.reflect.NativeMethodAccessorImpl.invoke(NativeMethodAccessorImpl.java:62)
	at sun.reflect.DelegatingMethodAccessorImpl.invoke(DelegatingMethodAccessorImpl.java:43)
	at java.lang.reflect.Method.invoke(Method.java:498)
	at com.carrotsearch.randomizedtesting.RandomizedRunner.invoke(RandomizedRunner.java:1737)
	at com.carrotsearch.randomizedtesting.RandomizedRunner$8.evaluate(RandomizedRunner.java:934)
	at com.carrotsearch.randomizedtesting.RandomizedRunner$9.evaluate(RandomizedRunner.java:970)
	at com.carrotsearch.randomizedtesting.RandomizedRunner$10.evaluate(RandomizedRunner.java:984)
	at com.carrotsearch.randomizedtesting.rules.SystemPropertiesRestoreRule$1.evaluate(SystemPropertiesRestoreRule.java:57)
	at org.apache.lucene.util.TestRuleSetupTeardownChained$1.evaluate(TestRuleSetupTeardownChained.java:49)
	at org.apache.lucene.util.AbstractBeforeAfterRule$1.evaluate(AbstractBeforeAfterRule.java:45)
	at org.apache.lucene.util.TestRuleThreadAndTestName$1.evaluate(TestRuleThreadAndTestName.java:48)
	at org.apache.lucene.util.TestRuleIgnoreAfterMaxFailures$1.evaluate(TestRuleIgnoreAfterMaxFailures.java:64)
	at org.apache.lucene.util.TestRuleMarkFailure$1.evaluate(TestRuleMarkFailure.java:47)
	at com.carrotsearch.randomizedtesting.rules.StatementAdapter.evaluate(StatementAdapter.java:36)
	at com.carrotsearch.randomizedtesting.ThreadLeakControl$StatementRunner.run(ThreadLeakControl.java:368)
	at com.carrotsearch.randomizedtesting.ThreadLeakControl.forkTimeoutingTask(ThreadLeakControl.java:817)
	at com.carrotsearch.randomizedtesting.ThreadLeakControl$3.evaluate(ThreadLeakControl.java:468)
	at com.carrotsearch.randomizedtesting.RandomizedRunner.runSingleTest(RandomizedRunner.java:943)
	at com.carrotsearch.randomizedtesting.RandomizedRunner$5.evaluate(RandomizedRunner.java:829)
	at com.carrotsearch.randomizedtesting.RandomizedRunner$6.evaluate(RandomizedRunner.java:879)
	at com.carrotsearch.randomizedtesting.RandomizedRunner$7.evaluate(RandomizedRunner.java:890)
	at com.carrotsearch.randomizedtesting.rules.StatementAdapter.evaluate(StatementAdapter.java:36)
	at com.carrotsearch.randomizedtesting.rules.SystemPropertiesRestoreRule$1.evaluate(SystemPropertiesRestoreRule.java:57)
	at org.apache.lucene.util.AbstractBeforeAfterRule$1.evaluate(AbstractBeforeAfterRule.java:45)
	at com.carrotsearch.randomizedtesting.rules.StatementAdapter.evaluate(StatementAdapter.java:36)
	at org.apache.lucene.util.TestRuleStoreClassName$1.evaluate(TestRuleStoreClassName.java:41)
	at com.carrotsearch.randomizedtesting.rules.NoShadowingOrOverridesOnMethodsRule$1.evaluate(NoShadowingOrOverridesOnMethodsRule.java:40)
	at com.carrotsearch.randomizedtesting.rules.NoShadowingOrOverridesOnMethodsRule$1.evaluate(NoShadowingOrOverridesOnMethodsRule.java:40)
	at com.carrotsearch.randomizedtesting.rules.StatementAdapter.evaluate(StatementAdapter.java:36)
	at com.carrotsearch.randomizedtesting.rules.StatementAdapter.evaluate(StatementAdapter.java:36)
	at com.carrotsearch.randomizedtesting.rules.StatementAdapter.evaluate(StatementAdapter.java:36)
	at org.apache.lucene.util.TestRuleAssertionsRequired$1.evaluate(TestRuleAssertionsRequired.java:53)
	at org.apache.lucene.util.TestRuleMarkFailure$1.evaluate(TestRuleMarkFailure.java:47)
	at org.apache.lucene.util.TestRuleIgnoreAfterMaxFailures$1.evaluate(TestRuleIgnoreAfterMaxFailures.java:64)
	at org.apache.lucene.util.TestRuleIgnoreTestSuites$1.evaluate(TestRuleIgnoreTestSuites.java:54)
	at com.carrotsearch.randomizedtesting.rules.StatementAdapter.evaluate(StatementAdapter.java:36)
	at com.carrotsearch.randomizedtesting.ThreadLeakControl$StatementRunner.run(ThreadLeakControl.java:368)
	at java.lang.Thread.run(Thread.java:748)


FAILED:  org.apache.solr.cloud.LIROnShardRestartTest.testSeveralReplicasInLIR

Error Message:
No live SolrServers available to handle this request

Stack Trace:
org.apache.solr.client.solrj.SolrServerException: No live SolrServers available to handle this request
	at __randomizedtesting.SeedInfo.seed([F9084EEA1D47C3E9:7F52D9DE3D1D8EB0]:0)
	at org.apache.solr.client.solrj.impl.LBHttpSolrClient.request(LBHttpSolrClient.java:460)
	at org.apache.solr.client.solrj.impl.CloudSolrClient.sendRequest(CloudSolrClient.java:1109)
	at org.apache.solr.client.solrj.impl.CloudSolrClient.requestWithRetryOnStaleState(CloudSolrClient.java:886)
	at org.apache.solr.client.solrj.impl.CloudSolrClient.request(CloudSolrClient.java:819)
	at org.apache.solr.client.solrj.SolrRequest.process(SolrRequest.java:194)
	at org.apache.solr.client.solrj.SolrRequest.process(SolrRequest.java:211)
	at org.apache.solr.cloud.LIROnShardRestartTest.testSeveralReplicasInLIR(LIROnShardRestartTest.java:190)
	at sun.reflect.NativeMethodAccessorImpl.invoke0(Native Method)
	at sun.reflect.NativeMethodAccessorImpl.invoke(NativeMethodAccessorImpl.java:62)
	at sun.reflect.DelegatingMethodAccessorImpl.invoke(DelegatingMethodAccessorImpl.java:43)
	at java.lang.reflect.Method.invoke(Method.java:498)
	at com.carrotsearch.randomizedtesting.RandomizedRunner.invoke(RandomizedRunner.java:1737)
	at com.carrotsearch.randomizedtesting.RandomizedRunner$8.evaluate(RandomizedRunner.java:934)
	at com.carrotsearch.randomizedtesting.RandomizedRunner$9.evaluate(RandomizedRunner.java:970)
	at com.carrotsearch.randomizedtesting.RandomizedRunner$10.evaluate(RandomizedRunner.java:984)
	at com.carrotsearch.randomizedtesting.rules.SystemPropertiesRestoreRule$1.evaluate(SystemPropertiesRestoreRule.java:57)
	at org.apache.lucene.util.TestRuleSetupTeardownChained$1.evaluate(TestRuleSetupTeardownChained.java:49)
	at org.apache.lucene.util.AbstractBeforeAfterRule$1.evaluate(AbstractBeforeAfterRule.java:45)
	at org.apache.lucene.util.TestRuleThreadAndTestName$1.evaluate(TestRuleThreadAndTestName.java:48)
	at org.apache.lucene.util.TestRuleIgnoreAfterMaxFailures$1.evaluate(TestRuleIgnoreAfterMaxFailures.java:64)
	at org.apache.lucene.util.TestRuleMarkFailure$1.evaluate(TestRuleMarkFailure.java:47)
	at com.carrotsearch.randomizedtesting.rules.StatementAdapter.evaluate(StatementAdapter.java:36)
	at com.carrotsearch.randomizedtesting.ThreadLeakControl$StatementRunner.run(ThreadLeakControl.java:368)
	at com.carrotsearch.randomizedtesting.ThreadLeakControl.forkTimeoutingTask(ThreadLeakControl.java:817)
	at com.carrotsearch.randomizedtesting.ThreadLeakControl$3.evaluate(ThreadLeakControl.java:468)
	at com.carrotsearch.randomizedtesting.RandomizedRunner.runSingleTest(RandomizedRunner.java:943)
	at com.carrotsearch.randomizedtesting.RandomizedRunner$5.evaluate(RandomizedRunner.java:829)
	at com.carrotsearch.randomizedtesting.RandomizedRunner$6.evaluate(RandomizedRunner.java:879)
	at com.carrotsearch.randomizedtesting.RandomizedRunner$7.evaluate(RandomizedRunner.java:890)
	at com.carrotsearch.randomizedtesting.rules.StatementAdapter.evaluate(StatementAdapter.java:36)
	at com.carrotsearch.randomizedtesting.rules.SystemPropertiesRestoreRule$1.evaluate(SystemPropertiesRestoreRule.java:57)
	at org.apache.lucene.util.AbstractBeforeAfterRule$1.evaluate(AbstractBeforeAfterRule.java:45)
	at com.carrotsearch.randomizedtesting.rules.StatementAdapter.evaluate(StatementAdapter.java:36)
	at org.apache.lucene.util.TestRuleStoreClassName$1.evaluate(TestRuleStoreClassName.java:41)
	at com.carrotsearch.randomizedtesting.rules.NoShadowingOrOverridesOnMethodsRule$1.evaluate(NoShadowingOrOverridesOnMethodsRule.java:40)
	at com.carrotsearch.randomizedtesting.rules.NoShadowingOrOverridesOnMethodsRule$1.evaluate(NoShadowingOrOverridesOnMethodsRule.java:40)
	at com.carrotsearch.randomizedtesting.rules.StatementAdapter.evaluate(StatementAdapter.java:36)
	at com.carrotsearch.randomizedtesting.rules.StatementAdapter.evaluate(StatementAdapter.java:36)
	at com.carrotsearch.randomizedtesting.rules.StatementAdapter.evaluate(StatementAdapter.java:36)
	at org.apache.lucene.util.TestRuleAssertionsRequired$1.evaluate(TestRuleAssertionsRequired.java:53)
	at org.apache.lucene.util.TestRuleMarkFailure$1.evaluate(TestRuleMarkFailure.java:47)
	at org.apache.lucene.util.TestRuleIgnoreAfterMaxFailures$1.evaluate(TestRuleIgnoreAfterMaxFailures.java:64)
	at org.apache.lucene.util.TestRuleIgnoreTestSuites$1.evaluate(TestRuleIgnoreTestSuites.java:54)
	at com.carrotsearch.randomizedtesting.rules.StatementAdapter.evaluate(StatementAdapter.java:36)
	at com.carrotsearch.randomizedtesting.ThreadLeakControl$StatementRunner.run(ThreadLeakControl.java:368)
	at java.lang.Thread.run(Thread.java:748)




Build Log:
[...truncated 13585 lines...]
   [junit4] Suite: org.apache.solr.cloud.LIROnShardRestartTest
   [junit4]   2> Creating dataDir: /home/jenkins/jenkins-slave/workspace/Lucene-Solr-NightlyTests-7.x/checkout/solr/build/solr-core/test/J0/temp/solr.cloud.LIROnShardRestartTest_F9084EEA1D47C3E9-001/init-core-data-001
   [junit4]   2> 669126 WARN  (SUITE-LIROnShardRestartTest-seed#[F9084EEA1D47C3E9]-worker) [    ] o.a.s.SolrTestCaseJ4 startTrackingSearchers: numOpens=9 numCloses=9
   [junit4]   2> 669126 INFO  (SUITE-LIROnShardRestartTest-seed#[F9084EEA1D47C3E9]-worker) [    ] o.a.s.SolrTestCaseJ4 Using PointFields (NUMERIC_POINTS_SYSPROP=true) w/NUMERIC_DOCVALUES_SYSPROP=false
   [junit4]   2> 669128 INFO  (SUITE-LIROnShardRestartTest-seed#[F9084EEA1D47C3E9]-worker) [    ] o.a.s.SolrTestCaseJ4 Randomized ssl (true) and clientAuth (false) via: @org.apache.solr.util.RandomizeSSL(reason=, ssl=NaN, value=NaN, clientAuth=NaN)
   [junit4]   2> 669128 INFO  (SUITE-LIROnShardRestartTest-seed#[F9084EEA1D47C3E9]-worker) [    ] o.a.s.SolrTestCaseJ4 SecureRandom sanity checks: test.solr.allowed.securerandom=null & java.security.egd=file:/dev/./urandom
   [junit4]   2> 669145 INFO  (SUITE-LIROnShardRestartTest-seed#[F9084EEA1D47C3E9]-worker) [    ] o.a.s.c.MiniSolrCloudCluster Starting cluster of 3 servers in /home/jenkins/jenkins-slave/workspace/Lucene-Solr-NightlyTests-7.x/checkout/solr/build/solr-core/test/J0/temp/solr.cloud.LIROnShardRestartTest_F9084EEA1D47C3E9-001/tempDir-001
   [junit4]   2> 669145 INFO  (SUITE-LIROnShardRestartTest-seed#[F9084EEA1D47C3E9]-worker) [    ] o.a.s.c.ZkTestServer STARTING ZK TEST SERVER
   [junit4]   2> 669145 INFO  (Thread-551) [    ] o.a.s.c.ZkTestServer client port:0.0.0.0/0.0.0.0:0
   [junit4]   2> 669145 INFO  (Thread-551) [    ] o.a.s.c.ZkTestServer Starting server
   [junit4]   2> 669167 ERROR (Thread-551) [    ] o.a.z.s.ZooKeeperServer ZKShutdownHandler is not registered, so ZooKeeper server won't take any action on ERROR or SHUTDOWN server state changes
   [junit4]   2> 669255 INFO  (SUITE-LIROnShardRestartTest-seed#[F9084EEA1D47C3E9]-worker) [    ] o.a.s.c.ZkTestServer start zk server on port:33025
   [junit4]   2> 669356 INFO  (zkConnectionManagerCallback-461-thread-1) [    ] o.a.s.c.c.ConnectionManager zkClient has connected
   [junit4]   2> 669407 INFO  (jetty-launcher-458-thread-1) [    ] o.e.j.s.Server jetty-9.4.11.v20180605; built: 2018-06-05T18:24:03.829Z; git: d5fc0523cfa96bfebfbda19606cad384d772f04c; jvm 1.8.0_172-b11
   [junit4]   2> 669444 INFO  (jetty-launcher-458-thread-2) [    ] o.e.j.s.Server jetty-9.4.11.v20180605; built: 2018-06-05T18:24:03.829Z; git: d5fc0523cfa96bfebfbda19606cad384d772f04c; jvm 1.8.0_172-b11
   [junit4]   2> 669470 INFO  (jetty-launcher-458-thread-3) [    ] o.e.j.s.Server jetty-9.4.11.v20180605; built: 2018-06-05T18:24:03.829Z; git: d5fc0523cfa96bfebfbda19606cad384d772f04c; jvm 1.8.0_172-b11
   [junit4]   2> 669471 INFO  (jetty-launcher-458-thread-2) [    ] o.e.j.s.session DefaultSessionIdManager workerName=node0
   [junit4]   2> 669471 INFO  (jetty-launcher-458-thread-2) [    ] o.e.j.s.session No SessionScavenger set, using defaults
   [junit4]   2> 669471 INFO  (jetty-launcher-458-thread-2) [    ] o.e.j.s.session node0 Scavenging every 660000ms
   [junit4]   2> 669471 INFO  (jetty-launcher-458-thread-2) [    ] o.e.j.s.h.ContextHandler Started o.e.j.s.ServletContextHandler@483c647a{/solr,null,AVAILABLE}
   [junit4]   2> 669473 INFO  (jetty-launcher-458-thread-2) [    ] o.e.j.s.AbstractConnector Started ServerConnector@49efaeda{SSL,[ssl, http/1.1]}{127.0.0.1:41642}
   [junit4]   2> 669473 INFO  (jetty-launcher-458-thread-2) [    ] o.e.j.s.Server Started @669523ms
   [junit4]   2> 669473 INFO  (jetty-launcher-458-thread-2) [    ] o.a.s.c.s.e.JettySolrRunner Jetty properties: {hostContext=/solr, hostPort=41642}
   [junit4]   2> 669473 ERROR (jetty-launcher-458-thread-2) [    ] o.a.s.u.StartupLoggingUtils Missing Java Option solr.log.dir. Logging may be missing or incomplete.
   [junit4]   2> 669473 INFO  (jetty-launcher-458-thread-2) [    ] o.a.s.s.SolrDispatchFilter Using logger factory org.apache.logging.slf4j.Log4jLoggerFactory
   [junit4]   2> 669473 INFO  (jetty-launcher-458-thread-2) [    ] o.a.s.s.SolrDispatchFilter  ___      _       Welcome to Apache Solr™ version 7.5.0
   [junit4]   2> 669473 INFO  (jetty-launcher-458-thread-2) [    ] o.a.s.s.SolrDispatchFilter / __| ___| |_ _   Starting in cloud mode on port null
   [junit4]   2> 669473 INFO  (jetty-launcher-458-thread-2) [    ] o.a.s.s.SolrDispatchFilter \__ \/ _ \ | '_|  Install dir: null
   [junit4]   2> 669473 INFO  (jetty-launcher-458-thread-2) [    ] o.a.s.s.SolrDispatchFilter |___/\___/_|_|    Start time: 2018-08-21T06:42:07.886Z
   [junit4]   2> 669532 INFO  (jetty-launcher-458-thread-1) [    ] o.e.j.s.session DefaultSessionIdManager workerName=node0
   [junit4]   2> 669532 INFO  (jetty-launcher-458-thread-1) [    ] o.e.j.s.session No SessionScavenger set, using defaults
   [junit4]   2> 669532 INFO  (jetty-launcher-458-thread-1) [    ] o.e.j.s.session node0 Scavenging every 600000ms
   [junit4]   2> 669533 INFO  (jetty-launcher-458-thread-1) [    ] o.e.j.s.h.ContextHandler Started o.e.j.s.ServletContextHandler@2c9d3121{/solr,null,AVAILABLE}
   [junit4]   2> 669616 INFO  (jetty-launcher-458-thread-1) [    ] o.e.j.s.AbstractConnector Started ServerConnector@2b981dc3{SSL,[ssl, http/1.1]}{127.0.0.1:39489}
   [junit4]   2> 669617 INFO  (jetty-launcher-458-thread-1) [    ] o.e.j.s.Server Started @669667ms
   [junit4]   2> 669617 INFO  (jetty-launcher-458-thread-1) [    ] o.a.s.c.s.e.JettySolrRunner Jetty properties: {hostContext=/solr, hostPort=39489}
   [junit4]   2> 669617 ERROR (jetty-launcher-458-thread-1) [    ] o.a.s.u.StartupLoggingUtils Missing Java Option solr.log.dir. Logging may be missing or incomplete.
   [junit4]   2> 669617 INFO  (jetty-launcher-458-thread-1) [    ] o.a.s.s.SolrDispatchFilter Using logger factory org.apache.logging.slf4j.Log4jLoggerFactory
   [junit4]   2> 669617 INFO  (jetty-launcher-458-thread-1) [    ] o.a.s.s.SolrDispatchFilter  ___      _       Welcome to Apache Solr™ version 7.5.0
   [junit4]   2> 669617 INFO  (jetty-launcher-458-thread-1) [    ] o.a.s.s.SolrDispatchFilter / __| ___| |_ _   Starting in cloud mode on port null
   [junit4]   2> 669617 INFO  (jetty-launcher-458-thread-1) [    ] o.a.s.s.SolrDispatchFilter \__ \/ _ \ | '_|  Install dir: null
   [junit4]   2> 669617 INFO  (jetty-launcher-458-thread-1) [    ] o.a.s.s.SolrDispatchFilter |___/\___/_|_|    Start time: 2018-08-21T06:42:08.030Z
   [junit4]   2> 669638 INFO  (zkConnectionManagerCallback-463-thread-1) [    ] o.a.s.c.c.ConnectionManager zkClient has connected
   [junit4]   2> 669638 INFO  (jetty-launcher-458-thread-2) [    ] o.a.s.s.SolrDispatchFilter solr.xml found in ZooKeeper. Loading...
   [junit4]   2> 669654 INFO  (jetty-launcher-458-thread-3) [    ] o.e.j.s.session DefaultSessionIdManager workerName=node0
   [junit4]   2> 669654 INFO  (jetty-launcher-458-thread-3) [    ] o.e.j.s.session No SessionScavenger set, using defaults
   [junit4]   2> 669654 INFO  (jetty-launcher-458-thread-3) [    ] o.e.j.s.session node0 Scavenging every 600000ms
   [junit4]   2> 669677 INFO  (jetty-launcher-458-thread-3) [    ] o.e.j.s.h.ContextHandler Started o.e.j.s.ServletContextHandler@38001607{/solr,null,AVAILABLE}
   [junit4]   2> 669678 INFO  (jetty-launcher-458-thread-3) [    ] o.e.j.s.AbstractConnector Started ServerConnector@232ccb9b{SSL,[ssl, http/1.1]}{127.0.0.1:45287}
   [junit4]   2> 669678 INFO  (jetty-launcher-458-thread-3) [    ] o.e.j.s.Server Started @669728ms
   [junit4]   2> 669678 INFO  (jetty-launcher-458-thread-3) [    ] o.a.s.c.s.e.JettySolrRunner Jetty properties: {hostContext=/solr, hostPort=45287}
   [junit4]   2> 669678 ERROR (jetty-launcher-458-thread-3) [    ] o.a.s.u.StartupLoggingUtils Missing Java Option solr.log.dir. Logging may be missing or incomplete.
   [junit4]   2> 669678 INFO  (jetty-launcher-458-thread-3) [    ] o.a.s.s.SolrDispatchFilter Using logger factory org.apache.logging.slf4j.Log4jLoggerFactory
   [junit4]   2> 669678 INFO  (jetty-launcher-458-thread-3) [    ] o.a.s.s.SolrDispatchFilter  ___      _       Welcome to Apache Solr™ version 7.5.0
   [junit4]   2> 669678 INFO  (jetty-launcher-458-thread-3) [    ] o.a.s.s.SolrDispatchFilter / __| ___| |_ _   Starting in cloud mode on port null
   [junit4]   2> 669678 INFO  (jetty-launcher-458-thread-3) [    ] o.a.s.s.SolrDispatchFilter \__ \/ _ \ | '_|  Install dir: null
   [junit4]   2> 669678 INFO  (jetty-launcher-458-thread-3) [    ] o.a.s.s.SolrDispatchFilter |___/\___/_|_|    Start time: 2018-08-21T06:42:08.091Z
   [junit4]   2> 669679 INFO  (zkConnectionManagerCallback-465-thread-1) [    ] o.a.s.c.c.ConnectionManager zkClient has connected
   [junit4]   2> 669685 INFO  (jetty-launcher-458-thread-1) [    ] o.a.s.s.SolrDispatchFilter solr.xml found in ZooKeeper. Loading...
   [junit4]   2> 669746 INFO  (zkConnectionManagerCallback-467-thread-1) [    ] o.a.s.c.c.ConnectionManager zkClient has connected
   [junit4]   2> 669856 INFO  (jetty-launcher-458-thread-3) [    ] o.a.s.s.SolrDispatchFilter solr.xml found in ZooKeeper. Loading...
   [junit4]   2> 670536 INFO  (jetty-launcher-458-thread-2) [    ] o.a.s.c.ZkContainer Zookeeper client=127.0.0.1:33025/solr
   [junit4]   2> 670538 INFO  (zkConnectionManagerCallback-471-thread-1) [    ] o.a.s.c.c.ConnectionManager zkClient has connected
   [junit4]   2> 670738 INFO  (zkConnectionManagerCallback-473-thread-1) [    ] o.a.s.c.c.ConnectionManager zkClient has connected
   [junit4]   2> 670922 INFO  (jetty-launcher-458-thread-1) [    ] o.a.s.c.ZkContainer Zookeeper client=127.0.0.1:33025/solr
   [junit4]   2> 670974 INFO  (zkConnectionManagerCallback-479-thread-1) [    ] o.a.s.c.c.ConnectionManager zkClient has connected
   [junit4]   2> 671084 INFO  (zkConnectionManagerCallback-481-thread-1) [    ] o.a.s.c.c.ConnectionManager zkClient has connected
   [junit4]   2> 671237 INFO  (jetty-launcher-458-thread-1) [n:127.0.0.1:39489_solr    ] o.a.s.c.OverseerElectionContext I am going to be the leader 127.0.0.1:39489_solr
   [junit4]   2> 671238 INFO  (jetty-launcher-458-thread-1) [n:127.0.0.1:39489_solr    ] o.a.s.c.Overseer Overseer (id=73182921116352519-127.0.0.1:39489_solr-n_0000000000) starting
   [junit4]   2> 671283 INFO  (zkConnectionManagerCallback-489-thread-1) [    ] o.a.s.c.c.ConnectionManager zkClient has connected
   [junit4]   2> 671285 INFO  (jetty-launcher-458-thread-3) [    ] o.a.s.c.ZkContainer Zookeeper client=127.0.0.1:33025/solr
   [junit4]   2> 671287 INFO  (zkConnectionManagerCallback-492-thread-1) [    ] o.a.s.c.c.ConnectionManager zkClient has connected
   [junit4]   2> 671301 INFO  (jetty-launcher-458-thread-1) [n:127.0.0.1:39489_solr    ] o.a.s.c.s.i.ZkClientClusterStateProvider Cluster at 127.0.0.1:33025/solr ready
   [junit4]   2> 671302 INFO  (jetty-launcher-458-thread-1) [n:127.0.0.1:39489_solr    ] o.a.s.c.ZkController Register node as live in ZooKeeper:/live_nodes/127.0.0.1:39489_solr
   [junit4]   2> 671316 INFO  (OverseerStateUpdate-73182921116352519-127.0.0.1:39489_solr-n_0000000000) [n:127.0.0.1:39489_solr    ] o.a.s.c.Overseer Starting to work on the main queue : 127.0.0.1:39489_solr
   [junit4]   2> 671344 INFO  (OverseerStateUpdate-73182921116352519-127.0.0.1:39489_solr-n_0000000000) [n:127.0.0.1:39489_solr    ] o.a.s.c.c.ZkStateReader Updated live nodes from ZooKeeper... (0) -> (1)
   [junit4]   2> 671460 INFO  (zkCallback-488-thread-1) [    ] o.a.s.c.c.ZkStateReader Updated live nodes from ZooKeeper... (0) -> (1)
   [junit4]   2> 671460 INFO  (zkConnectionManagerCallback-494-thread-1) [    ] o.a.s.c.c.ConnectionManager zkClient has connected
   [junit4]   2> 671488 INFO  (jetty-launcher-458-thread-1) [n:127.0.0.1:39489_solr    ] o.a.s.h.a.MetricsHistoryHandler No .system collection, keeping metrics history in memory.
   [junit4]   2> 671578 INFO  (jetty-launcher-458-thread-3) [n:127.0.0.1:45287_solr    ] o.a.s.c.c.ZkStateReader Updated live nodes from ZooKeeper... (0) -> (1)
   [junit4]   2> 671613 INFO  (jetty-launcher-458-thread-1) [n:127.0.0.1:39489_solr    ] o.a.s.m.r.SolrJmxReporter JMX monitoring for 'solr_39489.solr.node' (registry 'solr.node') enabled at server: com.sun.jmx.mbeanserver.JmxMBeanServer@5025b3e7
   [junit4]   2> 671651 INFO  (jetty-launcher-458-thread-3) [n:127.0.0.1:45287_solr    ] o.a.s.c.TransientSolrCoreCacheDefault Allocating transient cache for 2147483647 transient cores
   [junit4]   2> 671651 INFO  (jetty-launcher-458-thread-3) [n:127.0.0.1:45287_solr    ] o.a.s.c.ZkController Register node as live in ZooKeeper:/live_nodes/127.0.0.1:45287_solr
   [junit4]   2> 671690 INFO  (zkCallback-488-thread-1) [    ] o.a.s.c.c.ZkStateReader Updated live nodes from ZooKeeper... (1) -> (2)
   [junit4]   2> 671706 INFO  (zkCallback-480-thread-2) [    ] o.a.s.c.c.ZkStateReader Updated live nodes from ZooKeeper... (1) -> (2)
   [junit4]   2> 671713 INFO  (jetty-launcher-458-thread-1) [n:127.0.0.1:39489_solr    ] o.a.s.m.r.SolrJmxReporter JMX monitoring for 'solr_39489.solr.jvm' (registry 'solr.jvm') enabled at server: com.sun.jmx.mbeanserver.JmxMBeanServer@5025b3e7
   [junit4]   2> 671713 INFO  (jetty-launcher-458-thread-1) [n:127.0.0.1:39489_solr    ] o.a.s.m.r.SolrJmxReporter JMX monitoring for 'solr_39489.solr.jetty' (registry 'solr.jetty') enabled at server: com.sun.jmx.mbeanserver.JmxMBeanServer@5025b3e7
   [junit4]   2> 671810 INFO  (jetty-launcher-458-thread-1) [n:127.0.0.1:39489_solr    ] o.a.s.c.CorePropertiesLocator Found 0 core definitions underneath /home/jenkins/jenkins-slave/workspace/Lucene-Solr-NightlyTests-7.x/checkout/solr/build/solr-core/test/J0/temp/solr.cloud.LIROnShardRestartTest_F9084EEA1D47C3E9-001/tempDir-001/node1/.
   [junit4]   2> 671815 INFO  (zkCallback-493-thread-1) [    ] o.a.s.c.c.ZkStateReader Updated live nodes from ZooKeeper... (1) -> (2)
   [junit4]   2> 671872 INFO  (zkConnectionManagerCallback-502-thread-1) [    ] o.a.s.c.c.ConnectionManager zkClient has connected
   [junit4]   2> 671873 INFO  (jetty-launcher-458-thread-3) [n:127.0.0.1:45287_solr    ] o.a.s.c.c.ZkStateReader Updated live nodes from ZooKeeper... (0) -> (2)
   [junit4]   2> 671895 INFO  (jetty-launcher-458-thread-3) [n:127.0.0.1:45287_solr    ] o.a.s.c.s.i.ZkClientClusterStateProvider Cluster at 127.0.0.1:33025/solr ready
   [junit4]   2> 671895 INFO  (jetty-launcher-458-thread-3) [n:127.0.0.1:45287_solr    ] o.a.s.h.a.MetricsHistoryHandler No .system collection, keeping metrics history in memory.
   [junit4]   2> 672072 INFO  (jetty-launcher-458-thread-3) [n:127.0.0.1:45287_solr    ] o.a.s.m.r.SolrJmxReporter JMX monitoring for 'solr_45287.solr.node' (registry 'solr.node') enabled at server: com.sun.jmx.mbeanserver.JmxMBeanServer@5025b3e7
   [junit4]   2> 672095 INFO  (jetty-launcher-458-thread-3) [n:127.0.0.1:45287_solr    ] o.a.s.m.r.SolrJmxReporter JMX monitoring for 'solr_45287.solr.jvm' (registry 'solr.jvm') enabled at server: com.sun.jmx.mbeanserver.JmxMBeanServer@5025b3e7
   [junit4]   2> 672095 INFO  (jetty-launcher-458-thread-3) [n:127.0.0.1:45287_solr    ] o.a.s.m.r.SolrJmxReporter JMX monitoring for 'solr_45287.solr.jetty' (registry 'solr.jetty') enabled at server: com.sun.jmx.mbeanserver.JmxMBeanServer@5025b3e7
   [junit4]   2> 672109 INFO  (jetty-launcher-458-thread-3) [n:127.0.0.1:45287_solr    ] o.a.s.c.CorePropertiesLocator Found 0 core definitions underneath /home/jenkins/jenkins-slave/workspace/Lucene-Solr-NightlyTests-7.x/checkout/solr/build/solr-core/test/J0/temp/solr.cloud.LIROnShardRestartTest_F9084EEA1D47C3E9-001/tempDir-001/node3/.
   [junit4]   2> 672479 INFO  (jetty-launcher-458-thread-2) [n:127.0.0.1:41642_solr    ] o.a.s.c.c.ZkStateReader Updated live nodes from ZooKeeper... (0) -> (2)
   [junit4]   2> 672507 INFO  (jetty-launcher-458-thread-2) [n:127.0.0.1:41642_solr    ] o.a.s.c.TransientSolrCoreCacheDefault Allocating transient cache for 2147483647 transient cores
   [junit4]   2> 672507 INFO  (jetty-launcher-458-thread-2) [n:127.0.0.1:41642_solr    ] o.a.s.c.ZkController Register node as live in ZooKeeper:/live_nodes/127.0.0.1:41642_solr
   [junit4]   2> 672509 INFO  (zkCallback-488-thread-1) [    ] o.a.s.c.c.ZkStateReader Updated live nodes from ZooKeeper... (2) -> (3)
   [junit4]   2> 672510 INFO  (zkCallback-493-thread-1) [    ] o.a.s.c.c.ZkStateReader Updated live nodes from ZooKeeper... (2) -> (3)
   [junit4]   2> 672533 INFO  (zkCallback-480-thread-2) [    ] o.a.s.c.c.ZkStateReader Updated live nodes from ZooKeeper... (2) -> (3)
   [junit4]   2> 672539 INFO  (zkCallback-472-thread-1) [    ] o.a.s.c.c.ZkStateReader Updated live nodes from ZooKeeper... (2) -> (3)
   [junit4]   2> 672559 INFO  (zkCallback-501-thread-1) [    ] o.a.s.c.c.ZkStateReader Updated live nodes from ZooKeeper... (2) -> (3)
   [junit4]   2> 672660 INFO  (zkConnectionManagerCallback-508-thread-1) [    ] o.a.s.c.c.ConnectionManager zkClient has connected
   [junit4]   2> 672660 INFO  (jetty-launcher-458-thread-2) [n:127.0.0.1:41642_solr    ] o.a.s.c.c.ZkStateReader Updated live nodes from ZooKeeper... (0) -> (3)
   [junit4]   2> 672674 INFO  (jetty-launcher-458-thread-2) [n:127.0.0.1:41642_solr    ] o.a.s.c.s.i.ZkClientClusterStateProvider Cluster at 127.0.0.1:33025/solr ready
   [junit4]   2> 672689 INFO  (jetty-launcher-458-thread-2) [n:127.0.0.1:41642_solr    ] o.a.s.h.a.MetricsHistoryHandler No .system collection, keeping metrics history in memory.
   [junit4]   2> 672800 INFO  (jetty-launcher-458-thread-2) [n:127.0.0.1:41642_solr    ] o.a.s.m.r.SolrJmxReporter JMX monitoring for 'solr_41642.solr.node' (registry 'solr.node') enabled at server: com.sun.jmx.mbeanserver.JmxMBeanServer@5025b3e7
   [junit4]   2> 672854 INFO  (jetty-launcher-458-thread-2) [n:127.0.0.1:41642_solr    ] o.a.s.m.r.SolrJmxReporter JMX monitoring for 'solr_41642.solr.jvm' (registry 'solr.jvm') enabled at server: com.sun.jmx.mbeanserver.JmxMBeanServer@5025b3e7
   [junit4]   2> 672854 INFO  (jetty-launcher-458-thread-2) [n:127.0.0.1:41642_solr    ] o.a.s.m.r.SolrJmxReporter JMX monitoring for 'solr_41642.solr.jetty' (registry 'solr.jetty') enabled at server: com.sun.jmx.mbeanserver.JmxMBeanServer@5025b3e7
   [junit4]   2> 672855 INFO  (jetty-launcher-458-thread-2) [n:127.0.0.1:41642_solr    ] o.a.s.c.CorePropertiesLocator Found 0 core definitions underneath /home/jenkins/jenkins-slave/workspace/Lucene-Solr-NightlyTests-7.x/checkout/solr/build/solr-core/test/J0/temp/solr.cloud.LIROnShardRestartTest_F9084EEA1D47C3E9-001/tempDir-001/node2/.
   [junit4]   2> 673114 INFO  (zkConnectionManagerCallback-511-thread-1) [    ] o.a.s.c.c.ConnectionManager zkClient has connected
   [junit4]   2> 673119 INFO  (zkConnectionManagerCallback-516-thread-1) [    ] o.a.s.c.c.ConnectionManager zkClient has connected
   [junit4]   2> 673128 INFO  (SUITE-LIROnShardRestartTest-seed#[F9084EEA1D47C3E9]-worker) [    ] o.a.s.c.c.ZkStateReader Updated live nodes from ZooKeeper... (0) -> (3)
   [junit4]   2> 673141 INFO  (SUITE-LIROnShardRestartTest-seed#[F9084EEA1D47C3E9]-worker) [    ] o.a.s.c.s.i.ZkClientClusterStateProvider Cluster at 127.0.0.1:33025/solr ready
   [junit4]   2> 673394 INFO  (TEST-LIROnShardRestartTest.testAllReplicasInLIR-seed#[F9084EEA1D47C3E9]) [    ] o.a.s.SolrTestCaseJ4 ###Starting testAllReplicasInLIR
   [junit4]   2> 673513 INFO  (qtp276341149-2484) [n:127.0.0.1:41642_solr    ] o.a.s.h.a.CollectionsHandler Invoked Collection Action :create with params pullReplicas=0&name=allReplicasInLIR&nrtReplicas=3&action=CREATE&numShards=1&tlogReplicas=0&wt=javabin&version=2 and sendToOCPQueue=true
   [junit4]   2> 673515 INFO  (OverseerThreadFactory-1267-thread-1-processing-n:127.0.0.1:39489_solr) [n:127.0.0.1:39489_solr    ] o.a.s.c.a.c.CreateCollectionCmd Create collection allReplicasInLIR
   [junit4]   2> 673516 INFO  (OverseerThreadFactory-1267-thread-1-processing-n:127.0.0.1:39489_solr) [n:127.0.0.1:39489_solr    ] o.a.s.c.c.ZkConfigManager Copying zk node /configs/_default/protwords.txt to /configs/allReplicasInLIR.AUTOCREATED/protwords.txt
   [junit4]   2> 673517 INFO  (OverseerThreadFactory-1267-thread-1-processing-n:127.0.0.1:39489_solr) [n:127.0.0.1:39489_solr    ] o.a.s.c.c.ZkConfigManager Copying zk node /configs/_default/managed-schema to /configs/allReplicasInLIR.AUTOCREATED/managed-schema
   [junit4]   2> 673531 INFO  (OverseerThreadFactory-1267-thread-1-processing-n:127.0.0.1:39489_solr) [n:127.0.0.1:39489_solr    ] o.a.s.c.c.ZkConfigManager Copying zk node /configs/_default/solrconfig.xml to /configs/allReplicasInLIR.AUTOCREATED/solrconfig.xml
   [junit4]   2> 673533 INFO  (OverseerThreadFactory-1267-thread-1-processing-n:127.0.0.1:39489_solr) [n:127.0.0.1:39489_solr    ] o.a.s.c.c.ZkConfigManager Copying zk node /configs/_default/synonyms.txt to /configs/allReplicasInLIR.AUTOCREATED/synonyms.txt
   [junit4]   2> 673534 INFO  (OverseerThreadFactory-1267-thread-1-processing-n:127.0.0.1:39489_solr) [n:127.0.0.1:39489_solr    ] o.a.s.c.c.ZkConfigManager Copying zk node /configs/_default/stopwords.txt to /configs/allReplicasInLIR.AUTOCREATED/stopwords.txt
   [junit4]   2> 673568 INFO  (OverseerThreadFactory-1267-thread-1-processing-n:127.0.0.1:39489_solr) [n:127.0.0.1:39489_solr    ] o.a.s.c.c.ZkConfigManager Copying zk node /configs/_default/params.json to /configs/allReplicasInLIR.AUTOCREATED/params.json
   [junit4]   2> 673570 INFO  (OverseerThreadFactory-1267-thread-1-processing-n:127.0.0.1:39489_solr) [n:127.0.0.1:39489_solr    ] o.a.s.c.c.ZkConfigManager Copying zk node /configs/_default/lang/contractions_it.txt to /configs/allReplicasInLIR.AUTOCREATED/lang/contractions_it.txt
   [junit4]   2> 673595 INFO  (OverseerThreadFactory-1267-thread-1-processing-n:127.0.0.1:39489_solr) [n:127.0.0.1:39489_solr    ] o.a.s.c.c.ZkConfigManager Copying zk node /configs/_default/lang/stopwords_no.txt to /configs/allReplicasInLIR.AUTOCREATED/lang/stopwords_no.txt
   [junit4]   2> 673625 INFO  (OverseerThreadFactory-1267-thread-1-processing-n:127.0.0.1:39489_solr) [n:127.0.0.1:39489_solr    ] o.a.s.c.c.ZkConfigManager Copying zk node /configs/_default/lang/stopwords_hy.txt to /configs/allReplicasInLIR.AUTOCREATED/lang/stopwords_hy.txt
   [junit4]   2> 673626 INFO  (OverseerThreadFactory-1267-thread-1-processing-n:127.0.0.1:39489_solr) [n:127.0.0.1:39489_solr    ] o.a.s.c.c.ZkConfigManager Copying zk node /configs/_default/lang/stemdict_nl.txt to /configs/allReplicasInLIR.AUTOCREATED/lang/stemdict_nl.txt
   [junit4]   2> 673628 INFO  (OverseerThreadFactory-1267-thread-1-processing-n:127.0.0.1:39489_solr) [n:127.0.0.1:39489_solr    ] o.a.s.c.c.ZkConfigManager Copying zk node /configs/_default/lang/contractions_ca.txt to /configs/allReplicasInLIR.AUTOCREATED/lang/contractions_ca.txt
   [junit4]   2> 673662 INFO  (OverseerThreadFactory-1267-thread-1-processing-n:127.0.0.1:39489_solr) [n:127.0.0.1:39489_solr    ] o.a.s.c.c.ZkConfigManager Copying zk node /configs/_default/lang/stopwords_id.txt to /configs/allReplicasInLIR.AUTOCREATED/lang/stopwords_id.txt
   [junit4]   2> 673664 INFO  (OverseerThreadFactory-1267-thread-1-processing-n:127.0.0.1:39489_solr) [n:127.0.0.1:39489_solr    ] o.a.s.c.c.ZkConfigManager Copying zk node /configs/_default/lang/stopwords_ga.txt to /configs/allReplicasInLIR.AUTOCREATED/lang/stopwords_ga.txt
   [junit4]   2> 673715 INFO  (OverseerThreadFactory-1267-thread-1-processing-n:127.0.0.1:39489_solr) [n:127.0.0.1:39489_solr    ] o.a.s.c.c.ZkConfigManager Copying zk node /configs/_default/lang/stopwords_da.txt to /configs/allReplicasInLIR.AUTOCREATED/lang/stopwords_da.txt
   [junit4]   2> 673717 INFO  (OverseerThreadFactory-1267-thread-1-processing-n:127.0.0.1:39489_solr) [n:127.0.0.1:39489_solr    ] o.a.s.c.c.ZkConfigManager Copying zk node /configs/_default/lang/stopwords_hi.txt to /configs/allReplicasInLIR.AUTOCREATED/lang/stopwords_hi.txt
   [junit4]   2> 673732 INFO  (OverseerThreadFactory-1267-thread-1-processing-n:127.0.0.1:39489_solr) [n:127.0.0.1:39489_solr    ] o.a.s.c.c.ZkConfigManager Copying zk node /configs/_default/lang/stopwords_ja.txt to /configs/allReplicasInLIR.AUTOCREATED/lang/stopwords_ja.txt
   [junit4]   2> 673747 INFO  (OverseerThreadFactory-1267-thread-1-processing-n:127.0.0.1:39489_solr) [n:127.0.0.1:39489_solr    ] o.a.s.c.c.ZkConfigManager Copying zk node /configs/_default/lang/stopwords_pt.txt to /configs/allReplicasInLIR.AUTOCREATED/lang/stopwords_pt.txt
   [junit4]   2> 673750 INFO  (OverseerThreadFactory-1267-thread-1-processing-n:127.0.0.1:39489_solr) [n:127.0.0.1:39489_solr    ] o.a.s.c.c.ZkConfigManager Copying zk node /configs/_default/lang/stopwords_hu.txt to /configs/allReplicasInLIR.AUTOCREATED/lang/stopwords_hu.txt
   [junit4]   2> 673772 INFO  (OverseerThreadFactory-1267-thread-1-processing-n:127.0.0.1:39489_solr) [n:127.0.0.1:39489_solr    ] o.a.s.c.c.ZkConfigManager Copying zk node /configs/_default/lang/stopwords_el.txt to /configs/allReplicasInLIR.AUTOCREATED/lang/stopwords_el.txt
   [junit4]   2> 673784 INFO  (OverseerThreadFactory-1267-thread-1-processing-n:127.0.0.1:39489_solr) [n:127.0.0.1:39489_solr    ] o.a.s.c.c.ZkConfigManager Copying zk node /configs/_default/lang/stopwords_ru.txt to /configs/allReplicasInLIR.AUTOCREATED/lang/stopwords_ru.txt
   [junit4]   2> 673786 INFO  (OverseerThreadFactory-1267-thread-1-processing-n:127.0.0.1:39489_solr) [n:127.0.0.1:39489_solr    ] o.a.s.c.c.ZkConfigManager Copying zk node /configs/_default/lang/stopwords_tr.txt to /configs/allReplicasInLIR.AUTOCREATED/lang/stopwords_tr.txt
   [junit4]   2> 673804 INFO  (OverseerThreadFactory-1267-thread-1-processing-n:127.0.0.1:39489_solr) [n:127.0.0.1:39489_solr    ] o.a.s.c.c.ZkConfigManager Copying zk node /configs/_default/lang/stopwords_ar.txt to /configs/allReplicasInLIR.AUTOCREATED/lang/stopwords_ar.txt
   [junit4]   2> 673806 INFO  (OverseerThreadFactory-1267-thread-1-processing-n:127.0.0.1:39489_solr) [n:127.0.0.1:39489_solr    ] o.a.s.c.c.ZkConfigManager Copying zk node /configs/_default/lang/userdict_ja.txt to /configs/allReplicasInLIR.AUTOCREATED/lang/userdict_ja.txt
   [junit4]   2> 673808 INFO  (OverseerThreadFactory-1267-thread-1-processing-n:127.0.0.1:39489_solr) [n:127.0.0.1:39489_solr    ] o.a.s.c.c.ZkConfigManager Copying zk node /configs/_default/lang/stopwords_it.txt to /configs/allReplicasInLIR.AUTOCREATED/lang/stopwords_it.txt
   [junit4]   2> 673809 INFO  (OverseerThreadFactory-1267-thread-1-processing-n:127.0.0.1:39489_solr) [n:127.0.0.1:39489_solr    ] o.a.s.c.c.ZkConfigManager Copying zk node /configs/_default/lang/stopwords_eu.txt to /configs/allReplicasInLIR.AUTOCREATED/lang/stopwords_eu.txt
   [junit4]   2> 673811 INFO  (OverseerThreadFactory-1267-thread-1-processing-n:127.0.0.1:39489_solr) [n:127.0.0.1:39489_solr    ] o.a.s.c.c.ZkConfigManager Copying zk node /configs/_default/lang/stopwords_cz.txt to /configs/allReplicasInLIR.AUTOCREATED/lang/stopwords_cz.txt
   [junit4]   2> 673889 INFO  (OverseerThreadFactory-1267-thread-1-processing-n:127.0.0.1:39489_solr) [n:127.0.0.1:39489_solr    ] o.a.s.c.c.ZkConfigManager Copying zk node /configs/_default/lang/stoptags_ja.txt to /configs/allReplicasInLIR.AUTOCREATED/lang/stoptags_ja.txt
   [junit4]   2> 673935 INFO  (OverseerThreadFactory-1267-thread-1-processing-n:127.0.0.1:39489_solr) [n:127.0.0.1:39489_solr    ] o.a.s.c.c.ZkConfigManager Copying zk node /configs/_default/lang/contractions_fr.txt to /configs/allReplicasInLIR.AUTOCREATED/lang/contractions_fr.txt
   [junit4]   2> 673936 INFO  (OverseerThreadFactory-1267-thread-1-processing-n:127.0.0.1:39489_solr) [n:127.0.0.1:39489_solr    ] o.a.s.c.c.ZkConfigManager Copying zk node /configs/_default/lang/stopwords_fa.txt to /configs/allReplicasInLIR.AUTOCREATED/lang/stopwords_fa.txt
   [junit4]   2> 673964 INFO  (OverseerThreadFactory-1267-thread-1-processing-n:127.0.0.1:39489_solr) [n:127.0.0.1:39489_solr    ] o.a.s.c.c.ZkConfigManager Copying zk node /configs/_default/lang/stopwords_de.txt to /configs/allReplicasInLIR.AUTOCREATED/lang/stopwords_de.txt
   [junit4]   2> 673966 INFO  (OverseerThreadFactory-1267-thread-1-processing-n:127.0.0.1:39489_solr) [n:127.0.0.1:39489_solr    ] o.a.s.c.c.ZkConfigManager Copying zk node /configs/_default/lang/contractions_ga.txt to /configs/allReplicasInLIR.AUTOCREATED/lang/contractions_ga.txt
   [junit4]   2> 673975 INFO  (OverseerThreadFactory-1267-thread-1-processing-n:127.0.0.1:39489_solr) [n:127.0.0.1:39489_solr    ] o.a.s.c.c.ZkConfigManager Copying zk node /configs/_default/lang/stopwords_ca.txt to /configs/allReplicasInLIR.AUTOCREATED/lang/stopwords_ca.txt
   [junit4]   2> 673977 INFO  (OverseerThreadFactory-1267-thread-1-processing-n:127.0.0.1:39489_solr) [n:127.0.0.1:39489_solr    ] o.a.s.c.c.ZkConfigManager Copying zk node /configs/_default/lang/stopwords_nl.txt to /configs/allReplicasInLIR.AUTOCREATED/lang/stopwords_nl.txt
   [junit4]   2> 673978 INFO  (OverseerThreadFactory-1267-thread-1-processing-n:127.0.0.1:39489_solr) [n:127.0.0.1:39489_solr    ] o.a.s.c.c.ZkConfigManager Copying zk node /configs/_default/lang/stopwords_bg.txt to /configs/allReplicasInLIR.AUTOCREATED/lang/stopwords_bg.txt
   [junit4]   2> 673980 INFO  (OverseerThreadFactory-1267-thread-1-processing-n:127.0.0.1:39489_solr) [n:127.0.0.1:39489_solr    ] o.a.s.c.c.ZkConfigManager Copying zk node /configs/_default/lang/stopwords_es.txt to /configs/allReplicasInLIR.AUTOCREATED/lang/stopwords_es.txt
   [junit4]   2> 673982 INFO  (OverseerThreadFactory-1267-thread-1-processing-n:127.0.0.1:39489_solr) [n:127.0.0.1:39489_solr    ] o.a.s.c.c.ZkConfigManager Copying zk node /configs/_default/lang/stopwords_en.txt to /configs/allReplicasInLIR.AUTOCREATED/lang/stopwords_en.txt
   [junit4]   2> 673983 INFO  (OverseerThreadFactory-1267-thread-1-processing-n:127.0.0.1:39489_solr) [n:127.0.0.1:39489_solr    ] o.a.s.c.c.ZkConfigManager Copying zk node /configs/_default/lang/stopwords_lv.txt to /configs/allReplicasInLIR.AUTOCREATED/lang/stopwords_lv.txt
   [junit4]   2> 673985 INFO  (OverseerThreadFactory-1267-thread-1-processing-n:127.0.0.1:39489_solr) [n:127.0.0.1:39489_solr    ] o.a.s.c.c.ZkConfigManager Copying zk node /configs/_default/lang/stopwords_th.txt to /configs/allReplicasInLIR.AUTOCREATED/lang/stopwords_th.txt
   [junit4]   2> 673995 INFO  (OverseerThreadFactory-1267-thread-1-processing-n:127.0.0.1:39489_solr) [n:127.0.0.1:39489_solr    ] o.a.s.c.c.ZkConfigManager Copying zk node /configs/_default/lang/stopwords_ro.txt to /configs/allReplicasInLIR.AUTOCREATED/lang/stopwords_ro.txt
   [junit4]   2> 673997 INFO  (OverseerThreadFactory-1267-thread-1-processing-n:127.0.0.1:39489_solr) [n:127.0.0.1:39489_solr    ] o.a.s.c.c.ZkConfigManager Copying zk node /configs/_default/lang/stopwords_fr.txt to /configs/allReplicasInLIR.AUTOCREATED/lang/stopwords_fr.txt
   [junit4]   2> 673998 INFO  (OverseerThreadFactory-1267-thread-1-processing-n:127.0.0.1:39489_solr) [n:127.0.0.1:39489_solr    ] o.a.s.c.c.ZkConfigManager Copying zk node /configs/_default/lang/stopwords_sv.txt to /configs/allReplicasInLIR.AUTOCREATED/lang/stopwords_sv.txt
   [junit4]   2> 674008 INFO  (OverseerThreadFactory-1267-thread-1-processing-n:127.0.0.1:39489_solr) [n:127.0.0.1:39489_solr    ] o.a.s.c.c.ZkConfigManager Copying zk node /configs/_default/lang/stopwords_fi.txt to /configs/allReplicasInLIR.AUTOCREATED/lang/stopwords_fi.txt
   [junit4]   2> 674009 INFO  (OverseerThreadFactory-1267-thread-1-processing-n:127.0.0.1:39489_solr) [n:127.0.0.1:39489_solr    ] o.a.s.c.c.ZkConfigManager Copying zk node /configs/_default/lang/hyphenations_ga.txt to /configs/allReplicasInLIR.AUTOCREATED/lang/hyphenations_ga.txt
   [junit4]   2> 674019 INFO  (OverseerThreadFactory-1267-thread-1-processing-n:127.0.0.1:39489_solr) [n:127.0.0.1:39489_solr    ] o.a.s.c.c.ZkConfigManager Copying zk node /configs/_default/lang/stopwords_gl.txt to /configs/allReplicasInLIR.AUTOCREATED/lang/stopwords_gl.txt
   [junit4]   2> 674138 INFO  (OverseerStateUpdate-73182921116352519-127.0.0.1:39489_solr-n_0000000000) [n:127.0.0.1:39489_solr    ] o.a.s.c.o.SliceMutator createReplica() {
   [junit4]   2>   "operation":"ADDREPLICA",
   [junit4]   2>   "collection":"allReplicasInLIR",
   [junit4]   2>   "shard":"shard1",
   [junit4]   2>   "core":"allReplicasInLIR_shard1_replica_n1",
   [junit4]   2>   "state":"down",
   [junit4]   2>   "base_url":"https://127.0.0.1:45287/solr",
   [junit4]   2>   "type":"NRT",
   [junit4]   2>   "waitForFinalState":"false"} 
   [junit4]   2> 674140 INFO  (OverseerStateUpdate-73182921116352519-127.0.0.1:39489_solr-n_0000000000) [n:127.0.0.1:39489_solr    ] o.a.s.c.o.SliceMutator createReplica() {
   [junit4]   2>   "operation":"ADDREPLICA",
   [junit4]   2>   "collection":"allReplicasInLIR",
   [junit4]   2>   "shard":"shard1",
   [junit4]   2>   "core":"allReplicasInLIR_shard1_replica_n2",
   [junit4]   2>   "state":"down",
   [junit4]   2>   "base_url":"https://127.0.0.1:39489/solr",
   [junit4]   2>   "type":"NRT",
   [junit4]   2>   "waitForFinalState":"false"} 
   [junit4]   2> 674156 INFO  (OverseerStateUpdate-73182921116352519-127.0.0.1:39489_solr-n_0000000000) [n:127.0.0.1:39489_solr    ] o.a.s.c.o.SliceMutator createReplica() {
   [junit4]   2>   "operation":"ADDREPLICA",
   [junit4]   2>   "collection":"allReplicasInLIR",
   [junit4]   2>   "shard":"shard1",
   [junit4]   2>   "core":"allReplicasInLIR_shard1_replica_n4",
   [junit4]   2>   "state":"down",
   [junit4]   2>   "base_url":"https://127.0.0.1:41642/solr",
   [junit4]   2>   "type":"NRT",
   [junit4]   2>   "waitForFinalState":"false"} 
   [junit4]   2> 674421 INFO  (qtp276341149-2487) [n:127.0.0.1:41642_solr    x:allReplicasInLIR_shard1_replica_n4] o.a.s.h.a.CoreAdminOperation core create command qt=/admin/cores&coreNodeName=core_node6&collection.configName=allReplicasInLIR.AUTOCREATED&newCollection=true&name=allReplicasInLIR_shard1_replica_n4&action=CREATE&numShards=1&collection=allReplicasInLIR&shard=shard1&wt=javabin&version=2&replicaType=NRT
   [junit4]   2> 674554 INFO  (qtp493160009-2492) [n:127.0.0.1:39489_solr    x:allReplicasInLIR_shard1_replica_n2] o.a.s.h.a.CoreAdminOperation core create command qt=/admin/cores&coreNodeName=core_node5&collection.configName=allReplicasInLIR.AUTOCREATED&newCollection=true&name=allReplicasInLIR_shard1_replica_n2&action=CREATE&numShards=1&collection=allReplicasInLIR&shard=shard1&wt=javabin&version=2&replicaType=NRT
   [junit4]   2> 674554 INFO  (qtp493160009-2492) [n:127.0.0.1:39489_solr    x:allReplicasInLIR_shard1_replica_n2] o.a.s.c.TransientSolrCoreCacheDefault Allocating transient cache for 2147483647 transient cores
   [junit4]   2> 674568 INFO  (qtp1259384059-2507) [n:127.0.0.1:45287_solr    x:allReplicasInLIR_shard1_replica_n1] o.a.s.h.a.CoreAdminOperation core create command qt=/admin/cores&coreNodeName=core_node3&collection.configName=allReplicasInLIR.AUTOCREATED&newCollection=true&name=allReplicasInLIR_shard1_replica_n1&action=CREATE&numShards=1&collection=allReplicasInLIR&shard=shard1&wt=javabin&version=2&replicaType=NRT
   [junit4]   2> 675594 INFO  (qtp276341149-2487) [n:127.0.0.1:41642_solr c:allReplicasInLIR s:shard1 r:core_node6 x:allReplicasInLIR_shard1_replica_n4] o.a.s.c.RequestParams conf resource params.json loaded . version : 0 
   [junit4]   2> 675595 INFO  (qtp276341149-2487) [n:127.0.0.1:41642_solr c:allReplicasInLIR s:shard1 r:core_node6 x:allReplicasInLIR_shard1_replica_n4] o.a.s.c.RequestParams request params refreshed to version 0
   [junit4]   2> 675610 WARN  (qtp276341149-2487) [n:127.0.0.1:41642_solr c:allReplicasInLIR s:shard1 r:core_node6 x:allReplicasInLIR_shard1_replica_n4] o.a.s.c.SolrConfig Couldn't add files from /home/jenkins/jenkins-slave/workspace/Lucene-Solr-NightlyTests-7.x/checkout/solr/build/solr-core/test/J0/temp/solr.cloud.LIROnShardRestartTest_F9084EEA1D47C3E9-001/tempDir-001/node2/allReplicasInLIR_shard1_replica_n4/../../../../contrib/extraction/lib filtered by .*\.jar to classpath: /home/jenkins/jenkins-slave/workspace/Lucene-Solr-NightlyTests-7.x/checkout/solr/build/solr-core/test/J0/temp/solr.cloud.LIROnShardRestartTest_F9084EEA1D47C3E9-001/tempDir-001/node2/allReplicasInLIR_shard1_replica_n4/../../../../contrib/extraction/lib
   [junit4]   2> 675610 WARN  (qtp276341149-2487) [n:127.0.0.1:41642_solr c:allReplicasInLIR s:shard1 r:core_node6 x:allReplicasInLIR_shard1_replica_n4] o.a.s.c.SolrConfig Couldn't add files from /home/jenkins/jenkins-slave/workspace/Lucene-Solr-NightlyTests-7.x/checkout/solr/build/solr-core/test/J0/temp/solr.cloud.LIROnShardRestartTest_F9084EEA1D47C3E9-001/tempDir-001/node2/allReplicasInLIR_shard1_replica_n4/../../../../dist filtered by solr-cell-\d.*\.jar to classpath: /home/jenkins/jenkins-slave/workspace/Lucene-Solr-NightlyTests-7.x/checkout/solr/build/solr-core/test/J0/temp/solr.cloud.LIROnShardRestartTest_F9084EEA1D47C3E9-001/tempDir-001/node2/allReplicasInLIR_shard1_replica_n4/../../../../dist
   [junit4]   2> 675611 WARN  (qtp276341149-2487) [n:127.0.0.1:41642_solr c:allReplicasInLIR s:shard1 r:core_node6 x:allReplicasInLIR_shard1_replica_n4] o.a.s.c.SolrConfig Couldn't add files from /home/jenkins/jenkins-slave/workspace/Lucene-Solr-NightlyTests-7.x/checkout/solr/build/solr-core/test/J0/temp/solr.cloud.LIROnShardRestartTest_F9084EEA1D47C3E9-001/tempDir-001/node2/allReplicasInLIR_shard1_replica_n4/../../../../contrib/clustering/lib filtered by .*\.jar to classpath: /home/jenkins/jenkins-slave/workspace/Lucene-Solr-NightlyTests-7.x/checkout/solr/build/solr-core/test/J0/temp/solr.cloud.LIROnShardRestartTest_F9084EEA1D47C3E9-001/tempDir-001/node2/allReplicasInLIR_shard1_replica_n4/../../../../contrib/clustering/lib
   [junit4]   2> 675611 WARN  (qtp276341149-2487) [n:127.0.0.1:41642_solr c:allReplicasInLIR s:shard1 r:core_node6 x:allReplicasInLIR_shard1_replica_n4] o.a.s.c.SolrConfig Couldn't add files from /home/jenkins/jenkins-slave/workspace/Lucene-Solr-NightlyTests-7.x/checkout/solr/build/solr-core/test/J0/temp/solr.cloud.LIROnShardRestartTest_F9084EEA1D47C3E9-001/tempDir-001/node2/allReplicasInLIR_shard1_replica_n4/../../../../dist filtered by solr-clustering-\d.*\.jar to classpath: /home/jenkins/jenkins-slave/workspace/Lucene-Solr-NightlyTests-7.x/checkout/solr/build/solr-core/test/J0/temp/solr.cloud.LIROnShardRestartTest_F9084EEA1D47C3E9-001/tempDir-001/node2/allReplicasInLIR_shard1_replica_n4/../../../../dist
   [junit4]   2> 675611 WARN  (qtp276341149-2487) [n:127.0.0.1:41642_solr c:allReplicasInLIR s:shard1 r:core_node6 x:allReplicasInLIR_shard1_replica_n4] o.a.s.c.SolrConfig Couldn't add files from /home/jenkins/jenkins-slave/workspace/Lucene-Solr-NightlyTests-7.x/checkout/solr/build/solr-core/test/J0/temp/solr.cloud.LIROnShardRestartTest_F9084EEA1D47C3E9-001/tempDir-001/node2/allReplicasInLIR_shard1_replica_n4/../../../../contrib/langid/lib filtered by .*\.jar to classpath: /home/jenkins/jenkins-slave/workspace/Lucene-Solr-NightlyTests-7.x/checkout/solr/build/solr-core/test/J0/temp/solr.cloud.LIROnShardRestartTest_F9084EEA1D47C3E9-001/tempDir-001/node2/allReplicasInLIR_shard1_replica_n4/../../../../contrib/langid/lib
   [junit4]   2> 675611 WARN  (qtp276341149-2487) [n:127.0.0.1:41642_solr c:allReplicasInLIR s:shard1 r:core_node6 x:allReplicasInLIR_shard1_replica_n4] o.a.s.c.SolrConfig Couldn't add files from /home/jenkins/jenkins-slave/workspace/Lucene-Solr-NightlyTests-7.x/checkout/solr/build/solr-core/test/J0/temp/solr.cloud.LIROnShardRestartTest_F9084EEA1D47C3E9-001/tempDir-001/node2/allReplicasInLIR_shard1_replica_n4/../../../../dist filtered by solr-langid-\d.*\.jar to classpath: /home/jenkins/jenkins-slave/workspace/Lucene-Solr-NightlyTests-7.x/checkout/solr/build/solr-core/test/J0/temp/solr.cloud.LIROnShardRestartTest_F9084EEA1D47C3E9-001/tempDir-001/node2/allReplicasInLIR_shard1_replica_n4/../../../../dist
   [junit4]   2> 675629 WARN  (qtp276341149-2487) [n:127.0.0.1:41642_solr c:allReplicasInLIR s:shard1 r:core_node6 x:allReplicasInLIR_shard1_replica_n4] o.a.s.c.SolrConfig Couldn't add files from /home/jenkins/jenkins-slave/workspace/Lucene-Solr-NightlyTests-7.x/checkout/solr/build/solr-core/test/J0/temp/solr.cloud.LIROnShardRestartTest_F9084EEA1D47C3E9-001/tempDir-001/node2/allReplicasInLIR_shard1_replica_n4/../../../../contrib/velocity/lib filtered by .*\.jar to classpath: /home/jenkins/jenkins-slave/workspace/Lucene-Solr-NightlyTests-7.x/checkout/solr/build/solr-core/test/J0/temp/solr.cloud.LIROnShardRestartTest_F9084EEA1D47C3E9-001/tempDir-001/node2/allReplicasInLIR_shard1_replica_n4/../../../../contrib/velocity/lib
   [junit4]   2> 675629 WARN  (qtp276341149-2487) [n:127.0.0.1:41642_solr c:allReplicasInLIR s:shard1 r:core_node6 x:allReplicasInLIR_shard1_replica_n4] o.a.s.c.SolrConfig Couldn't add files from /home/jenkins/jenkins-slave/workspace/Lucene-Solr-NightlyTests-7.x/checkout/solr/build/solr-core/test/J0/temp/solr.cloud.LIROnShardRestartTest_F9084EEA1D47C3E9-001/tempDir-001/node2/allReplicasInLIR_shard1_replica_n4/../../../../dist filtered by solr-velocity-\d.*\.jar to classpath: /home/jenkins/jenkins-slave/workspace/Lucene-Solr-NightlyTests-7.x/checkout/solr/build/solr-core/test/J0/temp/solr.cloud.LIROnShardRestartTest_F9084EEA1D47C3E9-001/tempDir-001/node2/allReplicasInLIR_shard1_replica_n4/../../../../dist
   [junit4]   2> 675648 INFO  (qtp276341149-2487) [n:127.0.0.1:41642_solr c:allReplicasInLIR s:shard1 r:core_node6 x:allReplicasInLIR_shard1_replica_n4] o.a.s.c.SolrConfig Using Lucene MatchVersion: 7.5.0
   [junit4]   2> 675657 INFO  (qtp1259384059-2507) [n:127.0.0.1:45287_solr c:allReplicasInLIR s:shard1 r:core_node3 x:allReplicasInLIR_shard1_replica_n1] o.a.s.c.RequestParams conf resource params.json loaded . version : 0 
   [junit4]   2> 675657 INFO  (qtp1259384059-2507) [n:127.0.0.1:45287_solr c:allReplicasInLIR s:shard1 r:core_node3 x:allReplicasInLIR_shard1_replica_n1] o.a.s.c.RequestParams request params refreshed to version 0
   [junit4]   2> 675658 WARN  (qtp1259384059-2507) [n:127.0.0.1:45287_solr c:allReplicasInLIR s:shard1 r:core_node3 x:allReplicasInLIR_shard1_replica_n1] o.a.s.c.SolrConfig Couldn't add files from /home/jenkins/jenkins-slave/workspace/Lucene-Solr-NightlyTests-7.x/checkout/solr/build/solr-core/test/J0/temp/solr.cloud.LIROnShardRestartTest_F9084EEA1D47C3E9-001/tempDir-001/node3/allReplicasInLIR_shard1_replica_n1/../../../../contrib/extraction/lib filtered by .*\.jar to classpath: /home/jenkins/jenkins-slave/workspace/Lucene-Solr-NightlyTests-7.x/checkout/solr/build/solr-core/test/J0/temp/solr.cloud.LIROnShardRestartTest_F9084EEA1D47C3E9-001/tempDir-001/node3/allReplicasInLIR_shard1_replica_n1/../../../../contrib/extraction/lib
   [junit4]   2> 675726 WARN  (qtp1259384059-2507) [n:127.0.0.1:45287_solr c:allReplicasInLIR s:shard1 r:core_node3 x:allReplicasInLIR_shard1_replica_n1] o.a.s.c.SolrConfig Couldn't add files from /home/jenkins/jenkins-slave/workspace/Lucene-Solr-NightlyTests-7.x/checkout/solr/build/solr-core/test/J0/temp/solr.cloud.LIROnShardRestartTest_F9084EEA1D47C3E9-001/tempDir-001/node3/allReplicasInLIR_shard1_replica_n1/../../../../dist filtered by solr-cell-\d.*\.jar to classpath: /home/jenkins/jenkins-slave/workspace/Lucene-Solr-NightlyTests-7.x/checkout/solr/build/solr-core/test/J0/temp/solr.cloud.LIROnShardRestartTest_F9084EEA1D47C3E9-001/tempDir-001/node3/allReplicasInLIR_shard1_replica_n1/../../../../dist
   [junit4]   2> 675726 WARN  (qtp1259384059-2507) [n:127.0.0.1:45287_solr c:allReplicasInLIR s:shard1 r:core_node3 x:allReplicasInLIR_shard1_replica_n1] o.a.s.c.SolrConfig Couldn't add files from /home/jenkins/jenkins-slave/workspace/Lucene-Solr-NightlyTests-7.x/checkout/solr/build/solr-core/test/J0/temp/solr.cloud.LIROnShardRestartTest_F9084EEA1D47C3E9-001/tempDir-001/node3/allReplicasInLIR_shard1_replica_n1/../../../../contrib/clustering/lib filtered by .*\.jar to classpath: /home/jenkins/jenkins-slave/workspace/Lucene-Solr-NightlyTests-7.x/checkout/solr/build/solr-core/test/J0/temp/solr.cloud.LIROnShardRestartTest_F9084EEA1D47C3E9-001/tempDir-001/node3/allReplicasInLIR_shard1_replica_n1/../../../../contrib/clustering/lib
   [junit4]   2> 675726 WARN  (qtp1259384059-2507) [n:127.0.0.1:45287_solr c:allReplicasInLIR s:shard1 r:core_node3 x:allReplicasInLIR_shard1_replica_n1] o.a.s.c.SolrConfig Couldn't add files from /home/jenkins/jenkins-slave/workspace/Lucene-Solr-NightlyTests-7.x/checkout/solr/build/solr-core/test/J0/temp/solr.cloud.LIROnShardRestartTest_F9084EEA1D47C3E9-001/tempDir-001/node3/allReplicasInLIR_shard1_replica_n1/../../../../dist filtered by solr-clustering-\d.*\.jar to classpath: /home/jenkins/jenkins-slave/workspace/Lucene-Solr-NightlyTests-7.x/checkout/solr/build/solr-core/test/J0/temp/solr.cloud.LIROnShardRestartTest_F9084EEA1D47C3E9-001/tempDir-001/node3/allReplicasInLIR_shard1_replica_n1/../../../../dist
   [junit4]   2> 675727 WARN  (qtp1259384059-2507) [n:127.0.0.1:45287_solr c:allReplicasInLIR s:shard1 r:core_node3 x:allReplicasInLIR_shard1_replica_n1] o.a.s.c.SolrConfig Couldn't add files from /home/jenkins/jenkins-slave/workspace/Lucene-Solr-NightlyTests-7.x/checkout/solr/build/solr-core/test/J0/temp/solr.cloud.LIROnShardRestartTest_F9084EEA1D47C3E9-001/tempDir-001/node3/allReplicasInLIR_shard1_replica_n1/../../../../contrib/langid/lib filtered by .*\.jar to classpath: /home/jenkins/jenkins-slave/workspace/Lucene-Solr-NightlyTests-7.x/checkout/solr/build/solr-core/test/J0/temp/solr.cloud.LIROnShardRestartTest_F9084EEA1D47C3E9-001/tempDir-001/node3/allReplicasInLIR_shard1_replica_n1/../../../../contrib/langid/lib
   [junit4]   2> 675727 WARN  (qtp1259384059-2507) [n:127.0.0.1:45287_solr c:allReplicasInLIR s:shard1 r:core_node3 x:allReplicasInLIR_shard1_replica_n1] o.a.s.c.SolrConfig Couldn't add files from /home/jenkins/jenkins-slave/workspace/Lucene-Solr-NightlyTests-7.x/checkout/solr/build/solr-core/test/J0/temp/solr.cloud.LIROnShardRestartTest_F9084EEA1D47C3E9-001/tempDir-001/node3/allReplicasInLIR_shard1_replica_n1/../../../../dist filtered by solr-langid-\d.*\.jar to classpath: /home/jenkins/jenkins-slave/workspace/Lucene-Solr-NightlyTests-7.x/checkout/solr/build/solr-core/test/J0/temp/solr.cloud.LIROnShardRestartTest_F9084EEA1D47C3E9-001/tempDir-001/node3/allReplicasInLIR_shard1_replica_n1/../../../../dist
   [junit4]   2> 675727 WARN  (qtp1259384059-2507) [n:127.0.0.1:45287_solr c:allReplicasInLIR s:shard1 r:core_node3 x:allReplicasInLIR_shard1_replica_n1] o.a.s.c.SolrConfig Couldn't add files from /home/jenkins/jenkins-slave/workspace/Lucene-Solr-NightlyTests-7.x/checkout/solr/build/solr-core/test/J0/temp/solr.cloud.LIROnShardRestartTest_F9084EEA1D47C3E9-001/tempDir-001/node3/allReplicasInLIR_shard1_replica_n1/../../../../contrib/velocity/lib filtered by .*\.jar to classpath: /home/jenkins/jenkins-slave/workspace/Lucene-Solr-NightlyTests-7.x/checkout/solr/build/solr-core/test/J0/temp/solr.cloud.LIROnShardRestartTest_F9084EEA1D47C3E9-001/tempDir-001/node3/allReplicasInLIR_shard1_replica_n1/../../../../contrib/velocity/lib
   [junit4]   2> 675727 WARN  (qtp1259384059-2507) [n:127.0.0.1:45287_solr c:allReplicasInLIR s:shard1 r:core_node3 x:allReplicasInLIR_shard1_replica_n1] o.a.s.c.SolrConfig Couldn't add files from /home/jenkins/jenkins-slave/workspace/Lucene-Solr-NightlyTests-7.x/checkout/solr/build/solr-core/test/J0/temp/solr.cloud.LIROnShardRestartTest_F9084EEA1D47C3E9-001/tempDir-001/node3/allReplicasInLIR_shard1_replica_n1/../../../../dist filtered by solr-velocity-\d.*\.jar to classpath: /home/jenkins/jenkins-slave/workspace/Lucene-Solr-NightlyTests-7.x/checkout/solr/build/solr-core/test/J0/temp/solr.cloud.LIROnShardRestartTest_F9084EEA1D47C3E9-001/tempDir-001/node3/allReplicasInLIR_shard1_replica_n1/../../../../dist
   [junit4]   2> 675766 INFO  (qtp1259384059-2507) [n:127.0.0.1:45287_solr c:allReplicasInLIR s:shard1 r:core_node3 x:allReplicasInLIR_shard1_replica_n1] o.a.s.c.SolrConfig Using Lucene MatchVersion: 7.5.0
   [junit4]   2> 675822 INFO  (qtp276341149-2487) [n:127.0.0.1:41642_solr c:allReplicasInLIR s:shard1 r:core_node6 x:allReplicasInLIR_shard1_replica_n4] o.a.s.s.IndexSchema [allReplicasInLIR_shard1_replica_n4] Schema name=default-config
   [junit4]   2> 676003 INFO  (qtp1259384059-2507) [n:127.0.0.1:45287_solr c:allReplicasInLIR s:shard1 r:core_node3 x:allReplicasInLIR_shard1_replica_n1] o.a.s.s.IndexSchema [allReplicasInLIR_shard1_replica_n1] Schema name=default-config
   [junit4]   2> 676006 INFO  (qtp493160009-2492) [n:127.0.0.1:39489_solr c:allReplicasInLIR s:shard1 r:core_node5 x:allReplicasInLIR_shard1_replica_n2] o.a.s.c.RequestParams conf resource params.json loaded . version : 0 
   [junit4]   2> 676055 INFO  (qtp493160009-2492) [n:127.0.0.1:39489_solr c:allReplicasInLIR s:shard1 r:core_node5 x:allReplicasInLIR_shard1_replica_n2] o.a.s.c.RequestParams request params refreshed to version 0
   [junit4]   2> 676056 WARN  (qtp493160009-2492) [n:127.0.0.1:39489_solr c:allReplicasInLIR s:shard1 r:core_node5 x:allReplicasInLIR_shard1_replica_n2] o.a.s.c.SolrConfig Couldn't add files from /home/jenkins/jenkins-slave/workspace/Lucene-Solr-NightlyTests-7.x/checkout/solr/build/solr-core/test/J0/temp/solr.cloud.LIROnShardRestartTest_F9084EEA1D47C3E9-001/tempDir-001/node1/allReplicasInLIR_shard1_replica_n2/../../../../contrib/extraction/lib filtered by .*\.jar to classpath: /home/jenkins/jenkins-slave/workspace/Lucene-Solr-NightlyTests-7.x/checkout/solr/build/solr-core/test/J0/temp/solr.cloud.LIROnShardRestartTest_F9084EEA1D47C3E9-001/tempDir-001/node1/allReplicasInLIR_shard1_replica_n2/../../../../contrib/extraction/lib
   [junit4]   2> 676056 WARN  (qtp493160009-2492) [n:127.0.0.1:39489_solr c:allReplicasInLIR s:shard1 r:core_node5 x:allReplicasInLIR_shard1_replica_n2] o.a.s.c.SolrConfig Couldn't add files from /home/jenkins/jenkins-slave/workspace/Lucene-Solr-NightlyTests-7.x/checkout/solr/build/solr-core/test/J0/temp/solr.cloud.LIROnShardRestartTest_F9084EEA1D47C3E9-001/tempDir-001/node1/allReplicasInLIR_shard1_replica_n2/../../../../dist filtered by solr-cell-\d.*\.jar to classpath: /home/jenkins/jenkins-slave/workspace/Lucene-Solr-NightlyTests-7.x/checkout/solr/build/solr-core/test/J0/temp/solr.cloud.LIROnShardRestartTest_F9084EEA1D47C3E9-001/tempDir-001/node1/allReplicasInLIR_shard1_replica_n2/../../../../dist
   [junit4]   2> 676056 WARN  (qtp493160009-2492) [n:127.0.0.1:39489_solr c:allReplicasInLIR s:shard1 r:core_node5 x:allReplicasInLIR_shard1_replica_n2] o.a.s.c.SolrConfig Couldn't add files from /home/jenkins/jenkins-slave/workspace/Lucene-Solr-NightlyTests-7.x/checkout/solr/build/solr-core/test/J0/temp/solr.cloud.LIROnShardRestartTest_F9084EEA1D47C3E9-001/tempDir-001/node1/allReplicasInLIR_shard1_replica_n2/../../../../contrib/clustering/lib filtered by .*\.jar to classpath: /home/jenkins/jenkins-slave/workspace/Lucene-Solr-NightlyTests-7.x/checkout/solr/build/solr-core/test/J0/temp/solr.cloud.LIROnShardRestartTest_F9084EEA1D47C3E9-001/tempDir-001/node1/allReplicasInLIR_shard1_replica_n2/../../../../contrib/clustering/lib
   [junit4]   2> 676056 WARN  (qtp493160009-2492) [n:127.0.0.1:39489_solr c:allReplicasInLIR s:shard1 r:core_node5 x:allReplicasInLIR_shard1_replica_n2] o.a.s.c.SolrConfig Couldn't add files from /home/jenkins/jenkins-slave/workspace/Lucene-Solr-NightlyTests-7.x/checkout/solr/build/solr-core/test/J0/temp/solr.cloud.LIROnShardRestartTest_F9084EEA1D47C3E9-001/tempDir-001/node1/allReplicasInLIR_shard1_replica_n2/../../../../dist filtered by solr-clustering-\d.*\.jar to classpath: /home/jenkins/jenkins-slave/workspace/Lucene-Solr-NightlyTests-7.x/checkout/solr/build/solr-core/test/J0/temp/solr.cloud.LIROnShardRestartTest_F9084EEA1D47C3E9-001/tempDir-001/node1/allReplicasInLIR_shard1_replica_n2/../../../../dist
   [junit4]   2> 676057 WARN  (qtp493160009-2492) [n:127.0.0.1:39489_solr c:allReplicasInLIR s:shard1 r:core_node5 x:allReplicasInLIR_shard1_replica_n2] o.a.s.c.SolrConfig Couldn't add files from /home/jenkins/jenkins-slave/workspace/Lucene-Solr-NightlyTests-7.x/checkout/solr/build/solr-core/test/J0/temp/solr.cloud.LIROnShardRestartTest_F9084EEA1D47C3E9-001/tempDir-001/node1/allReplicasInLIR_shard1_replica_n2/../../../../contrib/langid/lib filtered by .*\.jar to classpath: /home/jenkins/jenkins-slave/workspace/Lucene-Solr-NightlyTests-7.x/checkout/solr/build/solr-core/test/J0/temp/solr.cloud.LIROnShardRestartTest_F9084EEA1D47C3E9-001/tempDir-001/node1/allReplicasInLIR_shard1_replica_n2/../../../../contrib/langid/lib
   [junit4]   2> 676057 WARN  (qtp493160009-2492) [n:127.0.0.1:39489_solr c:allReplicasInLIR s:shard1 r:core_node5 x:allReplicasInLIR_shard1_replica_n2] o.a.s.c.SolrConfig Couldn't add files from /home/jenkins/jenkins-slave/workspace/Lucene-Solr-NightlyTests-7.x/checkout/solr/build/solr-core/test/J0/temp/solr.cloud.LIROnShardRestartTest_F9084EEA1D47C3E9-001/tempDir-001/node1/allReplicasInLIR_shard1_replica_n2/../../../../dist filtered by solr-langid-\d.*\.jar to classpath: /home/jenkins/jenkins-slave/workspace/Lucene-Solr-NightlyTests-7.x/checkout/solr/build/solr-core/test/J0/temp/solr.cloud.LIROnShardRestartTest_F9084EEA1D47C3E9-001/tempDir-001/node1/allReplicasInLIR_shard1_replica_n2/../../../../dist
   [junit4]   2> 676057 WARN  (qtp493160009-2492) [n:127.0.0.1:39489_solr c:allReplicasInLIR s:shard1 r:core_node5 x:allReplicasInLIR_shard1_replica_n2] o.a.s.c.SolrConfig Couldn't add files from /home/jenkins/jenkins-slave/workspace/Lucene-Solr-NightlyTests-7.x/checkout/solr/build/solr-core/test/J0/temp/solr.cloud.LIROnShardRestartTest_F9084EEA1D47C3E9-001/tempDir-001/node1/allReplicasInLIR_shard1_replica_n2/../../../../contrib/velocity/lib filtered by .*\.jar to classpath: /home/jenkins/jenkins-slave/workspace/Lucene-Solr-NightlyTests-7.x/checkout/solr/build/solr-core/test/J0/temp/solr.cloud.LIROnShardRestartTest_F9084EEA1D47C3E9-001/tempDir-001/node1/allReplicasInLIR_shard1_replica_n2/../../../../contrib/velocity/lib
   [junit4]   2> 676057 WARN  (qtp493160009-2492) [n:127.0.0.1:39489_solr c:allReplicasInLIR s:shard1 r:core_node5 x:allReplicasInLIR_shard1_replica_n2] o.a.s.c.SolrConfig Couldn't add files from /home/jenkins/jenkins-slave/workspace/Lucene-Solr-NightlyTests-7.x/checkout/solr/build/solr-core/test/J0/temp/solr.cloud.LIROnShardRestartTest_F9084EEA1D47C3E9-001/tempDir-001/node1/allReplicasInLIR_shard1_replica_n2/../../../../dist filtered by solr-velocity-\d.*\.jar to classpath: /home/jenkins/jenkins-slave/workspace/Lucene-Solr-NightlyTests-7.x/checkout/solr/build/solr-core/test/J0/temp/solr.cloud.LIROnShardRestartTest_F9084EEA1D47C3E9-001/tempDir-001/node1/allReplicasInLIR_shard1_replica_n2/../../../../dist
   [junit4]   2> 676095 INFO  (qtp493160009-2492) [n:127.0.0.1:39489_solr c:allReplicasInLIR s:shard1 r:core_node5 x:allReplicasInLIR_shard1_replica_n2] o.a.s.c.SolrConfig Using Lucene MatchVersion: 7.5.0
   [junit4]   2> 676224 INFO  (qtp493160009-2492) [n:127.0.0.1:39489_solr c:allReplicasInLIR s:shard1 r:core_node5 x:allReplicasInLIR_shard1_replica_n2] o.a.s.s.IndexSchema [allReplicasInLIR_shard1_replica_n2] Schema name=default-config
   [junit4]   2> 678778 INFO  (qtp1259384059-2507) [n:127.0.0.1:45287_solr c:allReplicasInLIR s:shard1 r:core_node3 x:allReplicasInLIR_shard1_replica_n1] o.a.s.s.IndexSchema Loaded schema default-config/1.6 with uniqueid field id
   [junit4]   2> 678798 INFO  (qtp276341149-2487) [n:127.0.0.1:41642_solr c:allReplicasInLIR s:shard1 r:core_node6 x:allReplicasInLIR_shard1_replica_n4] o.a.s.s.IndexSchema Loaded schema default-config/1.6 with uniqueid field id
   [junit4]   2> 678816 INFO  (qtp493160009-2492) [n:127.0.0.1:39489_solr c:allReplicasInLIR s:shard1 r:core_node5 x:allReplicasInLIR_shard1_replica_n2] o.a.s.s.IndexSchema Loaded schema default-config/1.6 with uniqueid field id
   [junit4]   2> 679165 INFO  (qtp276341149-2487) [n:127.0.0.1:41642_solr c:allReplicasInLIR s:shard1 r:core_node6 x:allReplicasInLIR_shard1_replica_n4] o.a.s.c.CoreContainer Creating SolrCore 'allReplicasInLIR_shard1_replica_n4' using configuration from collection allReplicasInLIR, trusted=true
   [junit4]   2> 679165 INFO  (qtp276341149-2487) [n:127.0.0.1:41642_solr c:allReplicasInLIR s:shard1 r:core_node6 x:allReplicasInLIR_shard1_replica_n4] o.a.s.m.r.SolrJmxReporter JMX monitoring for 'solr_41642.solr.core.allReplicasInLIR.shard1.replica_n4' (registry 'solr.core.allReplicasInLIR.shard1.replica_n4') enabled at server: com.sun.jmx.mbeanserver.JmxMBeanServer@5025b3e7
   [junit4]   2> 679165 INFO  (qtp276341149-2487) [n:127.0.0.1:41642_solr c:allReplicasInLIR s:shard1 r:core_node6 x:allReplicasInLIR_shard1_replica_n4] o.a.s.c.SolrCore solr.RecoveryStrategy.Builder
   [junit4]   2> 679166 INFO  (qtp276341149-2487) [n:127.0.0.1:41642_solr c:allReplicasInLIR s:shard1 r:core_node6 x:allReplicasInLIR_shard1_replica_n4] o.a.s.c.SolrCore [[allReplicasInLIR_shard1_replica_n4] ] Opening new SolrCore at [/home/jenkins/jenkins-slave/workspace/Lucene-Solr-NightlyTests-7.x/checkout/solr/build/solr-core/test/J0/temp/solr.cloud.LIROnShardRestartTest_F9084EEA1D47C3E9-001/tempDir-001/node2/allReplicasInLIR_shard1_replica_n4], dataDir=[/home/jenkins/jenkins-slave/workspace/Lucene-Solr-NightlyTests-7.x/checkout/solr/build/solr-core/test/J0/temp/solr.cloud.LIROnShardRestartTest_F9084EEA1D47C3E9-001/tempDir-001/node2/./allReplicasInLIR_shard1_replica_n4/data/]
   [junit4]   2> 679180 INFO  (qtp1259384059-2507) [n:127.0.0.1:45287_solr c:allReplicasInLIR s:shard1 r:core_node3 x:allReplicasInLIR_shard1_replica_n1] o.a.s.c.CoreContainer Creating SolrCore 'allReplicasInLIR_shard1_replica_n1' using configuration from collection allReplicasInLIR, trusted=true
   [junit4]   2> 679180 INFO  (qtp1259384059-2507) [n:127.0.0.1:45287_solr c:allReplicasInLIR s:shard1 r:core_node3 x:allReplicasInLIR_shard1_replica_n1] o.a.s.m.r.SolrJmxReporter JMX monitoring for 'solr_45287.solr.core.allReplicasInLIR.shard1.replica_n1' (registry 'solr.core.allReplicasInLIR.shard1.replica_n1') enabled at server: com.sun.jmx.mbeanserver.JmxMBeanServer@5025b3e7
   [junit4]   2> 679180 INFO  (qtp1259384059-2507) [n:127.0.0.1:45287_solr c:allReplicasInLIR s:shard1 r:core_node3 x:allReplicasInLIR_shard1_replica_n1] o.a.s.c.SolrCore solr.RecoveryStrategy.Builder
   [junit4]   2> 679181 INFO  (qtp1259384059-2507) [n:127.0.0.1:45287_solr c:allReplicasInLIR s:shard1 r:core_node3 x:allReplicasInLIR_shard1_replica_n1] o.a.s.c.SolrCore [[allReplicasInLIR_shard1_replica_n1] ] Opening new SolrCore at [/home/jenkins/jenkins-slave/workspace/Lucene-Solr-NightlyTests-7.x/checkout/solr/build/solr-core/test/J0/temp/solr.cloud.LIROnShardRestartTest_F9084EEA1D47C3E9-001/tempDir-001/node3/allReplicasInLIR_shard1_replica_n1], dataDir=[/home/jenkins/jenkins-slave/workspace/Lucene-Solr-NightlyTests-7.x/checkout/solr/build/solr-core/test/J0/temp/solr.cloud.LIROnShardRestartTest_F9084EEA1D47C3E9-001/tempDir-001/node3/./allReplicasInLIR_shard1_replica_n1/data/]
   [junit4]   2> 679183 INFO  (qtp493160009-2492) [n:127.0.0.1:39489_solr c:allReplicasInLIR s:shard1 r:core_node5 x:allReplicasInLIR_shard1_replica_n2] o.a.s.c.CoreContainer Creating SolrCore 'allReplicasInLIR_shard1_replica_n2' using configuration from collection allReplicasInLIR, trusted=true
   [junit4]   2> 679183 INFO  (qtp493160009-2492) [n:127.0.0.1:39489_solr c:allReplicasInLIR s:shard1 r:core_node5 x:allReplicasInLIR_shard1_replica_n2] o.a.s.m.r.SolrJmxReporter JMX monitoring for 'solr_39489.solr.core.allReplicasInLIR.shard1.replica_n2' (registry 'solr.core.allReplicasInLIR.shard1.replica_n2') enabled at server: com.sun.jmx.mbeanserver.JmxMBeanServer@5025b3e7
   [junit4]   2> 679183 INFO  (qtp493160009-2492) [n:127.0.0.1:39489_solr c:allReplicasInLIR s:shard1 r:core_node5 x:allReplicasInLIR_shard1_replica_n2] o.a.s.c.SolrCore solr.RecoveryStrategy.Builder
   [junit4]   2> 679216 INFO  (qtp493160009-2492) [n:127.0.0.1:39489_solr c:allReplicasInLIR s:shard1 r:core_node5 x:allReplicasInLIR_shard1_replica_n2] o.a.s.c.SolrCore [[allReplicasInLIR_shard1_replica_n2] ] Opening new SolrCore at [/home/jenkins/jenkins-slave/workspace/Lucene-Solr-NightlyTests-7.x/checkout/solr/build/solr-core/test/J0/temp/solr.cloud.LIROnShardRestartTest_F9084EEA1D47C3E9-001/tempDir-001/node1/allReplicasInLIR_shard1_replica_n2], dataDir=[/home/jenkins/jenkins-slave/workspace/Lucene-Solr-NightlyTests-7.x/checkout/solr/build/solr-core/test/J0/temp/solr.cloud.LIROnShardRestartTest_F9084EEA1D47C3E9-001/tempDir-001/node1/./allReplicasInLIR_shard1_replica_n2/data/]
   [junit4]   2> 679860 INFO  (qtp1259384059-2507) [n:127.0.0.1:45287_solr c:allReplicasInLIR s:shard1 r:core_node3 x:allReplicasInLIR_shard1_replica_n1] o.a.s.r.XSLTResponseWriter xsltCacheLifetimeSeconds=5
   [junit4]   2> 679875 INFO  (qtp276341149-2487) [n:127.0.0.1:41642_solr c:allReplicasInLIR s:shard1 r:core_node6 x:allReplicasInLIR_shard1_replica_n4] o.a.s.r.XSLTResponseWriter xsltCacheLifetimeSeconds=5
   [junit4]   2> 679878 INFO  (qtp493160009-2492) [n:127.0.0.1:39489_solr c:allReplicasInLIR s:shard1 r:core_node5 x:allReplicasInLIR_shard1_replica_n2] o.a.s.r.XSLTResponseWriter xsltCacheLifetimeSeconds=5
   [junit4]   2> 681217 INFO  (qtp493160009-2492) [n:127.0.0.1:39489_solr c:allReplicasInLIR s:shard1 r:core_node5 x:allReplicasInLIR_shard1_replica_n2] o.a.s.u.UpdateHandler Using UpdateLog implementation: org.apache.solr.update.UpdateLog
   [junit4]   2> 681217 INFO  (qtp493160009-2492) [n:127.0.0.1:39489_solr c:allReplicasInLIR s:shard1 r:core_node5 x:allReplicasInLIR_shard1_replica_n2] o.a.s.u.UpdateLog Initializing UpdateLog: dataDir= defaultSyncLevel=FLUSH numRecordsToKeep=100 maxNumLogsToKeep=10 numVersionBuckets=65536
   [junit4]   2> 681218 INFO  (qtp493160009-2492) [n:127.0.0.1:39489_solr c:allReplicasInLIR s:shard1 r:core_node5 x:allReplicasInLIR_shard1_replica_n2] o.a.s.u.CommitTracker Hard AutoCommit: if uncommitted for 15000ms; 
   [junit4]   2> 681218 INFO  (qtp493160009-2492) [n:127.0.0.1:39489_solr c:allReplicasInLIR s:shard1 r:core_node5 x:allReplicasInLIR_shard1_replica_n2] o.a.s.u.CommitTracker Soft AutoCommit: disabled
   [junit4]   2> 681265 INFO  (qtp1259384059-2507) [n:127.0.0.1:45287_solr c:allReplicasInLIR s:shard1 r:core_node3 x:allReplicasInLIR_shard1_replica_n1] o.a.s.u.UpdateHandler Using UpdateLog implementation: org.apache.solr.update.UpdateLog
   [junit4]   2> 681266 INFO  (qtp1259384059-2507) [n:127.0.0.1:45287_solr c:allReplicasInLIR s:shard1 r:core_node3 x:allReplicasInLIR_shard1_replica_n1] o.a.s.u.UpdateLog Initializing UpdateLog: dataDir= defaultSyncLevel=FLUSH numRecordsToKeep=100 maxNumLogsToKeep=10 numVersionBuckets=65536
   [junit4]   2> 681267 INFO  (qtp1259384059-2507) [n:127.0.0.1:45287_solr c:allReplicasInLIR s:shard1 r:core_node3 x:allReplicasInLIR_shard1_replica_n1] o.a.s.u.CommitTracker Hard AutoCommit: if uncommitted for 15000ms; 
   [junit4]   2> 681267 INFO  (qtp1259384059-2507) [n:127.0.0.1:45287_solr c:allReplicasInLIR s:shard1 r:core_node3 x:allReplicasInLIR_shard1_replica_n1] o.a.s.u.CommitTracker Soft AutoCommit: disabled
   [junit4]   2> 681290 INFO  (qtp493160009-2492) [n:127.0.0.1:39489_solr c:allReplicasInLIR s:shard1 r:core_node5 x:allReplicasInLIR_shard1_replica_n2] o.a.s.s.SolrIndexSearcher Opening [Searcher@3fc24504[allReplicasInLIR_shard1_replica_n2] main]
   [junit4]   2> 681291 INFO  (qtp493160009-2492) [n:127.0.0.1:39489_solr c:allReplicasInLIR s:shard1 r:core_node5 x:allReplicasInLIR_shard1_replica_n2] o.a.s.r.ManagedResourceStorage Configured ZooKeeperStorageIO with znodeBase: /configs/allReplicasInLIR.AUTOCREATED
   [junit4]   2> 681292 INFO  (qtp493160009-2492) [n:127.0.0.1:39489_solr c:allReplicasInLIR s:shard1 r:core_node5 x:allReplicasInLIR_shard1_replica_n2] o.a.s.r.ManagedResourceStorage Loaded null at path _rest_managed.json using ZooKeeperStorageIO:path=/configs/allReplicasInLIR.AUTOCREATED
   [junit4]   2> 681306 INFO  (qtp493160009-2492) [n:127.0.0.1:39489_solr c:allReplicasInLIR s:shard1 r:core_node5 x:allReplicasInLIR_shard1_replica_n2] o.a.s.s.ZkIndexSchemaReader Creating ZooKeeper watch for the managed schema at /configs/allReplicasInLIR.AUTOCREATED/managed-schema
   [junit4]   2> 681318 INFO  (qtp276341149-2487) [n:127.0.0.1:41642_solr c:allReplicasInLIR s:shard1 r:core_node6 x:allReplicasInLIR_shard1_replica_n4] o.a.s.u.UpdateHandler Using UpdateLog implementation: org.apache.solr.update.UpdateLog
   [junit4]   2> 681319 INFO  (qtp276341149-2487) [n:127.0.0.1:41642_solr c:allReplicasInLIR s:shard1 r:core_node6 x:allReplicasInLIR_shard1_replica_n4] o.a.s.u.UpdateLog Initializing UpdateLog: dataDir= defaultSyncLevel=FLUSH numRecordsToKeep=100 maxNumLogsToKeep=10 numVersionBuckets=65536
   [junit4]   2> 681320 INFO  (qtp276341149-2487) [n:127.0.0.1:41642_solr c:allReplicasInLIR s:shard1 r:core_node6 x:allReplicasInLIR_shard1_replica_n4] o.a.s.u.CommitTracker Hard AutoCommit: if uncommitted for 15000ms; 
   [junit4]   2> 681320 INFO  (qtp276341149-2487) [n:127.0.0.1:41642_solr c:allReplicasInLIR s:shard1 r:core_node6 x:allReplicasInLIR_shard1_replica_n4] o.a.s.u.CommitTracker Soft AutoCommit: disabled
   [junit4]   2> 681339 INFO  (qtp276341149-2487) [n:127.0.0.1:41642_solr c:allReplicasInLIR s:shard1 r:core_node6 x:allReplicasInLIR_shard1_replica_n4] o.a.s.s.SolrIndexSearcher Opening [Searcher@1b62799[allReplicasInLIR_shard1_replica_n4] main]
   [junit4]   2> 681340 INFO  (qtp276341149-2487) [n:127.0.0.1:41642_solr c:allReplicasInLIR s:shard1 r:core_node6 x:allReplicasInLIR_shard1_replica_n4] o.a.s.r.ManagedResourceStorage Configured ZooKeeperStorageIO with znodeBase: /configs/allReplicasInLIR.AUTOCREATED
   [junit4]   2> 681341 INFO  (qtp276341149-2487) [n:127.0.0.1:41642_solr c:allReplicasInLIR s:shard1 r:core_node6 x:allReplicasInLIR_shard1_replica_n4] o.a.s.r.ManagedResourceStorage Loaded null at path _rest_managed.json using ZooKeeperStorageIO:path=/configs/allReplicasInLIR.AUTOCREATED
   [junit4]   2> 681341 INFO  (qtp276341149-2487) [n:127.0.0.1:41642_solr c:allReplicasInLIR s:shard1 r:core_node6 x:allReplicasInLIR_shard1_replica_n4] o.a.s.s.ZkIndexSchemaReader Creating ZooKeeper watch for the managed schema at /configs/allReplicasInLIR.AUTOCREATED/managed-schema
   [junit4]   2> 681342 INFO  (qtp276341149-2487) [n:127.0.0.1:41642_solr c:allReplicasInLIR s:shard1 r:core_node6 x:allReplicasInLIR_shard1_replica_n4] o.a.s.s.ZkIndexSchemaReader Current schema version 0 is already the latest
   [junit4]   2> 681355 INFO  (qtp493160009-2492) [n:127.0.0.1:39489_solr c:allReplicasInLIR s:shard1 r:core_node5 x:allReplicasInLIR_shard1_replica_n2] o.a.s.s.ZkIndexSchemaReader Current schema version 0 is already the latest
   [junit4]   2> 681356 INFO  (qtp493160009-2492) [n:127.0.0.1:39489_solr c:allReplicasInLIR s:shard1 r:core_node5 x:allReplicasInLIR_shard1_replica_n2] o.a.s.h.c.SpellCheckComponent Initializing spell checkers
   [junit4]   2> 681363 INFO  (qtp276341149-2487) [n:127.0.0.1:41642_solr c:allReplicasInLIR s:shard1 r:core_node6 x:allReplicasInLIR_shard1_replica_n4] o.a.s.h.c.SpellCheckComponent Initializing spell checkers
   [junit4]   2> 681375 INFO  (qtp1259384059-2507) [n:127.0.0.1:45287_solr c:allReplicasInLIR s:shard1 r:core_node3 x:allReplicasInLIR_shard1_replica_n1] o.a.s.s.SolrIndexSearcher Opening [Searcher@4c36b06f[allReplicasInLIR_shard1_replica_n1] main]
   [junit4]   2> 681377 INFO  (qtp1259384059-2507) [n:127.0.0.1:45287_solr c:allReplicasInLIR s:shard1 r:core_node3 x:allReplicasInLIR_shard1_replica_n1] o.a.s.r.ManagedResourceStorage Configured ZooKeeperStorageIO with znodeBase: /configs/allReplicasInLIR.AUTOCREATED
   [junit4]   2> 681377 INFO  (qtp1259384059-2507) [n:127.0.0.1:45287_solr c:allReplicasInLIR s:shard1 r:core_node3 x:allReplicasInLIR_shard1_replica_n1] o.a.s.r.ManagedResourceStorage Loaded null at path _rest_managed.json using ZooKeeperStorageIO:path=/configs/allReplicasInLIR.AUTOCREATED
   [junit4]   2> 681377 INFO  (qtp1259384059-2507) [n:127.0.0.1:45287_solr c:allReplicasInLIR s:shard1 r:core_node3 x:allReplicasInLIR_shard1_replica_n1] o.a.s.s.ZkIndexSchemaReader Creating ZooKeeper watch for the managed schema at /configs/allReplicasInLIR.AUTOCREATED/managed-schema
   [junit4]   2> 681378 INFO  (qtp1259384059-2507) [n:127.0.0.1:45287_solr c:allReplicasInLIR s:shard1 r:core_node3 x:allReplicasInLIR_shard1_replica_n1] o.a.s.s.ZkIndexSchemaReader Current schema version 0 is already the latest
   [junit4]   2> 681378 INFO  (qtp1259384059-2507) [n:127.0.0.1:45287_solr c:allReplicasInLIR s:shard1 r:core_node3 x:allReplicasInLIR_shard1_replica_n1] o.a.s.h.c.SpellCheckComponent Initializing spell checkers
   [junit4]   2> 681452 INFO  (qtp493160009-2492) [n:127.0.0.1:39489_solr c:allReplicasInLIR s:shard1 r:core_node5 x:allReplicasInLIR_shard1_replica_n2] o.a.s.s.DirectSolrSpellChecker init: {name=default,field=_text_,classname=solr.DirectSolrSpellChecker,distanceMeasure=internal,accuracy=0.5,maxEdits=2,minPrefix=1,maxInspections=5,minQueryLength=4,maxQueryFrequency=0.01}
   [junit4]   2> 681466 INFO  (qtp276341149-2487) [n:127.0.0.1:41642_solr c:allReplicasInLIR s:shard1 r:core_node6 x:allReplicasInLIR_shard1_replica_n4] o.a.s.s.DirectSolrSpellChecker init: {name=default,field=_text_,classname=solr.DirectSolrSpellChecker,distanceMeasure=internal,accuracy=0.5,maxEdits=2,minPrefix=1,maxInspections=5,minQueryLength=4,maxQueryFrequency=0.01}
   [junit4]   2> 681468 INFO  (qtp1259384059-2507) [n:127.0.0.1:45287_solr c:allReplicasInLIR s:shard1 r:core_node3 x:allReplicasInLIR_shard1_replica_n1] o.a.s.s.DirectSolrSpellChecker init: {name=default,field=_text_,classname=solr.DirectSolrSpellChecker,distanceMeasure=internal,accuracy=0.5,maxEdits=2,minPrefix=1,maxInspections=5,minQueryLength=4,maxQueryFrequency=0.01}
   [junit4]   2> 681553 INFO  (qtp276341149-2487) [n:127.0.0.1:41642_solr c:allReplicasInLIR s:shard1 r:core_node6 x:allReplicasInLIR_shard1_replica_n4] o.a.s.h.ReplicationHandler Commits will be reserved for 10000ms.
   [junit4]   2> 681554 INFO  (qtp276341149-2487) [n:127.0.0.1:41642_solr c:allReplicasInLIR s:shard1 r:core_node6 x:allReplicasInLIR_shard1_replica_n4] o.a.s.u.UpdateLog Could not find max version in index or recent updates, using new clock 1609389823719636992
   [junit4]   2> 681558 INFO  (searcherExecutor-1280-thread-1-processing-n:127.0.0.1:41642_solr x:allReplicasInLIR_shard1_replica_n4 c:allReplicasInLIR s:shard1 r:core_node6) [n:127.0.0.1:41642_solr c:allReplicasInLIR s:shard1 r:core_node6 x:allReplicasInLIR_shard1_replica_n4] o.a.s.c.QuerySenderListener QuerySenderListener sending requests to Searcher@1b62799[allReplicasInLIR_shard1_replica_n4] main{ExitableDirectoryReader(UninvertingDirectoryReader())}
   [junit4]   2> 681559 INFO  (searcherExecutor-1280-thread-1-processing-n:127.0.0.1:41642_solr x:allReplicasInLIR_shard1_replica_n4 c:allReplicasInLIR s:shard1 r:core_node6) [n:127.0.0.1:41642_solr c:allReplicasInLIR s:shard1 r:core_node6 x:allReplicasInLIR_shard1_replica_n4] o.a.s.c.QuerySenderListener QuerySenderListener done.
   [junit4]   2> 681559 INFO  (searcherExecutor-1280-thread-1-processing-n:127.0.0.1:41642_solr x:allReplicasInLIR_shard1_replica_n4 c:allReplicasInLIR s:shard1 r:core_node6) [n:127.0.0.1:41642_solr c:allReplicasInLIR s:shard1 r:core_node6 x:allReplicasInLIR_shard1_replica_n4] o.a.s.h.c.SpellCheckComponent Loading spell index for spellchecker: default
   [junit4]   2> 681559 INFO  (searcherExecutor-1280-thread-1-processing-n:127.0.0.1:41642_solr x:allReplicasInLIR_shard1_replica_n4 c:allReplicasInLIR s:shard1 r:core_node6) [n:127.0.0.1:41642_solr c:allReplicasInLIR s:shard1 r:core_node6 x:allReplicasInLIR_shard1_replica_n4] o.a.s.c.SolrCore [allReplicasInLIR_shard1_replica_n4] Registered new searcher Searcher@1b62799[allReplicasInLIR_shard1_replica_n4] main{ExitableDirectoryReader(UninvertingDirectoryReader())}
   [junit4]   2> 681562 INFO  (qtp493160009-2492) [n:127.0.0.1:39489_solr c:allReplicasInLIR s:shard1 r:core_node5 x:allReplicasInLIR_shard1_replica_n2] o.a.s.h.ReplicationHandler Commits will be reserved for 10000ms.
   [junit4]   2> 681562 INFO  (qtp493160009-2492) [n:127.0.0.1:39489_solr c:allReplicasInLIR s:shard1 r:core_node5 x:allReplicasInLIR_shard1_replica_n2] o.a.s.u.UpdateLog Could not find max version in index or recent updates, using new clock 1609389823728025600
   [junit4]   2> 681566 INFO  (searcherExecutor-1282-thread-1-processing-n:127.0.0.1:39489_solr x:allReplicasInLIR_shard1_replica_n2 c:allReplicasInLIR s:shard1 r:core_node5) [n:127.0.0.1:39489_solr c:allReplicasInLIR s:shard1 r:core_node5 x:allReplicasInLIR_shard1_replica_n2] o.a.s.c.QuerySenderListener QuerySenderListener sending requests to Searcher@3fc24504[allReplicasInLIR_shard1_replica_n2] main{ExitableDirectoryReader(UninvertingDirectoryReader())}
   [junit4]   2> 681566 INFO  (searcherExecutor-1282-thread-1-processing-n:127.0.0.1:39489_solr x:allReplicasInLIR_shard1_replica_n2 c:allReplicasInLIR s:shard1 r:core_node5) [n:127.0.0.1:39489_solr c:allReplicasInLIR s:shard1 r:core_node5 x:allReplicasInLIR_shard1_replica_n2] o.a.s.c.QuerySenderListener QuerySenderListener done.
   [junit4]   2> 681567 INFO  (searcherExecutor-1282-thread-1-processing-n:127.0.0.1:39489_solr x:allReplicasInLIR_shard1_replica_n2 c:allReplicasInLIR s:shard1 r:core_node5) [n:127.0.0.1:39489_solr c:allReplicasInLIR s:shard1 r:core_node5 x:allReplicasInLIR_shard1_replica_n2] o.a.s.h.c.SpellCheckComponent Loading spell index for spellchecker: default
   [junit4]   2> 681567 INFO  (searcherExecutor-1282-thread-1-processing-n:127.0.0.1:39489_solr x:allReplicasInLIR_shard1_replica_n2 c:allReplicasInLIR s:shard1 r:core_node5) [n:127.0.0.1:39489_solr c:allReplicasInLIR s:shard1 r:core_node5 x:allReplicasInLIR_shard1_replica_n2] o.a.s.c.SolrCore [allReplicasInLIR_shard1_replica_n2] Registered new searcher Searcher@3fc24504[allReplicasInLIR_shard1_replica_n2] main{ExitableDirectoryReader(UninvertingDirectoryReader())}
   [junit4]   2> 681577 INFO  (qtp1259384059-2507) [n:127.0.0.1:45287_solr c:allReplicasInLIR s:shard1 r:core_node3 x:allReplicasInLIR_shard1_replica_n1] o.a.s.h.ReplicationHandler Commits will be reserved for 10000ms.
   [junit4]   2> 681577 INFO  (searcherExecutor-1281-thread-1-processing-n:127.0.0.1:45287_solr x:allReplicasInLIR_shard1_replica_n1 c:allReplicasInLIR s:shard1 r:core_node3) [n:127.0.0.1:45287_solr c:allReplicasInLIR s:shard1 r:core_node3 x:allReplicasInLIR_shard1_replica_n1] o.a.s.c.QuerySenderListener QuerySenderListener sending requests to Searcher@4c36b06f[allReplicasInLIR_shard1_replica_n1] main{ExitableDirectoryReader(UninvertingDirectoryReader())}
   [junit4]   2> 681577 INFO  (searcherExecutor-1281-thread-1-processing-n:127.0.0.1:45287_solr x:allReplicasInLIR_shard1_replica_n1 c:allReplicasInLIR s:shard1 r:core_node3) [n:127.0.0.1:45287_solr c:allReplicasInLIR s:shard1 r:core_node3 x:allReplicasInLIR_shard1_replica_n1] o.a.s.c.QuerySenderListener QuerySenderListener done.
   [junit4]   2> 681577 INFO  (searcherExecutor-1281-thread-1-processing-n:127.0.0.1:45287_solr x:allReplicasInLIR_shard1_replica_n1 c:allReplicasInLIR s:shard1 r:core_node3) [n:127.0.0.1:45287_solr c:allReplicasInLIR s:shard1 r:core_node3 x:allReplicasInLIR_shard1_replica_n1] o.a.s.h.c.SpellCheckComponent Loading spell index for spellchecker: default
   [junit4]   2> 681577 INFO  (searcherExecutor-1281-thread-1-processing-n:127.0.0.1:45287_solr x:allReplicasInLIR_shard1_replica_n1 c:allReplicasInLIR s:shard1 r:core_node3) [n:127.0.0.1:45287_solr c:allReplicasInLIR s:shard1 r:core_node3 x:allReplicasInLIR_shard1_replica_n1] o.a.s.c.SolrCore [allReplicasInLIR_shard1_replica_n1] Registered new searcher Searcher@4c36b06f[allReplicasInLIR_shard1_replica_n1] main{ExitableDirectoryReader(UninvertingDirectoryReader())}
   [junit4]   2> 681578 INFO  (qtp1259384059-2507) [n:127.0.0.1:45287_solr c:allReplicasInLIR s:shard1 r:core_node3 x:allReplicasInLIR_shard1_replica_n1] o.a.s.u.UpdateLog Could not find max version in index or recent updates, using new clock 1609389823744802816
   [junit4]   2> 681638 INFO  (qtp493160009-2492) [n:127.0.0.1:39489_solr c:allReplicasInLIR s:shard1 r:core_node5 x:allReplicasInLIR_shard1_replica_n2] o.a.s.c.ZkShardTerms Successful update of terms at /collections/allReplicasInLIR/terms/shard1 to Terms{values={core_node5=0}, version=0}
   [junit4]   2> 681679 INFO  (qtp493160009-2492) [n:127.0.0.1:39489_solr c:allReplicasInLIR s:shard1 r:core_node5 x:allReplicasInLIR_shard1_replica_n2] o.a.s.c.ShardLeaderElectionContext Waiting until we see more replicas up for shard shard1: total=3 found=1 timeoutin=9999ms
   [junit4]   2> 681699 INFO  (qtp276341149-2487) [n:127.0.0.1:41642_solr c:allReplicasInLIR s:shard1 r:core_node6 x:allReplicasInLIR_shard1_replica_n4] o.a.s.c.ZkShardTerms Successful update of terms at /collections/allReplicasInLIR/terms/shard1 to Terms{values={core_node6=0, core_node5=0}, version=1}
   [junit4]   2> 681752 INFO  (qtp1259384059-2507) [n:127.0.0.1:45287_solr c:allReplicasInLIR s:shard1 r:core_node3 x:allReplicasInLIR_shard1_replica_n1] o.a.s.c.ZkShardTerms Successful update of terms at /collections/allReplicasInLIR/terms/shard1 to Terms{values={core_node6=0, core_node3=0, core_node5=0}, version=2}
   [junit4]   2> 682189 INFO  (qtp493160009-2492) [n:127.0.0.1:39489_solr c:allReplicasInLIR s:shard1 r:core_node5 x:allReplicasInLIR_shard1_replica_n2] o.a.s.c.ShardLeaderElectionContext Enough replicas found to continue.
   [junit4]   2> 682189 INFO  (qtp493160009-2492) [n:127.0.0.1:39489_solr c:allReplicasInLIR s:shard1 r:core_node5 x:allReplicasInLIR_shard1_replica_n2] o.a.s.c.ShardLeaderElectionContext I may be the new leader - try and sync
   [junit4]   2> 682189 INFO  (qtp493160009-2492) [n:127.0.0.1:39489_solr c:allReplicasInLIR s:shard1 r:core_node5 x:allReplicasInLIR_shard1_replica_n2] o.a.s.c.SyncStrategy Sync replicas to https://127.0.0.1:39489/solr/allReplicasInLIR_shard1_replica_n2/
   [junit4]   2> 682190 INFO  (qtp493160009-2492) [n:127.0.0.1:39489_solr c:allReplicasInLIR s:shard1 r:core_node5 x:allReplicasInLIR_shard1_replica_n2] o.a.s.u.PeerSync PeerSync: core=allReplicasInLIR_shard1_replica_n2 url=https://127.0.0.1:39489/solr START replicas=[https://127.0.0.1:45287/solr/allReplicasInLIR_shard1_replica_n1/, https://127.0.0.1:41642/solr/allReplicasInLIR_shard1_replica_n4/] nUpdates=100
   [junit4]   2> 682214 INFO  (qtp493160009-2492) [n:127.0.0.1:39489_solr c:allReplicasInLIR s:shard1 r:core_node5 x:allReplicasInLIR_shard1_replica_n2] o.a.s.u.PeerSync PeerSync: core=allReplicasInLIR_shard1_replica_n2 url=https://127.0.0.1:39489/solr DONE.  We have no versions.  sync failed.
   [junit4]   2> 682247 INFO  (qtp276341149-2481) [n:127.0.0.1:41642_solr c:allReplicasInLIR s:shard1 r:core_node6 x:allReplicasInLIR_shard1_replica_n4] o.a.s.c.S.Request [allReplicasInLIR_shard1_replica_n4]  webapp=/solr path=/get params={distrib=false&qt=/get&fingerprint=false&getVersions=100&wt=javabin&version=2} status=0 QTime=5
   [junit4]   2> 682284 INFO  (qtp1259384059-2508) [n:127.0.0.1:45287_solr c:allReplicasInLIR s:shard1 r:core_node3 x:allReplicasInLIR_shard1_replica_n1] o.a.s.c.S.Request [allReplicasInLIR_shard1_replica_n1]  webapp=/solr path=/get params={distrib=false&qt=/get&fingerprint=false&getVersions=100&wt=javabin&version=2} status=0 QTime=0
   [junit4]   2> 682285 INFO  (qtp493160009-2492) [n:127.0.0.1:39489_solr c:allReplicasInLIR s:shard1 r:core_node5 x:allReplicasInLIR_shard1_replica_n2] o.a.s.c.SyncStrategy Leader's attempt to sync with shard failed, moving to the next candidate
   [junit4]   2> 682285 INFO  (qtp493160009-2492) [n:127.0.0.1:39489_solr c:allReplicasInLIR s:shard1 r:core_node5 x:allReplicasInLIR_shard1_replica_n2] o.a.s.c.ShardLeaderElectionContext We failed sync, but we have no versions - we can't sync in that case - we were active before, so become leader anyway
   [junit4]   2> 682285 INFO  (qtp493160009-2492) [n:127.0.0.1:39489_solr c:allReplicasInLIR s:shard1 r:core_node5 x:allReplicasInLIR_shard1_replica_n2] o.a.s.c.ShardLeaderElectionContext Found all replicas participating in election, clear LIR
   [junit4]   2> 682320 INFO  (qtp493160009-2492) [n:127.0.0.1:39489_solr c:allReplicasInLIR s:shard1 r:core_node5 x:allReplicasInLIR_shard1_replica_n2] o.a.s.c.ShardLeaderElectionContext I am the new leader: https://127.0.0.1:39489/solr/allReplicasInLIR_shard1_replica_n2/ shard1
   [junit4]   2> 682487 INFO  (qtp493160009-2492) [n:127.0.0.1:39489_solr c:allReplicasInLIR s:shard1 r:core_node5 x:allReplicasInLIR_shard1_replica_n2] o.a.s.c.ZkControll

[...truncated too long message...]

s.xml

resolve:

ivy-availability-check:
[loadresource] Do not set property disallowed.ivy.jars.list as its length is 0.

-ivy-fail-disallowed-ivy-version:

ivy-fail:

ivy-configure:
[ivy:configure] :: loading settings :: file = /home/jenkins/jenkins-slave/workspace/Lucene-Solr-NightlyTests-7.x/checkout/lucene/top-level-ivy-settings.xml

resolve:

ivy-availability-check:
[loadresource] Do not set property disallowed.ivy.jars.list as its length is 0.

-ivy-fail-disallowed-ivy-version:

ivy-fail:

ivy-fail:

ivy-configure:
[ivy:configure] :: loading settings :: file = /home/jenkins/jenkins-slave/workspace/Lucene-Solr-NightlyTests-7.x/checkout/lucene/top-level-ivy-settings.xml

resolve:

ivy-availability-check:
[loadresource] Do not set property disallowed.ivy.jars.list as its length is 0.

-ivy-fail-disallowed-ivy-version:

ivy-fail:

ivy-configure:
[ivy:configure] :: loading settings :: file = /home/jenkins/jenkins-slave/workspace/Lucene-Solr-NightlyTests-7.x/checkout/lucene/top-level-ivy-settings.xml

resolve:

ivy-availability-check:
[loadresource] Do not set property disallowed.ivy.jars.list as its length is 0.

-ivy-fail-disallowed-ivy-version:

ivy-fail:

ivy-fail:

ivy-configure:
[ivy:configure] :: loading settings :: file = /home/jenkins/jenkins-slave/workspace/Lucene-Solr-NightlyTests-7.x/checkout/lucene/top-level-ivy-settings.xml

resolve:

ivy-availability-check:
[loadresource] Do not set property disallowed.ivy.jars.list as its length is 0.

-ivy-fail-disallowed-ivy-version:

ivy-fail:

ivy-fail:

ivy-configure:
[ivy:configure] :: loading settings :: file = /home/jenkins/jenkins-slave/workspace/Lucene-Solr-NightlyTests-7.x/checkout/lucene/top-level-ivy-settings.xml

resolve:

ivy-availability-check:
[loadresource] Do not set property disallowed.ivy.jars.list as its length is 0.

-ivy-fail-disallowed-ivy-version:

ivy-fail:

ivy-fail:

ivy-configure:
[ivy:configure] :: loading settings :: file = /home/jenkins/jenkins-slave/workspace/Lucene-Solr-NightlyTests-7.x/checkout/lucene/top-level-ivy-settings.xml

resolve:

ivy-availability-check:
[loadresource] Do not set property disallowed.ivy.jars.list as its length is 0.

-ivy-fail-disallowed-ivy-version:

ivy-fail:

ivy-fail:

ivy-configure:
[ivy:configure] :: loading settings :: file = /home/jenkins/jenkins-slave/workspace/Lucene-Solr-NightlyTests-7.x/checkout/lucene/top-level-ivy-settings.xml

resolve:

ivy-availability-check:
[loadresource] Do not set property disallowed.ivy.jars.list as its length is 0.

-ivy-fail-disallowed-ivy-version:

ivy-fail:

ivy-fail:

ivy-configure:
[ivy:configure] :: loading settings :: file = /home/jenkins/jenkins-slave/workspace/Lucene-Solr-NightlyTests-7.x/checkout/lucene/top-level-ivy-settings.xml

resolve:

ivy-availability-check:
[loadresource] Do not set property disallowed.ivy.jars.list as its length is 0.

-ivy-fail-disallowed-ivy-version:

ivy-fail:

ivy-fail:

ivy-configure:
[ivy:configure] :: loading settings :: file = /home/jenkins/jenkins-slave/workspace/Lucene-Solr-NightlyTests-7.x/checkout/lucene/top-level-ivy-settings.xml

resolve:

ivy-availability-check:
[loadresource] Do not set property disallowed.ivy.jars.list as its length is 0.

-ivy-fail-disallowed-ivy-version:

ivy-fail:

ivy-fail:

ivy-configure:
[ivy:configure] :: loading settings :: file = /home/jenkins/jenkins-slave/workspace/Lucene-Solr-NightlyTests-7.x/checkout/lucene/top-level-ivy-settings.xml

resolve:

ivy-availability-check:
[loadresource] Do not set property disallowed.ivy.jars.list as its length is 0.

-ivy-fail-disallowed-ivy-version:

ivy-fail:

ivy-fail:

ivy-configure:
[ivy:configure] :: loading settings :: file = /home/jenkins/jenkins-slave/workspace/Lucene-Solr-NightlyTests-7.x/checkout/lucene/top-level-ivy-settings.xml

resolve:

ivy-availability-check:
[loadresource] Do not set property disallowed.ivy.jars.list as its length is 0.

-ivy-fail-disallowed-ivy-version:

ivy-fail:

ivy-fail:

ivy-configure:
[ivy:configure] :: loading settings :: file = /home/jenkins/jenkins-slave/workspace/Lucene-Solr-NightlyTests-7.x/checkout/lucene/top-level-ivy-settings.xml

resolve:

ivy-availability-check:
[loadresource] Do not set property disallowed.ivy.jars.list as its length is 0.

-ivy-fail-disallowed-ivy-version:

ivy-fail:

ivy-fail:

ivy-configure:
[ivy:configure] :: loading settings :: file = /home/jenkins/jenkins-slave/workspace/Lucene-Solr-NightlyTests-7.x/checkout/lucene/top-level-ivy-settings.xml

resolve:

jar-checksums:
    [mkdir] Created dir: /home/jenkins/jenkins-slave/workspace/Lucene-Solr-NightlyTests-7.x/checkout/solr/null1191119814
     [copy] Copying 239 files to /home/jenkins/jenkins-slave/workspace/Lucene-Solr-NightlyTests-7.x/checkout/solr/null1191119814
   [delete] Deleting directory /home/jenkins/jenkins-slave/workspace/Lucene-Solr-NightlyTests-7.x/checkout/solr/null1191119814

check-working-copy:
[ivy:cachepath] :: resolving dependencies :: org.eclipse.jgit#org.eclipse.jgit-caller;working
[ivy:cachepath] 	confs: [default]
[ivy:cachepath] 	found org.eclipse.jgit#org.eclipse.jgit;4.6.0.201612231935-r in public
[ivy:cachepath] 	found com.jcraft#jsch;0.1.53 in public
[ivy:cachepath] 	found com.googlecode.javaewah#JavaEWAH;1.1.6 in public
[ivy:cachepath] 	found org.apache.httpcomponents#httpclient;4.3.6 in public
[ivy:cachepath] 	found org.apache.httpcomponents#httpcore;4.3.3 in public
[ivy:cachepath] 	found commons-logging#commons-logging;1.1.3 in public
[ivy:cachepath] 	found commons-codec#commons-codec;1.6 in public
[ivy:cachepath] 	found org.slf4j#slf4j-api;1.7.2 in public
[ivy:cachepath] :: resolution report :: resolve 29ms :: artifacts dl 5ms
	---------------------------------------------------------------------
	|                  |            modules            ||   artifacts   |
	|       conf       | number| search|dwnlded|evicted|| number|dwnlded|
	---------------------------------------------------------------------
	|      default     |   8   |   0   |   0   |   0   ||   8   |   0   |
	---------------------------------------------------------------------
[wc-checker] Initializing working copy...
[wc-checker] SLF4J: Failed to load class "org.slf4j.impl.StaticLoggerBinder".
[wc-checker] SLF4J: Defaulting to no-operation (NOP) logger implementation
[wc-checker] SLF4J: See http://www.slf4j.org/codes.html#StaticLoggerBinder for further details.
[wc-checker] Checking working copy status...

-jenkins-base:

BUILD SUCCESSFUL
Total time: 568 minutes 45 seconds
Archiving artifacts
java.lang.InterruptedException: no matches found within 10000
	at hudson.FilePath$34.hasMatch(FilePath.java:2678)
	at hudson.FilePath$34.invoke(FilePath.java:2557)
	at hudson.FilePath$34.invoke(FilePath.java:2547)
	at hudson.FilePath$FileCallableWrapper.call(FilePath.java:2918)
Also:   hudson.remoting.Channel$CallSiteStackTrace: Remote call to lucene2
		at hudson.remoting.Channel.attachCallSiteStackTrace(Channel.java:1741)
		at hudson.remoting.UserRequest$ExceptionResponse.retrieve(UserRequest.java:357)
		at hudson.remoting.Channel.call(Channel.java:955)
		at hudson.FilePath.act(FilePath.java:1036)
		at hudson.FilePath.act(FilePath.java:1025)
		at hudson.FilePath.validateAntFileMask(FilePath.java:2547)
		at hudson.tasks.ArtifactArchiver.perform(ArtifactArchiver.java:243)
		at hudson.tasks.BuildStepCompatibilityLayer.perform(BuildStepCompatibilityLayer.java:81)
		at hudson.tasks.BuildStepMonitor$1.perform(BuildStepMonitor.java:20)
		at hudson.model.AbstractBuild$AbstractBuildExecution.perform(AbstractBuild.java:744)
		at hudson.model.AbstractBuild$AbstractBuildExecution.performAllBuildSteps(AbstractBuild.java:690)
		at hudson.model.Build$BuildExecution.post2(Build.java:186)
		at hudson.model.AbstractBuild$AbstractBuildExecution.post(AbstractBuild.java:635)
		at hudson.model.Run.execute(Run.java:1819)
		at hudson.model.FreeStyleBuild.run(FreeStyleBuild.java:43)
		at hudson.model.ResourceController.execute(ResourceController.java:97)
		at hudson.model.Executor.run(Executor.java:429)
Caused: hudson.FilePath$TunneledInterruptedException
	at hudson.FilePath$FileCallableWrapper.call(FilePath.java:2920)
	at hudson.remoting.UserRequest.perform(UserRequest.java:212)
	at hudson.remoting.UserRequest.perform(UserRequest.java:54)
	at hudson.remoting.Request$2.run(Request.java:369)
	at hudson.remoting.InterceptingExecutorService$1.call(InterceptingExecutorService.java:72)
	at java.util.concurrent.FutureTask.run(FutureTask.java:266)
	at java.util.concurrent.ThreadPoolExecutor.runWorker(ThreadPoolExecutor.java:1142)
	at java.util.concurrent.ThreadPoolExecutor$Worker.run(ThreadPoolExecutor.java:617)
	at java.lang.Thread.run(Thread.java:748)
Caused: java.lang.InterruptedException: java.lang.InterruptedException: no matches found within 10000
	at hudson.FilePath.act(FilePath.java:1038)
	at hudson.FilePath.act(FilePath.java:1025)
	at hudson.FilePath.validateAntFileMask(FilePath.java:2547)
	at hudson.tasks.ArtifactArchiver.perform(ArtifactArchiver.java:243)
	at hudson.tasks.BuildStepCompatibilityLayer.perform(BuildStepCompatibilityLayer.java:81)
	at hudson.tasks.BuildStepMonitor$1.perform(BuildStepMonitor.java:20)
	at hudson.model.AbstractBuild$AbstractBuildExecution.perform(AbstractBuild.java:744)
	at hudson.model.AbstractBuild$AbstractBuildExecution.performAllBuildSteps(AbstractBuild.java:690)
	at hudson.model.Build$BuildExecution.post2(Build.java:186)
	at hudson.model.AbstractBuild$AbstractBuildExecution.post(AbstractBuild.java:635)
	at hudson.model.Run.execute(Run.java:1819)
	at hudson.model.FreeStyleBuild.run(FreeStyleBuild.java:43)
	at hudson.model.ResourceController.execute(ResourceController.java:97)
	at hudson.model.Executor.run(Executor.java:429)
No artifacts found that match the file pattern "**/*.events,heapdumps/**,**/hs_err_pid*". Configuration error?
Recording test results
Build step 'Publish JUnit test result report' changed build result to UNSTABLE
Email was triggered for: Unstable (Test Failures)
Sending email for trigger: Unstable (Test Failures)

Mime
View raw message