lucene-dev mailing list archives

Site index · List index
Message view « Date » · « Thread »
Top « Date » · « Thread »
From Apache Jenkins Server <jenk...@builds.apache.org>
Subject [JENKINS] Lucene-Solr-BadApples-Tests-master - Build # 112 - Still Unstable
Date Wed, 01 Aug 2018 01:46:13 GMT
Build: https://builds.apache.org/job/Lucene-Solr-BadApples-Tests-master/112/

13 tests failed.
FAILED:  org.apache.solr.cloud.autoscaling.IndexSizeTriggerTest.testTrigger

Error Message:
number of ops expected:<2> but was:<1>

Stack Trace:
java.lang.AssertionError: number of ops expected:<2> but was:<1>
	at __randomizedtesting.SeedInfo.seed([3874D4689786D9E0:5BBFE2EA0E49AACD]:0)
	at org.junit.Assert.fail(Assert.java:93)
	at org.junit.Assert.failNotEquals(Assert.java:647)
	at org.junit.Assert.assertEquals(Assert.java:128)
	at org.junit.Assert.assertEquals(Assert.java:472)
	at org.apache.solr.cloud.autoscaling.IndexSizeTriggerTest.testTrigger(IndexSizeTriggerTest.java:189)
	at sun.reflect.NativeMethodAccessorImpl.invoke0(Native Method)
	at sun.reflect.NativeMethodAccessorImpl.invoke(NativeMethodAccessorImpl.java:62)
	at sun.reflect.DelegatingMethodAccessorImpl.invoke(DelegatingMethodAccessorImpl.java:43)
	at java.lang.reflect.Method.invoke(Method.java:498)
	at com.carrotsearch.randomizedtesting.RandomizedRunner.invoke(RandomizedRunner.java:1737)
	at com.carrotsearch.randomizedtesting.RandomizedRunner$8.evaluate(RandomizedRunner.java:934)
	at com.carrotsearch.randomizedtesting.RandomizedRunner$9.evaluate(RandomizedRunner.java:970)
	at com.carrotsearch.randomizedtesting.RandomizedRunner$10.evaluate(RandomizedRunner.java:984)
	at com.carrotsearch.randomizedtesting.rules.SystemPropertiesRestoreRule$1.evaluate(SystemPropertiesRestoreRule.java:57)
	at org.apache.lucene.util.TestRuleSetupTeardownChained$1.evaluate(TestRuleSetupTeardownChained.java:49)
	at org.apache.lucene.util.AbstractBeforeAfterRule$1.evaluate(AbstractBeforeAfterRule.java:45)
	at org.apache.lucene.util.TestRuleThreadAndTestName$1.evaluate(TestRuleThreadAndTestName.java:48)
	at org.apache.lucene.util.TestRuleIgnoreAfterMaxFailures$1.evaluate(TestRuleIgnoreAfterMaxFailures.java:64)
	at org.apache.lucene.util.TestRuleMarkFailure$1.evaluate(TestRuleMarkFailure.java:47)
	at com.carrotsearch.randomizedtesting.rules.StatementAdapter.evaluate(StatementAdapter.java:36)
	at com.carrotsearch.randomizedtesting.ThreadLeakControl$StatementRunner.run(ThreadLeakControl.java:368)
	at com.carrotsearch.randomizedtesting.ThreadLeakControl.forkTimeoutingTask(ThreadLeakControl.java:817)
	at com.carrotsearch.randomizedtesting.ThreadLeakControl$3.evaluate(ThreadLeakControl.java:468)
	at com.carrotsearch.randomizedtesting.RandomizedRunner.runSingleTest(RandomizedRunner.java:943)
	at com.carrotsearch.randomizedtesting.RandomizedRunner$5.evaluate(RandomizedRunner.java:829)
	at com.carrotsearch.randomizedtesting.RandomizedRunner$6.evaluate(RandomizedRunner.java:879)
	at com.carrotsearch.randomizedtesting.RandomizedRunner$7.evaluate(RandomizedRunner.java:890)
	at com.carrotsearch.randomizedtesting.rules.StatementAdapter.evaluate(StatementAdapter.java:36)
	at com.carrotsearch.randomizedtesting.rules.SystemPropertiesRestoreRule$1.evaluate(SystemPropertiesRestoreRule.java:57)
	at org.apache.lucene.util.AbstractBeforeAfterRule$1.evaluate(AbstractBeforeAfterRule.java:45)
	at com.carrotsearch.randomizedtesting.rules.StatementAdapter.evaluate(StatementAdapter.java:36)
	at org.apache.lucene.util.TestRuleStoreClassName$1.evaluate(TestRuleStoreClassName.java:41)
	at com.carrotsearch.randomizedtesting.rules.NoShadowingOrOverridesOnMethodsRule$1.evaluate(NoShadowingOrOverridesOnMethodsRule.java:40)
	at com.carrotsearch.randomizedtesting.rules.NoShadowingOrOverridesOnMethodsRule$1.evaluate(NoShadowingOrOverridesOnMethodsRule.java:40)
	at com.carrotsearch.randomizedtesting.rules.StatementAdapter.evaluate(StatementAdapter.java:36)
	at com.carrotsearch.randomizedtesting.rules.StatementAdapter.evaluate(StatementAdapter.java:36)
	at com.carrotsearch.randomizedtesting.rules.StatementAdapter.evaluate(StatementAdapter.java:36)
	at org.apache.lucene.util.TestRuleAssertionsRequired$1.evaluate(TestRuleAssertionsRequired.java:53)
	at org.apache.lucene.util.TestRuleMarkFailure$1.evaluate(TestRuleMarkFailure.java:47)
	at org.apache.lucene.util.TestRuleIgnoreAfterMaxFailures$1.evaluate(TestRuleIgnoreAfterMaxFailures.java:64)
	at org.apache.lucene.util.TestRuleIgnoreTestSuites$1.evaluate(TestRuleIgnoreTestSuites.java:54)
	at com.carrotsearch.randomizedtesting.rules.StatementAdapter.evaluate(StatementAdapter.java:36)
	at com.carrotsearch.randomizedtesting.ThreadLeakControl$StatementRunner.run(ThreadLeakControl.java:368)
	at java.lang.Thread.run(Thread.java:748)


FAILED:  org.apache.solr.cloud.autoscaling.IndexSizeTriggerTest.testSplitIntegration

Error Message:
events: [CapturedEvent{timestamp=15460444652099420, stage=STARTED, actionName='null', event={   "id":"36ed2fd7825c32Tc16675gmogt4qp3x9wd6lxs19",   "source":"index_size_trigger2",   "eventTime":15460438477265970,   "eventType":"INDEXSIZE",   "properties":{     "__start__":1,     "aboveSize":{"testSplitIntegration_collection":["{\"core_node1\":{\n    \"leader\":\"true\",\n    \"SEARCHER.searcher.maxDoc\":25,\n    \"SEARCHER.searcher.deletedDocs\":0,\n    \"INDEX.sizeInBytes\":22740,\n    \"node_name\":\"127.0.0.1:10002_solr\",\n    \"type\":\"NRT\",\n    \"SEARCHER.searcher.numDocs\":25,\n    \"__bytes__\":22740,\n    \"core\":\"testSplitIntegration_collection_shard1_replica_n1\",\n    \"__docs__\":25,\n    \"violationType\":\"aboveDocs\",\n    \"state\":\"active\",\n    \"INDEX.sizeInGB\":2.117827534675598E-5,\n    \"shard\":\"shard1\",\n    \"collection\":\"testSplitIntegration_collection\"}}"]},     "belowSize":{},     "_enqueue_time_":15460444643427270,     "requestedOps":["Op{action=SPLITSHARD, hints={COLL_SHARD=[{\n  \"first\":\"testSplitIntegration_collection\",\n  \"second\":\"shard1\"}]}}"]}}, context={}, config={   "trigger":"index_size_trigger2",   "stage":[     "STARTED",     "ABORTED",     "SUCCEEDED",     "FAILED"],   "afterAction":[     "compute_plan",     "execute_plan"],   "class":"org.apache.solr.cloud.autoscaling.IndexSizeTriggerTest$CapturingTriggerListener",   "beforeAction":[     "compute_plan",     "execute_plan"]}, message='null'}, CapturedEvent{timestamp=15460444851410520, stage=BEFORE_ACTION, actionName='compute_plan', event={   "id":"36ed2fd7825c32Tc16675gmogt4qp3x9wd6lxs19",   "source":"index_size_trigger2",   "eventTime":15460438477265970,   "eventType":"INDEXSIZE",   "properties":{     "__start__":1,     "aboveSize":{"testSplitIntegration_collection":["{\"core_node1\":{\n    \"leader\":\"true\",\n    \"SEARCHER.searcher.maxDoc\":25,\n    \"SEARCHER.searcher.deletedDocs\":0,\n    \"INDEX.sizeInBytes\":22740,\n    \"node_name\":\"127.0.0.1:10002_solr\",\n    \"type\":\"NRT\",\n    \"SEARCHER.searcher.numDocs\":25,\n    \"__bytes__\":22740,\n    \"core\":\"testSplitIntegration_collection_shard1_replica_n1\",\n    \"__docs__\":25,\n    \"violationType\":\"aboveDocs\",\n    \"state\":\"active\",\n    \"INDEX.sizeInGB\":2.117827534675598E-5,\n    \"shard\":\"shard1\",\n    \"collection\":\"testSplitIntegration_collection\"}}"]},     "belowSize":{},     "_enqueue_time_":15460444643427270,     "requestedOps":["Op{action=SPLITSHARD, hints={COLL_SHARD=[{\n  \"first\":\"testSplitIntegration_collection\",\n  \"second\":\"shard1\"}]}}"]}}, context={properties.BEFORE_ACTION=[compute_plan], source=index_size_trigger2}, config={   "trigger":"index_size_trigger2",   "stage":[     "STARTED",     "ABORTED",     "SUCCEEDED",     "FAILED"],   "afterAction":[     "compute_plan",     "execute_plan"],   "class":"org.apache.solr.cloud.autoscaling.IndexSizeTriggerTest$CapturingTriggerListener",   "beforeAction":[     "compute_plan",     "execute_plan"]}, message='null'}, CapturedEvent{timestamp=15460444907442870, stage=AFTER_ACTION, actionName='compute_plan', event={   "id":"36ed2fd7825c32Tc16675gmogt4qp3x9wd6lxs19",   "source":"index_size_trigger2",   "eventTime":15460438477265970,   "eventType":"INDEXSIZE",   "properties":{     "__start__":1,     "aboveSize":{"testSplitIntegration_collection":["{\"core_node1\":{\n    \"leader\":\"true\",\n    \"SEARCHER.searcher.maxDoc\":25,\n    \"SEARCHER.searcher.deletedDocs\":0,\n    \"INDEX.sizeInBytes\":22740,\n    \"node_name\":\"127.0.0.1:10002_solr\",\n    \"type\":\"NRT\",\n    \"SEARCHER.searcher.numDocs\":25,\n    \"__bytes__\":22740,\n    \"core\":\"testSplitIntegration_collection_shard1_replica_n1\",\n    \"__docs__\":25,\n    \"violationType\":\"aboveDocs\",\n    \"state\":\"active\",\n    \"INDEX.sizeInGB\":2.117827534675598E-5,\n    \"shard\":\"shard1\",\n    \"collection\":\"testSplitIntegration_collection\"}}"]},     "belowSize":{},     "_enqueue_time_":15460444643427270,     "requestedOps":["Op{action=SPLITSHARD, hints={COLL_SHARD=[{\n  \"first\":\"testSplitIntegration_collection\",\n  \"second\":\"shard1\"}]}}"]}}, context={properties.operations=[{class=org.apache.solr.client.solrj.request.CollectionAdminRequest$SplitShard, method=GET, params.action=SPLITSHARD, params.collection=testSplitIntegration_collection, params.shard=shard1}], properties.BEFORE_ACTION=[compute_plan], source=index_size_trigger2, properties.AFTER_ACTION=[compute_plan]}, config={   "trigger":"index_size_trigger2",   "stage":[     "STARTED",     "ABORTED",     "SUCCEEDED",     "FAILED"],   "afterAction":[     "compute_plan",     "execute_plan"],   "class":"org.apache.solr.cloud.autoscaling.IndexSizeTriggerTest$CapturingTriggerListener",   "beforeAction":[     "compute_plan",     "execute_plan"]}, message='null'}, CapturedEvent{timestamp=15460444922675270, stage=BEFORE_ACTION, actionName='execute_plan', event={   "id":"36ed2fd7825c32Tc16675gmogt4qp3x9wd6lxs19",   "source":"index_size_trigger2",   "eventTime":15460438477265970,   "eventType":"INDEXSIZE",   "properties":{     "__start__":1,     "aboveSize":{"testSplitIntegration_collection":["{\"core_node1\":{\n    \"leader\":\"true\",\n    \"SEARCHER.searcher.maxDoc\":25,\n    \"SEARCHER.searcher.deletedDocs\":0,\n    \"INDEX.sizeInBytes\":22740,\n    \"node_name\":\"127.0.0.1:10002_solr\",\n    \"type\":\"NRT\",\n    \"SEARCHER.searcher.numDocs\":25,\n    \"__bytes__\":22740,\n    \"core\":\"testSplitIntegration_collection_shard1_replica_n1\",\n    \"__docs__\":25,\n    \"violationType\":\"aboveDocs\",\n    \"state\":\"active\",\n    \"INDEX.sizeInGB\":2.117827534675598E-5,\n    \"shard\":\"shard1\",\n    \"collection\":\"testSplitIntegration_collection\"}}"]},     "belowSize":{},     "_enqueue_time_":15460444643427270,     "requestedOps":["Op{action=SPLITSHARD, hints={COLL_SHARD=[{\n  \"first\":\"testSplitIntegration_collection\",\n  \"second\":\"shard1\"}]}}"]}}, context={properties.operations=[{class=org.apache.solr.client.solrj.request.CollectionAdminRequest$SplitShard, method=GET, params.action=SPLITSHARD, params.collection=testSplitIntegration_collection, params.shard=shard1}], properties.BEFORE_ACTION=[compute_plan, execute_plan], source=index_size_trigger2, properties.AFTER_ACTION=[compute_plan]}, config={   "trigger":"index_size_trigger2",   "stage":[     "STARTED",     "ABORTED",     "SUCCEEDED",     "FAILED"],   "afterAction":[     "compute_plan",     "execute_plan"],   "class":"org.apache.solr.cloud.autoscaling.IndexSizeTriggerTest$CapturingTriggerListener",   "beforeAction":[     "compute_plan",     "execute_plan"]}, message='null'}, CapturedEvent{timestamp=15460452669123770, stage=AFTER_ACTION, actionName='execute_plan', event={   "id":"36ed2fd7825c32Tc16675gmogt4qp3x9wd6lxs19",   "source":"index_size_trigger2",   "eventTime":15460438477265970,   "eventType":"INDEXSIZE",   "properties":{     "__start__":1,     "aboveSize":{"testSplitIntegration_collection":["{\"core_node1\":{\n    \"leader\":\"true\",\n    \"SEARCHER.searcher.maxDoc\":25,\n    \"SEARCHER.searcher.deletedDocs\":0,\n    \"INDEX.sizeInBytes\":22740,\n    \"node_name\":\"127.0.0.1:10002_solr\",\n    \"type\":\"NRT\",\n    \"SEARCHER.searcher.numDocs\":25,\n    \"__bytes__\":22740,\n    \"core\":\"testSplitIntegration_collection_shard1_replica_n1\",\n    \"__docs__\":25,\n    \"violationType\":\"aboveDocs\",\n    \"state\":\"active\",\n    \"INDEX.sizeInGB\":2.117827534675598E-5,\n    \"shard\":\"shard1\",\n    \"collection\":\"testSplitIntegration_collection\"}}"]},     "belowSize":{},     "_enqueue_time_":15460444643427270,     "requestedOps":["Op{action=SPLITSHARD, hints={COLL_SHARD=[{\n  \"first\":\"testSplitIntegration_collection\",\n  \"second\":\"shard1\"}]}}"]}}, context={properties.operations=[{class=org.apache.solr.client.solrj.request.CollectionAdminRequest$SplitShard, method=GET, params.action=SPLITSHARD, params.async=index_size_trigger2/36ed2fd7825c32Tc16675gmogt4qp3x9wd6lxs19/0, params.waitForFinalState=true, params.collection=testSplitIntegration_collection, params.shard=shard1}], properties.BEFORE_ACTION=[compute_plan, execute_plan], properties.responses=[{status={state=completed,msg=found [index_size_trigger2/36ed2fd7825c32Tc16675gmogt4qp3x9wd6lxs19/0] in completed tasks},success=}], source=index_size_trigger2, properties.AFTER_ACTION=[compute_plan, execute_plan]}, config={   "trigger":"index_size_trigger2",   "stage":[     "STARTED",     "ABORTED",     "SUCCEEDED",     "FAILED"],   "afterAction":[     "compute_plan",     "execute_plan"],   "class":"org.apache.solr.cloud.autoscaling.IndexSizeTriggerTest$CapturingTriggerListener",   "beforeAction":[     "compute_plan",     "execute_plan"]}, message='null'}, CapturedEvent{timestamp=15460452699431320, stage=SUCCEEDED, actionName='null', event={   "id":"36ed2fd7825c32Tc16675gmogt4qp3x9wd6lxs19",   "source":"index_size_trigger2",   "eventTime":15460438477265970,   "eventType":"INDEXSIZE",   "properties":{     "__start__":1,     "aboveSize":{"testSplitIntegration_collection":["{\"core_node1\":{\n    \"leader\":\"true\",\n    \"SEARCHER.searcher.maxDoc\":25,\n    \"SEARCHER.searcher.deletedDocs\":0,\n    \"INDEX.sizeInBytes\":22740,\n    \"node_name\":\"127.0.0.1:10002_solr\",\n    \"type\":\"NRT\",\n    \"SEARCHER.searcher.numDocs\":25,\n    \"__bytes__\":22740,\n    \"core\":\"testSplitIntegration_collection_shard1_replica_n1\",\n    \"__docs__\":25,\n    \"violationType\":\"aboveDocs\",\n    \"state\":\"active\",\n    \"INDEX.sizeInGB\":2.117827534675598E-5,\n    \"shard\":\"shard1\",\n    \"collection\":\"testSplitIntegration_collection\"}}"]},     "belowSize":{},     "_enqueue_time_":15460444643427270,     "requestedOps":["Op{action=SPLITSHARD, hints={COLL_SHARD=[{\n  \"first\":\"testSplitIntegration_collection\",\n  \"second\":\"shard1\"}]}}"]}}, context={}, config={   "trigger":"index_size_trigger2",   "stage":[     "STARTED",     "ABORTED",     "SUCCEEDED",     "FAILED"],   "afterAction":[     "compute_plan",     "execute_plan"],   "class":"org.apache.solr.cloud.autoscaling.IndexSizeTriggerTest$CapturingTriggerListener",   "beforeAction":[     "compute_plan",     "execute_plan"]}, message='null'}, CapturedEvent{timestamp=15460464031238920, stage=STARTED, actionName='null', event={   "id":"36ed345af0e6e8Tc16675gmogt4qp3x9wd6lxs1c",   "source":"index_size_trigger2",   "eventTime":15460457862194920,   "eventType":"INDEXSIZE",   "properties":{     "__start__":2,     "aboveSize":{"testSplitIntegration_collection":[         "{\"core_node10\":{\n    \"leader\":\"true\",\n    \"SEARCHER.searcher.maxDoc\":12,\n    \"SEARCHER.searcher.deletedDocs\":0,\n    \"INDEX.sizeInBytes\":16240,\n    \"node_name\":\"127.0.0.1:10002_solr\",\n    \"base_url\":\"http://127.0.0.1:10002/solr\",\n    \"type\":\"NRT\",\n    \"SEARCHER.searcher.numDocs\":12,\n    \"__bytes__\":16240,\n    \"__docs__\":12,\n    \"violationType\":\"aboveDocs\",\n    \"state\":\"active\",\n    \"INDEX.sizeInGB\":1.5124678611755371E-5,\n    \"core\":\"testSplitIntegration_collection_shard1_1_replica1\",\n    \"shard\":\"shard1_1\",\n    \"collection\":\"testSplitIntegration_collection\"}}",         "{\"core_node7\":{\n    \"leader\":\"true\",\n    \"SEARCHER.searcher.maxDoc\":13,\n    \"SEARCHER.searcher.deletedDocs\":0,\n    \"INDEX.sizeInBytes\":26980,\n    \"node_name\":\"127.0.0.1:10001_solr\",\n    \"base_url\":\"http://127.0.0.1:10001/solr\",\n    \"type\":\"NRT\",\n    \"SEARCHER.searcher.numDocs\":13,\n    \"__bytes__\":26980,\n    \"__docs__\":13,\n    \"violationType\":\"aboveDocs\",\n    \"state\":\"active\",\n    \"INDEX.sizeInGB\":2.512708306312561E-5,\n    \"core\":\"testSplitIntegration_collection_shard1_0_replica0\",\n    \"shard\":\"shard1_0\",\n    \"collection\":\"testSplitIntegration_collection\"}}"]},     "belowSize":{},     "_enqueue_time_":15460464023054820,     "requestedOps":[       "Op{action=SPLITSHARD, hints={COLL_SHARD=[{\n  \"first\":\"testSplitIntegration_collection\",\n  \"second\":\"shard1_1\"}]}}",       "Op{action=SPLITSHARD, hints={COLL_SHARD=[{\n  \"first\":\"testSplitIntegration_collection\",\n  \"second\":\"shard1_0\"}]}}"]}}, context={}, config={   "trigger":"index_size_trigger2",   "stage":[     "STARTED",     "ABORTED",     "SUCCEEDED",     "FAILED"],   "afterAction":[     "compute_plan",     "execute_plan"],   "class":"org.apache.solr.cloud.autoscaling.IndexSizeTriggerTest$CapturingTriggerListener",   "beforeAction":[     "compute_plan",     "execute_plan"]}, message='null'}, CapturedEvent{timestamp=15460464102705820, stage=BEFORE_ACTION, actionName='compute_plan', event={   "id":"36ed345af0e6e8Tc16675gmogt4qp3x9wd6lxs1c",   "source":"index_size_trigger2",   "eventTime":15460457862194920,   "eventType":"INDEXSIZE",   "properties":{     "__start__":2,     "aboveSize":{"testSplitIntegration_collection":[         "{\"core_node10\":{\n    \"leader\":\"true\",\n    \"SEARCHER.searcher.maxDoc\":12,\n    \"SEARCHER.searcher.deletedDocs\":0,\n    \"INDEX.sizeInBytes\":16240,\n    \"node_name\":\"127.0.0.1:10002_solr\",\n    \"base_url\":\"http://127.0.0.1:10002/solr\",\n    \"type\":\"NRT\",\n    \"SEARCHER.searcher.numDocs\":12,\n    \"__bytes__\":16240,\n    \"__docs__\":12,\n    \"violationType\":\"aboveDocs\",\n    \"state\":\"active\",\n    \"INDEX.sizeInGB\":1.5124678611755371E-5,\n    \"core\":\"testSplitIntegration_collection_shard1_1_replica1\",\n    \"shard\":\"shard1_1\",\n    \"collection\":\"testSplitIntegration_collection\"}}",         "{\"core_node7\":{\n    \"leader\":\"true\",\n    \"SEARCHER.searcher.maxDoc\":13,\n    \"SEARCHER.searcher.deletedDocs\":0,\n    \"INDEX.sizeInBytes\":26980,\n    \"node_name\":\"127.0.0.1:10001_solr\",\n    \"base_url\":\"http://127.0.0.1:10001/solr\",\n    \"type\":\"NRT\",\n    \"SEARCHER.searcher.numDocs\":13,\n    \"__bytes__\":26980,\n    \"__docs__\":13,\n    \"violationType\":\"aboveDocs\",\n    \"state\":\"active\",\n    \"INDEX.sizeInGB\":2.512708306312561E-5,\n    \"core\":\"testSplitIntegration_collection_shard1_0_replica0\",\n    \"shard\":\"shard1_0\",\n    \"collection\":\"testSplitIntegration_collection\"}}"]},     "belowSize":{},     "_enqueue_time_":15460464023054820,     "requestedOps":[       "Op{action=SPLITSHARD, hints={COLL_SHARD=[{\n  \"first\":\"testSplitIntegration_collection\",\n  \"second\":\"shard1_1\"}]}}",       "Op{action=SPLITSHARD, hints={COLL_SHARD=[{\n  \"first\":\"testSplitIntegration_collection\",\n  \"second\":\"shard1_0\"}]}}"]}}, context={properties.BEFORE_ACTION=[compute_plan], source=index_size_trigger2}, config={   "trigger":"index_size_trigger2",   "stage":[     "STARTED",     "ABORTED",     "SUCCEEDED",     "FAILED"],   "afterAction":[     "compute_plan",     "execute_plan"],   "class":"org.apache.solr.cloud.autoscaling.IndexSizeTriggerTest$CapturingTriggerListener",   "beforeAction":[     "compute_plan",     "execute_plan"]}, message='null'}, CapturedEvent{timestamp=15460464799316820, stage=AFTER_ACTION, actionName='compute_plan', event={   "id":"36ed345af0e6e8Tc16675gmogt4qp3x9wd6lxs1c",   "source":"index_size_trigger2",   "eventTime":15460457862194920,   "eventType":"INDEXSIZE",   "properties":{     "__start__":2,     "aboveSize":{"testSplitIntegration_collection":[         "{\"core_node10\":{\n    \"leader\":\"true\",\n    \"SEARCHER.searcher.maxDoc\":12,\n    \"SEARCHER.searcher.deletedDocs\":0,\n    \"INDEX.sizeInBytes\":16240,\n    \"node_name\":\"127.0.0.1:10002_solr\",\n    \"base_url\":\"http://127.0.0.1:10002/solr\",\n    \"type\":\"NRT\",\n    \"SEARCHER.searcher.numDocs\":12,\n    \"__bytes__\":16240,\n    \"__docs__\":12,\n    \"violationType\":\"aboveDocs\",\n    \"state\":\"active\",\n    \"INDEX.sizeInGB\":1.5124678611755371E-5,\n    \"core\":\"testSplitIntegration_collection_shard1_1_replica1\",\n    \"shard\":\"shard1_1\",\n    \"collection\":\"testSplitIntegration_collection\"}}",         "{\"core_node7\":{\n    \"leader\":\"true\",\n    \"SEARCHER.searcher.maxDoc\":13,\n    \"SEARCHER.searcher.deletedDocs\":0,\n    \"INDEX.sizeInBytes\":26980,\n    \"node_name\":\"127.0.0.1:10001_solr\",\n    \"base_url\":\"http://127.0.0.1:10001/solr\",\n    \"type\":\"NRT\",\n    \"SEARCHER.searcher.numDocs\":13,\n    \"__bytes__\":26980,\n    \"__docs__\":13,\n    \"violationType\":\"aboveDocs\",\n    \"state\":\"active\",\n    \"INDEX.sizeInGB\":2.512708306312561E-5,\n    \"core\":\"testSplitIntegration_collection_shard1_0_replica0\",\n    \"shard\":\"shard1_0\",\n    \"collection\":\"testSplitIntegration_collection\"}}"]},     "belowSize":{},     "_enqueue_time_":15460464023054820,     "requestedOps":[       "Op{action=SPLITSHARD, hints={COLL_SHARD=[{\n  \"first\":\"testSplitIntegration_collection\",\n  \"second\":\"shard1_1\"}]}}",       "Op{action=SPLITSHARD, hints={COLL_SHARD=[{\n  \"first\":\"testSplitIntegration_collection\",\n  \"second\":\"shard1_0\"}]}}"]}}, context={properties.operations=[{class=org.apache.solr.client.solrj.request.CollectionAdminRequest$SplitShard, method=GET, params.action=SPLITSHARD, params.collection=testSplitIntegration_collection, params.shard=shard1_1}, {class=org.apache.solr.client.solrj.request.CollectionAdminRequest$SplitShard, method=GET, params.action=SPLITSHARD, params.collection=testSplitIntegration_collection, params.shard=shard1_0}], properties.BEFORE_ACTION=[compute_plan], source=index_size_trigger2, properties.AFTER_ACTION=[compute_plan]}, config={   "trigger":"index_size_trigger2",   "stage":[     "STARTED",     "ABORTED",     "SUCCEEDED",     "FAILED"],   "afterAction":[     "compute_plan",     "execute_plan"],   "class":"org.apache.solr.cloud.autoscaling.IndexSizeTriggerTest$CapturingTriggerListener",   "beforeAction":[     "compute_plan",     "execute_plan"]}, message='null'}, CapturedEvent{timestamp=15460464819494120, stage=BEFORE_ACTION, actionName='execute_plan', event={   "id":"36ed345af0e6e8Tc16675gmogt4qp3x9wd6lxs1c",   "source":"index_size_trigger2",   "eventTime":15460457862194920,   "eventType":"INDEXSIZE",   "properties":{     "__start__":2,     "aboveSize":{"testSplitIntegration_collection":[         "{\"core_node10\":{\n    \"leader\":\"true\",\n    \"SEARCHER.searcher.maxDoc\":12,\n    \"SEARCHER.searcher.deletedDocs\":0,\n    \"INDEX.sizeInBytes\":16240,\n    \"node_name\":\"127.0.0.1:10002_solr\",\n    \"base_url\":\"http://127.0.0.1:10002/solr\",\n    \"type\":\"NRT\",\n    \"SEARCHER.searcher.numDocs\":12,\n    \"__bytes__\":16240,\n    \"__docs__\":12,\n    \"violationType\":\"aboveDocs\",\n    \"state\":\"active\",\n    \"INDEX.sizeInGB\":1.5124678611755371E-5,\n    \"core\":\"testSplitIntegration_collection_shard1_1_replica1\",\n    \"shard\":\"shard1_1\",\n    \"collection\":\"testSplitIntegration_collection\"}}",         "{\"core_node7\":{\n    \"leader\":\"true\",\n    \"SEARCHER.searcher.maxDoc\":13,\n    \"SEARCHER.searcher.deletedDocs\":0,\n    \"INDEX.sizeInBytes\":26980,\n    \"node_name\":\"127.0.0.1:10001_solr\",\n    \"base_url\":\"http://127.0.0.1:10001/solr\",\n    \"type\":\"NRT\",\n    \"SEARCHER.searcher.numDocs\":13,\n    \"__bytes__\":26980,\n    \"__docs__\":13,\n    \"violationType\":\"aboveDocs\",\n    \"state\":\"active\",\n    \"INDEX.sizeInGB\":2.512708306312561E-5,\n    \"core\":\"testSplitIntegration_collection_shard1_0_replica0\",\n    \"shard\":\"shard1_0\",\n    \"collection\":\"testSplitIntegration_collection\"}}"]},     "belowSize":{},     "_enqueue_time_":15460464023054820,     "requestedOps":[       "Op{action=SPLITSHARD, hints={COLL_SHARD=[{\n  \"first\":\"testSplitIntegration_collection\",\n  \"second\":\"shard1_1\"}]}}",       "Op{action=SPLITSHARD, hints={COLL_SHARD=[{\n  \"first\":\"testSplitIntegration_collection\",\n  \"second\":\"shard1_0\"}]}}"]}}, context={properties.operations=[{class=org.apache.solr.client.solrj.request.CollectionAdminRequest$SplitShard, method=GET, params.action=SPLITSHARD, params.collection=testSplitIntegration_collection, params.shard=shard1_1}, {class=org.apache.solr.client.solrj.request.CollectionAdminRequest$SplitShard, method=GET, params.action=SPLITSHARD, params.collection=testSplitIntegration_collection, params.shard=shard1_0}], properties.BEFORE_ACTION=[compute_plan, execute_plan], source=index_size_trigger2, properties.AFTER_ACTION=[compute_plan]}, config={   "trigger":"index_size_trigger2",   "stage":[     "STARTED",     "ABORTED",     "SUCCEEDED",     "FAILED"],   "afterAction":[     "compute_plan",     "execute_plan"],   "class":"org.apache.solr.cloud.autoscaling.IndexSizeTriggerTest$CapturingTriggerListener",   "beforeAction":[     "compute_plan",     "execute_plan"]}, message='null'}] expected:<6> but was:<10>

Stack Trace:
java.lang.AssertionError: events: [CapturedEvent{timestamp=15460444652099420, stage=STARTED, actionName='null', event={
  "id":"36ed2fd7825c32Tc16675gmogt4qp3x9wd6lxs19",
  "source":"index_size_trigger2",
  "eventTime":15460438477265970,
  "eventType":"INDEXSIZE",
  "properties":{
    "__start__":1,
    "aboveSize":{"testSplitIntegration_collection":["{\"core_node1\":{\n    \"leader\":\"true\",\n    \"SEARCHER.searcher.maxDoc\":25,\n    \"SEARCHER.searcher.deletedDocs\":0,\n    \"INDEX.sizeInBytes\":22740,\n    \"node_name\":\"127.0.0.1:10002_solr\",\n    \"type\":\"NRT\",\n    \"SEARCHER.searcher.numDocs\":25,\n    \"__bytes__\":22740,\n    \"core\":\"testSplitIntegration_collection_shard1_replica_n1\",\n    \"__docs__\":25,\n    \"violationType\":\"aboveDocs\",\n    \"state\":\"active\",\n    \"INDEX.sizeInGB\":2.117827534675598E-5,\n    \"shard\":\"shard1\",\n    \"collection\":\"testSplitIntegration_collection\"}}"]},
    "belowSize":{},
    "_enqueue_time_":15460444643427270,
    "requestedOps":["Op{action=SPLITSHARD, hints={COLL_SHARD=[{\n  \"first\":\"testSplitIntegration_collection\",\n  \"second\":\"shard1\"}]}}"]}}, context={}, config={
  "trigger":"index_size_trigger2",
  "stage":[
    "STARTED",
    "ABORTED",
    "SUCCEEDED",
    "FAILED"],
  "afterAction":[
    "compute_plan",
    "execute_plan"],
  "class":"org.apache.solr.cloud.autoscaling.IndexSizeTriggerTest$CapturingTriggerListener",
  "beforeAction":[
    "compute_plan",
    "execute_plan"]}, message='null'}, CapturedEvent{timestamp=15460444851410520, stage=BEFORE_ACTION, actionName='compute_plan', event={
  "id":"36ed2fd7825c32Tc16675gmogt4qp3x9wd6lxs19",
  "source":"index_size_trigger2",
  "eventTime":15460438477265970,
  "eventType":"INDEXSIZE",
  "properties":{
    "__start__":1,
    "aboveSize":{"testSplitIntegration_collection":["{\"core_node1\":{\n    \"leader\":\"true\",\n    \"SEARCHER.searcher.maxDoc\":25,\n    \"SEARCHER.searcher.deletedDocs\":0,\n    \"INDEX.sizeInBytes\":22740,\n    \"node_name\":\"127.0.0.1:10002_solr\",\n    \"type\":\"NRT\",\n    \"SEARCHER.searcher.numDocs\":25,\n    \"__bytes__\":22740,\n    \"core\":\"testSplitIntegration_collection_shard1_replica_n1\",\n    \"__docs__\":25,\n    \"violationType\":\"aboveDocs\",\n    \"state\":\"active\",\n    \"INDEX.sizeInGB\":2.117827534675598E-5,\n    \"shard\":\"shard1\",\n    \"collection\":\"testSplitIntegration_collection\"}}"]},
    "belowSize":{},
    "_enqueue_time_":15460444643427270,
    "requestedOps":["Op{action=SPLITSHARD, hints={COLL_SHARD=[{\n  \"first\":\"testSplitIntegration_collection\",\n  \"second\":\"shard1\"}]}}"]}}, context={properties.BEFORE_ACTION=[compute_plan], source=index_size_trigger2}, config={
  "trigger":"index_size_trigger2",
  "stage":[
    "STARTED",
    "ABORTED",
    "SUCCEEDED",
    "FAILED"],
  "afterAction":[
    "compute_plan",
    "execute_plan"],
  "class":"org.apache.solr.cloud.autoscaling.IndexSizeTriggerTest$CapturingTriggerListener",
  "beforeAction":[
    "compute_plan",
    "execute_plan"]}, message='null'}, CapturedEvent{timestamp=15460444907442870, stage=AFTER_ACTION, actionName='compute_plan', event={
  "id":"36ed2fd7825c32Tc16675gmogt4qp3x9wd6lxs19",
  "source":"index_size_trigger2",
  "eventTime":15460438477265970,
  "eventType":"INDEXSIZE",
  "properties":{
    "__start__":1,
    "aboveSize":{"testSplitIntegration_collection":["{\"core_node1\":{\n    \"leader\":\"true\",\n    \"SEARCHER.searcher.maxDoc\":25,\n    \"SEARCHER.searcher.deletedDocs\":0,\n    \"INDEX.sizeInBytes\":22740,\n    \"node_name\":\"127.0.0.1:10002_solr\",\n    \"type\":\"NRT\",\n    \"SEARCHER.searcher.numDocs\":25,\n    \"__bytes__\":22740,\n    \"core\":\"testSplitIntegration_collection_shard1_replica_n1\",\n    \"__docs__\":25,\n    \"violationType\":\"aboveDocs\",\n    \"state\":\"active\",\n    \"INDEX.sizeInGB\":2.117827534675598E-5,\n    \"shard\":\"shard1\",\n    \"collection\":\"testSplitIntegration_collection\"}}"]},
    "belowSize":{},
    "_enqueue_time_":15460444643427270,
    "requestedOps":["Op{action=SPLITSHARD, hints={COLL_SHARD=[{\n  \"first\":\"testSplitIntegration_collection\",\n  \"second\":\"shard1\"}]}}"]}}, context={properties.operations=[{class=org.apache.solr.client.solrj.request.CollectionAdminRequest$SplitShard, method=GET, params.action=SPLITSHARD, params.collection=testSplitIntegration_collection, params.shard=shard1}], properties.BEFORE_ACTION=[compute_plan], source=index_size_trigger2, properties.AFTER_ACTION=[compute_plan]}, config={
  "trigger":"index_size_trigger2",
  "stage":[
    "STARTED",
    "ABORTED",
    "SUCCEEDED",
    "FAILED"],
  "afterAction":[
    "compute_plan",
    "execute_plan"],
  "class":"org.apache.solr.cloud.autoscaling.IndexSizeTriggerTest$CapturingTriggerListener",
  "beforeAction":[
    "compute_plan",
    "execute_plan"]}, message='null'}, CapturedEvent{timestamp=15460444922675270, stage=BEFORE_ACTION, actionName='execute_plan', event={
  "id":"36ed2fd7825c32Tc16675gmogt4qp3x9wd6lxs19",
  "source":"index_size_trigger2",
  "eventTime":15460438477265970,
  "eventType":"INDEXSIZE",
  "properties":{
    "__start__":1,
    "aboveSize":{"testSplitIntegration_collection":["{\"core_node1\":{\n    \"leader\":\"true\",\n    \"SEARCHER.searcher.maxDoc\":25,\n    \"SEARCHER.searcher.deletedDocs\":0,\n    \"INDEX.sizeInBytes\":22740,\n    \"node_name\":\"127.0.0.1:10002_solr\",\n    \"type\":\"NRT\",\n    \"SEARCHER.searcher.numDocs\":25,\n    \"__bytes__\":22740,\n    \"core\":\"testSplitIntegration_collection_shard1_replica_n1\",\n    \"__docs__\":25,\n    \"violationType\":\"aboveDocs\",\n    \"state\":\"active\",\n    \"INDEX.sizeInGB\":2.117827534675598E-5,\n    \"shard\":\"shard1\",\n    \"collection\":\"testSplitIntegration_collection\"}}"]},
    "belowSize":{},
    "_enqueue_time_":15460444643427270,
    "requestedOps":["Op{action=SPLITSHARD, hints={COLL_SHARD=[{\n  \"first\":\"testSplitIntegration_collection\",\n  \"second\":\"shard1\"}]}}"]}}, context={properties.operations=[{class=org.apache.solr.client.solrj.request.CollectionAdminRequest$SplitShard, method=GET, params.action=SPLITSHARD, params.collection=testSplitIntegration_collection, params.shard=shard1}], properties.BEFORE_ACTION=[compute_plan, execute_plan], source=index_size_trigger2, properties.AFTER_ACTION=[compute_plan]}, config={
  "trigger":"index_size_trigger2",
  "stage":[
    "STARTED",
    "ABORTED",
    "SUCCEEDED",
    "FAILED"],
  "afterAction":[
    "compute_plan",
    "execute_plan"],
  "class":"org.apache.solr.cloud.autoscaling.IndexSizeTriggerTest$CapturingTriggerListener",
  "beforeAction":[
    "compute_plan",
    "execute_plan"]}, message='null'}, CapturedEvent{timestamp=15460452669123770, stage=AFTER_ACTION, actionName='execute_plan', event={
  "id":"36ed2fd7825c32Tc16675gmogt4qp3x9wd6lxs19",
  "source":"index_size_trigger2",
  "eventTime":15460438477265970,
  "eventType":"INDEXSIZE",
  "properties":{
    "__start__":1,
    "aboveSize":{"testSplitIntegration_collection":["{\"core_node1\":{\n    \"leader\":\"true\",\n    \"SEARCHER.searcher.maxDoc\":25,\n    \"SEARCHER.searcher.deletedDocs\":0,\n    \"INDEX.sizeInBytes\":22740,\n    \"node_name\":\"127.0.0.1:10002_solr\",\n    \"type\":\"NRT\",\n    \"SEARCHER.searcher.numDocs\":25,\n    \"__bytes__\":22740,\n    \"core\":\"testSplitIntegration_collection_shard1_replica_n1\",\n    \"__docs__\":25,\n    \"violationType\":\"aboveDocs\",\n    \"state\":\"active\",\n    \"INDEX.sizeInGB\":2.117827534675598E-5,\n    \"shard\":\"shard1\",\n    \"collection\":\"testSplitIntegration_collection\"}}"]},
    "belowSize":{},
    "_enqueue_time_":15460444643427270,
    "requestedOps":["Op{action=SPLITSHARD, hints={COLL_SHARD=[{\n  \"first\":\"testSplitIntegration_collection\",\n  \"second\":\"shard1\"}]}}"]}}, context={properties.operations=[{class=org.apache.solr.client.solrj.request.CollectionAdminRequest$SplitShard, method=GET, params.action=SPLITSHARD, params.async=index_size_trigger2/36ed2fd7825c32Tc16675gmogt4qp3x9wd6lxs19/0, params.waitForFinalState=true, params.collection=testSplitIntegration_collection, params.shard=shard1}], properties.BEFORE_ACTION=[compute_plan, execute_plan], properties.responses=[{status={state=completed,msg=found [index_size_trigger2/36ed2fd7825c32Tc16675gmogt4qp3x9wd6lxs19/0] in completed tasks},success=}], source=index_size_trigger2, properties.AFTER_ACTION=[compute_plan, execute_plan]}, config={
  "trigger":"index_size_trigger2",
  "stage":[
    "STARTED",
    "ABORTED",
    "SUCCEEDED",
    "FAILED"],
  "afterAction":[
    "compute_plan",
    "execute_plan"],
  "class":"org.apache.solr.cloud.autoscaling.IndexSizeTriggerTest$CapturingTriggerListener",
  "beforeAction":[
    "compute_plan",
    "execute_plan"]}, message='null'}, CapturedEvent{timestamp=15460452699431320, stage=SUCCEEDED, actionName='null', event={
  "id":"36ed2fd7825c32Tc16675gmogt4qp3x9wd6lxs19",
  "source":"index_size_trigger2",
  "eventTime":15460438477265970,
  "eventType":"INDEXSIZE",
  "properties":{
    "__start__":1,
    "aboveSize":{"testSplitIntegration_collection":["{\"core_node1\":{\n    \"leader\":\"true\",\n    \"SEARCHER.searcher.maxDoc\":25,\n    \"SEARCHER.searcher.deletedDocs\":0,\n    \"INDEX.sizeInBytes\":22740,\n    \"node_name\":\"127.0.0.1:10002_solr\",\n    \"type\":\"NRT\",\n    \"SEARCHER.searcher.numDocs\":25,\n    \"__bytes__\":22740,\n    \"core\":\"testSplitIntegration_collection_shard1_replica_n1\",\n    \"__docs__\":25,\n    \"violationType\":\"aboveDocs\",\n    \"state\":\"active\",\n    \"INDEX.sizeInGB\":2.117827534675598E-5,\n    \"shard\":\"shard1\",\n    \"collection\":\"testSplitIntegration_collection\"}}"]},
    "belowSize":{},
    "_enqueue_time_":15460444643427270,
    "requestedOps":["Op{action=SPLITSHARD, hints={COLL_SHARD=[{\n  \"first\":\"testSplitIntegration_collection\",\n  \"second\":\"shard1\"}]}}"]}}, context={}, config={
  "trigger":"index_size_trigger2",
  "stage":[
    "STARTED",
    "ABORTED",
    "SUCCEEDED",
    "FAILED"],
  "afterAction":[
    "compute_plan",
    "execute_plan"],
  "class":"org.apache.solr.cloud.autoscaling.IndexSizeTriggerTest$CapturingTriggerListener",
  "beforeAction":[
    "compute_plan",
    "execute_plan"]}, message='null'}, CapturedEvent{timestamp=15460464031238920, stage=STARTED, actionName='null', event={
  "id":"36ed345af0e6e8Tc16675gmogt4qp3x9wd6lxs1c",
  "source":"index_size_trigger2",
  "eventTime":15460457862194920,
  "eventType":"INDEXSIZE",
  "properties":{
    "__start__":2,
    "aboveSize":{"testSplitIntegration_collection":[
        "{\"core_node10\":{\n    \"leader\":\"true\",\n    \"SEARCHER.searcher.maxDoc\":12,\n    \"SEARCHER.searcher.deletedDocs\":0,\n    \"INDEX.sizeInBytes\":16240,\n    \"node_name\":\"127.0.0.1:10002_solr\",\n    \"base_url\":\"http://127.0.0.1:10002/solr\",\n    \"type\":\"NRT\",\n    \"SEARCHER.searcher.numDocs\":12,\n    \"__bytes__\":16240,\n    \"__docs__\":12,\n    \"violationType\":\"aboveDocs\",\n    \"state\":\"active\",\n    \"INDEX.sizeInGB\":1.5124678611755371E-5,\n    \"core\":\"testSplitIntegration_collection_shard1_1_replica1\",\n    \"shard\":\"shard1_1\",\n    \"collection\":\"testSplitIntegration_collection\"}}",
        "{\"core_node7\":{\n    \"leader\":\"true\",\n    \"SEARCHER.searcher.maxDoc\":13,\n    \"SEARCHER.searcher.deletedDocs\":0,\n    \"INDEX.sizeInBytes\":26980,\n    \"node_name\":\"127.0.0.1:10001_solr\",\n    \"base_url\":\"http://127.0.0.1:10001/solr\",\n    \"type\":\"NRT\",\n    \"SEARCHER.searcher.numDocs\":13,\n    \"__bytes__\":26980,\n    \"__docs__\":13,\n    \"violationType\":\"aboveDocs\",\n    \"state\":\"active\",\n    \"INDEX.sizeInGB\":2.512708306312561E-5,\n    \"core\":\"testSplitIntegration_collection_shard1_0_replica0\",\n    \"shard\":\"shard1_0\",\n    \"collection\":\"testSplitIntegration_collection\"}}"]},
    "belowSize":{},
    "_enqueue_time_":15460464023054820,
    "requestedOps":[
      "Op{action=SPLITSHARD, hints={COLL_SHARD=[{\n  \"first\":\"testSplitIntegration_collection\",\n  \"second\":\"shard1_1\"}]}}",
      "Op{action=SPLITSHARD, hints={COLL_SHARD=[{\n  \"first\":\"testSplitIntegration_collection\",\n  \"second\":\"shard1_0\"}]}}"]}}, context={}, config={
  "trigger":"index_size_trigger2",
  "stage":[
    "STARTED",
    "ABORTED",
    "SUCCEEDED",
    "FAILED"],
  "afterAction":[
    "compute_plan",
    "execute_plan"],
  "class":"org.apache.solr.cloud.autoscaling.IndexSizeTriggerTest$CapturingTriggerListener",
  "beforeAction":[
    "compute_plan",
    "execute_plan"]}, message='null'}, CapturedEvent{timestamp=15460464102705820, stage=BEFORE_ACTION, actionName='compute_plan', event={
  "id":"36ed345af0e6e8Tc16675gmogt4qp3x9wd6lxs1c",
  "source":"index_size_trigger2",
  "eventTime":15460457862194920,
  "eventType":"INDEXSIZE",
  "properties":{
    "__start__":2,
    "aboveSize":{"testSplitIntegration_collection":[
        "{\"core_node10\":{\n    \"leader\":\"true\",\n    \"SEARCHER.searcher.maxDoc\":12,\n    \"SEARCHER.searcher.deletedDocs\":0,\n    \"INDEX.sizeInBytes\":16240,\n    \"node_name\":\"127.0.0.1:10002_solr\",\n    \"base_url\":\"http://127.0.0.1:10002/solr\",\n    \"type\":\"NRT\",\n    \"SEARCHER.searcher.numDocs\":12,\n    \"__bytes__\":16240,\n    \"__docs__\":12,\n    \"violationType\":\"aboveDocs\",\n    \"state\":\"active\",\n    \"INDEX.sizeInGB\":1.5124678611755371E-5,\n    \"core\":\"testSplitIntegration_collection_shard1_1_replica1\",\n    \"shard\":\"shard1_1\",\n    \"collection\":\"testSplitIntegration_collection\"}}",
        "{\"core_node7\":{\n    \"leader\":\"true\",\n    \"SEARCHER.searcher.maxDoc\":13,\n    \"SEARCHER.searcher.deletedDocs\":0,\n    \"INDEX.sizeInBytes\":26980,\n    \"node_name\":\"127.0.0.1:10001_solr\",\n    \"base_url\":\"http://127.0.0.1:10001/solr\",\n    \"type\":\"NRT\",\n    \"SEARCHER.searcher.numDocs\":13,\n    \"__bytes__\":26980,\n    \"__docs__\":13,\n    \"violationType\":\"aboveDocs\",\n    \"state\":\"active\",\n    \"INDEX.sizeInGB\":2.512708306312561E-5,\n    \"core\":\"testSplitIntegration_collection_shard1_0_replica0\",\n    \"shard\":\"shard1_0\",\n    \"collection\":\"testSplitIntegration_collection\"}}"]},
    "belowSize":{},
    "_enqueue_time_":15460464023054820,
    "requestedOps":[
      "Op{action=SPLITSHARD, hints={COLL_SHARD=[{\n  \"first\":\"testSplitIntegration_collection\",\n  \"second\":\"shard1_1\"}]}}",
      "Op{action=SPLITSHARD, hints={COLL_SHARD=[{\n  \"first\":\"testSplitIntegration_collection\",\n  \"second\":\"shard1_0\"}]}}"]}}, context={properties.BEFORE_ACTION=[compute_plan], source=index_size_trigger2}, config={
  "trigger":"index_size_trigger2",
  "stage":[
    "STARTED",
    "ABORTED",
    "SUCCEEDED",
    "FAILED"],
  "afterAction":[
    "compute_plan",
    "execute_plan"],
  "class":"org.apache.solr.cloud.autoscaling.IndexSizeTriggerTest$CapturingTriggerListener",
  "beforeAction":[
    "compute_plan",
    "execute_plan"]}, message='null'}, CapturedEvent{timestamp=15460464799316820, stage=AFTER_ACTION, actionName='compute_plan', event={
  "id":"36ed345af0e6e8Tc16675gmogt4qp3x9wd6lxs1c",
  "source":"index_size_trigger2",
  "eventTime":15460457862194920,
  "eventType":"INDEXSIZE",
  "properties":{
    "__start__":2,
    "aboveSize":{"testSplitIntegration_collection":[
        "{\"core_node10\":{\n    \"leader\":\"true\",\n    \"SEARCHER.searcher.maxDoc\":12,\n    \"SEARCHER.searcher.deletedDocs\":0,\n    \"INDEX.sizeInBytes\":16240,\n    \"node_name\":\"127.0.0.1:10002_solr\",\n    \"base_url\":\"http://127.0.0.1:10002/solr\",\n    \"type\":\"NRT\",\n    \"SEARCHER.searcher.numDocs\":12,\n    \"__bytes__\":16240,\n    \"__docs__\":12,\n    \"violationType\":\"aboveDocs\",\n    \"state\":\"active\",\n    \"INDEX.sizeInGB\":1.5124678611755371E-5,\n    \"core\":\"testSplitIntegration_collection_shard1_1_replica1\",\n    \"shard\":\"shard1_1\",\n    \"collection\":\"testSplitIntegration_collection\"}}",
        "{\"core_node7\":{\n    \"leader\":\"true\",\n    \"SEARCHER.searcher.maxDoc\":13,\n    \"SEARCHER.searcher.deletedDocs\":0,\n    \"INDEX.sizeInBytes\":26980,\n    \"node_name\":\"127.0.0.1:10001_solr\",\n    \"base_url\":\"http://127.0.0.1:10001/solr\",\n    \"type\":\"NRT\",\n    \"SEARCHER.searcher.numDocs\":13,\n    \"__bytes__\":26980,\n    \"__docs__\":13,\n    \"violationType\":\"aboveDocs\",\n    \"state\":\"active\",\n    \"INDEX.sizeInGB\":2.512708306312561E-5,\n    \"core\":\"testSplitIntegration_collection_shard1_0_replica0\",\n    \"shard\":\"shard1_0\",\n    \"collection\":\"testSplitIntegration_collection\"}}"]},
    "belowSize":{},
    "_enqueue_time_":15460464023054820,
    "requestedOps":[
      "Op{action=SPLITSHARD, hints={COLL_SHARD=[{\n  \"first\":\"testSplitIntegration_collection\",\n  \"second\":\"shard1_1\"}]}}",
      "Op{action=SPLITSHARD, hints={COLL_SHARD=[{\n  \"first\":\"testSplitIntegration_collection\",\n  \"second\":\"shard1_0\"}]}}"]}}, context={properties.operations=[{class=org.apache.solr.client.solrj.request.CollectionAdminRequest$SplitShard, method=GET, params.action=SPLITSHARD, params.collection=testSplitIntegration_collection, params.shard=shard1_1}, {class=org.apache.solr.client.solrj.request.CollectionAdminRequest$SplitShard, method=GET, params.action=SPLITSHARD, params.collection=testSplitIntegration_collection, params.shard=shard1_0}], properties.BEFORE_ACTION=[compute_plan], source=index_size_trigger2, properties.AFTER_ACTION=[compute_plan]}, config={
  "trigger":"index_size_trigger2",
  "stage":[
    "STARTED",
    "ABORTED",
    "SUCCEEDED",
    "FAILED"],
  "afterAction":[
    "compute_plan",
    "execute_plan"],
  "class":"org.apache.solr.cloud.autoscaling.IndexSizeTriggerTest$CapturingTriggerListener",
  "beforeAction":[
    "compute_plan",
    "execute_plan"]}, message='null'}, CapturedEvent{timestamp=15460464819494120, stage=BEFORE_ACTION, actionName='execute_plan', event={
  "id":"36ed345af0e6e8Tc16675gmogt4qp3x9wd6lxs1c",
  "source":"index_size_trigger2",
  "eventTime":15460457862194920,
  "eventType":"INDEXSIZE",
  "properties":{
    "__start__":2,
    "aboveSize":{"testSplitIntegration_collection":[
        "{\"core_node10\":{\n    \"leader\":\"true\",\n    \"SEARCHER.searcher.maxDoc\":12,\n    \"SEARCHER.searcher.deletedDocs\":0,\n    \"INDEX.sizeInBytes\":16240,\n    \"node_name\":\"127.0.0.1:10002_solr\",\n    \"base_url\":\"http://127.0.0.1:10002/solr\",\n    \"type\":\"NRT\",\n    \"SEARCHER.searcher.numDocs\":12,\n    \"__bytes__\":16240,\n    \"__docs__\":12,\n    \"violationType\":\"aboveDocs\",\n    \"state\":\"active\",\n    \"INDEX.sizeInGB\":1.5124678611755371E-5,\n    \"core\":\"testSplitIntegration_collection_shard1_1_replica1\",\n    \"shard\":\"shard1_1\",\n    \"collection\":\"testSplitIntegration_collection\"}}",
        "{\"core_node7\":{\n    \"leader\":\"true\",\n    \"SEARCHER.searcher.maxDoc\":13,\n    \"SEARCHER.searcher.deletedDocs\":0,\n    \"INDEX.sizeInBytes\":26980,\n    \"node_name\":\"127.0.0.1:10001_solr\",\n    \"base_url\":\"http://127.0.0.1:10001/solr\",\n    \"type\":\"NRT\",\n    \"SEARCHER.searcher.numDocs\":13,\n    \"__bytes__\":26980,\n    \"__docs__\":13,\n    \"violationType\":\"aboveDocs\",\n    \"state\":\"active\",\n    \"INDEX.sizeInGB\":2.512708306312561E-5,\n    \"core\":\"testSplitIntegration_collection_shard1_0_replica0\",\n    \"shard\":\"shard1_0\",\n    \"collection\":\"testSplitIntegration_collection\"}}"]},
    "belowSize":{},
    "_enqueue_time_":15460464023054820,
    "requestedOps":[
      "Op{action=SPLITSHARD, hints={COLL_SHARD=[{\n  \"first\":\"testSplitIntegration_collection\",\n  \"second\":\"shard1_1\"}]}}",
      "Op{action=SPLITSHARD, hints={COLL_SHARD=[{\n  \"first\":\"testSplitIntegration_collection\",\n  \"second\":\"shard1_0\"}]}}"]}}, context={properties.operations=[{class=org.apache.solr.client.solrj.request.CollectionAdminRequest$SplitShard, method=GET, params.action=SPLITSHARD, params.collection=testSplitIntegration_collection, params.shard=shard1_1}, {class=org.apache.solr.client.solrj.request.CollectionAdminRequest$SplitShard, method=GET, params.action=SPLITSHARD, params.collection=testSplitIntegration_collection, params.shard=shard1_0}], properties.BEFORE_ACTION=[compute_plan, execute_plan], source=index_size_trigger2, properties.AFTER_ACTION=[compute_plan]}, config={
  "trigger":"index_size_trigger2",
  "stage":[
    "STARTED",
    "ABORTED",
    "SUCCEEDED",
    "FAILED"],
  "afterAction":[
    "compute_plan",
    "execute_plan"],
  "class":"org.apache.solr.cloud.autoscaling.IndexSizeTriggerTest$CapturingTriggerListener",
  "beforeAction":[
    "compute_plan",
    "execute_plan"]}, message='null'}] expected:<6> but was:<10>
	at __randomizedtesting.SeedInfo.seed([3874D4689786D9E0:1FA6D28B879101E]:0)
	at org.junit.Assert.fail(Assert.java:93)
	at org.junit.Assert.failNotEquals(Assert.java:647)
	at org.junit.Assert.assertEquals(Assert.java:128)
	at org.junit.Assert.assertEquals(Assert.java:472)
	at org.apache.solr.cloud.autoscaling.IndexSizeTriggerTest.testSplitIntegration(IndexSizeTriggerTest.java:317)
	at sun.reflect.NativeMethodAccessorImpl.invoke0(Native Method)
	at sun.reflect.NativeMethodAccessorImpl.invoke(NativeMethodAccessorImpl.java:62)
	at sun.reflect.DelegatingMethodAccessorImpl.invoke(DelegatingMethodAccessorImpl.java:43)
	at java.lang.reflect.Method.invoke(Method.java:498)
	at com.carrotsearch.randomizedtesting.RandomizedRunner.invoke(RandomizedRunner.java:1737)
	at com.carrotsearch.randomizedtesting.RandomizedRunner$8.evaluate(RandomizedRunner.java:934)
	at com.carrotsearch.randomizedtesting.RandomizedRunner$9.evaluate(RandomizedRunner.java:970)
	at com.carrotsearch.randomizedtesting.RandomizedRunner$10.evaluate(RandomizedRunner.java:984)
	at com.carrotsearch.randomizedtesting.rules.SystemPropertiesRestoreRule$1.evaluate(SystemPropertiesRestoreRule.java:57)
	at org.apache.lucene.util.TestRuleSetupTeardownChained$1.evaluate(TestRuleSetupTeardownChained.java:49)
	at org.apache.lucene.util.AbstractBeforeAfterRule$1.evaluate(AbstractBeforeAfterRule.java:45)
	at org.apache.lucene.util.TestRuleThreadAndTestName$1.evaluate(TestRuleThreadAndTestName.java:48)
	at org.apache.lucene.util.TestRuleIgnoreAfterMaxFailures$1.evaluate(TestRuleIgnoreAfterMaxFailures.java:64)
	at org.apache.lucene.util.TestRuleMarkFailure$1.evaluate(TestRuleMarkFailure.java:47)
	at com.carrotsearch.randomizedtesting.rules.StatementAdapter.evaluate(StatementAdapter.java:36)
	at com.carrotsearch.randomizedtesting.ThreadLeakControl$StatementRunner.run(ThreadLeakControl.java:368)
	at com.carrotsearch.randomizedtesting.ThreadLeakControl.forkTimeoutingTask(ThreadLeakControl.java:817)
	at com.carrotsearch.randomizedtesting.ThreadLeakControl$3.evaluate(ThreadLeakControl.java:468)
	at com.carrotsearch.randomizedtesting.RandomizedRunner.runSingleTest(RandomizedRunner.java:943)
	at com.carrotsearch.randomizedtesting.RandomizedRunner$5.evaluate(RandomizedRunner.java:829)
	at com.carrotsearch.randomizedtesting.RandomizedRunner$6.evaluate(RandomizedRunner.java:879)
	at com.carrotsearch.randomizedtesting.RandomizedRunner$7.evaluate(RandomizedRunner.java:890)
	at com.carrotsearch.randomizedtesting.rules.StatementAdapter.evaluate(StatementAdapter.java:36)
	at com.carrotsearch.randomizedtesting.rules.SystemPropertiesRestoreRule$1.evaluate(SystemPropertiesRestoreRule.java:57)
	at org.apache.lucene.util.AbstractBeforeAfterRule$1.evaluate(AbstractBeforeAfterRule.java:45)
	at com.carrotsearch.randomizedtesting.rules.StatementAdapter.evaluate(StatementAdapter.java:36)
	at org.apache.lucene.util.TestRuleStoreClassName$1.evaluate(TestRuleStoreClassName.java:41)
	at com.carrotsearch.randomizedtesting.rules.NoShadowingOrOverridesOnMethodsRule$1.evaluate(NoShadowingOrOverridesOnMethodsRule.java:40)
	at com.carrotsearch.randomizedtesting.rules.NoShadowingOrOverridesOnMethodsRule$1.evaluate(NoShadowingOrOverridesOnMethodsRule.java:40)
	at com.carrotsearch.randomizedtesting.rules.StatementAdapter.evaluate(StatementAdapter.java:36)
	at com.carrotsearch.randomizedtesting.rules.StatementAdapter.evaluate(StatementAdapter.java:36)
	at com.carrotsearch.randomizedtesting.rules.StatementAdapter.evaluate(StatementAdapter.java:36)
	at org.apache.lucene.util.TestRuleAssertionsRequired$1.evaluate(TestRuleAssertionsRequired.java:53)
	at org.apache.lucene.util.TestRuleMarkFailure$1.evaluate(TestRuleMarkFailure.java:47)
	at org.apache.lucene.util.TestRuleIgnoreAfterMaxFailures$1.evaluate(TestRuleIgnoreAfterMaxFailures.java:64)
	at org.apache.lucene.util.TestRuleIgnoreTestSuites$1.evaluate(TestRuleIgnoreTestSuites.java:54)
	at com.carrotsearch.randomizedtesting.rules.StatementAdapter.evaluate(StatementAdapter.java:36)
	at com.carrotsearch.randomizedtesting.ThreadLeakControl$StatementRunner.run(ThreadLeakControl.java:368)
	at java.lang.Thread.run(Thread.java:748)


FAILED:  org.apache.solr.cloud.autoscaling.ScheduledMaintenanceTriggerTest.testInactiveShardCleanup

Error Message:
should be at least one inactive event

Stack Trace:
java.lang.AssertionError: should be at least one inactive event
	at __randomizedtesting.SeedInfo.seed([3874D4689786D9E0:2558141AF6C5FEEB]:0)
	at org.junit.Assert.fail(Assert.java:93)
	at org.junit.Assert.assertTrue(Assert.java:43)
	at org.apache.solr.cloud.autoscaling.ScheduledMaintenanceTriggerTest.testInactiveShardCleanup(ScheduledMaintenanceTriggerTest.java:224)
	at sun.reflect.NativeMethodAccessorImpl.invoke0(Native Method)
	at sun.reflect.NativeMethodAccessorImpl.invoke(NativeMethodAccessorImpl.java:62)
	at sun.reflect.DelegatingMethodAccessorImpl.invoke(DelegatingMethodAccessorImpl.java:43)
	at java.lang.reflect.Method.invoke(Method.java:498)
	at com.carrotsearch.randomizedtesting.RandomizedRunner.invoke(RandomizedRunner.java:1737)
	at com.carrotsearch.randomizedtesting.RandomizedRunner$8.evaluate(RandomizedRunner.java:934)
	at com.carrotsearch.randomizedtesting.RandomizedRunner$9.evaluate(RandomizedRunner.java:970)
	at com.carrotsearch.randomizedtesting.RandomizedRunner$10.evaluate(RandomizedRunner.java:984)
	at com.carrotsearch.randomizedtesting.rules.SystemPropertiesRestoreRule$1.evaluate(SystemPropertiesRestoreRule.java:57)
	at org.apache.lucene.util.TestRuleSetupTeardownChained$1.evaluate(TestRuleSetupTeardownChained.java:49)
	at org.apache.lucene.util.AbstractBeforeAfterRule$1.evaluate(AbstractBeforeAfterRule.java:45)
	at org.apache.lucene.util.TestRuleThreadAndTestName$1.evaluate(TestRuleThreadAndTestName.java:48)
	at org.apache.lucene.util.TestRuleIgnoreAfterMaxFailures$1.evaluate(TestRuleIgnoreAfterMaxFailures.java:64)
	at org.apache.lucene.util.TestRuleMarkFailure$1.evaluate(TestRuleMarkFailure.java:47)
	at com.carrotsearch.randomizedtesting.rules.StatementAdapter.evaluate(StatementAdapter.java:36)
	at com.carrotsearch.randomizedtesting.ThreadLeakControl$StatementRunner.run(ThreadLeakControl.java:368)
	at com.carrotsearch.randomizedtesting.ThreadLeakControl.forkTimeoutingTask(ThreadLeakControl.java:817)
	at com.carrotsearch.randomizedtesting.ThreadLeakControl$3.evaluate(ThreadLeakControl.java:468)
	at com.carrotsearch.randomizedtesting.RandomizedRunner.runSingleTest(RandomizedRunner.java:943)
	at com.carrotsearch.randomizedtesting.RandomizedRunner$5.evaluate(RandomizedRunner.java:829)
	at com.carrotsearch.randomizedtesting.RandomizedRunner$6.evaluate(RandomizedRunner.java:879)
	at com.carrotsearch.randomizedtesting.RandomizedRunner$7.evaluate(RandomizedRunner.java:890)
	at com.carrotsearch.randomizedtesting.rules.StatementAdapter.evaluate(StatementAdapter.java:36)
	at com.carrotsearch.randomizedtesting.rules.SystemPropertiesRestoreRule$1.evaluate(SystemPropertiesRestoreRule.java:57)
	at org.apache.lucene.util.AbstractBeforeAfterRule$1.evaluate(AbstractBeforeAfterRule.java:45)
	at com.carrotsearch.randomizedtesting.rules.StatementAdapter.evaluate(StatementAdapter.java:36)
	at org.apache.lucene.util.TestRuleStoreClassName$1.evaluate(TestRuleStoreClassName.java:41)
	at com.carrotsearch.randomizedtesting.rules.NoShadowingOrOverridesOnMethodsRule$1.evaluate(NoShadowingOrOverridesOnMethodsRule.java:40)
	at com.carrotsearch.randomizedtesting.rules.NoShadowingOrOverridesOnMethodsRule$1.evaluate(NoShadowingOrOverridesOnMethodsRule.java:40)
	at com.carrotsearch.randomizedtesting.rules.StatementAdapter.evaluate(StatementAdapter.java:36)
	at com.carrotsearch.randomizedtesting.rules.StatementAdapter.evaluate(StatementAdapter.java:36)
	at com.carrotsearch.randomizedtesting.rules.StatementAdapter.evaluate(StatementAdapter.java:36)
	at org.apache.lucene.util.TestRuleAssertionsRequired$1.evaluate(TestRuleAssertionsRequired.java:53)
	at org.apache.lucene.util.TestRuleMarkFailure$1.evaluate(TestRuleMarkFailure.java:47)
	at org.apache.lucene.util.TestRuleIgnoreAfterMaxFailures$1.evaluate(TestRuleIgnoreAfterMaxFailures.java:64)
	at org.apache.lucene.util.TestRuleIgnoreTestSuites$1.evaluate(TestRuleIgnoreTestSuites.java:54)
	at com.carrotsearch.randomizedtesting.rules.StatementAdapter.evaluate(StatementAdapter.java:36)
	at com.carrotsearch.randomizedtesting.ThreadLeakControl$StatementRunner.run(ThreadLeakControl.java:368)
	at java.lang.Thread.run(Thread.java:748)


FAILED:  org.apache.solr.cloud.autoscaling.SearchRateTriggerIntegrationTest.testDeleteNode

Error Message:
unexpected DELETENODE status: {responseHeader={status=0,QTime=102},status={state=notfound,msg=Did not find [search_rate_trigger3/36c74e576b78a7Tc16675gmogt4qp3x9wd6lxubp/0] in any tasks queue}}

Stack Trace:
java.lang.AssertionError: unexpected DELETENODE status: {responseHeader={status=0,QTime=102},status={state=notfound,msg=Did not find [search_rate_trigger3/36c74e576b78a7Tc16675gmogt4qp3x9wd6lxubp/0] in any tasks queue}}
	at __randomizedtesting.SeedInfo.seed([3874D4689786D9E0:1AE61AEAA04C569D]:0)
	at org.junit.Assert.fail(Assert.java:93)
	at org.apache.solr.cloud.autoscaling.SearchRateTriggerIntegrationTest.lambda$testDeleteNode$6(SearchRateTriggerIntegrationTest.java:670)
	at java.util.ArrayList.forEach(ArrayList.java:1257)
	at org.apache.solr.cloud.autoscaling.SearchRateTriggerIntegrationTest.testDeleteNode(SearchRateTriggerIntegrationTest.java:662)
	at sun.reflect.NativeMethodAccessorImpl.invoke0(Native Method)
	at sun.reflect.NativeMethodAccessorImpl.invoke(NativeMethodAccessorImpl.java:62)
	at sun.reflect.DelegatingMethodAccessorImpl.invoke(DelegatingMethodAccessorImpl.java:43)
	at java.lang.reflect.Method.invoke(Method.java:498)
	at com.carrotsearch.randomizedtesting.RandomizedRunner.invoke(RandomizedRunner.java:1737)
	at com.carrotsearch.randomizedtesting.RandomizedRunner$8.evaluate(RandomizedRunner.java:934)
	at com.carrotsearch.randomizedtesting.RandomizedRunner$9.evaluate(RandomizedRunner.java:970)
	at com.carrotsearch.randomizedtesting.RandomizedRunner$10.evaluate(RandomizedRunner.java:984)
	at com.carrotsearch.randomizedtesting.rules.SystemPropertiesRestoreRule$1.evaluate(SystemPropertiesRestoreRule.java:57)
	at org.apache.lucene.util.TestRuleSetupTeardownChained$1.evaluate(TestRuleSetupTeardownChained.java:49)
	at org.apache.lucene.util.AbstractBeforeAfterRule$1.evaluate(AbstractBeforeAfterRule.java:45)
	at org.apache.lucene.util.TestRuleThreadAndTestName$1.evaluate(TestRuleThreadAndTestName.java:48)
	at org.apache.lucene.util.TestRuleIgnoreAfterMaxFailures$1.evaluate(TestRuleIgnoreAfterMaxFailures.java:64)
	at org.apache.lucene.util.TestRuleMarkFailure$1.evaluate(TestRuleMarkFailure.java:47)
	at com.carrotsearch.randomizedtesting.rules.StatementAdapter.evaluate(StatementAdapter.java:36)
	at com.carrotsearch.randomizedtesting.ThreadLeakControl$StatementRunner.run(ThreadLeakControl.java:368)
	at com.carrotsearch.randomizedtesting.ThreadLeakControl.forkTimeoutingTask(ThreadLeakControl.java:817)
	at com.carrotsearch.randomizedtesting.ThreadLeakControl$3.evaluate(ThreadLeakControl.java:468)
	at com.carrotsearch.randomizedtesting.RandomizedRunner.runSingleTest(RandomizedRunner.java:943)
	at com.carrotsearch.randomizedtesting.RandomizedRunner$5.evaluate(RandomizedRunner.java:829)
	at com.carrotsearch.randomizedtesting.RandomizedRunner$6.evaluate(RandomizedRunner.java:879)
	at com.carrotsearch.randomizedtesting.RandomizedRunner$7.evaluate(RandomizedRunner.java:890)
	at com.carrotsearch.randomizedtesting.rules.StatementAdapter.evaluate(StatementAdapter.java:36)
	at com.carrotsearch.randomizedtesting.rules.SystemPropertiesRestoreRule$1.evaluate(SystemPropertiesRestoreRule.java:57)
	at org.apache.lucene.util.AbstractBeforeAfterRule$1.evaluate(AbstractBeforeAfterRule.java:45)
	at com.carrotsearch.randomizedtesting.rules.StatementAdapter.evaluate(StatementAdapter.java:36)
	at org.apache.lucene.util.TestRuleStoreClassName$1.evaluate(TestRuleStoreClassName.java:41)
	at com.carrotsearch.randomizedtesting.rules.NoShadowingOrOverridesOnMethodsRule$1.evaluate(NoShadowingOrOverridesOnMethodsRule.java:40)
	at com.carrotsearch.randomizedtesting.rules.NoShadowingOrOverridesOnMethodsRule$1.evaluate(NoShadowingOrOverridesOnMethodsRule.java:40)
	at com.carrotsearch.randomizedtesting.rules.StatementAdapter.evaluate(StatementAdapter.java:36)
	at com.carrotsearch.randomizedtesting.rules.StatementAdapter.evaluate(StatementAdapter.java:36)
	at com.carrotsearch.randomizedtesting.rules.StatementAdapter.evaluate(StatementAdapter.java:36)
	at org.apache.lucene.util.TestRuleAssertionsRequired$1.evaluate(TestRuleAssertionsRequired.java:53)
	at org.apache.lucene.util.TestRuleMarkFailure$1.evaluate(TestRuleMarkFailure.java:47)
	at org.apache.lucene.util.TestRuleIgnoreAfterMaxFailures$1.evaluate(TestRuleIgnoreAfterMaxFailures.java:64)
	at org.apache.lucene.util.TestRuleIgnoreTestSuites$1.evaluate(TestRuleIgnoreTestSuites.java:54)
	at com.carrotsearch.randomizedtesting.rules.StatementAdapter.evaluate(StatementAdapter.java:36)
	at com.carrotsearch.randomizedtesting.ThreadLeakControl$StatementRunner.run(ThreadLeakControl.java:368)
	at java.lang.Thread.run(Thread.java:748)


FAILED:  org.apache.solr.cloud.autoscaling.sim.TestLargeCluster.testNodeLost

Error Message:
did not finish processing all events in time: started=5, finished=4

Stack Trace:
java.lang.AssertionError: did not finish processing all events in time: started=5, finished=4
	at __randomizedtesting.SeedInfo.seed([3874D4689786D9E0:87611A96146CBC66]:0)
	at org.junit.Assert.fail(Assert.java:93)
	at org.apache.solr.cloud.autoscaling.sim.TestLargeCluster.doTestNodeLost(TestLargeCluster.java:525)
	at org.apache.solr.cloud.autoscaling.sim.TestLargeCluster.testNodeLost(TestLargeCluster.java:378)
	at sun.reflect.NativeMethodAccessorImpl.invoke0(Native Method)
	at sun.reflect.NativeMethodAccessorImpl.invoke(NativeMethodAccessorImpl.java:62)
	at sun.reflect.DelegatingMethodAccessorImpl.invoke(DelegatingMethodAccessorImpl.java:43)
	at java.lang.reflect.Method.invoke(Method.java:498)
	at com.carrotsearch.randomizedtesting.RandomizedRunner.invoke(RandomizedRunner.java:1737)
	at com.carrotsearch.randomizedtesting.RandomizedRunner$8.evaluate(RandomizedRunner.java:934)
	at com.carrotsearch.randomizedtesting.RandomizedRunner$9.evaluate(RandomizedRunner.java:970)
	at com.carrotsearch.randomizedtesting.RandomizedRunner$10.evaluate(RandomizedRunner.java:984)
	at com.carrotsearch.randomizedtesting.rules.SystemPropertiesRestoreRule$1.evaluate(SystemPropertiesRestoreRule.java:57)
	at org.apache.lucene.util.TestRuleSetupTeardownChained$1.evaluate(TestRuleSetupTeardownChained.java:49)
	at org.apache.lucene.util.AbstractBeforeAfterRule$1.evaluate(AbstractBeforeAfterRule.java:45)
	at org.apache.lucene.util.TestRuleThreadAndTestName$1.evaluate(TestRuleThreadAndTestName.java:48)
	at org.apache.lucene.util.TestRuleIgnoreAfterMaxFailures$1.evaluate(TestRuleIgnoreAfterMaxFailures.java:64)
	at org.apache.lucene.util.TestRuleMarkFailure$1.evaluate(TestRuleMarkFailure.java:47)
	at com.carrotsearch.randomizedtesting.rules.StatementAdapter.evaluate(StatementAdapter.java:36)
	at com.carrotsearch.randomizedtesting.ThreadLeakControl$StatementRunner.run(ThreadLeakControl.java:368)
	at com.carrotsearch.randomizedtesting.ThreadLeakControl.forkTimeoutingTask(ThreadLeakControl.java:817)
	at com.carrotsearch.randomizedtesting.ThreadLeakControl$3.evaluate(ThreadLeakControl.java:468)
	at com.carrotsearch.randomizedtesting.RandomizedRunner.runSingleTest(RandomizedRunner.java:943)
	at com.carrotsearch.randomizedtesting.RandomizedRunner$5.evaluate(RandomizedRunner.java:829)
	at com.carrotsearch.randomizedtesting.RandomizedRunner$6.evaluate(RandomizedRunner.java:879)
	at com.carrotsearch.randomizedtesting.RandomizedRunner$7.evaluate(RandomizedRunner.java:890)
	at com.carrotsearch.randomizedtesting.rules.StatementAdapter.evaluate(StatementAdapter.java:36)
	at com.carrotsearch.randomizedtesting.rules.SystemPropertiesRestoreRule$1.evaluate(SystemPropertiesRestoreRule.java:57)
	at org.apache.lucene.util.AbstractBeforeAfterRule$1.evaluate(AbstractBeforeAfterRule.java:45)
	at com.carrotsearch.randomizedtesting.rules.StatementAdapter.evaluate(StatementAdapter.java:36)
	at org.apache.lucene.util.TestRuleStoreClassName$1.evaluate(TestRuleStoreClassName.java:41)
	at com.carrotsearch.randomizedtesting.rules.NoShadowingOrOverridesOnMethodsRule$1.evaluate(NoShadowingOrOverridesOnMethodsRule.java:40)
	at com.carrotsearch.randomizedtesting.rules.NoShadowingOrOverridesOnMethodsRule$1.evaluate(NoShadowingOrOverridesOnMethodsRule.java:40)
	at com.carrotsearch.randomizedtesting.rules.StatementAdapter.evaluate(StatementAdapter.java:36)
	at com.carrotsearch.randomizedtesting.rules.StatementAdapter.evaluate(StatementAdapter.java:36)
	at com.carrotsearch.randomizedtesting.rules.StatementAdapter.evaluate(StatementAdapter.java:36)
	at org.apache.lucene.util.TestRuleAssertionsRequired$1.evaluate(TestRuleAssertionsRequired.java:53)
	at org.apache.lucene.util.TestRuleMarkFailure$1.evaluate(TestRuleMarkFailure.java:47)
	at org.apache.lucene.util.TestRuleIgnoreAfterMaxFailures$1.evaluate(TestRuleIgnoreAfterMaxFailures.java:64)
	at org.apache.lucene.util.TestRuleIgnoreTestSuites$1.evaluate(TestRuleIgnoreTestSuites.java:54)
	at com.carrotsearch.randomizedtesting.rules.StatementAdapter.evaluate(StatementAdapter.java:36)
	at com.carrotsearch.randomizedtesting.ThreadLeakControl$StatementRunner.run(ThreadLeakControl.java:368)
	at java.lang.Thread.run(Thread.java:748)


FAILED:  org.apache.solr.cloud.autoscaling.sim.TestTriggerIntegration.testCooldown

Error Message:
The trigger did not fire at all

Stack Trace:
java.lang.AssertionError: The trigger did not fire at all
	at __randomizedtesting.SeedInfo.seed([3874D4689786D9E0:9CAB98CE92CAC12]:0)
	at org.junit.Assert.fail(Assert.java:93)
	at org.junit.Assert.assertTrue(Assert.java:43)
	at org.apache.solr.cloud.autoscaling.sim.TestTriggerIntegration.testCooldown(TestTriggerIntegration.java:1103)
	at sun.reflect.NativeMethodAccessorImpl.invoke0(Native Method)
	at sun.reflect.NativeMethodAccessorImpl.invoke(NativeMethodAccessorImpl.java:62)
	at sun.reflect.DelegatingMethodAccessorImpl.invoke(DelegatingMethodAccessorImpl.java:43)
	at java.lang.reflect.Method.invoke(Method.java:498)
	at com.carrotsearch.randomizedtesting.RandomizedRunner.invoke(RandomizedRunner.java:1737)
	at com.carrotsearch.randomizedtesting.RandomizedRunner$8.evaluate(RandomizedRunner.java:934)
	at com.carrotsearch.randomizedtesting.RandomizedRunner$9.evaluate(RandomizedRunner.java:970)
	at com.carrotsearch.randomizedtesting.RandomizedRunner$10.evaluate(RandomizedRunner.java:984)
	at com.carrotsearch.randomizedtesting.rules.SystemPropertiesRestoreRule$1.evaluate(SystemPropertiesRestoreRule.java:57)
	at org.apache.lucene.util.TestRuleSetupTeardownChained$1.evaluate(TestRuleSetupTeardownChained.java:49)
	at org.apache.lucene.util.AbstractBeforeAfterRule$1.evaluate(AbstractBeforeAfterRule.java:45)
	at org.apache.lucene.util.TestRuleThreadAndTestName$1.evaluate(TestRuleThreadAndTestName.java:48)
	at org.apache.lucene.util.TestRuleIgnoreAfterMaxFailures$1.evaluate(TestRuleIgnoreAfterMaxFailures.java:64)
	at org.apache.lucene.util.TestRuleMarkFailure$1.evaluate(TestRuleMarkFailure.java:47)
	at com.carrotsearch.randomizedtesting.rules.StatementAdapter.evaluate(StatementAdapter.java:36)
	at com.carrotsearch.randomizedtesting.ThreadLeakControl$StatementRunner.run(ThreadLeakControl.java:368)
	at com.carrotsearch.randomizedtesting.ThreadLeakControl.forkTimeoutingTask(ThreadLeakControl.java:817)
	at com.carrotsearch.randomizedtesting.ThreadLeakControl$3.evaluate(ThreadLeakControl.java:468)
	at com.carrotsearch.randomizedtesting.RandomizedRunner.runSingleTest(RandomizedRunner.java:943)
	at com.carrotsearch.randomizedtesting.RandomizedRunner$5.evaluate(RandomizedRunner.java:829)
	at com.carrotsearch.randomizedtesting.RandomizedRunner$6.evaluate(RandomizedRunner.java:879)
	at com.carrotsearch.randomizedtesting.RandomizedRunner$7.evaluate(RandomizedRunner.java:890)
	at com.carrotsearch.randomizedtesting.rules.StatementAdapter.evaluate(StatementAdapter.java:36)
	at com.carrotsearch.randomizedtesting.rules.SystemPropertiesRestoreRule$1.evaluate(SystemPropertiesRestoreRule.java:57)
	at org.apache.lucene.util.AbstractBeforeAfterRule$1.evaluate(AbstractBeforeAfterRule.java:45)
	at com.carrotsearch.randomizedtesting.rules.StatementAdapter.evaluate(StatementAdapter.java:36)
	at org.apache.lucene.util.TestRuleStoreClassName$1.evaluate(TestRuleStoreClassName.java:41)
	at com.carrotsearch.randomizedtesting.rules.NoShadowingOrOverridesOnMethodsRule$1.evaluate(NoShadowingOrOverridesOnMethodsRule.java:40)
	at com.carrotsearch.randomizedtesting.rules.NoShadowingOrOverridesOnMethodsRule$1.evaluate(NoShadowingOrOverridesOnMethodsRule.java:40)
	at com.carrotsearch.randomizedtesting.rules.StatementAdapter.evaluate(StatementAdapter.java:36)
	at com.carrotsearch.randomizedtesting.rules.StatementAdapter.evaluate(StatementAdapter.java:36)
	at com.carrotsearch.randomizedtesting.rules.StatementAdapter.evaluate(StatementAdapter.java:36)
	at org.apache.lucene.util.TestRuleAssertionsRequired$1.evaluate(TestRuleAssertionsRequired.java:53)
	at org.apache.lucene.util.TestRuleMarkFailure$1.evaluate(TestRuleMarkFailure.java:47)
	at org.apache.lucene.util.TestRuleIgnoreAfterMaxFailures$1.evaluate(TestRuleIgnoreAfterMaxFailures.java:64)
	at org.apache.lucene.util.TestRuleIgnoreTestSuites$1.evaluate(TestRuleIgnoreTestSuites.java:54)
	at com.carrotsearch.randomizedtesting.rules.StatementAdapter.evaluate(StatementAdapter.java:36)
	at com.carrotsearch.randomizedtesting.ThreadLeakControl$StatementRunner.run(ThreadLeakControl.java:368)
	at java.lang.Thread.run(Thread.java:748)


FAILED:  org.apache.solr.cloud.autoscaling.sim.TestTriggerIntegration.testSearchRate

Error Message:
The trigger did not fire at all

Stack Trace:
java.lang.AssertionError: The trigger did not fire at all
	at __randomizedtesting.SeedInfo.seed([3874D4689786D9E0:653CCAE158407FAF]:0)
	at org.junit.Assert.fail(Assert.java:93)
	at org.junit.Assert.assertTrue(Assert.java:43)
	at org.apache.solr.cloud.autoscaling.sim.TestTriggerIntegration.testSearchRate(TestTriggerIntegration.java:1204)
	at sun.reflect.NativeMethodAccessorImpl.invoke0(Native Method)
	at sun.reflect.NativeMethodAccessorImpl.invoke(NativeMethodAccessorImpl.java:62)
	at sun.reflect.DelegatingMethodAccessorImpl.invoke(DelegatingMethodAccessorImpl.java:43)
	at java.lang.reflect.Method.invoke(Method.java:498)
	at com.carrotsearch.randomizedtesting.RandomizedRunner.invoke(RandomizedRunner.java:1737)
	at com.carrotsearch.randomizedtesting.RandomizedRunner$8.evaluate(RandomizedRunner.java:934)
	at com.carrotsearch.randomizedtesting.RandomizedRunner$9.evaluate(RandomizedRunner.java:970)
	at com.carrotsearch.randomizedtesting.RandomizedRunner$10.evaluate(RandomizedRunner.java:984)
	at com.carrotsearch.randomizedtesting.rules.SystemPropertiesRestoreRule$1.evaluate(SystemPropertiesRestoreRule.java:57)
	at org.apache.lucene.util.TestRuleSetupTeardownChained$1.evaluate(TestRuleSetupTeardownChained.java:49)
	at org.apache.lucene.util.AbstractBeforeAfterRule$1.evaluate(AbstractBeforeAfterRule.java:45)
	at org.apache.lucene.util.TestRuleThreadAndTestName$1.evaluate(TestRuleThreadAndTestName.java:48)
	at org.apache.lucene.util.TestRuleIgnoreAfterMaxFailures$1.evaluate(TestRuleIgnoreAfterMaxFailures.java:64)
	at org.apache.lucene.util.TestRuleMarkFailure$1.evaluate(TestRuleMarkFailure.java:47)
	at com.carrotsearch.randomizedtesting.rules.StatementAdapter.evaluate(StatementAdapter.java:36)
	at com.carrotsearch.randomizedtesting.ThreadLeakControl$StatementRunner.run(ThreadLeakControl.java:368)
	at com.carrotsearch.randomizedtesting.ThreadLeakControl.forkTimeoutingTask(ThreadLeakControl.java:817)
	at com.carrotsearch.randomizedtesting.ThreadLeakControl$3.evaluate(ThreadLeakControl.java:468)
	at com.carrotsearch.randomizedtesting.RandomizedRunner.runSingleTest(RandomizedRunner.java:943)
	at com.carrotsearch.randomizedtesting.RandomizedRunner$5.evaluate(RandomizedRunner.java:829)
	at com.carrotsearch.randomizedtesting.RandomizedRunner$6.evaluate(RandomizedRunner.java:879)
	at com.carrotsearch.randomizedtesting.RandomizedRunner$7.evaluate(RandomizedRunner.java:890)
	at com.carrotsearch.randomizedtesting.rules.StatementAdapter.evaluate(StatementAdapter.java:36)
	at com.carrotsearch.randomizedtesting.rules.SystemPropertiesRestoreRule$1.evaluate(SystemPropertiesRestoreRule.java:57)
	at org.apache.lucene.util.AbstractBeforeAfterRule$1.evaluate(AbstractBeforeAfterRule.java:45)
	at com.carrotsearch.randomizedtesting.rules.StatementAdapter.evaluate(StatementAdapter.java:36)
	at org.apache.lucene.util.TestRuleStoreClassName$1.evaluate(TestRuleStoreClassName.java:41)
	at com.carrotsearch.randomizedtesting.rules.NoShadowingOrOverridesOnMethodsRule$1.evaluate(NoShadowingOrOverridesOnMethodsRule.java:40)
	at com.carrotsearch.randomizedtesting.rules.NoShadowingOrOverridesOnMethodsRule$1.evaluate(NoShadowingOrOverridesOnMethodsRule.java:40)
	at com.carrotsearch.randomizedtesting.rules.StatementAdapter.evaluate(StatementAdapter.java:36)
	at com.carrotsearch.randomizedtesting.rules.StatementAdapter.evaluate(StatementAdapter.java:36)
	at com.carrotsearch.randomizedtesting.rules.StatementAdapter.evaluate(StatementAdapter.java:36)
	at org.apache.lucene.util.TestRuleAssertionsRequired$1.evaluate(TestRuleAssertionsRequired.java:53)
	at org.apache.lucene.util.TestRuleMarkFailure$1.evaluate(TestRuleMarkFailure.java:47)
	at org.apache.lucene.util.TestRuleIgnoreAfterMaxFailures$1.evaluate(TestRuleIgnoreAfterMaxFailures.java:64)
	at org.apache.lucene.util.TestRuleIgnoreTestSuites$1.evaluate(TestRuleIgnoreTestSuites.java:54)
	at com.carrotsearch.randomizedtesting.rules.StatementAdapter.evaluate(StatementAdapter.java:36)
	at com.carrotsearch.randomizedtesting.ThreadLeakControl$StatementRunner.run(ThreadLeakControl.java:368)
	at java.lang.Thread.run(Thread.java:748)


FAILED:  org.apache.solr.update.MaxSizeAutoCommitTest.deleteTest

Error Message:
Tlog size exceeds the max size bound. Tlog path: /home/jenkins/jenkins-slave/workspace/Lucene-Solr-BadApples-Tests-master/solr/build/solr-core/test/J0/temp/solr.update.MaxSizeAutoCommitTest_3874D4689786D9E0-001/init-core-data-001/tlog/tlog.0000000000000000002, tlog size: 1276

Stack Trace:
java.lang.AssertionError: Tlog size exceeds the max size bound. Tlog path: /home/jenkins/jenkins-slave/workspace/Lucene-Solr-BadApples-Tests-master/solr/build/solr-core/test/J0/temp/solr.update.MaxSizeAutoCommitTest_3874D4689786D9E0-001/init-core-data-001/tlog/tlog.0000000000000000002, tlog size: 1276
	at __randomizedtesting.SeedInfo.seed([3874D4689786D9E0:283A3197EC28E011]:0)
	at org.junit.Assert.fail(Assert.java:93)
	at org.junit.Assert.assertTrue(Assert.java:43)
	at org.apache.solr.update.MaxSizeAutoCommitTest.getTlogFileSizes(MaxSizeAutoCommitTest.java:383)
	at org.apache.solr.update.MaxSizeAutoCommitTest.deleteTest(MaxSizeAutoCommitTest.java:203)
	at sun.reflect.NativeMethodAccessorImpl.invoke0(Native Method)
	at sun.reflect.NativeMethodAccessorImpl.invoke(NativeMethodAccessorImpl.java:62)
	at sun.reflect.DelegatingMethodAccessorImpl.invoke(DelegatingMethodAccessorImpl.java:43)
	at java.lang.reflect.Method.invoke(Method.java:498)
	at com.carrotsearch.randomizedtesting.RandomizedRunner.invoke(RandomizedRunner.java:1737)
	at com.carrotsearch.randomizedtesting.RandomizedRunner$8.evaluate(RandomizedRunner.java:934)
	at com.carrotsearch.randomizedtesting.RandomizedRunner$9.evaluate(RandomizedRunner.java:970)
	at com.carrotsearch.randomizedtesting.RandomizedRunner$10.evaluate(RandomizedRunner.java:984)
	at com.carrotsearch.randomizedtesting.rules.SystemPropertiesRestoreRule$1.evaluate(SystemPropertiesRestoreRule.java:57)
	at org.apache.lucene.util.TestRuleSetupTeardownChained$1.evaluate(TestRuleSetupTeardownChained.java:49)
	at org.apache.lucene.util.AbstractBeforeAfterRule$1.evaluate(AbstractBeforeAfterRule.java:45)
	at org.apache.lucene.util.TestRuleThreadAndTestName$1.evaluate(TestRuleThreadAndTestName.java:48)
	at org.apache.lucene.util.TestRuleIgnoreAfterMaxFailures$1.evaluate(TestRuleIgnoreAfterMaxFailures.java:64)
	at org.apache.lucene.util.TestRuleMarkFailure$1.evaluate(TestRuleMarkFailure.java:47)
	at com.carrotsearch.randomizedtesting.rules.StatementAdapter.evaluate(StatementAdapter.java:36)
	at com.carrotsearch.randomizedtesting.ThreadLeakControl$StatementRunner.run(ThreadLeakControl.java:368)
	at com.carrotsearch.randomizedtesting.ThreadLeakControl.forkTimeoutingTask(ThreadLeakControl.java:817)
	at com.carrotsearch.randomizedtesting.ThreadLeakControl$3.evaluate(ThreadLeakControl.java:468)
	at com.carrotsearch.randomizedtesting.RandomizedRunner.runSingleTest(RandomizedRunner.java:943)
	at com.carrotsearch.randomizedtesting.RandomizedRunner$5.evaluate(RandomizedRunner.java:829)
	at com.carrotsearch.randomizedtesting.RandomizedRunner$6.evaluate(RandomizedRunner.java:879)
	at com.carrotsearch.randomizedtesting.RandomizedRunner$7.evaluate(RandomizedRunner.java:890)
	at com.carrotsearch.randomizedtesting.rules.StatementAdapter.evaluate(StatementAdapter.java:36)
	at com.carrotsearch.randomizedtesting.rules.SystemPropertiesRestoreRule$1.evaluate(SystemPropertiesRestoreRule.java:57)
	at org.apache.lucene.util.AbstractBeforeAfterRule$1.evaluate(AbstractBeforeAfterRule.java:45)
	at com.carrotsearch.randomizedtesting.rules.StatementAdapter.evaluate(StatementAdapter.java:36)
	at org.apache.lucene.util.TestRuleStoreClassName$1.evaluate(TestRuleStoreClassName.java:41)
	at com.carrotsearch.randomizedtesting.rules.NoShadowingOrOverridesOnMethodsRule$1.evaluate(NoShadowingOrOverridesOnMethodsRule.java:40)
	at com.carrotsearch.randomizedtesting.rules.NoShadowingOrOverridesOnMethodsRule$1.evaluate(NoShadowingOrOverridesOnMethodsRule.java:40)
	at com.carrotsearch.randomizedtesting.rules.StatementAdapter.evaluate(StatementAdapter.java:36)
	at com.carrotsearch.randomizedtesting.rules.StatementAdapter.evaluate(StatementAdapter.java:36)
	at com.carrotsearch.randomizedtesting.rules.StatementAdapter.evaluate(StatementAdapter.java:36)
	at org.apache.lucene.util.TestRuleAssertionsRequired$1.evaluate(TestRuleAssertionsRequired.java:53)
	at org.apache.lucene.util.TestRuleMarkFailure$1.evaluate(TestRuleMarkFailure.java:47)
	at org.apache.lucene.util.TestRuleIgnoreAfterMaxFailures$1.evaluate(TestRuleIgnoreAfterMaxFailures.java:64)
	at org.apache.lucene.util.TestRuleIgnoreTestSuites$1.evaluate(TestRuleIgnoreTestSuites.java:54)
	at com.carrotsearch.randomizedtesting.rules.StatementAdapter.evaluate(StatementAdapter.java:36)
	at com.carrotsearch.randomizedtesting.ThreadLeakControl$StatementRunner.run(ThreadLeakControl.java:368)
	at java.lang.Thread.run(Thread.java:748)


FAILED:  org.apache.solr.client.solrj.io.stream.StreamDecoratorTest.testParallelExecutorStream

Error Message:
--> http://127.0.0.1:46524/solr/destination1:org.apache.solr.common.SolrException: Could not load collection from ZK: destination1

Stack Trace:
java.io.IOException: --> http://127.0.0.1:46524/solr/destination1:org.apache.solr.common.SolrException: Could not load collection from ZK: destination1
	at __randomizedtesting.SeedInfo.seed([EF6F3C58E3F3D0F8:52784941DADFEDA5]:0)
	at org.apache.solr.client.solrj.io.stream.SolrStream.read(SolrStream.java:217)
	at org.apache.solr.client.solrj.io.stream.StreamDecoratorTest.getTuples(StreamDecoratorTest.java:3918)
	at org.apache.solr.client.solrj.io.stream.StreamDecoratorTest.testParallelExecutorStream(StreamDecoratorTest.java:3605)
	at sun.reflect.NativeMethodAccessorImpl.invoke0(Native Method)
	at sun.reflect.NativeMethodAccessorImpl.invoke(NativeMethodAccessorImpl.java:62)
	at sun.reflect.DelegatingMethodAccessorImpl.invoke(DelegatingMethodAccessorImpl.java:43)
	at java.lang.reflect.Method.invoke(Method.java:498)
	at com.carrotsearch.randomizedtesting.RandomizedRunner.invoke(RandomizedRunner.java:1737)
	at com.carrotsearch.randomizedtesting.RandomizedRunner$8.evaluate(RandomizedRunner.java:934)
	at com.carrotsearch.randomizedtesting.RandomizedRunner$9.evaluate(RandomizedRunner.java:970)
	at com.carrotsearch.randomizedtesting.RandomizedRunner$10.evaluate(RandomizedRunner.java:984)
	at com.carrotsearch.randomizedtesting.rules.SystemPropertiesRestoreRule$1.evaluate(SystemPropertiesRestoreRule.java:57)
	at org.apache.lucene.util.TestRuleSetupTeardownChained$1.evaluate(TestRuleSetupTeardownChained.java:49)
	at org.apache.lucene.util.AbstractBeforeAfterRule$1.evaluate(AbstractBeforeAfterRule.java:45)
	at org.apache.lucene.util.TestRuleThreadAndTestName$1.evaluate(TestRuleThreadAndTestName.java:48)
	at org.apache.lucene.util.TestRuleIgnoreAfterMaxFailures$1.evaluate(TestRuleIgnoreAfterMaxFailures.java:64)
	at org.apache.lucene.util.TestRuleMarkFailure$1.evaluate(TestRuleMarkFailure.java:47)
	at com.carrotsearch.randomizedtesting.rules.StatementAdapter.evaluate(StatementAdapter.java:36)
	at com.carrotsearch.randomizedtesting.ThreadLeakControl$StatementRunner.run(ThreadLeakControl.java:368)
	at com.carrotsearch.randomizedtesting.ThreadLeakControl.forkTimeoutingTask(ThreadLeakControl.java:817)
	at com.carrotsearch.randomizedtesting.ThreadLeakControl$3.evaluate(ThreadLeakControl.java:468)
	at com.carrotsearch.randomizedtesting.RandomizedRunner.runSingleTest(RandomizedRunner.java:943)
	at com.carrotsearch.randomizedtesting.RandomizedRunner$5.evaluate(RandomizedRunner.java:829)
	at com.carrotsearch.randomizedtesting.RandomizedRunner$6.evaluate(RandomizedRunner.java:879)
	at com.carrotsearch.randomizedtesting.RandomizedRunner$7.evaluate(RandomizedRunner.java:890)
	at com.carrotsearch.randomizedtesting.rules.StatementAdapter.evaluate(StatementAdapter.java:36)
	at com.carrotsearch.randomizedtesting.rules.SystemPropertiesRestoreRule$1.evaluate(SystemPropertiesRestoreRule.java:57)
	at org.apache.lucene.util.AbstractBeforeAfterRule$1.evaluate(AbstractBeforeAfterRule.java:45)
	at com.carrotsearch.randomizedtesting.rules.StatementAdapter.evaluate(StatementAdapter.java:36)
	at org.apache.lucene.util.TestRuleStoreClassName$1.evaluate(TestRuleStoreClassName.java:41)
	at com.carrotsearch.randomizedtesting.rules.NoShadowingOrOverridesOnMethodsRule$1.evaluate(NoShadowingOrOverridesOnMethodsRule.java:40)
	at com.carrotsearch.randomizedtesting.rules.NoShadowingOrOverridesOnMethodsRule$1.evaluate(NoShadowingOrOverridesOnMethodsRule.java:40)
	at com.carrotsearch.randomizedtesting.rules.StatementAdapter.evaluate(StatementAdapter.java:36)
	at com.carrotsearch.randomizedtesting.rules.StatementAdapter.evaluate(StatementAdapter.java:36)
	at com.carrotsearch.randomizedtesting.rules.StatementAdapter.evaluate(StatementAdapter.java:36)
	at org.apache.lucene.util.TestRuleAssertionsRequired$1.evaluate(TestRuleAssertionsRequired.java:53)
	at org.apache.lucene.util.TestRuleMarkFailure$1.evaluate(TestRuleMarkFailure.java:47)
	at org.apache.lucene.util.TestRuleIgnoreAfterMaxFailures$1.evaluate(TestRuleIgnoreAfterMaxFailures.java:64)
	at org.apache.lucene.util.TestRuleIgnoreTestSuites$1.evaluate(TestRuleIgnoreTestSuites.java:54)
	at com.carrotsearch.randomizedtesting.rules.StatementAdapter.evaluate(StatementAdapter.java:36)
	at com.carrotsearch.randomizedtesting.ThreadLeakControl$StatementRunner.run(ThreadLeakControl.java:368)
	at java.lang.Thread.run(Thread.java:748)


FAILED:  junit.framework.TestSuite.org.apache.solr.client.solrj.io.stream.StreamDecoratorTest

Error Message:
6 threads leaked from SUITE scope at org.apache.solr.client.solrj.io.stream.StreamDecoratorTest:     1) Thread[id=755, name=Connection evictor, state=TIMED_WAITING, group=TGRP-StreamDecoratorTest]         at java.lang.Thread.sleep(Native Method)         at org.apache.http.impl.client.IdleConnectionEvictor$1.run(IdleConnectionEvictor.java:66)         at java.lang.Thread.run(Thread.java:748)    2) Thread[id=1823, name=zkConnectionManagerCallback-327-thread-1-SendThread(127.0.0.1:44410), state=TIMED_WAITING, group=TGRP-StreamDecoratorTest]         at java.lang.Thread.sleep(Native Method)         at org.apache.zookeeper.client.StaticHostProvider.next(StaticHostProvider.java:105)         at org.apache.zookeeper.ClientCnxn$SendThread.startConnect(ClientCnxn.java:1000)         at org.apache.zookeeper.ClientCnxn$SendThread.run(ClientCnxn.java:1063)    3) Thread[id=752, name=zkConnectionManagerCallback-327-thread-1, state=WAITING, group=TGRP-StreamDecoratorTest]         at sun.misc.Unsafe.park(Native Method)         at java.util.concurrent.locks.LockSupport.park(LockSupport.java:175)         at java.util.concurrent.locks.AbstractQueuedSynchronizer$ConditionObject.await(AbstractQueuedSynchronizer.java:2039)         at java.util.concurrent.LinkedBlockingQueue.take(LinkedBlockingQueue.java:442)         at java.util.concurrent.ThreadPoolExecutor.getTask(ThreadPoolExecutor.java:1074)         at java.util.concurrent.ThreadPoolExecutor.runWorker(ThreadPoolExecutor.java:1134)         at java.util.concurrent.ThreadPoolExecutor$Worker.run(ThreadPoolExecutor.java:624)         at java.lang.Thread.run(Thread.java:748)    4) Thread[id=1824, name=zkConnectionManagerCallback-327-thread-1-EventThread, state=WAITING, group=TGRP-StreamDecoratorTest]         at sun.misc.Unsafe.park(Native Method)         at java.util.concurrent.locks.LockSupport.park(LockSupport.java:175)         at java.util.concurrent.locks.AbstractQueuedSynchronizer$ConditionObject.await(AbstractQueuedSynchronizer.java:2039)         at java.util.concurrent.LinkedBlockingQueue.take(LinkedBlockingQueue.java:442)         at org.apache.zookeeper.ClientCnxn$EventThread.run(ClientCnxn.java:502)    5) Thread[id=759, name=Connection evictor, state=TIMED_WAITING, group=TGRP-StreamDecoratorTest]         at java.lang.Thread.sleep(Native Method)         at org.apache.http.impl.client.IdleConnectionEvictor$1.run(IdleConnectionEvictor.java:66)         at java.lang.Thread.run(Thread.java:748)    6) Thread[id=749, name=Connection evictor, state=TIMED_WAITING, group=TGRP-StreamDecoratorTest]         at java.lang.Thread.sleep(Native Method)         at org.apache.http.impl.client.IdleConnectionEvictor$1.run(IdleConnectionEvictor.java:66)         at java.lang.Thread.run(Thread.java:748)

Stack Trace:
com.carrotsearch.randomizedtesting.ThreadLeakError: 6 threads leaked from SUITE scope at org.apache.solr.client.solrj.io.stream.StreamDecoratorTest: 
   1) Thread[id=755, name=Connection evictor, state=TIMED_WAITING, group=TGRP-StreamDecoratorTest]
        at java.lang.Thread.sleep(Native Method)
        at org.apache.http.impl.client.IdleConnectionEvictor$1.run(IdleConnectionEvictor.java:66)
        at java.lang.Thread.run(Thread.java:748)
   2) Thread[id=1823, name=zkConnectionManagerCallback-327-thread-1-SendThread(127.0.0.1:44410), state=TIMED_WAITING, group=TGRP-StreamDecoratorTest]
        at java.lang.Thread.sleep(Native Method)
        at org.apache.zookeeper.client.StaticHostProvider.next(StaticHostProvider.java:105)
        at org.apache.zookeeper.ClientCnxn$SendThread.startConnect(ClientCnxn.java:1000)
        at org.apache.zookeeper.ClientCnxn$SendThread.run(ClientCnxn.java:1063)
   3) Thread[id=752, name=zkConnectionManagerCallback-327-thread-1, state=WAITING, group=TGRP-StreamDecoratorTest]
        at sun.misc.Unsafe.park(Native Method)
        at java.util.concurrent.locks.LockSupport.park(LockSupport.java:175)
        at java.util.concurrent.locks.AbstractQueuedSynchronizer$ConditionObject.await(AbstractQueuedSynchronizer.java:2039)
        at java.util.concurrent.LinkedBlockingQueue.take(LinkedBlockingQueue.java:442)
        at java.util.concurrent.ThreadPoolExecutor.getTask(ThreadPoolExecutor.java:1074)
        at java.util.concurrent.ThreadPoolExecutor.runWorker(ThreadPoolExecutor.java:1134)
        at java.util.concurrent.ThreadPoolExecutor$Worker.run(ThreadPoolExecutor.java:624)
        at java.lang.Thread.run(Thread.java:748)
   4) Thread[id=1824, name=zkConnectionManagerCallback-327-thread-1-EventThread, state=WAITING, group=TGRP-StreamDecoratorTest]
        at sun.misc.Unsafe.park(Native Method)
        at java.util.concurrent.locks.LockSupport.park(LockSupport.java:175)
        at java.util.concurrent.locks.AbstractQueuedSynchronizer$ConditionObject.await(AbstractQueuedSynchronizer.java:2039)
        at java.util.concurrent.LinkedBlockingQueue.take(LinkedBlockingQueue.java:442)
        at org.apache.zookeeper.ClientCnxn$EventThread.run(ClientCnxn.java:502)
   5) Thread[id=759, name=Connection evictor, state=TIMED_WAITING, group=TGRP-StreamDecoratorTest]
        at java.lang.Thread.sleep(Native Method)
        at org.apache.http.impl.client.IdleConnectionEvictor$1.run(IdleConnectionEvictor.java:66)
        at java.lang.Thread.run(Thread.java:748)
   6) Thread[id=749, name=Connection evictor, state=TIMED_WAITING, group=TGRP-StreamDecoratorTest]
        at java.lang.Thread.sleep(Native Method)
        at org.apache.http.impl.client.IdleConnectionEvictor$1.run(IdleConnectionEvictor.java:66)
        at java.lang.Thread.run(Thread.java:748)
	at __randomizedtesting.SeedInfo.seed([EF6F3C58E3F3D0F8]:0)


FAILED:  junit.framework.TestSuite.org.apache.solr.client.solrj.io.stream.StreamDecoratorTest

Error Message:
There are still zombie threads that couldn't be terminated:    1) Thread[id=1823, name=zkConnectionManagerCallback-327-thread-1-SendThread(127.0.0.1:44410), state=TIMED_WAITING, group=TGRP-StreamDecoratorTest]         at java.lang.Thread.sleep(Native Method)         at org.apache.zookeeper.client.StaticHostProvider.next(StaticHostProvider.java:105)         at org.apache.zookeeper.ClientCnxn$SendThread.startConnect(ClientCnxn.java:1000)         at org.apache.zookeeper.ClientCnxn$SendThread.run(ClientCnxn.java:1063)    2) Thread[id=752, name=zkConnectionManagerCallback-327-thread-1, state=WAITING, group=TGRP-StreamDecoratorTest]         at sun.misc.Unsafe.park(Native Method)         at java.util.concurrent.locks.LockSupport.park(LockSupport.java:175)         at java.util.concurrent.locks.AbstractQueuedSynchronizer$ConditionObject.await(AbstractQueuedSynchronizer.java:2039)         at java.util.concurrent.LinkedBlockingQueue.take(LinkedBlockingQueue.java:442)         at java.util.concurrent.ThreadPoolExecutor.getTask(ThreadPoolExecutor.java:1074)         at java.util.concurrent.ThreadPoolExecutor.runWorker(ThreadPoolExecutor.java:1134)         at java.util.concurrent.ThreadPoolExecutor$Worker.run(ThreadPoolExecutor.java:624)         at java.lang.Thread.run(Thread.java:748)

Stack Trace:
com.carrotsearch.randomizedtesting.ThreadLeakError: There are still zombie threads that couldn't be terminated:
   1) Thread[id=1823, name=zkConnectionManagerCallback-327-thread-1-SendThread(127.0.0.1:44410), state=TIMED_WAITING, group=TGRP-StreamDecoratorTest]
        at java.lang.Thread.sleep(Native Method)
        at org.apache.zookeeper.client.StaticHostProvider.next(StaticHostProvider.java:105)
        at org.apache.zookeeper.ClientCnxn$SendThread.startConnect(ClientCnxn.java:1000)
        at org.apache.zookeeper.ClientCnxn$SendThread.run(ClientCnxn.java:1063)
   2) Thread[id=752, name=zkConnectionManagerCallback-327-thread-1, state=WAITING, group=TGRP-StreamDecoratorTest]
        at sun.misc.Unsafe.park(Native Method)
        at java.util.concurrent.locks.LockSupport.park(LockSupport.java:175)
        at java.util.concurrent.locks.AbstractQueuedSynchronizer$ConditionObject.await(AbstractQueuedSynchronizer.java:2039)
        at java.util.concurrent.LinkedBlockingQueue.take(LinkedBlockingQueue.java:442)
        at java.util.concurrent.ThreadPoolExecutor.getTask(ThreadPoolExecutor.java:1074)
        at java.util.concurrent.ThreadPoolExecutor.runWorker(ThreadPoolExecutor.java:1134)
        at java.util.concurrent.ThreadPoolExecutor$Worker.run(ThreadPoolExecutor.java:624)
        at java.lang.Thread.run(Thread.java:748)
	at __randomizedtesting.SeedInfo.seed([EF6F3C58E3F3D0F8]:0)


FAILED:  org.apache.solr.cloud.api.collections.ShardSplitTest.test

Error Message:
Wrong doc count on sha

[...truncated too long message...]

Apples-Tests-master/lucene/top-level-ivy-settings.xml

resolve:

ivy-availability-check:
[loadresource] Do not set property disallowed.ivy.jars.list as its length is 0.

-ivy-fail-disallowed-ivy-version:

ivy-fail:

ivy-configure:
[ivy:configure] :: loading settings :: file = /home/jenkins/jenkins-slave/workspace/Lucene-Solr-BadApples-Tests-master/lucene/top-level-ivy-settings.xml

resolve:

ivy-availability-check:
[loadresource] Do not set property disallowed.ivy.jars.list as its length is 0.

-ivy-fail-disallowed-ivy-version:

ivy-fail:

ivy-fail:

ivy-configure:
[ivy:configure] :: loading settings :: file = /home/jenkins/jenkins-slave/workspace/Lucene-Solr-BadApples-Tests-master/lucene/top-level-ivy-settings.xml

resolve:

ivy-availability-check:
[loadresource] Do not set property disallowed.ivy.jars.list as its length is 0.

-ivy-fail-disallowed-ivy-version:

ivy-fail:

ivy-configure:
[ivy:configure] :: loading settings :: file = /home/jenkins/jenkins-slave/workspace/Lucene-Solr-BadApples-Tests-master/lucene/top-level-ivy-settings.xml

resolve:

ivy-availability-check:
[loadresource] Do not set property disallowed.ivy.jars.list as its length is 0.

-ivy-fail-disallowed-ivy-version:

ivy-fail:

ivy-fail:

ivy-configure:
[ivy:configure] :: loading settings :: file = /home/jenkins/jenkins-slave/workspace/Lucene-Solr-BadApples-Tests-master/lucene/top-level-ivy-settings.xml

resolve:

ivy-availability-check:
[loadresource] Do not set property disallowed.ivy.jars.list as its length is 0.

-ivy-fail-disallowed-ivy-version:

ivy-fail:

ivy-fail:

ivy-configure:
[ivy:configure] :: loading settings :: file = /home/jenkins/jenkins-slave/workspace/Lucene-Solr-BadApples-Tests-master/lucene/top-level-ivy-settings.xml

resolve:

ivy-availability-check:
[loadresource] Do not set property disallowed.ivy.jars.list as its length is 0.

-ivy-fail-disallowed-ivy-version:

ivy-fail:

ivy-fail:

ivy-configure:
[ivy:configure] :: loading settings :: file = /home/jenkins/jenkins-slave/workspace/Lucene-Solr-BadApples-Tests-master/lucene/top-level-ivy-settings.xml

resolve:

ivy-availability-check:
[loadresource] Do not set property disallowed.ivy.jars.list as its length is 0.

-ivy-fail-disallowed-ivy-version:

ivy-fail:

ivy-fail:

ivy-configure:
[ivy:configure] :: loading settings :: file = /home/jenkins/jenkins-slave/workspace/Lucene-Solr-BadApples-Tests-master/lucene/top-level-ivy-settings.xml

resolve:

ivy-availability-check:
[loadresource] Do not set property disallowed.ivy.jars.list as its length is 0.

-ivy-fail-disallowed-ivy-version:

ivy-fail:

ivy-fail:

ivy-configure:
[ivy:configure] :: loading settings :: file = /home/jenkins/jenkins-slave/workspace/Lucene-Solr-BadApples-Tests-master/lucene/top-level-ivy-settings.xml

resolve:

ivy-availability-check:
[loadresource] Do not set property disallowed.ivy.jars.list as its length is 0.

-ivy-fail-disallowed-ivy-version:

ivy-fail:

ivy-fail:

ivy-configure:
[ivy:configure] :: loading settings :: file = /home/jenkins/jenkins-slave/workspace/Lucene-Solr-BadApples-Tests-master/lucene/top-level-ivy-settings.xml

resolve:

ivy-availability-check:
[loadresource] Do not set property disallowed.ivy.jars.list as its length is 0.

-ivy-fail-disallowed-ivy-version:

ivy-fail:

ivy-fail:

ivy-configure:
[ivy:configure] :: loading settings :: file = /home/jenkins/jenkins-slave/workspace/Lucene-Solr-BadApples-Tests-master/lucene/top-level-ivy-settings.xml

resolve:

ivy-availability-check:
[loadresource] Do not set property disallowed.ivy.jars.list as its length is 0.

-ivy-fail-disallowed-ivy-version:

ivy-fail:

ivy-fail:

ivy-configure:
[ivy:configure] :: loading settings :: file = /home/jenkins/jenkins-slave/workspace/Lucene-Solr-BadApples-Tests-master/lucene/top-level-ivy-settings.xml

resolve:

ivy-availability-check:
[loadresource] Do not set property disallowed.ivy.jars.list as its length is 0.

-ivy-fail-disallowed-ivy-version:

ivy-fail:

ivy-fail:

ivy-configure:
[ivy:configure] :: loading settings :: file = /home/jenkins/jenkins-slave/workspace/Lucene-Solr-BadApples-Tests-master/lucene/top-level-ivy-settings.xml

resolve:

ivy-availability-check:
[loadresource] Do not set property disallowed.ivy.jars.list as its length is 0.

-ivy-fail-disallowed-ivy-version:

ivy-fail:

ivy-fail:

ivy-configure:
[ivy:configure] :: loading settings :: file = /home/jenkins/jenkins-slave/workspace/Lucene-Solr-BadApples-Tests-master/lucene/top-level-ivy-settings.xml

resolve:

jar-checksums:
    [mkdir] Created dir: /home/jenkins/jenkins-slave/workspace/Lucene-Solr-BadApples-Tests-master/solr/null1976893833
     [copy] Copying 240 files to /home/jenkins/jenkins-slave/workspace/Lucene-Solr-BadApples-Tests-master/solr/null1976893833
   [delete] Deleting directory /home/jenkins/jenkins-slave/workspace/Lucene-Solr-BadApples-Tests-master/solr/null1976893833

check-working-copy:
[ivy:cachepath] :: resolving dependencies :: org.eclipse.jgit#org.eclipse.jgit-caller;working
[ivy:cachepath] 	confs: [default]
[ivy:cachepath] 	found org.eclipse.jgit#org.eclipse.jgit;4.6.0.201612231935-r in public
[ivy:cachepath] 	found com.jcraft#jsch;0.1.53 in public
[ivy:cachepath] 	found com.googlecode.javaewah#JavaEWAH;1.1.6 in public
[ivy:cachepath] 	found org.apache.httpcomponents#httpclient;4.3.6 in public
[ivy:cachepath] 	found org.apache.httpcomponents#httpcore;4.3.3 in public
[ivy:cachepath] 	found commons-logging#commons-logging;1.1.3 in public
[ivy:cachepath] 	found commons-codec#commons-codec;1.6 in public
[ivy:cachepath] 	found org.slf4j#slf4j-api;1.7.2 in public
[ivy:cachepath] :: resolution report :: resolve 30ms :: artifacts dl 4ms
	---------------------------------------------------------------------
	|                  |            modules            ||   artifacts   |
	|       conf       | number| search|dwnlded|evicted|| number|dwnlded|
	---------------------------------------------------------------------
	|      default     |   8   |   0   |   0   |   0   ||   8   |   0   |
	---------------------------------------------------------------------
[wc-checker] Initializing working copy...
[wc-checker] SLF4J: Failed to load class "org.slf4j.impl.StaticLoggerBinder".
[wc-checker] SLF4J: Defaulting to no-operation (NOP) logger implementation
[wc-checker] SLF4J: See http://www.slf4j.org/codes.html#StaticLoggerBinder for further details.
[wc-checker] Checking working copy status...

-jenkins-base:

BUILD SUCCESSFUL
Total time: 229 minutes 59 seconds
Archiving artifacts
java.lang.InterruptedException: no matches found within 10000
	at hudson.FilePath$34.hasMatch(FilePath.java:2678)
	at hudson.FilePath$34.invoke(FilePath.java:2557)
	at hudson.FilePath$34.invoke(FilePath.java:2547)
	at hudson.FilePath$FileCallableWrapper.call(FilePath.java:2918)
Also:   hudson.remoting.Channel$CallSiteStackTrace: Remote call to lucene2
		at hudson.remoting.Channel.attachCallSiteStackTrace(Channel.java:1741)
		at hudson.remoting.UserRequest$ExceptionResponse.retrieve(UserRequest.java:357)
		at hudson.remoting.Channel.call(Channel.java:955)
		at hudson.FilePath.act(FilePath.java:1036)
		at hudson.FilePath.act(FilePath.java:1025)
		at hudson.FilePath.validateAntFileMask(FilePath.java:2547)
		at hudson.tasks.ArtifactArchiver.perform(ArtifactArchiver.java:243)
		at hudson.tasks.BuildStepCompatibilityLayer.perform(BuildStepCompatibilityLayer.java:81)
		at hudson.tasks.BuildStepMonitor$1.perform(BuildStepMonitor.java:20)
		at hudson.model.AbstractBuild$AbstractBuildExecution.perform(AbstractBuild.java:744)
		at hudson.model.AbstractBuild$AbstractBuildExecution.performAllBuildSteps(AbstractBuild.java:690)
		at hudson.model.Build$BuildExecution.post2(Build.java:186)
		at hudson.model.AbstractBuild$AbstractBuildExecution.post(AbstractBuild.java:635)
		at hudson.model.Run.execute(Run.java:1819)
		at hudson.model.FreeStyleBuild.run(FreeStyleBuild.java:43)
		at hudson.model.ResourceController.execute(ResourceController.java:97)
		at hudson.model.Executor.run(Executor.java:429)
Caused: hudson.FilePath$TunneledInterruptedException
	at hudson.FilePath$FileCallableWrapper.call(FilePath.java:2920)
	at hudson.remoting.UserRequest.perform(UserRequest.java:212)
	at hudson.remoting.UserRequest.perform(UserRequest.java:54)
	at hudson.remoting.Request$2.run(Request.java:369)
	at hudson.remoting.InterceptingExecutorService$1.call(InterceptingExecutorService.java:72)
	at java.util.concurrent.FutureTask.run(FutureTask.java:266)
	at java.util.concurrent.ThreadPoolExecutor.runWorker(ThreadPoolExecutor.java:1142)
	at java.util.concurrent.ThreadPoolExecutor$Worker.run(ThreadPoolExecutor.java:617)
	at java.lang.Thread.run(Thread.java:748)
Caused: java.lang.InterruptedException: java.lang.InterruptedException: no matches found within 10000
	at hudson.FilePath.act(FilePath.java:1038)
	at hudson.FilePath.act(FilePath.java:1025)
	at hudson.FilePath.validateAntFileMask(FilePath.java:2547)
	at hudson.tasks.ArtifactArchiver.perform(ArtifactArchiver.java:243)
	at hudson.tasks.BuildStepCompatibilityLayer.perform(BuildStepCompatibilityLayer.java:81)
	at hudson.tasks.BuildStepMonitor$1.perform(BuildStepMonitor.java:20)
	at hudson.model.AbstractBuild$AbstractBuildExecution.perform(AbstractBuild.java:744)
	at hudson.model.AbstractBuild$AbstractBuildExecution.performAllBuildSteps(AbstractBuild.java:690)
	at hudson.model.Build$BuildExecution.post2(Build.java:186)
	at hudson.model.AbstractBuild$AbstractBuildExecution.post(AbstractBuild.java:635)
	at hudson.model.Run.execute(Run.java:1819)
	at hudson.model.FreeStyleBuild.run(FreeStyleBuild.java:43)
	at hudson.model.ResourceController.execute(ResourceController.java:97)
	at hudson.model.Executor.run(Executor.java:429)
No artifacts found that match the file pattern "**/*.events,heapdumps/**,**/hs_err_pid*". Configuration error?
Recording test results
Build step 'Publish JUnit test result report' changed build result to UNSTABLE
Email was triggered for: Unstable (Test Failures)
Sending email for trigger: Unstable (Test Failures)

Mime
View raw message