lucene-dev mailing list archives

Site index · List index
Message view « Date » · « Thread »
Top « Date » · « Thread »
From Apache Jenkins Server <jenk...@builds.apache.org>
Subject [JENKINS] Lucene-Solr-Tests-master - Build # 2693 - Unstable
Date Sun, 12 Aug 2018 17:55:59 GMT
Build: https://builds.apache.org/job/Lucene-Solr-Tests-master/2693/

1 tests failed.
FAILED:  org.apache.solr.cloud.MultiThreadedOCPTest.test

Error Message:


Stack Trace:
java.lang.AssertionError
	at __randomizedtesting.SeedInfo.seed([25D56684F7208E3:8A0969B2E18E651B]:0)
	at org.junit.Assert.fail(Assert.java:92)
	at org.junit.Assert.assertTrue(Assert.java:43)
	at org.junit.Assert.assertTrue(Assert.java:54)
	at org.apache.solr.cloud.MultiThreadedOCPTest.testFillWorkQueue(MultiThreadedOCPTest.java:113)
	at org.apache.solr.cloud.MultiThreadedOCPTest.test(MultiThreadedOCPTest.java:68)
	at sun.reflect.NativeMethodAccessorImpl.invoke0(Native Method)
	at sun.reflect.NativeMethodAccessorImpl.invoke(NativeMethodAccessorImpl.java:62)
	at sun.reflect.DelegatingMethodAccessorImpl.invoke(DelegatingMethodAccessorImpl.java:43)
	at java.lang.reflect.Method.invoke(Method.java:498)
	at com.carrotsearch.randomizedtesting.RandomizedRunner.invoke(RandomizedRunner.java:1737)
	at com.carrotsearch.randomizedtesting.RandomizedRunner$8.evaluate(RandomizedRunner.java:934)
	at com.carrotsearch.randomizedtesting.RandomizedRunner$9.evaluate(RandomizedRunner.java:970)
	at com.carrotsearch.randomizedtesting.RandomizedRunner$10.evaluate(RandomizedRunner.java:984)
	at org.apache.solr.BaseDistributedSearchTestCase$ShardsRepeatRule$ShardsFixedStatement.callStatement(BaseDistributedSearchTestCase.java:1008)
	at org.apache.solr.BaseDistributedSearchTestCase$ShardsRepeatRule$ShardsStatement.evaluate(BaseDistributedSearchTestCase.java:983)
	at com.carrotsearch.randomizedtesting.rules.SystemPropertiesRestoreRule$1.evaluate(SystemPropertiesRestoreRule.java:57)
	at org.apache.lucene.util.TestRuleSetupTeardownChained$1.evaluate(TestRuleSetupTeardownChained.java:49)
	at org.apache.lucene.util.AbstractBeforeAfterRule$1.evaluate(AbstractBeforeAfterRule.java:45)
	at org.apache.lucene.util.TestRuleThreadAndTestName$1.evaluate(TestRuleThreadAndTestName.java:48)
	at org.apache.lucene.util.TestRuleIgnoreAfterMaxFailures$1.evaluate(TestRuleIgnoreAfterMaxFailures.java:64)
	at org.apache.lucene.util.TestRuleMarkFailure$1.evaluate(TestRuleMarkFailure.java:47)
	at com.carrotsearch.randomizedtesting.rules.StatementAdapter.evaluate(StatementAdapter.java:36)
	at com.carrotsearch.randomizedtesting.ThreadLeakControl$StatementRunner.run(ThreadLeakControl.java:368)
	at com.carrotsearch.randomizedtesting.ThreadLeakControl.forkTimeoutingTask(ThreadLeakControl.java:817)
	at com.carrotsearch.randomizedtesting.ThreadLeakControl$3.evaluate(ThreadLeakControl.java:468)
	at com.carrotsearch.randomizedtesting.RandomizedRunner.runSingleTest(RandomizedRunner.java:943)
	at com.carrotsearch.randomizedtesting.RandomizedRunner$5.evaluate(RandomizedRunner.java:829)
	at com.carrotsearch.randomizedtesting.RandomizedRunner$6.evaluate(RandomizedRunner.java:879)
	at com.carrotsearch.randomizedtesting.RandomizedRunner$7.evaluate(RandomizedRunner.java:890)
	at com.carrotsearch.randomizedtesting.rules.StatementAdapter.evaluate(StatementAdapter.java:36)
	at com.carrotsearch.randomizedtesting.rules.SystemPropertiesRestoreRule$1.evaluate(SystemPropertiesRestoreRule.java:57)
	at org.apache.lucene.util.AbstractBeforeAfterRule$1.evaluate(AbstractBeforeAfterRule.java:45)
	at com.carrotsearch.randomizedtesting.rules.StatementAdapter.evaluate(StatementAdapter.java:36)
	at org.apache.lucene.util.TestRuleStoreClassName$1.evaluate(TestRuleStoreClassName.java:41)
	at com.carrotsearch.randomizedtesting.rules.NoShadowingOrOverridesOnMethodsRule$1.evaluate(NoShadowingOrOverridesOnMethodsRule.java:40)
	at com.carrotsearch.randomizedtesting.rules.NoShadowingOrOverridesOnMethodsRule$1.evaluate(NoShadowingOrOverridesOnMethodsRule.java:40)
	at com.carrotsearch.randomizedtesting.rules.StatementAdapter.evaluate(StatementAdapter.java:36)
	at com.carrotsearch.randomizedtesting.rules.StatementAdapter.evaluate(StatementAdapter.java:36)
	at com.carrotsearch.randomizedtesting.rules.StatementAdapter.evaluate(StatementAdapter.java:36)
	at org.apache.lucene.util.TestRuleAssertionsRequired$1.evaluate(TestRuleAssertionsRequired.java:53)
	at org.apache.lucene.util.TestRuleMarkFailure$1.evaluate(TestRuleMarkFailure.java:47)
	at org.apache.lucene.util.TestRuleIgnoreAfterMaxFailures$1.evaluate(TestRuleIgnoreAfterMaxFailures.java:64)
	at org.apache.lucene.util.TestRuleIgnoreTestSuites$1.evaluate(TestRuleIgnoreTestSuites.java:54)
	at com.carrotsearch.randomizedtesting.rules.StatementAdapter.evaluate(StatementAdapter.java:36)
	at com.carrotsearch.randomizedtesting.ThreadLeakControl$StatementRunner.run(ThreadLeakControl.java:368)
	at java.lang.Thread.run(Thread.java:748)




Build Log:
[...truncated 12393 lines...]
   [junit4] Suite: org.apache.solr.cloud.MultiThreadedOCPTest
   [junit4]   2> 216797 INFO  (SUITE-MultiThreadedOCPTest-seed#[25D56684F7208E3]-worker) [    ] o.a.s.SolrTestCaseJ4 SecureRandom sanity checks: test.solr.allowed.securerandom=null & java.security.egd=file:/dev/./urandom
   [junit4]   2> Creating dataDir: /home/jenkins/jenkins-slave/workspace/Lucene-Solr-Tests-master/solr/build/solr-core/test/J0/temp/solr.cloud.MultiThreadedOCPTest_25D56684F7208E3-001/init-core-data-001
   [junit4]   2> 216797 WARN  (SUITE-MultiThreadedOCPTest-seed#[25D56684F7208E3]-worker) [    ] o.a.s.SolrTestCaseJ4 startTrackingSearchers: numOpens=1 numCloses=1
   [junit4]   2> 216890 INFO  (SUITE-MultiThreadedOCPTest-seed#[25D56684F7208E3]-worker) [    ] o.a.s.SolrTestCaseJ4 Using PointFields (NUMERIC_POINTS_SYSPROP=true) w/NUMERIC_DOCVALUES_SYSPROP=false
   [junit4]   2> 216892 INFO  (SUITE-MultiThreadedOCPTest-seed#[25D56684F7208E3]-worker) [    ] o.a.s.SolrTestCaseJ4 Randomized ssl (true) and clientAuth (true) via: @org.apache.solr.util.RandomizeSSL(reason=, ssl=NaN, value=NaN, clientAuth=NaN)
   [junit4]   2> 216893 INFO  (SUITE-MultiThreadedOCPTest-seed#[25D56684F7208E3]-worker) [    ] o.a.s.BaseDistributedSearchTestCase Setting hostContext system property: /t/l
   [junit4]   2> 217017 INFO  (TEST-MultiThreadedOCPTest.test-seed#[25D56684F7208E3]) [    ] o.a.s.c.ZkTestServer STARTING ZK TEST SERVER
   [junit4]   2> 217017 INFO  (Thread-106) [    ] o.a.s.c.ZkTestServer client port:0.0.0.0/0.0.0.0:0
   [junit4]   2> 217017 INFO  (Thread-106) [    ] o.a.s.c.ZkTestServer Starting server
   [junit4]   2> 217055 ERROR (Thread-106) [    ] o.a.z.s.ZooKeeperServer ZKShutdownHandler is not registered, so ZooKeeper server won't take any action on ERROR or SHUTDOWN server state changes
   [junit4]   2> 217126 INFO  (TEST-MultiThreadedOCPTest.test-seed#[25D56684F7208E3]) [    ] o.a.s.c.ZkTestServer start zk server on port:36017
   [junit4]   2> 217391 INFO  (zkConnectionManagerCallback-107-thread-1) [    ] o.a.s.c.c.ConnectionManager zkClient has connected
   [junit4]   2> 217980 INFO  (zkConnectionManagerCallback-109-thread-1) [    ] o.a.s.c.c.ConnectionManager zkClient has connected
   [junit4]   2> 218016 INFO  (TEST-MultiThreadedOCPTest.test-seed#[25D56684F7208E3]) [    ] o.a.s.c.AbstractZkTestCase put /home/jenkins/jenkins-slave/workspace/Lucene-Solr-Tests-master/solr/core/src/test-files/solr/collection1/conf/solrconfig-tlog.xml to /configs/conf1/solrconfig.xml
   [junit4]   2> 218049 INFO  (TEST-MultiThreadedOCPTest.test-seed#[25D56684F7208E3]) [    ] o.a.s.c.AbstractZkTestCase put /home/jenkins/jenkins-slave/workspace/Lucene-Solr-Tests-master/solr/core/src/test-files/solr/collection1/conf/schema.xml to /configs/conf1/schema.xml
   [junit4]   2> 218051 INFO  (TEST-MultiThreadedOCPTest.test-seed#[25D56684F7208E3]) [    ] o.a.s.c.AbstractZkTestCase put /home/jenkins/jenkins-slave/workspace/Lucene-Solr-Tests-master/solr/core/src/test-files/solr/collection1/conf/solrconfig.snippet.randomindexconfig.xml to /configs/conf1/solrconfig.snippet.randomindexconfig.xml
   [junit4]   2> 218069 INFO  (TEST-MultiThreadedOCPTest.test-seed#[25D56684F7208E3]) [    ] o.a.s.c.AbstractZkTestCase put /home/jenkins/jenkins-slave/workspace/Lucene-Solr-Tests-master/solr/core/src/test-files/solr/collection1/conf/stopwords.txt to /configs/conf1/stopwords.txt
   [junit4]   2> 218086 INFO  (TEST-MultiThreadedOCPTest.test-seed#[25D56684F7208E3]) [    ] o.a.s.c.AbstractZkTestCase put /home/jenkins/jenkins-slave/workspace/Lucene-Solr-Tests-master/solr/core/src/test-files/solr/collection1/conf/protwords.txt to /configs/conf1/protwords.txt
   [junit4]   2> 218088 INFO  (TEST-MultiThreadedOCPTest.test-seed#[25D56684F7208E3]) [    ] o.a.s.c.AbstractZkTestCase put /home/jenkins/jenkins-slave/workspace/Lucene-Solr-Tests-master/solr/core/src/test-files/solr/collection1/conf/currency.xml to /configs/conf1/currency.xml
   [junit4]   2> 218089 INFO  (TEST-MultiThreadedOCPTest.test-seed#[25D56684F7208E3]) [    ] o.a.s.c.AbstractZkTestCase put /home/jenkins/jenkins-slave/workspace/Lucene-Solr-Tests-master/solr/core/src/test-files/solr/collection1/conf/enumsConfig.xml to /configs/conf1/enumsConfig.xml
   [junit4]   2> 218107 INFO  (TEST-MultiThreadedOCPTest.test-seed#[25D56684F7208E3]) [    ] o.a.s.c.AbstractZkTestCase put /home/jenkins/jenkins-slave/workspace/Lucene-Solr-Tests-master/solr/core/src/test-files/solr/collection1/conf/open-exchange-rates.json to /configs/conf1/open-exchange-rates.json
   [junit4]   2> 218108 INFO  (TEST-MultiThreadedOCPTest.test-seed#[25D56684F7208E3]) [    ] o.a.s.c.AbstractZkTestCase put /home/jenkins/jenkins-slave/workspace/Lucene-Solr-Tests-master/solr/core/src/test-files/solr/collection1/conf/mapping-ISOLatin1Accent.txt to /configs/conf1/mapping-ISOLatin1Accent.txt
   [junit4]   2> 218122 INFO  (TEST-MultiThreadedOCPTest.test-seed#[25D56684F7208E3]) [    ] o.a.s.c.AbstractZkTestCase put /home/jenkins/jenkins-slave/workspace/Lucene-Solr-Tests-master/solr/core/src/test-files/solr/collection1/conf/old_synonyms.txt to /configs/conf1/old_synonyms.txt
   [junit4]   2> 218123 INFO  (TEST-MultiThreadedOCPTest.test-seed#[25D56684F7208E3]) [    ] o.a.s.c.AbstractZkTestCase put /home/jenkins/jenkins-slave/workspace/Lucene-Solr-Tests-master/solr/core/src/test-files/solr/collection1/conf/synonyms.txt to /configs/conf1/synonyms.txt
   [junit4]   2> 218581 INFO  (zkConnectionManagerCallback-113-thread-1) [    ] o.a.s.c.c.ConnectionManager zkClient has connected
   [junit4]   2> 218585 INFO  (TEST-MultiThreadedOCPTest.test-seed#[25D56684F7208E3]) [    ] o.a.s.c.AbstractFullDistribZkTestBase Will use NRT replicas unless explicitly asked otherwise
   [junit4]   2> 219562 INFO  (TEST-MultiThreadedOCPTest.test-seed#[25D56684F7208E3]) [    ] o.e.j.s.Server jetty-9.4.11.v20180605; built: 2018-06-05T18:24:03.829Z; git: d5fc0523cfa96bfebfbda19606cad384d772f04c; jvm 1.8.0_172-b11
   [junit4]   2> 219566 INFO  (TEST-MultiThreadedOCPTest.test-seed#[25D56684F7208E3]) [    ] o.e.j.s.session DefaultSessionIdManager workerName=node0
   [junit4]   2> 219566 INFO  (TEST-MultiThreadedOCPTest.test-seed#[25D56684F7208E3]) [    ] o.e.j.s.session No SessionScavenger set, using defaults
   [junit4]   2> 219566 INFO  (TEST-MultiThreadedOCPTest.test-seed#[25D56684F7208E3]) [    ] o.e.j.s.session node0 Scavenging every 660000ms
   [junit4]   2> 219567 INFO  (TEST-MultiThreadedOCPTest.test-seed#[25D56684F7208E3]) [    ] o.e.j.s.h.ContextHandler Started o.e.j.s.ServletContextHandler@130198e7{/t/l,null,AVAILABLE}
   [junit4]   2> 219678 INFO  (TEST-MultiThreadedOCPTest.test-seed#[25D56684F7208E3]) [    ] o.e.j.s.AbstractConnector Started ServerConnector@8459437{SSL,[ssl, http/1.1]}{127.0.0.1:40061}
   [junit4]   2> 219678 INFO  (TEST-MultiThreadedOCPTest.test-seed#[25D56684F7208E3]) [    ] o.e.j.s.Server Started @219887ms
   [junit4]   2> 219678 INFO  (TEST-MultiThreadedOCPTest.test-seed#[25D56684F7208E3]) [    ] o.a.s.c.s.e.JettySolrRunner Jetty properties: {solr.data.dir=/home/jenkins/jenkins-slave/workspace/Lucene-Solr-Tests-master/solr/build/solr-core/test/J0/temp/solr.cloud.MultiThreadedOCPTest_25D56684F7208E3-001/tempDir-001/control/data, hostContext=/t/l, hostPort=40061, coreRootDirectory=/home/jenkins/jenkins-slave/workspace/Lucene-Solr-Tests-master/solr/build/solr-core/test/J0/../../../../../../../../../../home/jenkins/jenkins-slave/workspace/Lucene-Solr-Tests-master/solr/build/solr-core/test/J0/temp/solr.cloud.MultiThreadedOCPTest_25D56684F7208E3-001/control-001/cores}
   [junit4]   2> 219679 ERROR (TEST-MultiThreadedOCPTest.test-seed#[25D56684F7208E3]) [    ] o.a.s.u.StartupLoggingUtils Missing Java Option solr.log.dir. Logging may be missing or incomplete.
   [junit4]   2> 219679 INFO  (TEST-MultiThreadedOCPTest.test-seed#[25D56684F7208E3]) [    ] o.a.s.s.SolrDispatchFilter Using logger factory org.apache.logging.slf4j.Log4jLoggerFactory
   [junit4]   2> 219679 INFO  (TEST-MultiThreadedOCPTest.test-seed#[25D56684F7208E3]) [    ] o.a.s.s.SolrDispatchFilter  ___      _       Welcome to Apache Solr? version 8.0.0
   [junit4]   2> 219695 INFO  (TEST-MultiThreadedOCPTest.test-seed#[25D56684F7208E3]) [    ] o.a.s.s.SolrDispatchFilter / __| ___| |_ _   Starting in cloud mode on port null
   [junit4]   2> 219695 INFO  (TEST-MultiThreadedOCPTest.test-seed#[25D56684F7208E3]) [    ] o.a.s.s.SolrDispatchFilter \__ \/ _ \ | '_|  Install dir: null
   [junit4]   2> 219695 INFO  (TEST-MultiThreadedOCPTest.test-seed#[25D56684F7208E3]) [    ] o.a.s.s.SolrDispatchFilter |___/\___/_|_|    Start time: 2018-08-12T15:56:54.225Z
   [junit4]   2> 219790 INFO  (zkConnectionManagerCallback-115-thread-1) [    ] o.a.s.c.c.ConnectionManager zkClient has connected
   [junit4]   2> 219854 INFO  (TEST-MultiThreadedOCPTest.test-seed#[25D56684F7208E3]) [    ] o.a.s.s.SolrDispatchFilter Loading solr.xml from SolrHome (not found in ZooKeeper)
   [junit4]   2> 219854 INFO  (TEST-MultiThreadedOCPTest.test-seed#[25D56684F7208E3]) [    ] o.a.s.c.SolrXmlConfig Loading container configuration from /home/jenkins/jenkins-slave/workspace/Lucene-Solr-Tests-master/solr/build/solr-core/test/J0/temp/solr.cloud.MultiThreadedOCPTest_25D56684F7208E3-001/control-001/solr.xml
   [junit4]   2> 219871 INFO  (TEST-MultiThreadedOCPTest.test-seed#[25D56684F7208E3]) [    ] o.a.s.c.SolrXmlConfig Configuration parameter autoReplicaFailoverWorkLoopDelay is ignored
   [junit4]   2> 219871 INFO  (TEST-MultiThreadedOCPTest.test-seed#[25D56684F7208E3]) [    ] o.a.s.c.SolrXmlConfig Configuration parameter autoReplicaFailoverBadNodeExpiration is ignored
   [junit4]   2> 219872 INFO  (TEST-MultiThreadedOCPTest.test-seed#[25D56684F7208E3]) [    ] o.a.s.c.SolrXmlConfig MBean server found: com.sun.jmx.mbeanserver.JmxMBeanServer@4b5a5ed1, but no JMX reporters were configured - adding default JMX reporter.
   [junit4]   2> 220507 INFO  (TEST-MultiThreadedOCPTest.test-seed#[25D56684F7208E3]) [    ] o.a.s.c.ZkContainer Zookeeper client=127.0.0.1:36017/solr
   [junit4]   2> 220582 INFO  (zkConnectionManagerCallback-119-thread-1) [    ] o.a.s.c.c.ConnectionManager zkClient has connected
   [junit4]   2> 220825 INFO  (zkConnectionManagerCallback-121-thread-1) [    ] o.a.s.c.c.ConnectionManager zkClient has connected
   [junit4]   2> 222067 INFO  (TEST-MultiThreadedOCPTest.test-seed#[25D56684F7208E3]) [n:127.0.0.1:40061_t%2Fl    ] o.a.s.c.OverseerElectionContext I am going to be the leader 127.0.0.1:40061_t%2Fl
   [junit4]   2> 222068 INFO  (TEST-MultiThreadedOCPTest.test-seed#[25D56684F7208E3]) [n:127.0.0.1:40061_t%2Fl    ] o.a.s.c.Overseer Overseer (id=73134141623304197-127.0.0.1:40061_t%2Fl-n_0000000000) starting
   [junit4]   2> 222127 INFO  (zkConnectionManagerCallback-128-thread-1) [    ] o.a.s.c.c.ConnectionManager zkClient has connected
   [junit4]   2> 222237 INFO  (TEST-MultiThreadedOCPTest.test-seed#[25D56684F7208E3]) [n:127.0.0.1:40061_t%2Fl    ] o.a.s.c.s.i.ZkClientClusterStateProvider Cluster at 127.0.0.1:36017/solr ready
   [junit4]   2> 222256 INFO  (OverseerStateUpdate-73134141623304197-127.0.0.1:40061_t%2Fl-n_0000000000) [    ] o.a.s.c.Overseer Starting to work on the main queue : 127.0.0.1:40061_t%2Fl
   [junit4]   2> 222309 INFO  (TEST-MultiThreadedOCPTest.test-seed#[25D56684F7208E3]) [n:127.0.0.1:40061_t%2Fl    ] o.a.s.c.ZkController Register node as live in ZooKeeper:/live_nodes/127.0.0.1:40061_t%2Fl
   [junit4]   2> 222349 INFO  (zkCallback-127-thread-1) [    ] o.a.s.c.c.ZkStateReader Updated live nodes from ZooKeeper... (0) -> (1)
   [junit4]   2> 222382 INFO  (zkCallback-120-thread-1) [    ] o.a.s.c.c.ZkStateReader Updated live nodes from ZooKeeper... (0) -> (1)
   [junit4]   2> 222569 INFO  (TEST-MultiThreadedOCPTest.test-seed#[25D56684F7208E3]) [n:127.0.0.1:40061_t%2Fl    ] o.a.s.h.a.MetricsHistoryHandler No .system collection, keeping metrics history in memory.
   [junit4]   2> 222716 INFO  (TEST-MultiThreadedOCPTest.test-seed#[25D56684F7208E3]) [n:127.0.0.1:40061_t%2Fl    ] o.a.s.m.r.SolrJmxReporter JMX monitoring for 'solr.node' (registry 'solr.node') enabled at server: com.sun.jmx.mbeanserver.JmxMBeanServer@4b5a5ed1
   [junit4]   2> 222845 INFO  (TEST-MultiThreadedOCPTest.test-seed#[25D56684F7208E3]) [n:127.0.0.1:40061_t%2Fl    ] o.a.s.m.r.SolrJmxReporter JMX monitoring for 'solr.jvm' (registry 'solr.jvm') enabled at server: com.sun.jmx.mbeanserver.JmxMBeanServer@4b5a5ed1
   [junit4]   2> 222845 INFO  (TEST-MultiThreadedOCPTest.test-seed#[25D56684F7208E3]) [n:127.0.0.1:40061_t%2Fl    ] o.a.s.m.r.SolrJmxReporter JMX monitoring for 'solr.jetty' (registry 'solr.jetty') enabled at server: com.sun.jmx.mbeanserver.JmxMBeanServer@4b5a5ed1
   [junit4]   2> 222847 INFO  (TEST-MultiThreadedOCPTest.test-seed#[25D56684F7208E3]) [n:127.0.0.1:40061_t%2Fl    ] o.a.s.c.CorePropertiesLocator Found 0 core definitions underneath /home/jenkins/jenkins-slave/workspace/Lucene-Solr-Tests-master/solr/build/solr-core/test/J0/../../../../../../../../../../home/jenkins/jenkins-slave/workspace/Lucene-Solr-Tests-master/solr/build/solr-core/test/J0/temp/solr.cloud.MultiThreadedOCPTest_25D56684F7208E3-001/control-001/cores
   [junit4]   2> 223116 INFO  (zkConnectionManagerCallback-134-thread-1) [    ] o.a.s.c.c.ConnectionManager zkClient has connected
   [junit4]   2> 223130 INFO  (TEST-MultiThreadedOCPTest.test-seed#[25D56684F7208E3]) [    ] o.a.s.c.c.ZkStateReader Updated live nodes from ZooKeeper... (0) -> (1)
   [junit4]   2> 223131 INFO  (TEST-MultiThreadedOCPTest.test-seed#[25D56684F7208E3]) [    ] o.a.s.c.s.i.ZkClientClusterStateProvider Cluster at 127.0.0.1:36017/solr ready
   [junit4]   2> 224452 INFO  (qtp1424618149-465) [n:127.0.0.1:40061_t%2Fl    ] o.a.s.h.a.CollectionsHandler Invoked Collection Action :create with params collection.configName=conf1&name=control_collection&nrtReplicas=1&action=CREATE&numShards=1&createNodeSet=127.0.0.1:40061_t%252Fl&wt=javabin&version=2 and sendToOCPQueue=true
   [junit4]   2> 224468 INFO  (OverseerThreadFactory-244-thread-1) [    ] o.a.s.c.a.c.CreateCollectionCmd Create collection control_collection
   [junit4]   2> 225062 INFO  (qtp1424618149-464) [n:127.0.0.1:40061_t%2Fl    x:control_collection_shard1_replica_n1] o.a.s.h.a.CoreAdminOperation core create command qt=/admin/cores&collection.configName=conf1&newCollection=true&name=control_collection_shard1_replica_n1&action=CREATE&numShards=1&collection=control_collection&shard=shard1&wt=javabin&version=2&replicaType=NRT
   [junit4]   2> 225063 INFO  (qtp1424618149-464) [n:127.0.0.1:40061_t%2Fl    x:control_collection_shard1_replica_n1] o.a.s.c.TransientSolrCoreCacheDefault Allocating transient cache for 4 transient cores
   [junit4]   2> 226478 INFO  (qtp1424618149-464) [n:127.0.0.1:40061_t%2Fl c:control_collection s:shard1  x:control_collection_shard1_replica_n1] o.a.s.c.SolrConfig Using Lucene MatchVersion: 8.0.0
   [junit4]   2> 226748 INFO  (qtp1424618149-464) [n:127.0.0.1:40061_t%2Fl c:control_collection s:shard1  x:control_collection_shard1_replica_n1] o.a.s.s.IndexSchema [control_collection_shard1_replica_n1] Schema name=test
   [junit4]   2> 227904 INFO  (qtp1424618149-464) [n:127.0.0.1:40061_t%2Fl c:control_collection s:shard1  x:control_collection_shard1_replica_n1] o.a.s.s.IndexSchema Loaded schema test/1.0 with uniqueid field id
   [junit4]   2> 228029 INFO  (qtp1424618149-464) [n:127.0.0.1:40061_t%2Fl c:control_collection s:shard1  x:control_collection_shard1_replica_n1] o.a.s.c.CoreContainer Creating SolrCore 'control_collection_shard1_replica_n1' using configuration from collection control_collection, trusted=true
   [junit4]   2> 228030 INFO  (qtp1424618149-464) [n:127.0.0.1:40061_t%2Fl c:control_collection s:shard1  x:control_collection_shard1_replica_n1] o.a.s.m.r.SolrJmxReporter JMX monitoring for 'solr.core.control_collection.shard1.replica_n1' (registry 'solr.core.control_collection.shard1.replica_n1') enabled at server: com.sun.jmx.mbeanserver.JmxMBeanServer@4b5a5ed1
   [junit4]   2> 228030 INFO  (qtp1424618149-464) [n:127.0.0.1:40061_t%2Fl c:control_collection s:shard1  x:control_collection_shard1_replica_n1] o.a.s.c.SolrCore solr.RecoveryStrategy.Builder
   [junit4]   2> 228030 INFO  (qtp1424618149-464) [n:127.0.0.1:40061_t%2Fl c:control_collection s:shard1  x:control_collection_shard1_replica_n1] o.a.s.c.SolrCore [[control_collection_shard1_replica_n1] ] Opening new SolrCore at [/home/jenkins/jenkins-slave/workspace/Lucene-Solr-Tests-master/solr/build/solr-core/test/J0/temp/solr.cloud.MultiThreadedOCPTest_25D56684F7208E3-001/control-001/cores/control_collection_shard1_replica_n1], dataDir=[/home/jenkins/jenkins-slave/workspace/Lucene-Solr-Tests-master/solr/build/solr-core/test/J0/../../../../../../../../../../home/jenkins/jenkins-slave/workspace/Lucene-Solr-Tests-master/solr/build/solr-core/test/J0/temp/solr.cloud.MultiThreadedOCPTest_25D56684F7208E3-001/control-001/cores/control_collection_shard1_replica_n1/data/]
   [junit4]   2> 228066 INFO  (qtp1424618149-464) [n:127.0.0.1:40061_t%2Fl c:control_collection s:shard1  x:control_collection_shard1_replica_n1] o.a.s.u.RandomMergePolicy RandomMergePolicy wrapping class org.apache.lucene.index.TieredMergePolicy: [TieredMergePolicy: maxMergeAtOnce=18, maxMergeAtOnceExplicit=33, maxMergedSegmentMB=98.6318359375, floorSegmentMB=2.0283203125, forceMergeDeletesPctAllowed=25.00350975454992, segmentsPerTier=34.0, maxCFSSegmentSizeMB=8.796093022207999E12, noCFSRatio=1.0, deletesPctAllowed=49.466497666371865
   [junit4]   2> 228235 WARN  (qtp1424618149-464) [n:127.0.0.1:40061_t%2Fl c:control_collection s:shard1  x:control_collection_shard1_replica_n1] o.a.s.c.RequestHandlers INVALID paramSet a in requestHandler {type = requestHandler,name = /dump,class = DumpRequestHandler,attributes = {initParams=a, name=/dump, class=DumpRequestHandler},args = {defaults={a=A,b=B}}}
   [junit4]   2> 228636 INFO  (qtp1424618149-464) [n:127.0.0.1:40061_t%2Fl c:control_collection s:shard1  x:control_collection_shard1_replica_n1] o.a.s.u.UpdateHandler Using UpdateLog implementation: org.apache.solr.update.UpdateLog
   [junit4]   2> 228636 INFO  (qtp1424618149-464) [n:127.0.0.1:40061_t%2Fl c:control_collection s:shard1  x:control_collection_shard1_replica_n1] o.a.s.u.UpdateLog Initializing UpdateLog: dataDir= defaultSyncLevel=FLUSH numRecordsToKeep=100 maxNumLogsToKeep=10 numVersionBuckets=65536
   [junit4]   2> 228637 INFO  (qtp1424618149-464) [n:127.0.0.1:40061_t%2Fl c:control_collection s:shard1  x:control_collection_shard1_replica_n1] o.a.s.u.CommitTracker Hard AutoCommit: disabled
   [junit4]   2> 228637 INFO  (qtp1424618149-464) [n:127.0.0.1:40061_t%2Fl c:control_collection s:shard1  x:control_collection_shard1_replica_n1] o.a.s.u.CommitTracker Soft AutoCommit: disabled
   [junit4]   2> 228687 INFO  (qtp1424618149-464) [n:127.0.0.1:40061_t%2Fl c:control_collection s:shard1  x:control_collection_shard1_replica_n1] o.a.s.u.RandomMergePolicy RandomMergePolicy wrapping class org.apache.lucene.index.LogByteSizeMergePolicy: [LogByteSizeMergePolicy: minMergeSize=1677721, mergeFactor=40, maxMergeSize=2147483648, maxMergeSizeForForcedMerge=9223372036854775807, calibrateSizeByDeletes=false, maxMergeDocs=2147483647, maxCFSSegmentSizeMB=8.796093022207999E12, noCFSRatio=0.0]
   [junit4]   2> 228688 INFO  (qtp1424618149-464) [n:127.0.0.1:40061_t%2Fl c:control_collection s:shard1  x:control_collection_shard1_replica_n1] o.a.s.s.SolrIndexSearcher Opening [Searcher@63c954aa[control_collection_shard1_replica_n1] main]
   [junit4]   2> 228893 INFO  (qtp1424618149-464) [n:127.0.0.1:40061_t%2Fl c:control_collection s:shard1  x:control_collection_shard1_replica_n1] o.a.s.r.ManagedResourceStorage Configured ZooKeeperStorageIO with znodeBase: /configs/conf1
   [junit4]   2> 228894 INFO  (qtp1424618149-464) [n:127.0.0.1:40061_t%2Fl c:control_collection s:shard1  x:control_collection_shard1_replica_n1] o.a.s.r.ManagedResourceStorage Loaded null at path _rest_managed.json using ZooKeeperStorageIO:path=/configs/conf1
   [junit4]   2> 228909 INFO  (qtp1424618149-464) [n:127.0.0.1:40061_t%2Fl c:control_collection s:shard1  x:control_collection_shard1_replica_n1] o.a.s.h.ReplicationHandler Commits will be reserved for 10000ms.
   [junit4]   2> 229001 INFO  (searcherExecutor-249-thread-1-processing-n:127.0.0.1:40061_t%2Fl x:control_collection_shard1_replica_n1 c:control_collection s:shard1) [n:127.0.0.1:40061_t%2Fl c:control_collection s:shard1  x:control_collection_shard1_replica_n1] o.a.s.c.SolrCore [control_collection_shard1_replica_n1] Registered new searcher Searcher@63c954aa[control_collection_shard1_replica_n1] main{ExitableDirectoryReader(UninvertingDirectoryReader())}
   [junit4]   2> 229001 INFO  (qtp1424618149-464) [n:127.0.0.1:40061_t%2Fl c:control_collection s:shard1  x:control_collection_shard1_replica_n1] o.a.s.u.UpdateLog Could not find max version in index or recent updates, using new clock 1608609351368441856
   [junit4]   2> 229040 INFO  (qtp1424618149-464) [n:127.0.0.1:40061_t%2Fl c:control_collection s:shard1  x:control_collection_shard1_replica_n1] o.a.s.c.ZkShardTerms Successful update of terms at /collections/control_collection/terms/shard1 to Terms{values={core_node2=0}, version=0}
   [junit4]   2> 229076 INFO  (qtp1424618149-464) [n:127.0.0.1:40061_t%2Fl c:control_collection s:shard1  x:control_collection_shard1_replica_n1] o.a.s.c.ShardLeaderElectionContext Enough replicas found to continue.
   [junit4]   2> 229076 INFO  (qtp1424618149-464) [n:127.0.0.1:40061_t%2Fl c:control_collection s:shard1  x:control_collection_shard1_replica_n1] o.a.s.c.ShardLeaderElectionContext I may be the new leader - try and sync
   [junit4]   2> 229076 INFO  (qtp1424618149-464) [n:127.0.0.1:40061_t%2Fl c:control_collection s:shard1  x:control_collection_shard1_replica_n1] o.a.s.c.SyncStrategy Sync replicas to https://127.0.0.1:40061/t/l/control_collection_shard1_replica_n1/
   [junit4]   2> 229076 INFO  (qtp1424618149-464) [n:127.0.0.1:40061_t%2Fl c:control_collection s:shard1  x:control_collection_shard1_replica_n1] o.a.s.c.SyncStrategy Sync Success - now sync replicas to me
   [junit4]   2> 229077 INFO  (qtp1424618149-464) [n:127.0.0.1:40061_t%2Fl c:control_collection s:shard1  x:control_collection_shard1_replica_n1] o.a.s.c.SyncStrategy https://127.0.0.1:40061/t/l/control_collection_shard1_replica_n1/ has no replicas
   [junit4]   2> 229077 INFO  (qtp1424618149-464) [n:127.0.0.1:40061_t%2Fl c:control_collection s:shard1  x:control_collection_shard1_replica_n1] o.a.s.c.ShardLeaderElectionContext Found all replicas participating in election, clear LIR
   [junit4]   2> 229110 INFO  (qtp1424618149-464) [n:127.0.0.1:40061_t%2Fl c:control_collection s:shard1  x:control_collection_shard1_replica_n1] o.a.s.c.ShardLeaderElectionContext I am the new leader: https://127.0.0.1:40061/t/l/control_collection_shard1_replica_n1/ shard1
   [junit4]   2> 229163 INFO  (qtp1424618149-464) [n:127.0.0.1:40061_t%2Fl c:control_collection s:shard1  x:control_collection_shard1_replica_n1] o.a.s.c.ZkController I am the leader, no recovery necessary
   [junit4]   2> 229199 INFO  (qtp1424618149-464) [n:127.0.0.1:40061_t%2Fl c:control_collection s:shard1  x:control_collection_shard1_replica_n1] o.a.s.s.HttpSolrCall [admin] webapp=null path=/admin/cores params={qt=/admin/cores&collection.configName=conf1&newCollection=true&name=control_collection_shard1_replica_n1&action=CREATE&numShards=1&collection=control_collection&shard=shard1&wt=javabin&version=2&replicaType=NRT} status=0 QTime=4137
   [junit4]   2> 229347 INFO  (zkCallback-120-thread-1) [    ] o.a.s.c.c.ZkStateReader A cluster state change: [WatchedEvent state:SyncConnected type:NodeDataChanged path:/collections/control_collection/state.json] for collection [control_collection] has occurred - updating... (live nodes size: [1])
   [junit4]   2> 229385 INFO  (qtp1424618149-465) [n:127.0.0.1:40061_t%2Fl    ] o.a.s.h.a.CollectionsHandler Wait for new collection to be active for at most 30 seconds. Check all shard replicas
   [junit4]   2> 229386 INFO  (qtp1424618149-465) [n:127.0.0.1:40061_t%2Fl    ] o.a.s.s.HttpSolrCall [admin] webapp=null path=/admin/collections params={collection.configName=conf1&name=control_collection&nrtReplicas=1&action=CREATE&numShards=1&createNodeSet=127.0.0.1:40061_t%252Fl&wt=javabin&version=2} status=0 QTime=4933
   [junit4]   2> 229585 INFO  (zkConnectionManagerCallback-139-thread-1) [    ] o.a.s.c.c.ConnectionManager zkClient has connected
   [junit4]   2> 229587 INFO  (TEST-MultiThreadedOCPTest.test-seed#[25D56684F7208E3]) [    ] o.a.s.c.c.ZkStateReader Updated live nodes from ZooKeeper... (0) -> (1)
   [junit4]   2> 229588 INFO  (TEST-MultiThreadedOCPTest.test-seed#[25D56684F7208E3]) [    ] o.a.s.c.s.i.ZkClientClusterStateProvider Cluster at 127.0.0.1:36017/solr ready
   [junit4]   2> 229624 INFO  (TEST-MultiThreadedOCPTest.test-seed#[25D56684F7208E3]) [    ] o.a.s.c.ChaosMonkey monkey: init - expire sessions:false cause connection loss:false
   [junit4]   2> 229712 INFO  (qtp1424618149-465) [n:127.0.0.1:40061_t%2Fl    ] o.a.s.h.a.CollectionsHandler Invoked Collection Action :create with params collection.configName=conf1&name=collection1&nrtReplicas=1&action=CREATE&numShards=2&createNodeSet=&stateFormat=2&wt=javabin&version=2 and sendToOCPQueue=true
   [junit4]   2> 229785 INFO  (OverseerThreadFactory-244-thread-2) [    ] o.a.s.c.a.c.CreateCollectionCmd Create collection collection1
   [junit4]   2> 229785 INFO  (OverseerCollectionConfigSetProcessor-73134141623304197-127.0.0.1:40061_t%2Fl-n_0000000000) [    ] o.a.s.c.OverseerTaskQueue Response ZK path: /overseer/collection-queue-work/qnr-0000000000 doesn't exist.  Requestor may have disconnected from ZooKeeper
   [junit4]   2> 230005 WARN  (OverseerThreadFactory-244-thread-2) [    ] o.a.s.c.a.c.CreateCollectionCmd It is unusual to create a collection (collection1) without cores.
   [junit4]   2> 230058 INFO  (qtp1424618149-465) [n:127.0.0.1:40061_t%2Fl    ] o.a.s.h.a.CollectionsHandler Wait for new collection to be active for at most 30 seconds. Check all shard replicas
   [junit4]   2> 230094 INFO  (qtp1424618149-465) [n:127.0.0.1:40061_t%2Fl    ] o.a.s.s.HttpSolrCall [admin] webapp=null path=/admin/collections params={collection.configName=conf1&name=collection1&nrtReplicas=1&action=CREATE&numShards=2&createNodeSet=&stateFormat=2&wt=javabin&version=2} status=0 QTime=382
   [junit4]   2> 231832 INFO  (OverseerCollectionConfigSetProcessor-73134141623304197-127.0.0.1:40061_t%2Fl-n_0000000000) [    ] o.a.s.c.OverseerTaskQueue Response ZK path: /overseer/collection-queue-work/qnr-0000000002 doesn't exist.  Requestor may have disconnected from ZooKeeper
   [junit4]   2> 232565 INFO  (TEST-MultiThreadedOCPTest.test-seed#[25D56684F7208E3]) [    ] o.a.s.c.AbstractFullDistribZkTestBase create jetty 1 in directory /home/jenkins/jenkins-slave/workspace/Lucene-Solr-Tests-master/solr/build/solr-core/test/J0/temp/solr.cloud.MultiThreadedOCPTest_25D56684F7208E3-001/shard-1-001 of type NRT
   [junit4]   2> 232617 INFO  (TEST-MultiThreadedOCPTest.test-seed#[25D56684F7208E3]) [    ] o.e.j.s.Server jetty-9.4.11.v20180605; built: 2018-06-05T18:24:03.829Z; git: d5fc0523cfa96bfebfbda19606cad384d772f04c; jvm 1.8.0_172-b11
   [junit4]   2> 232800 INFO  (TEST-MultiThreadedOCPTest.test-seed#[25D56684F7208E3]) [    ] o.e.j.s.session DefaultSessionIdManager workerName=node0
   [junit4]   2> 232800 INFO  (TEST-MultiThreadedOCPTest.test-seed#[25D56684F7208E3]) [    ] o.e.j.s.session No SessionScavenger set, using defaults
   [junit4]   2> 232800 INFO  (TEST-MultiThreadedOCPTest.test-seed#[25D56684F7208E3]) [    ] o.e.j.s.session node0 Scavenging every 660000ms
   [junit4]   2> 232800 INFO  (TEST-MultiThreadedOCPTest.test-seed#[25D56684F7208E3]) [    ] o.e.j.s.h.ContextHandler Started o.e.j.s.ServletContextHandler@560d528c{/t/l,null,AVAILABLE}
   [junit4]   2> 232801 INFO  (TEST-MultiThreadedOCPTest.test-seed#[25D56684F7208E3]) [    ] o.e.j.s.AbstractConnector Started ServerConnector@6356b7b1{SSL,[ssl, http/1.1]}{127.0.0.1:38706}
   [junit4]   2> 232801 INFO  (TEST-MultiThreadedOCPTest.test-seed#[25D56684F7208E3]) [    ] o.e.j.s.Server Started @233010ms
   [junit4]   2> 232802 INFO  (TEST-MultiThreadedOCPTest.test-seed#[25D56684F7208E3]) [    ] o.a.s.c.s.e.JettySolrRunner Jetty properties: {solr.data.dir=/home/jenkins/jenkins-slave/workspace/Lucene-Solr-Tests-master/solr/build/solr-core/test/J0/temp/solr.cloud.MultiThreadedOCPTest_25D56684F7208E3-001/tempDir-001/jetty1, replicaType=NRT, solrconfig=solrconfig.xml, hostContext=/t/l, hostPort=38706, coreRootDirectory=/home/jenkins/jenkins-slave/workspace/Lucene-Solr-Tests-master/solr/build/solr-core/test/J0/temp/solr.cloud.MultiThreadedOCPTest_25D56684F7208E3-001/shard-1-001/cores}
   [junit4]   2> 232802 ERROR (TEST-MultiThreadedOCPTest.test-seed#[25D56684F7208E3]) [    ] o.a.s.u.StartupLoggingUtils Missing Java Option solr.log.dir. Logging may be missing or incomplete.
   [junit4]   2> 232802 INFO  (TEST-MultiThreadedOCPTest.test-seed#[25D56684F7208E3]) [    ] o.a.s.s.SolrDispatchFilter Using logger factory org.apache.logging.slf4j.Log4jLoggerFactory
   [junit4]   2> 232802 INFO  (TEST-MultiThreadedOCPTest.test-seed#[25D56684F7208E3]) [    ] o.a.s.s.SolrDispatchFilter  ___      _       Welcome to Apache Solr? version 8.0.0
   [junit4]   2> 232802 INFO  (TEST-MultiThreadedOCPTest.test-seed#[25D56684F7208E3]) [    ] o.a.s.s.SolrDispatchFilter / __| ___| |_ _   Starting in cloud mode on port null
   [junit4]   2> 232802 INFO  (TEST-MultiThreadedOCPTest.test-seed#[25D56684F7208E3]) [    ] o.a.s.s.SolrDispatchFilter \__ \/ _ \ | '_|  Install dir: null
   [junit4]   2> 232802 INFO  (TEST-MultiThreadedOCPTest.test-seed#[25D56684F7208E3]) [    ] o.a.s.s.SolrDispatchFilter |___/\___/_|_|    Start time: 2018-08-12T15:57:07.332Z
   [junit4]   2> 232842 INFO  (zkConnectionManagerCallback-141-thread-1) [    ] o.a.s.c.c.ConnectionManager zkClient has connected
   [junit4]   2> 232893 INFO  (TEST-MultiThreadedOCPTest.test-seed#[25D56684F7208E3]) [    ] o.a.s.s.SolrDispatchFilter Loading solr.xml from SolrHome (not found in ZooKeeper)
   [junit4]   2> 232893 INFO  (TEST-MultiThreadedOCPTest.test-seed#[25D56684F7208E3]) [    ] o.a.s.c.SolrXmlConfig Loading container configuration from /home/jenkins/jenkins-slave/workspace/Lucene-Solr-Tests-master/solr/build/solr-core/test/J0/temp/solr.cloud.MultiThreadedOCPTest_25D56684F7208E3-001/shard-1-001/solr.xml
   [junit4]   2> 232967 INFO  (TEST-MultiThreadedOCPTest.test-seed#[25D56684F7208E3]) [    ] o.a.s.c.SolrXmlConfig Configuration parameter autoReplicaFailoverWorkLoopDelay is ignored
   [junit4]   2> 232967 INFO  (TEST-MultiThreadedOCPTest.test-seed#[25D56684F7208E3]) [    ] o.a.s.c.SolrXmlConfig Configuration parameter autoReplicaFailoverBadNodeExpiration is ignored
   [junit4]   2> 232969 INFO  (TEST-MultiThreadedOCPTest.test-seed#[25D56684F7208E3]) [    ] o.a.s.c.SolrXmlConfig MBean server found: com.sun.jmx.mbeanserver.JmxMBeanServer@4b5a5ed1, but no JMX reporters were configured - adding default JMX reporter.
   [junit4]   2> 235138 INFO  (TEST-MultiThreadedOCPTest.test-seed#[25D56684F7208E3]) [    ] o.a.s.c.ZkContainer Zookeeper client=127.0.0.1:36017/solr
   [junit4]   2> 235159 INFO  (zkConnectionManagerCallback-145-thread-1) [    ] o.a.s.c.c.ConnectionManager zkClient has connected
   [junit4]   2> 235174 INFO  (zkConnectionManagerCallback-147-thread-1) [    ] o.a.s.c.c.ConnectionManager zkClient has connected
   [junit4]   2> 235197 INFO  (TEST-MultiThreadedOCPTest.test-seed#[25D56684F7208E3]) [    ] o.a.s.c.c.ZkStateReader Updated live nodes from ZooKeeper... (0) -> (1)
   [junit4]   2> 235231 INFO  (TEST-MultiThreadedOCPTest.test-seed#[25D56684F7208E3]) [    ] o.a.s.c.TransientSolrCoreCacheDefault Allocating transient cache for 4 transient cores
   [junit4]   2> 235231 INFO  (TEST-MultiThreadedOCPTest.test-seed#[25D56684F7208E3]) [    ] o.a.s.c.ZkController Register node as live in ZooKeeper:/live_nodes/127.0.0.1:38706_t%2Fl
   [junit4]   2> 235259 INFO  (zkCallback-120-thread-1) [    ] o.a.s.c.c.ZkStateReader Updated live nodes from ZooKeeper... (1) -> (2)
   [junit4]   2> 235260 INFO  (zkCallback-127-thread-1) [    ] o.a.s.c.c.ZkStateReader Updated live nodes from ZooKeeper... (1) -> (2)
   [junit4]   2> 235320 INFO  (zkCallback-146-thread-1) [    ] o.a.s.c.c.ZkStateReader Updated live nodes from ZooKeeper... (1) -> (2)
   [junit4]   2> 235320 INFO  (zkCallback-138-thread-1) [    ] o.a.s.c.c.ZkStateReader Updated live nodes from ZooKeeper... (1) -> (2)
   [junit4]   2> 235527 INFO  (zkConnectionManagerCallback-154-thread-1) [    ] o.a.s.c.c.ConnectionManager zkClient has connected
   [junit4]   2> 235541 INFO  (TEST-MultiThreadedOCPTest.test-seed#[25D56684F7208E3]) [    ] o.a.s.c.c.ZkStateReader Updated live nodes from ZooKeeper... (0) -> (2)
   [junit4]   2> 235557 INFO  (TEST-MultiThreadedOCPTest.test-seed#[25D56684F7208E3]) [    ] o.a.s.c.s.i.ZkClientClusterStateProvider Cluster at 127.0.0.1:36017/solr ready
   [junit4]   2> 235557 INFO  (TEST-MultiThreadedOCPTest.test-seed#[25D56684F7208E3]) [    ] o.a.s.h.a.MetricsHistoryHandler No .system collection, keeping metrics history in memory.
   [junit4]   2> 235651 INFO  (TEST-MultiThreadedOCPTest.test-seed#[25D56684F7208E3]) [    ] o.a.s.m.r.SolrJmxReporter JMX monitoring for 'solr.node' (registry 'solr.node') enabled at server: com.sun.jmx.mbeanserver.JmxMBeanServer@4b5a5ed1
   [junit4]   2> 235725 INFO  (TEST-MultiThreadedOCPTest.test-seed#[25D56684F7208E3]) [    ] o.a.s.m.r.SolrJmxReporter JMX monitoring for 'solr.jvm' (registry 'solr.jvm') enabled at server: com.sun.jmx.mbeanserver.JmxMBeanServer@4b5a5ed1
   [junit4]   2> 235725 INFO  (TEST-MultiThreadedOCPTest.test-seed#[25D56684F7208E3]) [    ] o.a.s.m.r.SolrJmxReporter JMX monitoring for 'solr.jetty' (registry 'solr.jetty') enabled at server: com.sun.jmx.mbeanserver.JmxMBeanServer@4b5a5ed1
   [junit4]   2> 235726 INFO  (TEST-MultiThreadedOCPTest.test-seed#[25D56684F7208E3]) [    ] o.a.s.c.CorePropertiesLocator Found 0 core definitions underneath /home/jenkins/jenkins-slave/workspace/Lucene-Solr-Tests-master/solr/build/solr-core/test/J0/temp/solr.cloud.MultiThreadedOCPTest_25D56684F7208E3-001/shard-1-001/cores
   [junit4]   2> 236394 INFO  (qtp1028003939-515) [n:127.0.0.1:38706_t%2Fl    ] o.a.s.h.a.CollectionsHandler Invoked Collection Action :addreplica with params node=127.0.0.1:38706_t%252Fl&action=ADDREPLICA&collection=collection1&shard=shard2&type=NRT&wt=javabin&version=2 and sendToOCPQueue=true
   [junit4]   2> 236484 INFO  (OverseerThreadFactory-244-thread-3) [ c:collection1 s:shard2  ] o.a.s.c.a.c.AddReplicaCmd Node Identified 127.0.0.1:38706_t%2Fl for creating new replica of shard shard2
   [junit4]   2> 236851 INFO  (qtp1028003939-519) [n:127.0.0.1:38706_t%2Fl    x:collection1_shard2_replica_n41] o.a.s.h.a.CoreAdminOperation core create command qt=/admin/cores&collection.configName=conf1&name=collection1_shard2_replica_n41&action=CREATE&collection=collection1&shard=shard2&wt=javabin&version=2&replicaType=NRT
   [junit4]   2> 238003 INFO  (qtp1028003939-519) [n:127.0.0.1:38706_t%2Fl c:collection1 s:shard2  x:collection1_shard2_replica_n41] o.a.s.c.SolrConfig Using Lucene MatchVersion: 8.0.0
   [junit4]   2> 238131 INFO  (qtp1028003939-519) [n:127.0.0.1:38706_t%2Fl c:collection1 s:shard2  x:collection1_shard2_replica_n41] o.a.s.s.IndexSchema [collection1_shard2_replica_n41] Schema name=test
   [junit4]   2> 239206 INFO  (qtp1028003939-519) [n:127.0.0.1:38706_t%2Fl c:collection1 s:shard2  x:collection1_shard2_replica_n41] o.a.s.s.IndexSchema Loaded schema test/1.0 with uniqueid field id
   [junit4]   2> 239416 INFO  (qtp1028003939-519) [n:127.0.0.1:38706_t%2Fl c:collection1 s:shard2  x:collection1_shard2_replica_n41] o.a.s.c.CoreContainer Creating SolrCore 'collection1_shard2_replica_n41' using configuration from collection collection1, trusted=true
   [junit4]   2> 239416 INFO  (qtp1028003939-519) [n:127.0.0.1:38706_t%2Fl c:collection1 s:shard2  x:collection1_shard2_replica_n41] o.a.s.m.r.SolrJmxReporter JMX monitoring for 'solr.core.collection1.shard2.replica_n41' (registry 'solr.core.collection1.shard2.replica_n41') enabled at server: com.sun.jmx.mbeanserver.JmxMBeanServer@4b5a5ed1
   [junit4]   2> 239416 INFO  (qtp1028003939-519) [n:127.0.0.1:38706_t%2Fl c:collection1 s:shard2  x:collection1_shard2_replica_n41] o.a.s.c.SolrCore solr.RecoveryStrategy.Builder
   [junit4]   2> 239417 INFO  (qtp1028003939-519) [n:127.0.0.1:38706_t%2Fl c:collection1 s:shard2  x:collection1_shard2_replica_n41] o.a.s.c.SolrCore [[collection1_shard2_replica_n41] ] Opening new SolrCore at [/home/jenkins/jenkins-slave/workspace/Lucene-Solr-Tests-master/solr/build/solr-core/test/J0/temp/solr.cloud.MultiThreadedOCPTest_25D56684F7208E3-001/shard-1-001/cores/collection1_shard2_replica_n41], dataDir=[/home/jenkins/jenkins-slave/workspace/Lucene-Solr-Tests-master/solr/build/solr-core/test/J0/temp/solr.cloud.MultiThreadedOCPTest_25D56684F7208E3-001/shard-1-001/cores/collection1_shard2_replica_n41/data/]
   [junit4]   2> 239433 INFO  (qtp1028003939-519) [n:127.0.0.1:38706_t%2Fl c:collection1 s:shard2  x:collection1_shard2_replica_n41] o.a.s.u.RandomMergePolicy RandomMergePolicy wrapping class org.apache.lucene.index.TieredMergePolicy: [TieredMergePolicy: maxMergeAtOnce=18, maxMergeAtOnceExplicit=33, maxMergedSegmentMB=98.6318359375, floorSegmentMB=2.0283203125, forceMergeDeletesPctAllowed=25.00350975454992, segmentsPerTier=34.0, maxCFSSegmentSizeMB=8.796093022207999E12, noCFSRatio=1.0, deletesPctAllowed=49.466497666371865
   [junit4]   2> 239452 WARN  (qtp1028003939-519) [n:127.0.0.1:38706_t%2Fl c:collection1 s:shard2  x:collection1_shard2_replica_n41] o.a.s.c.RequestHandlers INVALID paramSet a in requestHandler {type = requestHandler,name = /dump,class = DumpRequestHandler,attributes = {initParams=a, name=/dump, class=DumpRequestHandler},args = {defaults={a=A,b=B}}}
   [junit4]   2> 240069 INFO  (qtp1028003939-519) [n:127.0.0.1:38706_t%2Fl c:collection1 s:shard2  x:collection1_shard2_replica_n41] o.a.s.u.UpdateHandler Using UpdateLog implementation: org.apache.solr.update.UpdateLog
   [junit4]   2> 240069 INFO  (qtp1028003939-519) [n:127.0.0.1:38706_t%2Fl c:collection1 s:shard2  x:collection1_shard2_replica_n41] o.a.s.u.UpdateLog Initializing UpdateLog: dataDir= defaultSyncLevel=FLUSH numRecordsToKeep=100 maxNumLogsToKeep=10 numVersionBuckets=65536
   [junit4]   2> 240071 INFO  (qtp1028003939-519) [n:127.0.0.1:38706_t%2Fl c:collection1 s:shard2  x:collection1_shard2_replica_n41] o.a.s.u.CommitTracker Hard AutoCommit: disabled
   [junit4]   2> 240071 INFO  (qtp1028003939-519) [n:127.0.0.1:38706_t%2Fl c:collection1 s:shard2  x:collection1_shard2_replica_n41] o.a.s.u.CommitTracker Soft AutoCommit: disabled
   [junit4]   2> 240072 INFO  (qtp1028003939-519) [n:127.0.0.1:38706_t%2Fl c:collection1 s:shard2  x:collection1_shard2_replica_n41] o.a.s.u.RandomMergePolicy RandomMergePolicy wrapping class org.apache.lucene.index.LogByteSizeMergePolicy: [LogByteSizeMergePolicy: minMergeSize=1677721, mergeFactor=40, maxMergeSize=2147483648, maxMergeSizeForForcedMerge=9223372036854775807, calibrateSizeByDeletes=false, maxMergeDocs=2147483647, maxCFSSegmentSizeMB=8.796093022207999E12, noCFSRatio=0.0]
   [junit4]   2> 240085 INFO  (qtp1028003939-519) [n:127.0.0.1:38706_t%2Fl c:collection1 s:shard2  x:collection1_shard2_replica_n41] o.a.s.s.SolrIndexSearcher Opening [Searcher@565f816c[collection1_shard2_replica_n41] main]
   [junit4]   2> 240087 INFO  (qtp1028003939-519) [n:127.0.0.1:38706_t%2Fl c:collection1 s:shard2  x:collection1_shard2_replica_n41] o.a.s.r.ManagedResourceStorage Configured ZooKeeperStorageIO with znodeBase: /configs/conf1
   [junit4]   2> 240087 INFO  (qtp1028003939-519) [n:127.0.0.1:38706_t%2Fl c:collection1 s:shard2  x:collection1_shard2_replica_n41] o.a.s.r.ManagedResourceStorage Loaded null at path _rest_managed.json using ZooKeeperStorageIO:path=/configs/conf1
   [junit4]   2> 240088 INFO  (qtp1028003939-519) [n:127.0.0.1:38706_t%2Fl c:collection1 s:shard2  x:collection1_shard2_replica_n41] o.a.s.h.ReplicationHandler Commits will be reserved for 10000ms.
   [junit4]   2> 240094 INFO  (searcherExecutor-263-thread-1-processing-n:127.0.0.1:38706_t%2Fl x:collection1_shard2_replica_n41 c:collection1 s:shard2) [n:127.0.0.1:38706_t%2Fl c:collection1 s:shard2  x:collection1_shard2_replica_n41] o.a.s.c.SolrCore [collection1_shard2_replica_n41] Registered new searcher Searcher@565f816c[collection1_shard2_replica_n41] main{ExitableDirectoryReader(UninvertingDirectoryReader())}
   [junit4]   2> 240094 INFO  (qtp1028003939-519) [n:127.0.0.1:38706_t%2Fl c:collection1 s:shard2  x:collection1_shard2_replica_n41] o.a.s.u.UpdateLog Could not find max version in index or recent updates, using new clock 1608609363000295424
   [junit4]   2> 240133 INFO  (qtp1028003939-519) [n:127.0.0.1:38706_t%2Fl c:collection1 s:shard2  x:collection1_shard2_replica_n41] o.a.s.c.ZkShardTerms Successful update of terms at /collections/collection1/terms/shard2 to Terms{values={core_node42=0}, version=0}
   [junit4]   2> 240185 INFO  (qtp1028003939-519) [n:127.0.0.1:38706_t%2Fl c:collection1 s:shard2  x:collection1_shard2_replica_n41] o.a.s.c.ShardLeaderElectionContext Enough replicas found to continue.
   [junit4]   2> 240185 INFO  (qtp1028003939-519) [n:127.0.0.1:38706_t%2Fl c:collection1 s:shard2  x:collection1_shard2_replica_n41] o.a.s.c.ShardLeaderElectionContext I may be the new leader - try and sync
   [junit4]   2> 240185 INFO  (qtp1028003939-519) [n:127.0.0.1:38706_t%2Fl c:collection1 s:shard2  x:collection1_shard2_replica_n41] o.a.s.c.SyncStrategy Sync replicas to https://127.0.0.1:38706/t/l/collection1_shard2_replica_n41/
   [junit4]   2> 240185 INFO  (qtp1028003939-519) [n:127.0.0.1:38706_t%2Fl c:collection1 s:shard2  x:collection1_shard2_replica_n41] o.a.s.c.SyncStrategy Sync Success - now sync replicas to me
   [junit4]   2> 240186 INFO  (qtp1028003939-519) [n:127.0.0.1:38706_t%2Fl c:collection1 s:shard2  x:collection1_shard2_replica_n41] o.a.s.c.SyncStrategy https://127.0.0.1:38706/t/l/collection1_shard2_replica_n41/ has no replicas
   [junit4]   2> 240186 INFO  (qtp1028003939-519) [n:127.0.0.1:38706_t%2Fl c:collection1 s:shard2  x:collection1_shard2_replica_n41] o.a.s.c.ShardLeaderElectionContext Found all replicas participating in election, clear LIR
   [junit4]   2> 240206 INFO  (qtp1028003939-519) [n:127.0.0.1:38706_t%2Fl c:collection1 s:shard2  x:collection1_shard2_replica_n41] o.a.s.c.ShardLeaderElectionContext I am the new leader: https://127.0.0.1:38706/t/l/collection1_shard2_replica_n41/ shard2
   [junit4]   2> 240366 INFO  (qtp1028003939-519) [n:127.0.0.1:38706_t%2Fl c:collection1 s:shard2  x:collection1_shard2_replica_n41] o.a.s.c.ZkController I am the leader, no recovery necessary
   [junit4]   2> 240368 INFO  (qtp1028003939-519) [n:127.0.0.1:38706_t%2Fl c:collection1 s:shard2  x:collection1_shard2_replica_n41] o.a.s.s.HttpSolrCall [admin] webapp=null path=/admin/cores params={qt=/admin/cores&collection.configName=conf1&name=collection1_shard2_replica_n41&action=CREATE&collection=collection1&shard=shard2&wt=javabin&version=2&replicaType=NRT} status=0 QTime=3517
   [junit4]   2> 240509 INFO  (qtp1028003939-515) [n:127.0.0.1:38706_t%2Fl c:collection1   ] o.a.s.s.HttpSolrCall [admin] webapp=null path=/admin/collections params={node=127.0.0.1:38706_t%252Fl&action=ADDREPLICA&collection=collection1&shard=shard2&type=NRT&wt=javabin&version=2} status=0 QTime=4114
   [junit4]   2> 240586 INFO  (zkCallback-146-thread-1) [    ] o.a.s.c.c.ZkStateReader A cluster state change: [WatchedEvent state:SyncConnected type:NodeDataChanged path:/collections/collection1/state.json] for collection [collection1] has occurred - updating... (live nodes size: [2])
   [junit4]   2> 240642 INFO  (OverseerCollectionConfigSetProcessor-73134141623304197-127.0.0.1:40061_t%2Fl-n_0000000000) [    ] o.a.s.c.OverseerTaskQueue Response ZK path: /overseer/collection-queue-work/qnr-0000000004 doesn't exist.  Requestor may have disconnected from ZooKeeper
   [junit4]   2> 241200 INFO  (TEST-MultiThreadedOCPTest.test-seed#[25D56684F7208E3]) [    ] o.a.s.c.AbstractFullDistribZkTestBase create jetty 2 in directory /home/jenkins/jenkins-slave/workspace/Lucene-Solr-Tests-master/solr/build/solr-core/test/J0/temp/solr.cloud.MultiThreadedOCPTest_25D56684F7208E3-001/shard-2-001 of type NRT
   [junit4]   2> 241201 INFO  (TEST-MultiThreadedOCPTest.test-seed#[25D56684F7208E3]) [    ] o.e.j.s.Server jetty-9.4.11.v20180605; built: 2018-06-05T18:24:03.829Z; git: d5fc0523cfa96bfebfbda19606cad384d772f04c; jvm 1.8.0_172-b11
   [junit4]   2> 241219 INFO  (TEST-MultiThreadedOCPTest.test-seed#[25D56684F7208E3]) [    ] o.e.j.s.session DefaultSessionIdManager workerName=node0
   [junit4]   2> 241219 INFO  (TEST-MultiThreadedOCPTest.test-seed#[25D56684F7208E3]) [    ] o.e.j.s.session No SessionScavenger set, using defaults
   [junit4]   2> 241219 INFO  (TEST-MultiThreadedOCPTest.test-seed#[25D56684F7208E3]) [    ] o.e.j.s.session node0 Scavenging every 600000ms
   [junit4]   2> 241244 INFO  (TEST-MultiThreadedOCPTest.test-seed#[25D56684F7208E3]) [    ] o.e.j.s.h.ContextHandler Started o.e.j.s.ServletContextHandler@42a1d3b7{/t/l,null,AVAILABLE}
   [junit4]   2> 241297 INFO  (TEST-MultiThreadedOCPTest.test-seed#[25D56684F7208E3]) [    ] o.e.j.s.AbstractConnector Started ServerConnector@65fc9455{SSL,[ssl, http/1.1]}{127.0.0.1:43138}
   [junit4]   2> 241297 INFO  (TEST-MultiThreadedOCPTest.test-seed#[25D56684F7208E3]) [    ] o.e.j.s.Server Started @241505ms
   [junit4]   2> 241316 INFO  (TEST-MultiThreadedOCPTest.test-seed#[25D56684F7208E3]) [    ] o.a.s.c.s.e.JettySolrRunner Jetty properties: {solr.data.dir=/home/jenkins/jenkins-slave/workspace/Lucene-Solr-Tests-master/solr/build/solr-core/test/J0/temp/solr.cloud.MultiThreadedOCPTest_25D56684F7208E3-001/tempDir-001/jetty2, solrconfig=solrconfig.xml, hostContext=/t/l, hostPort=43138, coreRootDirectory=/home/jenkins/jenkins-slave/workspace/Lucene-Solr-Tests-master/solr/build/solr-core/test/J0/temp/solr.cloud.MultiThreadedOCPTest_25D56684F7208E3-001/shard-2-001/cores}
   [junit4]   2> 241317 ERROR (TEST-MultiThreadedOCPTest.test-seed#[25D56684F7208E3]) [    ] o.a.s.u.StartupLoggingUtils Missing Java Option solr.log.dir. Logging may be missing or incomplete.
   [junit4]   2> 241317 INFO  (TEST-MultiThreadedOCPTest.test-seed#[25D56684F7208E3]) [    ] o.a.s.s.SolrDispatchFilter Using logger factory org.apache.logging.slf4j.Log4jLoggerFactory
   [junit4]   2> 241317 INFO  (TEST-MultiThreadedOCPTest.test-seed#[25D56684F7208E3]) [    ] o.a.s.s.SolrDispatchFilter  ___      _       Welcome to Apache Solr? version 8.0.0
   [junit4]   2> 241317 INFO  (TEST-MultiThreadedOCPTest.test-seed#[25D56684F7208E3]) [    ] o.a.s.s.SolrDispatchFilter / __| ___| |_ _   Starting in cloud mode on port null
   [junit4]   2> 241317 INFO  (TEST-MultiThreadedOCPTest.test-seed#[25D56684F7208E3]) [    ] o.a.s.s.SolrDispatchFilter \__ \/ _ \ | '_|  Install dir: null
   [junit4]   2> 241317 INFO  (TEST-MultiThreadedOCPTest.test-seed#[25D56684F7208E3]) [    ] o.a.s.s.SolrDispatchFilter |___/\___/_|_|    Start time: 2018-08-12T15:57:15.847Z
   [junit4]   2> 241406 INFO  (zkConnectionManagerCallback-157-thread-1) [    ] o.a.s.c.c.ConnectionManager zkClient has connected
   [junit4]   2> 241426 INFO  (TEST-MultiThreadedOCPTest.test-seed#[25D56684F7208E3]) [    ] o.a.s.s.SolrDispatchFilter Loading solr.xml from SolrHome (not found in ZooKeeper)
   [junit4]   2> 241426 INFO  (TEST-MultiThreadedOCPTest.test-seed#[25D56684F7208E3]) [    ] o.a.s.c.SolrXmlConfig Loading container configuration from /home/jenkins/jenkins-slave/workspace/Lucene-Solr-Tests-master/solr/build/solr-core/test/J0/temp/solr.cloud.MultiThreadedOCPTest_25D56684F7208E3-001/shard-2-001/solr.xml
   [junit4]   2> 241463 INFO  (TEST-MultiThreadedOCPTest.test-seed#[25D56684F7208E3]) [    ] o.a.s.c.SolrXmlConfig Configuration parameter autoReplicaFailoverWorkLoopDelay is ignored
   [junit4]   2> 241463 INFO  (TEST-MultiThreadedOCPTest.test-seed#[25D56684F7208E3]) [    ] o.a.s.c.SolrXmlConfig Configuration parameter autoReplicaFailoverBadNodeExpiration is ignored
   [junit4]   2> 241464 INFO  (TEST-MultiThreadedOCPTest.test-seed#[25D56684F7208E3]) [    ] o.a.s.c.SolrXmlConfig MBean server found: com.sun.jmx.mbeanserver.JmxMBeanServer@4b5a5ed1, but no JMX reporters were configured - adding default JMX reporter.
   [junit4]   2> 242081 INFO  (TEST-MultiThreadedOCPTest.test-seed#[25D56684F7208E3]) [    ] o.a.s.c.ZkContainer Zookeeper client=127.0.0.1:36017/solr
   [junit4]   2> 242206 INFO  (zkConnectionManagerCallback-161-thread-1) [    ] o.a.s.c.c.ConnectionManager zkClient has connected
   [junit4]   2> 242312 INFO  (zkConnectionManagerCallback-163-thread-1) [    ] o.a.s.c.c.ConnectionManager zkClient has connected
   [junit4]   2> 242352 INFO  (TEST-MultiThreadedOCPTest.test-seed#[25D56684F7208E3]) [    ] o.a.s.c.c.ZkStateReader Updated live nodes from ZooKeeper... (0) -> (2)
   [junit4]   2> 242404 INFO  (TEST-MultiThreadedOCPTest.test-seed#[25D56684F7208E3]) [    ] o.a.s.c.TransientSolrCoreCacheDefault Allocating transient cache for 4 transient cores
   [junit4]   2> 242404 INFO  (TEST-MultiThreadedOCPTest.test-seed#[25D56684F7208E3]) [    ] o.a.s.c.ZkController Register node as live in ZooKeeper:/live_nodes/127.0.0.1:43138_t%2Fl
   [junit4]   2> 242438 INFO  (zkCallback-120-thread-1) [    ] o.a.s.c.c.ZkStateReader Updated live nodes from ZooKeeper... (2) -> (3)
   [junit4]   2> 242439 INFO  (zkCallback-146-thread-1) [    ] o.a.s.c.c.ZkStateReader Updated live nodes from ZooKeeper... (2) -> (3)
   [junit4]   2> 242450 INFO  (zkCallback-127-thread-1) [    ] o.a.s.c.c.ZkStateReader Updated live nodes from ZooKeeper... (2) -> (3)
   [junit4]   2> 242552 INFO  (zkCallback-153-thread-1) [    ] o.a.s.c.c.ZkStateReader Updated live nodes from ZooKeeper... (2) -> (3)
   [junit4]   2> 242584 INFO  (zkCallback-138-thread-1) [    ] o.a.s.c.c.ZkStateReader Updated live nodes from ZooKeeper... (2) -> (3)
   [junit4]   2> 242643 INFO  (zkCallback-162-thread-1) [    ] o.a.s.c.c.ZkStateReader Updated live nodes from ZooKeeper... (2) -> (3)
   [junit4]   2> 242716 INFO  (zkConnectionManagerCallback-170-thread-1) [    ] o.a.s.c.c.ConnectionManager zkClient has connected
   [junit4]   2> 242718 INFO  (TEST-MultiThreadedOCPTest.test-seed#[25D56684F7208E3]) [    ] o.a.s.c.c.ZkStateReader Updated live nodes from ZooKeeper... (0) -> (3)
   [junit4]   2> 242733 INFO  (TEST-MultiThreadedOCPTest.test-seed#[25D56684F7208E3]) [    ] o.a.s.c.s.i.ZkClientClusterStateProvider Cluster at 127.0.0.1:36017/solr ready
   [junit4]   2> 242735 INFO  (TEST-MultiThreadedOCPTest.test-seed#[25D56684F7208E3]) [    ] o.a.s.h.a.MetricsHistoryHandler No .system collection, keeping metrics history in memory.
   [junit4]   2> 242825 INFO  (TEST-MultiThreadedOCPTest.test-seed#[25D56684F7208E3]) [    ] o.a.s.m.r.SolrJmxReporter JMX monitoring for 'solr.node' (registry 'solr.node') enabled at server: com.sun.jmx.mbeanserver.JmxMBeanServer@4b5a5ed1
   [junit4]   2> 242890 INFO  (TEST-MultiThreadedOCPTest.test-seed#[25D56684F7208E3]) [    ] o.a.s.m.r.SolrJmxReporter JMX monitoring for 'solr.jvm' (registry 'solr.jvm') enabled at server: com.sun.jmx.mbeanserver.JmxMBeanServer@4b5a5ed1
   [junit4]   2> 242890 INFO  (TEST-MultiThreadedOCPTest.test-seed#[25D56684F7208E3]) [    ] o.a.s.m.r.SolrJmxReporter JMX monitoring for 'solr.jetty' (registry 'solr.jetty') enabled at server: com.sun.jmx.mbeanserver.JmxMBeanServer@4b5a5ed1
   [junit4]   2> 242912 INFO  (TEST-MultiThreadedOCPTest.test-seed#[25D56684F7208E3]) [    ] o.a.s.c.CorePropertiesLocator Found 0 core definitions underneath /home/jenkins/jenkins-slave/workspace/Lucene-Solr-Tests-master/solr/build/solr-core/test/J0/temp/solr.cloud.MultiThreadedOCPTest_25D56684F7208E3-001/shard-2-001/cores
   [junit4]   2> 243099 INFO  (qtp1028003939-517) [n:127.0.0.1:38706_t%2Fl    ] o.a.s.h.a.CollectionsHandler Invoked Collection Action :addreplica with params node=127.0.0.1:43138_t%252Fl&action=ADDREPLICA&collection=collection1&shard=shard1&type=NRT&wt=javabin&version=2 and sendToOCPQueue=true
   [junit4]   2> 243155 INFO  (OverseerThreadFactory-244-thread-4) [ c:collection1 s:shard1  ] o.a.s.c.a.c.AddReplicaCmd Node Identified 127.0.0.1:43138_t%2Fl for creating new replica of shard shard1
   [junit4]   2> 243500 INFO  (qtp1581008909-556) [n:127.0.0.1:43138_t%2Fl    x:collection1_shard1_replica_n43] o.a.s.h.a.CoreAdminOperation core create command qt=/admin/cores&collection.configName=conf1&name=collection1_shard1_replica_n43&action=CREATE&collection=collection1&shard=shard1&wt=javabin&version=2&replicaType=NRT
   [junit4]   2> 243556 INFO  (zkCallback-146-thread-1) [    ] o.a.s.c.c.ZkStateReader A cluster state change: [WatchedEvent state:SyncConnected type:NodeDataChanged path:/collections/collection1/state.json] for collection [collection1] has occurred - updating... (live nodes size: [3])
   [junit4]   2> 244711 INFO  (qtp1581008909-556) [n:127.0.0.1:43138_t%2Fl c:collection1 s:shard1  x:collection1_shard1_replica_n43] o.a.s.c.SolrConfig Using Lucene MatchVersion: 8.0.0
   [junit4]   2> 244924 INFO  (qtp1581008909-556) [n:127.0.0.1:43138_t%2Fl c:collection1 s:shard1  x:collection1_shard1_replica_n43] o.a.s.s.IndexSchema [collection1_shard1_replica_n43] Schema name=test
   [junit4]   2> 253691 WARN  (TEST-MultiThreadedOCPTest.test-seed#[25D56684F7208E3]-SendThread(127.0.0.1:36017)) [    ] o.a.z.ClientCnxn Client session timed out, have not heard from server in 10155ms for sessionid 0x103d31d44690006
   [junit4]   2> 253691 WARN  (TEST-MultiThreadedOCPTest.test-seed#[25D56684F7208E3]-SendThread(127.0.0.1:36017)) [    ] o.a.z.ClientCnxn Client session timed out, have not heard from server in 10958ms for sessionid 0x103d31d44690010
   [junit4]   2> 253691 WARN  (TEST-MultiThreadedOCPTest.test-seed#[25D56684F7208E3]-SendThread(127.0.0.1:36017)) [    ] o.a.z.ClientCnxn Client session timed out, have not heard from server in 11111ms for sessionid 0x103d31d44690008
   [junit4]   2> 253691 WARN  (NIOServerCxn.Factory:0.0.0.0/0.0.0.0:0) [    ] o.a.z.s.NIOServerCnxn Unable to read additional data from client sessionid 0x103d31d44690006, likely client has closed socket
   [junit4]   2> 253691 WARN  (TEST-MultiThreadedOCPTest.test-seed#[25D56684F7208E3]-SendThread(127.0.0.1:36017)) [    ] o.a.z.ClientCnxn Client session timed out, have not heard from server in 11248ms for sessionid 0x103d31d4469000c
   [junit4]   2> 253778 WARN  (NIOServerCxn.Factory:0.0.0.0/0.0.0.0:0) [    ] o.a.z.s.NIOServerCnxn Unable to read additional data from client sessionid 0x103d31d44690010, likely client has closed socket
   [junit4]   2> 253779 WARN  (NIOServerCxn.Factory:0.0.0.0/0.0.0.0:0) [    ] o.a.z.s.NIOServerCnxn Unable to read additional data from client sessionid 0x103d31d44690008, likely client has closed socket
   [junit4]   2> 253798 WARN  (zkConnectionManagerCallback-128-thread-1) [    ] o.a.s.c.c.ConnectionManager Watcher org.apache.solr.common.cloud.ConnectionManager@70d85dae name: ZooKeeperConnection Watcher:127.0.0.1:36017/solr got event WatchedEvent state:Disconnected type:None path:null path: null type: None
   [junit4]   2> 253798 WARN  (zkConnectionManagerCallback-128-thread-1) [    ] o.a.s.c.c.ConnectionManager zkClient has disconnected
   [junit4]   2> 254001 WARN  (zkConnectionManagerCallback-170-thread-1) [    ] o.a.s.c.c.ConnectionManager Watcher org.apache.solr.common.cloud.ConnectionManager@1771946 name: ZooKeeperConnection Watcher:127.0.0.1:36017/solr got event WatchedEvent state:Disconnected type:None path:null path: null type: None
   [junit4]   2> 254001 WARN  (zkConnectionManagerCallback-170-thread-1) [    ] o.a.s.c.c.ConnectionManager zkClient has disconnected
   [junit4]   2> 254093 WARN  (zkConnectionManagerCallback-139-thread-1) [    ] o.a.s.c.c.ConnectionManager Watcher org.apache.solr.common.cloud.ConnectionManager@66c1f376 name: ZooKeeperConnection Watcher:127.0.0.1:36017/solr got event WatchedEvent state:Disconnected type:None path:null path: null type: None
   [junit4]   2> 254093 WARN  (zkConnectionManagerCallback-139-thread-1) [    ] o.a.s.c.c.ConnectionManager zkClient has disconnected
   [junit4]   2> 254127 WARN  (zkConnectionManagerCallback-154-thread-1) [    ] o.a.s.c.c.ConnectionManager Watcher org.apache.solr.common.cloud.ConnectionManager@4ca24d71 name: ZooKeeperConnection Watcher:127.0.0.1:36017/solr got event WatchedEvent state:Disconnected type:None path:null path: null type: None
   [junit4]   2> 254127 WARN  (zkConnectionManagerCallback-154-thread-1) [    ] o.a.s.c.c.ConnectionManager zkClient has disconnected
   [junit4]   2> 254164 WARN  (NIOServerCxn.Factory:0.0.0.0/0.0.0.0:0) [    ] o.a.z.s.NIOServerCnxnFactory Ignoring unexpected runtime exception
   [junit4]   2> java.nio.channels.CancelledKeyException: null
   [junit4]   2> 	at sun.nio.ch.SelectionKeyImpl.ensureValid(SelectionKeyImpl.java:73) ~[?:1.8.0_172]
   [junit4]   2> 	at sun.nio.ch.SelectionKeyImpl.readyOps(SelectionKeyImpl.java:87) ~[?:1.8.0_172]
   [junit4]   2> 	at org.apache.zookeeper.server.NIOServerCnxnFactory.run(NIOServerCnxnFactory.java:205) [zookeeper-3.4.11.jar:3.4.11-37e277162d567b55a07d1755f0b31c32e93c01a0]
   [junit4]   2> 	at java.lang.Thread.run(Thread.java:748) [?:1.8.0_172]
   [junit4]   2> 254468 INFO  (qtp1581008909-556) [n:127.0.0.1:43138_t%2Fl c:collection1 s:shard1  x:collection1_shard1_replica_n43] o.a.s.s.IndexSchema Loaded schema test/1.0 with uniqueid field id
   [junit4]   2> 254752 INFO  (qtp1581008909-556) [n:127.0.0.1:43138_t%2Fl c:collection1 s:shard1  x:collection1_shard1_replica_n43] o.a.s.c.CoreContainer Creating SolrCore 'collection1_shard1_replica_n43' using configuration from collection collection1, trusted=true
   [junit4]   2> 254753 INFO  (qtp1581008909-556) [n:127.0.0.1:43138_t%2Fl c:collection1 s:shard1  x:collection1_shard1_replica_n43] o.a.s.m.r.SolrJmxReporter JMX monitoring for 'solr.core.collection1.shard1.replica_n43' (registry 'solr.core.collection1.shard1.replica_n43') enabled at server: com.sun.jmx.mbeanserver.JmxMBeanServer@4b5a5ed1
   [junit4]   2> 254753 INFO  (qtp1581008909-556) [n:127.0.0.1:43138_t%2Fl c:collection1 s:shard1  x:collection1_shard1_replica_n43] o.a.s.c.SolrCore solr.RecoveryStrategy.Builder
   [junit4]   2> 254753 INFO  (qtp1581008909-556) [n:127.0.0.1:43138_t%2Fl c:collection1 s:shard1  x:collection1_shard1_replica_n43] o.a.s.c.SolrCore [[collection1_shard1_replica_n43] ] Opening new SolrCore at [/home/jenkins/jenkins-slave/workspace/Lucene-Solr-Tests-master/solr/build/solr-core/test/J0/temp/solr.cloud.MultiThreadedOCPTest_25D56684F7208E3-001/shard-2-001/cores/collection1_shard1_replica_n43], dataDir=[/home/jenkins/jenkins-slave/workspace/Lucene-Solr-Tests-master/solr/build/solr-core/test/J0/temp/solr.cloud.MultiThreadedOCPTest_25D56684F7208E3-001/shard-2-001/cores/collection1_shard1_replica_n43/data/]
   [junit4]   2> 254756 INFO  (qtp1581008909-556) [n:127.0.0.1:43138_t%2Fl c:collection1 s:shard1  x:collection1_shard1_replica_n43] o.a.s.u.RandomMergePolicy RandomMergePolicy wrapping class org.apache.lucene.index.TieredMergePolicy: [TieredMergePolicy: maxMergeAtOnce=18, maxMergeAtOnceExplicit=33, maxMergedSegmentMB=98.6318359375, floorSegmentMB=2.0283203125, forceMergeDeletesPctAllowed=25.00350975454992, segmentsPerTier=34.0, maxCFSSegmentSizeMB=8.796093022207999E12, noCFSRatio=1.0, deletesPctAllowed=49.466497666371865
   [junit4]   2> 254770 WARN  (qtp1581008909-556) [n:127.0.0.1:43138_t%2Fl c:collection1 s:shard1  x:collection1_shard1_replica_n43] o.a.s.c.RequestHandlers INVALID paramSet a in requestHandler {type = requestHandler,name = /dump,class = DumpRequestHandler,attributes = {initParams=a, name=/dump, class=DumpRequestHandler},args = {defaults={a=A,b=B}}}
   [junit4]   2> 255173 WARN  (TEST-MultiThreadedOCPTest.test-seed#[25D56684F7208E3]-SendThread(127.0.0.1:36017)) [    ] o.a.z.ClientCnxn Unable to reconnect to ZooKeeper service, session 0x103d31d44690010 has expired
   [junit4]   2> 255179 WARN  (zkConnectionManagerCallback-170-thread-1) [    ] o.a.s.c.c.ConnectionManager Watcher org.apache.solr.common.cloud.ConnectionManager@1771946 name: ZooKeeperConnection Watcher:127.0.0.1:36017/solr got event WatchedEvent state:Expired type:None path:null path: null type: None
   [junit4]   2> 255179 WARN  (zkConnectionManagerCallback-170-thread-1) [    ] o.a.s.c.c.ConnectionManager Our previous ZooKeeper session was expired. Attempting to reconnect to recover relationship with ZooKeeper...
   [junit4]   2> 255179 WARN  (zkConnectionManagerCallback-170-thread-1) [    ] o.a.s.c.c.DefaultConnectionStrategy Connection expired - starting a new one...
   [junit4]   2> 255295 INFO  (qtp1581008909-556) [n:127.0.0.1:43138_t%2Fl c:collection1 s:shard1  x:collection1_shard1_replica_n43] o.a.s.u.UpdateHandler Using UpdateLog implementation: org.apache.solr.update.UpdateLog
   [junit4]   2> 255295 INFO  (qtp1581008909-556) [n:127.0.0.1:43138_t%2Fl c:collection1 s:shard1  x:collection1_shard1_replica_n43] o.a.s.u.UpdateLog Initializing UpdateLog: dataDir= defaultSyncLevel=FLUSH numRecordsToKeep=100 maxNumLogsToKeep=10 numVersionBuckets=65536
   [junit4]   2> 255298 INFO  (zkConnectionManagerCallback-170-thread-1-EventThread) [    ] o.a.s.c.c.ConnectionManager zkClient has connected
   [junit4]   2> 255299 INFO  (zkConnectionManagerCallback-170-thread-1) [    ] o.a.s.c.c.ConnectionManager Connection with ZooKeeper reestablished.
   [junit4]   2> 255370 INFO  (qtp1581008909-556) [n:127.0.0.1:43138_t%2Fl c:collection1 s:shard1  x:collection1_shard1_replica_n43] o.a.s.u.CommitTracker Hard AutoCommit: disabled
   [junit4]   2> 255370 INFO  (qtp1581008909-556) [n:127.0.0.1:43138_t%2Fl c:collection1 s:shard1  x:collection1_shard1_replica_n43] o.a.s.u.CommitTracker Soft AutoCommit: disabled
   [junit4]   2> 255372 INFO  (qtp1581008909-556) [n:127.0.0.1:43138_t%2Fl c:collection1 s:shard1  x:collection1_shard1_replica_n43] o.a.s.u.RandomMergePolicy RandomMergePolicy wrapping class org.apache.lucene.index.LogByteSizeMergePolicy: [LogByteSizeMergePolicy: minMergeSize=1677721, mergeFactor=40, maxMergeSize=2147483648, maxMergeSizeForForcedMerge=9223372036854775807, calibrateSizeByDeletes=false, maxMergeDocs=2147483647, maxCFSSegmentSizeMB=8.796093022207999E12, noCFSRatio=0.0]
   [junit4]   2> 255406 INFO  (qtp1581008909-556) [n:127.0.0.1:43138_t%2Fl c:collection1 s:shard1  x:collection1_shard1_replica_n43] o.a.s.s.SolrIndexSearcher Opening [Searcher@4dc2c6f[collection1_shard1_replica_n43] main]
   [junit4]   2> 255410 INFO  (zkConnectionManagerCallback-170-thread-1) [    ] o.a.s.c.c.DefaultConnectionStrategy Reconnected to ZooKeeper
   [junit4]   2> 255410 INFO  (zkConnectionManagerCallback-170-thread-1) [    ] o.a.s.c.c.ConnectionManager zkClient Connected:true
   [junit4]   2> 255463 INFO  (qtp1581008909-556) [n:127.0.0.1:43138_t%2Fl c:collection1 s:shard1  x:collection1_shard1_replica_n43] o.a.s.r.ManagedResourceStorage Configured ZooKeeperStorageIO with znodeBase: /configs/conf1
   [junit4]   2> 255483 INFO  (qtp1581008909-556) [n:127.0.0.1:43138_t%2Fl c:collection1 s:shard1  x:collection1_shard1_replica_n43] o.a.s.r.ManagedResourceStorage Loaded null at path _rest_managed.json using ZooKeeperStorageIO:path=/configs/conf1
   [junit4]   2> 255484 INFO  (qtp1581008909-556) [n:127.0.0.1:43138_t%2Fl c:collection1 s:shard1  x:collection1_shard1_replica_n43] o.a.s.h.ReplicationHandler Commits will be reserved for 10000ms.
   [junit4]   2> 255484 INFO  (qtp1581008909-556) [n:127.0.0.1:43138_t%2Fl c:collection1 s:shard1  x:collection1_shard1_replica_n43] o.a.s.u.UpdateLog Could not find max version in index or recent updates, using new clock 1608609379137880064
   [junit4]   2> 255521 INFO  (searcherExecutor-277-thread-1-processing-n:127.0.0.1:43138_t%2Fl x:collection1_shard1_replica_n43 c:collection1 s:shard1) [n:127.0.0.1:43138_t%2Fl c:collection1 s:shard1  x:collection1_shard1_replica_n43] o.a.s.c.SolrCore [collection1_shard1_replica_n43] Registered new searcher Searcher@4dc2c6f[collection1_shard1_replica_n43] main{ExitableDirectoryReader(UninvertingDirectoryReader())}
   [junit4]   2> 255604 INFO  (qtp1581008909-556) [n:127.0.0.1:43138_t%2Fl c:collection1 s:shard1  x:collection1_shard1_replica_n43] o.a.s.c.ZkShardTerms Successful update of terms at /collections/collection1/terms/shard1 to Terms{values={core_node44=0}, version=0}
   [junit4]   2> 255643 INFO  (qtp1581008909-556) [n:127.0.0.1:43138_t%2Fl c:collection1 s:shard1  x:collection1_shard1_replica_n43] o.a.s.c.ShardLeaderElectionContext Enough replicas found to continue.
   [junit4]   2> 255643 INFO  (qtp1581008909-556) [n:127.0.0.1:43138_t%2Fl c:collection1 s:shard1  x:collection1_shard1_replica_n43] o.a.s.c.ShardLeaderElectionContext I may be the new leader - try and sync
   [junit4]   2> 255643 INFO  (qtp1581008909-556) [n:127.0.0.1:43138_t%2Fl c:collection1 s:shard1  x:collection1_shard1_replica_n43] o.a.s.c.SyncStrategy Sync replicas to https://127.0.0.1:43138/t/l/collection1_shard1_replica_n43/
   [junit4]   2> 255643 INFO  (qtp1581008909-556) [n:127.0.0.1:43138_t%2Fl c:collection1 s:shard1  x:collection1_shard1_replica_n43] o.a.s.c.SyncStrategy Sync Success - now sync replicas to me
   [junit4]   2> 255644 INFO  (qtp1581008909-556) [n:127.0.0.1:43138_t%2Fl c:collection1 s:shard1  x:collection1_shard1_replica_n43] o.a.s.c.SyncStrategy https://127.0.0.1:43138/t/l/collection1_shard1_replica_n43/ has no replicas
   [junit4]   2> 255644 INFO  (qtp1581008909-556) [n:127.0.0.1:43138_t%2Fl c:collection1 s:shard1  x:collection1_shard1_replica_n43] o.a.s.c.ShardLeaderElectionContext Found all replicas participating in election, clear LIR
   [junit4]   2> 255664 INFO  (qtp1581008909-556) [n:127.0.0.1:43138_t%2Fl c:collection1 s:shard1  x:collection1_shard1_replica_n43] o.a.s.c.ShardLeaderElectionContext I am the new leader: https://127.0.0.1:43138/t/l/collection1_shard1_replica_n43/ shard1
   [junit4]   2> 255681 INFO  (zkCallback-146-thread-1) [    ] o.a.s.c.c.ZkStateReader A cluster state change: [WatchedEvent state:SyncConnected type:NodeDataChanged path:/collections/collection1/state.json] for collection [collection1] has occurred - updating... (live nodes size: [3])
   [junit4]   2> 255691 WARN  (TEST-MultiThreadedOCPTest.test-seed#[25D56684F7208E3]-SendThread(127.0.0.1:36017)) [    ] o.a.z.ClientCnxn Unable to reconnect to ZooKeeper service, session 0x103d31d44690006 has expired
   [junit4]   2> 255693 WARN  (zkConnectionManagerCallback-128-thread-1) [    ] o.a.s.c.c.ConnectionManager Watcher org.apache.solr.common.cloud.ConnectionManager@70d85dae name: ZooKeeperConnection Watcher:127.0.0.1:36017/solr got event WatchedEvent state:Expired type:None path:null path: null type: None
   [junit4]   2> 255693 WARN  (zkConnectionManagerCallback-128-thread-1) [    ] o.a.s.c.c.ConnectionManager Our previous ZooKeeper session was expired. Attempting to reconnect to recover relationship with ZooKeeper...
   [junit4]   2> 255693 WARN  (zkConnectionManagerCallback-128-thread-1) [    ] o.a.s.c.c.DefaultConnectionStrategy Connection expired - starting a new one...
   [junit4]   2> 255900 WARN  (TEST-MultiThreadedOCPTest.test-seed#[25D56684F7208E3]-SendThread(127.0.0.1:36017)) [    ] o.a.z.ClientCnxn Unable to reconnect to ZooKeeper service, session 0x103d31d44690008 has expired
   [junit4]   2> 255901 WARN  (zkConnectionManagerCallback-139-thread-1) [    ] o.a.s.c.c.ConnectionManager Watcher org.apache.solr.common.cloud.ConnectionManager@66c1f376 name: ZooKeeperConnection Watcher:127.0.0.1:36017/solr got event WatchedEvent state:Expired type:None path:null path: null type: None
   [junit4]   2> 255902 WARN  (zkConnectionManagerCallback-139-thread-1) [    ] o.a.s.c.c.ConnectionManager Our previous ZooKeeper session was expired. Attempting to reconnect to recover relationship with ZooKeeper...
   [junit4]   2> 255902 WARN  (zkConnectionManagerCallback-139-thread-1) [    ] o.a.s.c.c.DefaultConnectionStrategy Connection expired - starting a new one...
   [junit4]   2> 255972 INFO  (qtp1581008909-556) [n:127.0.0.1:43138_t%2Fl c:collection1 s:shard1  x:collection1_shard1_replica_n43] o.a.s.c.ZkController I am the leader, no recovery necessary
   [junit4]   2> 255975 INFO  (zkConnectionManagerCallback-128-thread-1-EventThread) [    ] o.a.s.c.c.ConnectionManager zkClient has connected
   [junit4]   2> 255975 INFO  (zkConnectionManagerCallback-128-thread-1) [    ] o.a.s.c.c.ConnectionManager Connection with ZooKeeper reestablished.
   [junit4]   2> 256035 INFO  (zkConnectionManagerCallback-128-thread-1) [    ] o.a.s.c.c.DefaultConnectionStrategy Reconnected to ZooKeeper
   [junit4]   2> 256035 INFO  (zkConnectionManagerCallback-128-thread-1) [    ] o.a.s.c.c.ConnectionManager zkClient Connected:true
   [junit4]   2> 256036 INFO  (zkConnectionManagerCallback-139-thread-1-EventThread) [    ] o.a.s.c.c.ConnectionManager zkClient has connected
   [junit4]   2> 256048 INFO  (zkConnectionManagerCallback-139-thread-1) [    ] o.a.s.c.c.ConnectionManager Connection with ZooKeeper reestablished.
   [junit4]   2> 256070 INFO  (qtp1581008909-556) [n:127.0.0.1:43138_t%2Fl c:collection1 s:shard1  x:collection1_shard1_replica_n43] o.a.s.s.HttpSolrCall [admin] webapp=null path=/admin/cores params={qt=/admin/cores&collection.configName=conf1&name=collection1_shard1_replica_n43&action=CREATE&collection=collection1&shard=shard1&wt=javabin&version=2&replicaType=NRT} status=0 QTime=12570
   [junit4]   2> 256085 WARN  (TEST-MultiThreadedOCPTest.test-seed#[25D56684F7208E3]-SendThread(127.0.0.1:36017)) [    ] o.a.z.ClientCnxn Unable to reconnect to ZooKeeper service, session 0x103d31d4469000c has expired
   [junit4]   2> 256088 INFO  (zkConnectionManagerCallback-139-thread-1) [    ] o.a.s.c.c.DefaultConnectionStrategy Reconnected to ZooKeeper
   [junit4]   2> 256088 INFO  (zkConnectionManagerCallback-139-thread-1) [    ] o.a.s.c.c.ConnectionManager zkClient Connected:true
   [junit4]   2> 256125 WARN  (zkConnectionManagerCallback-154-thread-1) [    ] o.a.s.c.c.ConnectionManager Watcher org.apache.solr.common.cloud.ConnectionManager@4ca24d71 name: ZooKeeperConnection Watcher:127.0.0.1:36017/solr got event WatchedEvent state:Expired type:None path:null path: null type: None
   [junit4]   2> 256125 WARN  (zkConnectionManagerCallback-154-thread-1) [    ] o.a.s.c.c.ConnectionManager Our previous ZooKeeper session was expired. Attempting to reconnect to recover relationship with ZooKeeper...
   [junit4]   2> 256125 WARN  (zkConnectionManagerCallback-154-thread-1) [    ] o.a.s.c.c.DefaultConnectionStrategy Connection expired - starting a new one...
   [junit4]   2> 256158 INFO  (zkCallback-146-thread-1) [    ] o.a.s.c.c.ZkStateReader A cluster state change: [WatchedEvent state:SyncConnected type:NodeDataChanged path:/collections/collection1/state.json] for collection [collection1] has occurred - updating... (live nodes size: [3])
   [junit4]   2> 256159 INFO  (qtp1028003939-517) [n:127.0.0.1:38706_t%2Fl c:collection1   ] o.a.s.s.HttpSolrCall [admin] webapp=null path=/admin/collections params={node=127.0.0.1:43138_t%252Fl&action=ADDREPLICA&collection=collection1&shard=shard1&type=NRT&wt=javabin&version=2} status=0 QTime=13059
   [junit4]   2> 256166 INFO  (OverseerCollectionConfigSetProcessor-73134141623304197-127.0.0.1:40061_t%2Fl-n_0000000000) [    ] o.a.s.c.OverseerTaskQueue Response ZK path: /overseer/collection-queue-work/qnr-0000000006 doesn't exist.  Requestor may have disconnected from ZooKeeper
   [junit4]   2> 256170 INFO  (zkCallback-162-thread-1) [    ] o.a.s.c.c.ZkStateReader A cluster state change: [WatchedEvent state:SyncConnected type:NodeDataChanged path:/collections/collection1/state.json] for collection [collection1] has occurred - updating... (live nodes size: [3])
   [junit4]   2> 256272 INFO  (zkConnectionManagerCallback-154-thread-1-EventThread) [    ] o.a.s.c.c.ConnectionManager zkClient has connected
   [junit4]   2> 256272 INFO  (zkConnectionManagerCallback-154-thread-1) [    ] o.a.s.c.c.ConnectionManager Connection with ZooKeeper reestablished.
   [junit4]   2> 256471 INFO  (zkConnectionManagerCallback-154-thread-1) [    ] o.a.s.c.c.DefaultConnectionStrategy Reconnected to ZooKeeper
   [junit4]   2> 256471 INFO  (zkConnectionManagerCallback-154-thread-1) [    ] o.a.s.c.c.ConnectionManager zkClient Connected:true
   [junit4]   2> 256837 INFO  (TEST-MultiThreadedOCPTest.test-seed#[25D56684F7208E3]) [    ] o.a.s.c.AbstractFullDistribZkTestBase create jetty 3 in directory /home/jenkins/jenkins-slave/workspace/Lucene-Solr-Tests-master/solr/build/solr-core/test/J0/temp/solr.cloud.MultiThreadedOCPTest_25D56684F7208E3-001/shard-3-001 of type NRT
   [junit4]   2> 256859 INFO  (TEST-MultiThreadedOCPTest.test-seed#[25D56684F7208E3]) [    ] o.e.j.s.Server jetty-9.4.11.v20180605; built: 2018-06-05T18:24:03.829Z; git: d5fc0523cfa96bfebfbda19606cad384d772f04c; jvm 1.8.0_172-b11
   [junit4]   2> 256886 INFO  (TEST-MultiThreadedOCPTest.test-seed#[25D56684F7208E3]) [    ] o.e.j.s.session DefaultSessionIdManager workerName=node0
   [junit4]   2> 256886 INFO  (TEST-MultiThreadedOCPTest.test-seed#[25D56684F7208E3]) [    ] o.e.j.s.session No SessionScavenger set, using defaults
   [junit4]   2> 256886 INFO  (TEST-MultiThreadedOCPTest.test-seed#[25D56684F7208E3]) [    ] o.e.j.s.session node0 Scavenging every 660000ms
   [junit4]   2> 256886 INFO  (TEST-MultiThreadedOCPTest.test-seed#[25D56684F7208E3]) [    ] o.e.j.s.h.ContextHandler Started o.e.j.s.ServletContextHandler@397bd590{/t/l,null,AVAILABLE}
   [junit4]   2> 256887 INFO  (TEST-MultiThreadedOCPTest.test-seed#[25D56684F7208E3]) [    ] o.e.j.s.AbstractConnector Started ServerConnector@d09775a{SSL,[ssl, http/1.1]}{127.0.0.1:35171}
   [junit4]   2> 256887 INFO  (TEST-MultiThreadedOCPTest.test-seed#[25D56684F7208E3]) [    ] o.e.j.s.Server Started @257096ms
   [junit4]   2> 256887 INFO  (TEST-MultiThreadedOCPTest.test-seed#[25D56684F7208E3]) [    ] o.a.s.c.s.e.JettySolrRunner Jetty properties: {solr.data.dir=/home/jenkins/jenkins-slave/workspace/Lucene-Solr-Tests-master/solr/build/solr-core/test/J0/temp/solr.cloud.MultiThreadedOCPTest_25D56684F7208E3-001/tempDir-001/jetty3, solrconfig=solrconfig.xml, hostContext=/t/l, hostPort=35171, coreRootDirectory=/home/jenkins/jenkins-slave/workspace/Lucene-Solr-Tests-master/solr/build/solr-core/test/J0/../../../../../../../../../../home/jenkins/jenkins-slave/workspace/Lucene-Solr-Tests-master/solr/build/solr-core/test/J0/temp/solr.cloud.MultiThreadedOCPTest_25D56684F7208E3-001/shard-3-001/cores}
   [junit4]   2> 256888 ERROR (TEST-MultiThreadedOCPTest.test-seed#[25D56684F7208E3]) [    ] o.a.s.u.StartupLoggingUtils Missing Java Option solr.log.dir. Logging may be missing or incomplete.
   [junit4]   2> 256888 INFO  (TEST-MultiThreadedOCPTest.test-seed#[25D56684F7208E3]) [    ] o.a.s.s.SolrDispatchFilter Using logger factory org.apache.logging.slf4j.Log4jLoggerFactory
   [junit4]   2> 256888 INFO  (TEST-MultiThreadedOCPTest.test-seed#[25D56684F7208E3]) [    ] o.a.s.s.SolrDispatchFilter  ___      _       Welcome to Apache Solr? version 8.0.0
   [junit4]   2> 256888 INFO  (TEST-MultiThreadedOCPTest.test-seed#[25D56684F7208E3]) [    ] o.a.s.s.SolrDispatchFilter / __| ___| |_ _   Starting in cloud mode on port null
   [junit4]   2> 256888 INFO  (TEST-MultiThreadedOCPTest.test-seed#[25D56684F7208E3]) [    ] o.a.s.s.SolrDispatchFilter \__ \/ _ \ | '_|  Install dir: null
   [junit4]   2> 256888 INFO  (TEST-MultiThreadedOCPTest.test-seed#[25D56684F7208E3]) [    ] o.a.s.s.SolrDispatchFilter |___/\___/_|_|    Start time: 2018-08-12T15:57:31.418Z
   [junit4]   2> 256969 INFO  (zkConnectionManagerCallback-173-thread-1) [    ] o.a.s.c.c.ConnectionManager zkClient has connected
   [junit4]   2> 256987 INFO  (TEST-MultiThreadedOCPTest.test-seed#[25D56684F7208E3]) [    ] o.a.s.s.SolrDispatchFilter Loading solr.xml from SolrHome (not found in ZooKeeper)
   [junit4]   2> 256987 INFO  (TEST-MultiThreadedOCPTest.test-seed#[25D56684F7208E3]) [    ] o.a.s.c.SolrXmlConfig Loading container configuration from /home/jenkins/jenkins-slave/workspace/Lucene-Solr-Tests-master/solr/build/solr-core/test/J0/temp/solr.cloud.MultiThreadedOCPTest_25D56684F7208E3-001/shard-3-001/solr.xml
   [junit4]   2> 257002 INFO  (TEST-MultiThreadedOCPTest.test-seed#[25D56684F7208E3]) [    ] o.a.s.c.SolrXmlConfig Configuration parameter autoReplicaFailoverWorkLoopDelay is ignored
   [junit4]   2> 257002 INFO  (TEST-MultiThreadedOCPTest.test-seed#[25D56684F7208E3]) [    ] o.a.s.c.SolrXmlConfig Configuration parameter autoReplicaFailoverBadNodeExpiration is ignored
   [junit4]   2> 257019 INFO  (TEST-MultiThreadedOCPTest.test-seed#[25D56684F7208E3]) [    ] o.a.s.c.SolrXmlConfig MBean server found: com.sun.jmx.mbeanserver.JmxMBeanServer@4b5a5ed1, but no JMX reporters were configured - adding default JMX reporter.
   [junit4]   2> 257545 INFO  (TEST-MultiThreadedOCPTest.test-seed#[25D56684F7208E3]) [    ] o.a.s.c.ZkContainer Zookeeper client=127.0.0.1:36017/solr
   [junit4]   2> 257578 INFO  (zkConnectionManagerCallback-177-thread-1) [    ] o.a.s.c.c.ConnectionManager zkClient has connected
   [junit4]   2> 257614 INFO  (zkConnectionManagerCallback-179-thread-1) [    ] o.a.s.c.c.ConnectionManager zkClient has connected
   [junit4]   2> 257651 INFO  (TEST-MultiThreadedOCPTest.test-seed#[25D56684F7208E3]) [    ] o.a.s.c.c.ZkStateReader Updated live nodes from ZooKeeper... (0) -> (3)
   [junit4]   2> 257687 INFO  (TEST-MultiThreadedOCPTest.test-seed#[25D56684F7208E3]) [    ] o.a.s.c.TransientSolrCoreCacheDefault Allocating transient cache for 4 transient cores
   [junit4]   2> 257687 INFO  (TEST-MultiThreadedOCPTest.test-seed#[25D56684F7208E3]) [    ] o.a.s.c.ZkController Register node as live in ZooKeeper:/live_nodes/127.0.0.1:35171_t%2Fl
   [junit4]   2> 257719 INFO  (zkCallback-169-thread-3) [    ] o.a.s.c.c.ZkStateReader Updated live nodes from ZooKeeper... (3) -> (4)
   [junit4]   2> 257719 INFO  (zkCallback-138-thread-1) [    ] o.a.s.c.c.ZkStateReader Updated live nodes from ZooKeeper... (3) -> (4)
   [junit4]   2> 257719 INFO  (zkCallback-120-thread-2) [    ] o.a.s.c.c.ZkStateReader Updated live nodes from ZooKeeper... (3) -> (4)
   [junit4]   2> 257722 INFO  (zkCallback-146-thread-1) [    ] o.a.s.c.c.ZkStateReader Updated live nodes from ZooKeeper... (3) -> (4)
   [junit4]   2> 257734 INFO  (zkCallback-153-thread-4) [    ] o.a.s.c.c.ZkStateReader Updated live nodes from ZooKeeper... (3) -> (4)
   [junit4]   2> 257735 INFO  (zkCallback-127-thread-5) [    ] o.a.s.c.c.ZkStateReader Updated live nodes from ZooKeeper... (3) -> (4)
   [junit4]   2> 257763 INFO  (zkCallback-162-thread-1) [    ] o.a.s.c.c.ZkStateReader Updated live nodes from ZooKeeper... (3) -> (4)
   [junit4]   2> 257763 INFO  (zkCallback-178-thread-1) [    ] o.a.s.c.c.ZkStateReader Updated live nodes from ZooKeeper... (3) -> (4)
   [junit4]   2> 257833 INFO  (zkConnectionManagerCallback-186-thread-1) [    ] o.a.s.c.c.ConnectionManager zkClient has connected
   [junit4]   2> 257835 INFO  (TEST-MultiThreadedOCPTest.test-seed#[25D56684F7208E3]) [    ] o.a.s.c.c.ZkStateReader Updated live nodes from ZooKeeper... (0) -> (4)
   [junit4]   2> 257848 INFO  (TEST-MultiThreadedOCPTest.test-seed#[25D56684F7208E3]) [    ] o.a.s.c.s.i.ZkClientClusterStateProvider Cluster at 127.0.0.1:36017/solr ready
   [junit4]   2> 257869 INFO  (TEST-MultiThreadedOCPTest.test-seed#[25D56684F7208E3]) [    ] o.a.s.h.a.MetricsHistoryHandler No .system collection, keeping metrics history in memory.
   [junit4]   2> 257956 INFO  (TEST-MultiThreadedOCPTest.test-seed#[25D56684F7208E3]) [    ] o.a.s.m.r.SolrJmxReporter JMX monitoring for 'solr.node' (registry 'solr.node') enabled at server: com.sun.jmx.mbeanserver.JmxMBeanServer@4b5a5ed1
   [junit4]   2> 258028 INFO  (TEST-MultiThreadedOCPTest.test-seed#[25D56684F7208E3]) [    ] o.a.s.m.r.SolrJmxReporter JMX monitoring for 'solr.jvm' (registry 'solr.jvm') enabled at server: com.sun.jmx.mbeanserver.JmxMBeanServer@4b5a5ed1
   [junit4]   2> 258029 INFO  (TEST-MultiThreadedOCPTest.test-seed#[25D56684F7208E3]) [    ] o.a.s.m.r.SolrJmxReporter JMX monitoring for 'solr.jetty' (registry 'solr.jetty') enabled at server: com.sun.jmx.mbeanserver.JmxMBeanServer@4b5a5ed1
   [junit4]   2> 258030 INFO  (TEST-MultiThreadedOCPTest.test-seed#[25D56684F7208E3]) [    ] o.a.s.c.CorePropertiesLocator Found 0 core definitions underneath /home/jenkins/jenkins-slave/workspace/Lucene-Solr-Tests-master/solr/build/solr-core/test/J0/../../../../../../../../../../home/jenkins/jenkins-slave/workspace/Lucene-Solr-Tests-master/solr/build/solr-core/test/J0/temp/solr.cloud.MultiThreadedOCPTest_25D56684F7208E3-001/shard-3-001/cores
   [junit4]   2> 258404 INFO  (qtp1382544328-615) [n:127.0.0.1:35171_t%2Fl    ] o.a.s.h.a.CollectionsHandler Invoked Collection Action :addreplica with params node=127.0.0.1:35171_t%252Fl&action=ADDREPLICA&collection=collection1&shard=shard2&type=NRT&wt=javabin&version=2 and sendToOCPQueue=true
   [junit4]   2> 258416 INFO  (OverseerThreadFactory-244-thread-5) [ c:collection1 s:shard2  ] o.a.s.c.a.c.AddReplicaCmd Node Identified 127.0.0.1:35171_t%2Fl for creating new replica of shard shard2
   [junit4]   2> 258564 INFO  (qtp1382544328-616) [n:127.0.0.1:35171_t%2Fl    x:collection1_shard2_replica_n45] o.a.s.h.a.CoreAdminOperation core create command qt=/admin/cores&collection.configName=conf1&name=collection1_shard2_replica_n45&action=CREATE&collection=collection1&shard=shard2&wt=javabin&version=2&replicaType=NRT
   [junit4]   2> 258623 INFO  (zkCallback-162-thread-1) [    ] o.a.s.c.c.ZkStateReader A cluster state change: [WatchedEvent state:SyncConnected type:NodeDataChanged path:/collections/collection1/state.json] for collection [collection1] has occurred - updating... (live nodes size: [4])
   [junit4]   2> 258652 INFO  (zkCallback-146-thread-1) [    ] o.a.s.c.c.ZkStateReader A cluster state change: [WatchedEvent state:SyncConnected type:NodeDataChanged path:/collections/collection1/state.json] for collection [collection1] has occurred - updating... (live nodes size: [4])
   [junit4]   2> 258806 INFO  (qtp1382544328-616) [n:127.0.0.1:35171_t%2Fl c:collection1 s:shard2  x:collection1_shard2_replica_n45] o.a.s.c.SolrConfig Using Lucene MatchVersion: 8.0.0
   [junit4]   2> 258860 INFO  (qtp1382544328-616) [n:127.0.0.1:35171_t%2Fl c:collection1 s:shard2  x:collection1_shard2_replica_n45] o.a.s.s.IndexSchema [collection1_shard2_replica_n45] Schema name=test
   [junit4]   2> 259298 INFO  (qtp1382544328-616) [n:127.0.0.1:35171_t%2Fl c:collection1 s:shard2  x:collection1_shard2_replica_n45] o.a.s.s.IndexSchema Loaded schema test/1.0 with uniqueid field id
   [junit4]   2> 259383 INFO  (qtp1382544328-616) [n:127.0.0.1:35171_t%2Fl c:collection1 s:shard2  x:collection1_shard2_replica_n45] o.a.s.c.CoreContainer Creating SolrCore 'collection1_shard2_replica_n45' using configuration from collection collection1, trusted=true
   [junit4]   2> 259418 INFO  (qtp1382544328-616) [n:127.0.0.1:35171_t%2Fl c:collection1 s:shard2  x:collection1_shard2_replica_n45] o.a.s.m.r.SolrJmxReporter JMX monitoring for 'solr.core.collection1.shard2.replica_n45' (registry 'solr.core.collection1.shard2.replica_n45') enabled at server: com.sun.jmx.mbeanserver.JmxMBeanServer@4b5a5ed1
   [junit4]   2> 259418 INFO  (qtp1382544328-616) [n:127.0.0.1:35171_t%2Fl c:collection1 s:shard2  x:collection1_shard2_replica_n45] o.a.s.c.SolrCore solr.RecoveryStrategy.Builder
   [junit4]   2> 259419 INFO  (qtp1382544328-616) [n:127.0.0.1:35171_t%2Fl c:collection1 s:shard2  x:collection1_shard2_replica_n45] o.a.s.c.SolrCore [[collection1_shard2_replica_n45] ] Opening new SolrCore at [/home/jenkins/jenkins-slave/workspace/Lucene-Solr-Tests-master/solr/build/solr-core/test/J0/temp/solr.cloud.MultiThreadedOCPTest_25D56684F7208E3-001/shard-3-001/cores/collection1_shard2_replica_n45], dataDir=[/home/jenkins/jenkins-slave/workspace/Lucene-Solr-Tests-master/solr/build/solr-core/test/J0/../../../../../../../../../../home/jenkins/jenkins-slave/workspace/Lucene-Solr-Tests-master/solr/build/solr-core/test/J0/temp/solr.cloud.MultiThreadedOCPTest_25D56684F7208E3-001/shard-3-001/cores/collection1_shard2_replica_n45/data/]
   [junit4]   2> 259434 INFO  (qtp1382544328-616) [n:127.0.0.1:35171_t%2Fl c:collection1 s:shard2  x:collection1_shard2_replica_n45] o.a.s.u.RandomMergePolicy RandomMergePolicy wrapping class org.apache.lucene.index.TieredMergePolicy: [TieredMergePolicy: maxMergeAtOnce=18, maxMergeAtOnceExplicit=33, maxMergedSegmentMB=98.6318359375, floorSegmentMB=2.0283203125, forceMergeDeletesPctAllowed=25.00350975454992, segmentsPerTier=34.0, maxCFSSegmentSizeMB=8.796093022207999E12, noCFSRatio=1.0, deletesPctAllowed=49.466497666371865
   [junit4]   2> 259436 WARN  (qtp1382544328-616) [n:127.0.0.1:35171_t%2Fl c:collection1 s:shard2  x:collection1_shard2_replica_n45] o.a.s.c.RequestHandlers INVALID paramSet a in requestHandler {type = requestHandler,name = /dump,class = DumpRequestHandler,attributes = {initParams=a, name=/dump, class=DumpRequestHandler},args = {defaults={a=A,b=B}}}
   [junit4]   2> 259794 INFO  (qtp1382544328-616) [n:127.0.0.1:35171_t%2Fl c:coll

[...truncated too long message...]



-ivy-fail-disallowed-ivy-version:

ivy-fail:

ivy-fail:

ivy-configure:
[ivy:configure] :: loading settings :: file = /home/jenkins/jenkins-slave/workspace/Lucene-Solr-Tests-master/lucene/top-level-ivy-settings.xml

resolve:

ivy-availability-check:
[loadresource] Do not set property disallowed.ivy.jars.list as its length is 0.

-ivy-fail-disallowed-ivy-version:

ivy-fail:

ivy-configure:
[ivy:configure] :: loading settings :: file = /home/jenkins/jenkins-slave/workspace/Lucene-Solr-Tests-master/lucene/top-level-ivy-settings.xml

resolve:

ivy-availability-check:
[loadresource] Do not set property disallowed.ivy.jars.list as its length is 0.

-ivy-fail-disallowed-ivy-version:

ivy-fail:

ivy-fail:

ivy-configure:
[ivy:configure] :: loading settings :: file = /home/jenkins/jenkins-slave/workspace/Lucene-Solr-Tests-master/lucene/top-level-ivy-settings.xml

resolve:

ivy-availability-check:
[loadresource] Do not set property disallowed.ivy.jars.list as its length is 0.

-ivy-fail-disallowed-ivy-version:

ivy-fail:

ivy-configure:
[ivy:configure] :: loading settings :: file = /home/jenkins/jenkins-slave/workspace/Lucene-Solr-Tests-master/lucene/top-level-ivy-settings.xml

resolve:

ivy-availability-check:
[loadresource] Do not set property disallowed.ivy.jars.list as its length is 0.

-ivy-fail-disallowed-ivy-version:

ivy-fail:

ivy-fail:

ivy-configure:
[ivy:configure] :: loading settings :: file = /home/jenkins/jenkins-slave/workspace/Lucene-Solr-Tests-master/lucene/top-level-ivy-settings.xml

resolve:

ivy-availability-check:
[loadresource] Do not set property disallowed.ivy.jars.list as its length is 0.

-ivy-fail-disallowed-ivy-version:

ivy-fail:

ivy-fail:

ivy-configure:
[ivy:configure] :: loading settings :: file = /home/jenkins/jenkins-slave/workspace/Lucene-Solr-Tests-master/lucene/top-level-ivy-settings.xml

resolve:

ivy-availability-check:
[loadresource] Do not set property disallowed.ivy.jars.list as its length is 0.

-ivy-fail-disallowed-ivy-version:

ivy-fail:

ivy-fail:

ivy-configure:
[ivy:configure] :: loading settings :: file = /home/jenkins/jenkins-slave/workspace/Lucene-Solr-Tests-master/lucene/top-level-ivy-settings.xml

resolve:

ivy-availability-check:
[loadresource] Do not set property disallowed.ivy.jars.list as its length is 0.

-ivy-fail-disallowed-ivy-version:

ivy-fail:

ivy-fail:

ivy-configure:
[ivy:configure] :: loading settings :: file = /home/jenkins/jenkins-slave/workspace/Lucene-Solr-Tests-master/lucene/top-level-ivy-settings.xml

resolve:

ivy-availability-check:
[loadresource] Do not set property disallowed.ivy.jars.list as its length is 0.

-ivy-fail-disallowed-ivy-version:

ivy-fail:

ivy-fail:

ivy-configure:
[ivy:configure] :: loading settings :: file = /home/jenkins/jenkins-slave/workspace/Lucene-Solr-Tests-master/lucene/top-level-ivy-settings.xml

resolve:

ivy-availability-check:
[loadresource] Do not set property disallowed.ivy.jars.list as its length is 0.

-ivy-fail-disallowed-ivy-version:

ivy-fail:

ivy-fail:

ivy-configure:
[ivy:configure] :: loading settings :: file = /home/jenkins/jenkins-slave/workspace/Lucene-Solr-Tests-master/lucene/top-level-ivy-settings.xml

resolve:

ivy-availability-check:
[loadresource] Do not set property disallowed.ivy.jars.list as its length is 0.

-ivy-fail-disallowed-ivy-version:

ivy-fail:

ivy-fail:

ivy-configure:
[ivy:configure] :: loading settings :: file = /home/jenkins/jenkins-slave/workspace/Lucene-Solr-Tests-master/lucene/top-level-ivy-settings.xml

resolve:

ivy-availability-check:
[loadresource] Do not set property disallowed.ivy.jars.list as its length is 0.

-ivy-fail-disallowed-ivy-version:

ivy-fail:

ivy-fail:

ivy-configure:
[ivy:configure] :: loading settings :: file = /home/jenkins/jenkins-slave/workspace/Lucene-Solr-Tests-master/lucene/top-level-ivy-settings.xml

resolve:

ivy-availability-check:
[loadresource] Do not set property disallowed.ivy.jars.list as its length is 0.

-ivy-fail-disallowed-ivy-version:

ivy-fail:

ivy-fail:

ivy-configure:
[ivy:configure] :: loading settings :: file = /home/jenkins/jenkins-slave/workspace/Lucene-Solr-Tests-master/lucene/top-level-ivy-settings.xml

resolve:

ivy-availability-check:
[loadresource] Do not set property disallowed.ivy.jars.list as its length is 0.

-ivy-fail-disallowed-ivy-version:

ivy-fail:

ivy-fail:

ivy-configure:
[ivy:configure] :: loading settings :: file = /home/jenkins/jenkins-slave/workspace/Lucene-Solr-Tests-master/lucene/top-level-ivy-settings.xml

resolve:

jar-checksums:
    [mkdir] Created dir: /home/jenkins/jenkins-slave/workspace/Lucene-Solr-Tests-master/solr/null291214083
     [copy] Copying 238 files to /home/jenkins/jenkins-slave/workspace/Lucene-Solr-Tests-master/solr/null291214083
   [delete] Deleting directory /home/jenkins/jenkins-slave/workspace/Lucene-Solr-Tests-master/solr/null291214083

check-working-copy:
[ivy:cachepath] :: resolving dependencies :: org.eclipse.jgit#org.eclipse.jgit-caller;working
[ivy:cachepath] 	confs: [default]
[ivy:cachepath] 	found org.eclipse.jgit#org.eclipse.jgit;4.6.0.201612231935-r in public
[ivy:cachepath] 	found com.jcraft#jsch;0.1.53 in public
[ivy:cachepath] 	found com.googlecode.javaewah#JavaEWAH;1.1.6 in public
[ivy:cachepath] 	found org.apache.httpcomponents#httpclient;4.3.6 in public
[ivy:cachepath] 	found org.apache.httpcomponents#httpcore;4.3.3 in public
[ivy:cachepath] 	found commons-logging#commons-logging;1.1.3 in public
[ivy:cachepath] 	found commons-codec#commons-codec;1.6 in public
[ivy:cachepath] 	found org.slf4j#slf4j-api;1.7.2 in public
[ivy:cachepath] :: resolution report :: resolve 28ms :: artifacts dl 2ms
	---------------------------------------------------------------------
	|                  |            modules            ||   artifacts   |
	|       conf       | number| search|dwnlded|evicted|| number|dwnlded|
	---------------------------------------------------------------------
	|      default     |   8   |   0   |   0   |   0   ||   8   |   0   |
	---------------------------------------------------------------------
[wc-checker] Initializing working copy...
[wc-checker] SLF4J: Failed to load class "org.slf4j.impl.StaticLoggerBinder".
[wc-checker] SLF4J: Defaulting to no-operation (NOP) logger implementation
[wc-checker] SLF4J: See http://www.slf4j.org/codes.html#StaticLoggerBinder for further details.
[wc-checker] Checking working copy status...

-jenkins-base:

BUILD SUCCESSFUL
Total time: 208 minutes 15 seconds
Archiving artifacts
java.lang.InterruptedException: no matches found within 10000
	at hudson.FilePath$34.hasMatch(FilePath.java:2678)
	at hudson.FilePath$34.invoke(FilePath.java:2557)
	at hudson.FilePath$34.invoke(FilePath.java:2547)
	at hudson.FilePath$FileCallableWrapper.call(FilePath.java:2918)
Also:   hudson.remoting.Channel$CallSiteStackTrace: Remote call to lucene2
		at hudson.remoting.Channel.attachCallSiteStackTrace(Channel.java:1741)
		at hudson.remoting.UserRequest$ExceptionResponse.retrieve(UserRequest.java:357)
		at hudson.remoting.Channel.call(Channel.java:955)
		at hudson.FilePath.act(FilePath.java:1036)
		at hudson.FilePath.act(FilePath.java:1025)
		at hudson.FilePath.validateAntFileMask(FilePath.java:2547)
		at hudson.tasks.ArtifactArchiver.perform(ArtifactArchiver.java:243)
		at hudson.tasks.BuildStepCompatibilityLayer.perform(BuildStepCompatibilityLayer.java:81)
		at hudson.tasks.BuildStepMonitor$1.perform(BuildStepMonitor.java:20)
		at hudson.model.AbstractBuild$AbstractBuildExecution.perform(AbstractBuild.java:744)
		at hudson.model.AbstractBuild$AbstractBuildExecution.performAllBuildSteps(AbstractBuild.java:690)
		at hudson.model.Build$BuildExecution.post2(Build.java:186)
		at hudson.model.AbstractBuild$AbstractBuildExecution.post(AbstractBuild.java:635)
		at hudson.model.Run.execute(Run.java:1819)
		at hudson.model.FreeStyleBuild.run(FreeStyleBuild.java:43)
		at hudson.model.ResourceController.execute(ResourceController.java:97)
		at hudson.model.Executor.run(Executor.java:429)
Caused: hudson.FilePath$TunneledInterruptedException
	at hudson.FilePath$FileCallableWrapper.call(FilePath.java:2920)
	at hudson.remoting.UserRequest.perform(UserRequest.java:212)
	at hudson.remoting.UserRequest.perform(UserRequest.java:54)
	at hudson.remoting.Request$2.run(Request.java:369)
	at hudson.remoting.InterceptingExecutorService$1.call(InterceptingExecutorService.java:72)
	at java.util.concurrent.FutureTask.run(FutureTask.java:266)
	at java.util.concurrent.ThreadPoolExecutor.runWorker(ThreadPoolExecutor.java:1142)
	at java.util.concurrent.ThreadPoolExecutor$Worker.run(ThreadPoolExecutor.java:617)
	at java.lang.Thread.run(Thread.java:748)
Caused: java.lang.InterruptedException: java.lang.InterruptedException: no matches found within 10000
	at hudson.FilePath.act(FilePath.java:1038)
	at hudson.FilePath.act(FilePath.java:1025)
	at hudson.FilePath.validateAntFileMask(FilePath.java:2547)
	at hudson.tasks.ArtifactArchiver.perform(ArtifactArchiver.java:243)
	at hudson.tasks.BuildStepCompatibilityLayer.perform(BuildStepCompatibilityLayer.java:81)
	at hudson.tasks.BuildStepMonitor$1.perform(BuildStepMonitor.java:20)
	at hudson.model.AbstractBuild$AbstractBuildExecution.perform(AbstractBuild.java:744)
	at hudson.model.AbstractBuild$AbstractBuildExecution.performAllBuildSteps(AbstractBuild.java:690)
	at hudson.model.Build$BuildExecution.post2(Build.java:186)
	at hudson.model.AbstractBuild$AbstractBuildExecution.post(AbstractBuild.java:635)
	at hudson.model.Run.execute(Run.java:1819)
	at hudson.model.FreeStyleBuild.run(FreeStyleBuild.java:43)
	at hudson.model.ResourceController.execute(ResourceController.java:97)
	at hudson.model.Executor.run(Executor.java:429)
No artifacts found that match the file pattern "**/*.events,heapdumps/**,**/hs_err_pid*". Configuration error?
Recording test results
Build step 'Publish JUnit test result report' changed build result to UNSTABLE
Email was triggered for: Unstable (Test Failures)
Sending email for trigger: Unstable (Test Failures)

Mime
View raw message