lucene-dev mailing list archives

Site index · List index
Message view « Date » · « Thread »
Top « Date » · « Thread »
From Apache Jenkins Server <jenk...@builds.apache.org>
Subject [JENKINS] Lucene-Solr-NightlyTests-master - Build # 1627 - Failure
Date Tue, 28 Aug 2018 10:23:18 GMT
Build: https://builds.apache.org/job/Lucene-Solr-NightlyTests-master/1627/

1 tests failed.
FAILED:  org.apache.lucene.document.TestLatLonPolygonShapeQueries.testRandomBig

Error Message:
Java heap space

Stack Trace:
java.lang.OutOfMemoryError: Java heap space
	at __randomizedtesting.SeedInfo.seed([D4243FCFFAD0E376:537342406B899FF6]:0)
	at org.apache.lucene.store.RAMFile.newBuffer(RAMFile.java:78)
	at org.apache.lucene.store.RAMFile.addBuffer(RAMFile.java:51)
	at org.apache.lucene.store.RAMOutputStream.switchCurrentBuffer(RAMOutputStream.java:164)
	at org.apache.lucene.store.RAMOutputStream.writeBytes(RAMOutputStream.java:150)
	at org.apache.lucene.store.MockIndexOutputWrapper.writeBytes(MockIndexOutputWrapper.java:141)
	at org.apache.lucene.util.bkd.OfflinePointReader.split(OfflinePointReader.java:215)
	at org.apache.lucene.util.bkd.BKDWriter.build(BKDWriter.java:1787)
	at org.apache.lucene.util.bkd.BKDWriter.build(BKDWriter.java:1814)
	at org.apache.lucene.util.bkd.BKDWriter.finish(BKDWriter.java:1004)
	at org.apache.lucene.index.RandomCodec$1$1.writeField(RandomCodec.java:139)
	at org.apache.lucene.codecs.PointsWriter.mergeOneField(PointsWriter.java:62)
	at org.apache.lucene.codecs.PointsWriter.merge(PointsWriter.java:186)
	at org.apache.lucene.codecs.lucene60.Lucene60PointsWriter.merge(Lucene60PointsWriter.java:144)
	at org.apache.lucene.codecs.asserting.AssertingPointsFormat$AssertingPointsWriter.merge(AssertingPointsFormat.java:142)
	at org.apache.lucene.index.SegmentMerger.mergePoints(SegmentMerger.java:201)
	at org.apache.lucene.index.SegmentMerger.merge(SegmentMerger.java:161)
	at org.apache.lucene.index.IndexWriter.mergeMiddle(IndexWriter.java:4436)
	at org.apache.lucene.index.IndexWriter.merge(IndexWriter.java:4058)
	at org.apache.lucene.index.SerialMergeScheduler.merge(SerialMergeScheduler.java:40)
	at org.apache.lucene.index.IndexWriter.maybeMerge(IndexWriter.java:2160)
	at org.apache.lucene.index.IndexWriter.processEvents(IndexWriter.java:5093)
	at org.apache.lucene.index.IndexWriter.updateDocument(IndexWriter.java:1602)
	at org.apache.lucene.index.IndexWriter.addDocument(IndexWriter.java:1218)
	at org.apache.lucene.document.BaseLatLonShapeTestCase.indexRandomShapes(BaseLatLonShapeTestCase.java:214)
	at org.apache.lucene.document.BaseLatLonShapeTestCase.verify(BaseLatLonShapeTestCase.java:192)
	at org.apache.lucene.document.BaseLatLonShapeTestCase.doTestRandom(BaseLatLonShapeTestCase.java:173)
	at org.apache.lucene.document.BaseLatLonShapeTestCase.testRandomBig(BaseLatLonShapeTestCase.java:149)
	at sun.reflect.NativeMethodAccessorImpl.invoke0(Native Method)
	at sun.reflect.NativeMethodAccessorImpl.invoke(NativeMethodAccessorImpl.java:62)
	at sun.reflect.DelegatingMethodAccessorImpl.invoke(DelegatingMethodAccessorImpl.java:43)
	at java.lang.reflect.Method.invoke(Method.java:498)
	at com.carrotsearch.randomizedtesting.RandomizedRunner.invoke(RandomizedRunner.java:1737)




Build Log:
[...truncated 9 lines...]
ERROR: Error cloning remote repo 'origin'
hudson.plugins.git.GitException: Command "git fetch --tags --progress git://git.apache.org/lucene-solr.git +refs/heads/*:refs/remotes/origin/*" returned status code 128:
stdout: 
stderr: remote: Counting objects: 75329           
remote: Counting objects: 172503           
remote: Counting objects: 255550           
remote: Counting objects: 351904           
remote: Counting objects: 425630           
remote: Counting objects: 485179           
remote: Counting objects: 558321           
remote: Counting objects: 625701           
remote: Counting objects: 708191           
remote: Counting objects: 797317           
remote: Counting objects: 885134           
remote: Counting objects: 988042, done.        
remote: Compressing objects:   0% (1/195253)           
remote: Compressing objects:   1% (1953/195253)           
remote: Compressing objects:   2% (3906/195253)           
remote: Compressing objects:   3% (5858/195253)           
remote: Compressing objects:   4% (7811/195253)           
remote: Compressing objects:   5% (9763/195253)           
remote: Compressing objects:   6% (11716/195253)           
remote: Compressing objects:   7% (13668/195253)           
remote: Compressing objects:   8% (15621/195253)           
remote: Compressing objects:   9% (17573/195253)           
remote: Compressing objects:  10% (19526/195253)           
remote: Compressing objects:  11% (21478/195253)           
remote: Compressing objects:  12% (23431/195253)           
remote: Compressing objects:  13% (25383/195253)           
remote: Compressing objects:  14% (27336/195253)           
remote: Compressing objects:  15% (29288/195253)           
remote: Compressing objects:  16% (31241/195253)           
remote: Compressing objects:  17% (33194/195253)           
remote: Compressing objects:  18% (35146/195253)           
remote: Compressing objects:  19% (37099/195253)           
remote: Compressing objects:  20% (39051/195253)           
remote: Compressing objects:  21% (41004/195253)           
remote: Compressing objects:  22% (42956/195253)           
remote: Compressing objects:  23% (44909/195253)           
remote: Compressing objects:  24% (46861/195253)           
remote: Compressing objects:  25% (48814/195253)           
remote: Compressing objects:  26% (50766/195253)           
remote: Compressing objects:  27% (52719/195253)           
remote: Compressing objects:  28% (54671/195253)           
remote: Compressing objects:  29% (56624/195253)           
remote: Compressing objects:  30% (58576/195253)           
remote: Compressing objects:  31% (60529/195253)           
remote: Compressing objects:  32% (62481/195253)           
remote: Compressing objects:  33% (64434/195253)           
remote: Compressing objects:  34% (66387/195253)           
remote: Compressing objects:  35% (68339/195253)           
remote: Compressing objects:  36% (70292/195253)           
remote: Compressing objects:  37% (72244/195253)           
remote: Compressing objects:  38% (74197/195253)           
remote: Compressing objects:  39% (76149/195253)           
remote: Compressing objects:  40% (78102/195253)           
remote: Compressing objects:  41% (80054/195253)           
remote: Compressing objects:  42% (82007/195253)           
remote: Compressing objects:  43% (83959/195253)           
remote: Compressing objects:  44% (85912/195253)           
remote: Compressing objects:  45% (87864/195253)           
remote: Compressing objects:  46% (89817/195253)           
remote: Compressing objects:  47% (91769/195253)           
remote: Compressing objects:  48% (93722/195253)           
remote: Compressing objects:  49% (95674/195253)           
remote: Compressing objects:  50% (97627/195253)           
remote: Compressing objects:  51% (99580/195253)           
remote: Compressing objects:  52% (101532/195253)           
remote: Compressing objects:  53% (103485/195253)           
remote: Compressing objects:  54% (105437/195253)           
remote: Compressing objects:  55% (107390/195253)           
remote: Compressing objects:  56% (109342/195253)           
remote: Compressing objects:  57% (111295/195253)           
remote: Compressing objects:  58% (113247/195253)           
remote: Compressing objects:  59% (115200/195253)           
remote: Compressing objects:  60% (117152/195253)           
remote: Compressing objects:  61% (119105/195253)           
remote: Compressing objects:  62% (121057/195253)           
remote: Compressing objects:  63% (123010/195253)           
remote: Compressing objects:  64% (124962/195253)           
remote: Compressing objects:  65% (126915/195253)           
remote: Compressing objects:  66% (128867/195253)           
remote: Compressing objects:  67% (130820/195253)           
remote: Compressing objects:  68% (132773/195253)           
remote: Compressing objects:  69% (134725/195253)           
remote: Compressing objects:  70% (136678/195253)           
remote: Compressing objects:  71% (138630/195253)           
remote: Compressing objects:  72% (140583/195253)           
remote: Compressing objects:  73% (142535/195253)           
remote: Compressing objects:  74% (144488/195253)           
remote: Compressing objects:  75% (146440/195253)           
remote: Compressing objects:  76% (148393/195253)           
remote: Compressing objects:  77% (150345/195253)           
remote: Compressing objects:  78% (152298/195253)           
remote: Compressing objects:  79% (154250/195253)           
remote: Compressing objects:  80% (156203/195253)           
remote: Compressing objects:  81% (158155/195253)           
remote: Compressing objects:  82% (160108/195253)           
remote: Compressing objects:  82% (161373/195253)           
remote: Compressing objects:  83% (162060/195253)           
remote: Compressing objects:  84% (164013/195253)           
remote: Compressing objects:  85% (165966/195253)           
remote: Compressing objects:  86% (167918/195253)           
remote: Compressing objects:  87% (169871/195253)           
remote: Compressing objects:  88% (171823/195253)           
remote: Compressing objects:  89% (173776/195253)           
remote: Compressing objects:  90% (175728/195253)           
remote: Compressing objects:  91% (177681/195253)           
remote: Compressing objects:  92% (179633/195253)           
remote: Compressing objects:  93% (181586/195253)           
remote: Compressing objects:  93% (181778/195253)           
remote: Compressing objects:  94% (183538/195253)           
remote: Compressing objects:  95% (185491/195253)           
remote: Compressing objects:  95% (185983/195253)           
remote: Compressing objects:  96% (187443/195253)           
remote: Compressing objects:  97% (189396/195253)           
remote: Compressing objects:  97% (189641/195253)           
fatal: The remote end hung up unexpectedly
fatal: protocol error: bad pack header

	at org.jenkinsci.plugins.gitclient.CliGitAPIImpl.launchCommandIn(CliGitAPIImpl.java:2002)
	at org.jenkinsci.plugins.gitclient.CliGitAPIImpl.launchCommandWithCredentials(CliGitAPIImpl.java:1721)
	at org.jenkinsci.plugins.gitclient.CliGitAPIImpl.access$300(CliGitAPIImpl.java:72)
	at org.jenkinsci.plugins.gitclient.CliGitAPIImpl$1.execute(CliGitAPIImpl.java:405)
	at org.jenkinsci.plugins.gitclient.CliGitAPIImpl$2.execute(CliGitAPIImpl.java:614)
	at org.jenkinsci.plugins.gitclient.RemoteGitImpl$CommandInvocationHandler$1.call(RemoteGitImpl.java:153)
	at org.jenkinsci.plugins.gitclient.RemoteGitImpl$CommandInvocationHandler$1.call(RemoteGitImpl.java:146)
	at hudson.remoting.UserRequest.perform(UserRequest.java:212)
	at hudson.remoting.UserRequest.perform(UserRequest.java:54)
	at hudson.remoting.Request$2.run(Request.java:369)
	at hudson.remoting.InterceptingExecutorService$1.call(InterceptingExecutorService.java:72)
	at java.util.concurrent.FutureTask.run(FutureTask.java:266)
	at java.util.concurrent.ThreadPoolExecutor.runWorker(ThreadPoolExecutor.java:1142)
	at java.util.concurrent.ThreadPoolExecutor$Worker.run(ThreadPoolExecutor.java:617)
	at java.lang.Thread.run(Thread.java:748)
	Suppressed: hudson.remoting.Channel$CallSiteStackTrace: Remote call to lucene
		at hudson.remoting.Channel.attachCallSiteStackTrace(Channel.java:1741)
		at hudson.remoting.UserRequest$ExceptionResponse.retrieve(UserRequest.java:357)
		at hudson.remoting.Channel.call(Channel.java:955)
		at org.jenkinsci.plugins.gitclient.RemoteGitImpl$CommandInvocationHandler.execute(RemoteGitImpl.java:146)
		at sun.reflect.GeneratedMethodAccessor804.invoke(Unknown Source)
		at sun.reflect.DelegatingMethodAccessorImpl.invoke(DelegatingMethodAccessorImpl.java:43)
		at java.lang.reflect.Method.invoke(Method.java:498)
		at org.jenkinsci.plugins.gitclient.RemoteGitImpl$CommandInvocationHandler.invoke(RemoteGitImpl.java:132)
		at com.sun.proxy.$Proxy126.execute(Unknown Source)
		at hudson.plugins.git.GitSCM.retrieveChanges(GitSCM.java:1146)
		at hudson.plugins.git.GitSCM.checkout(GitSCM.java:1186)
		at org.jenkinsci.plugins.multiplescms.MultiSCM.checkout(MultiSCM.java:143)
		at hudson.scm.SCM.checkout(SCM.java:504)
		at hudson.model.AbstractProject.checkout(AbstractProject.java:1208)
		at hudson.model.AbstractBuild$AbstractBuildExecution.defaultCheckout(AbstractBuild.java:574)
		at jenkins.scm.SCMCheckoutStrategy.checkout(SCMCheckoutStrategy.java:86)
		at hudson.model.AbstractBuild$AbstractBuildExecution.run(AbstractBuild.java:499)
		at hudson.model.Run.execute(Run.java:1794)
		at hudson.model.FreeStyleBuild.run(FreeStyleBuild.java:43)
		at hudson.model.ResourceController.execute(ResourceController.java:97)
		at hudson.model.Executor.run(Executor.java:429)
ERROR: Error cloning remote repo 'origin'
Retrying after 10 seconds
 > git rev-parse --is-inside-work-tree # timeout=10
Fetching changes from the remote Git repository
 > git config remote.origin.url git://git.apache.org/lucene-solr.git # timeout=10
Fetching upstream changes from git://git.apache.org/lucene-solr.git
 > git --version # timeout=10
 > git fetch --tags --progress git://git.apache.org/lucene-solr.git +refs/heads/*:refs/remotes/origin/*
 > git rev-parse refs/remotes/origin/master^{commit} # timeout=10
 > git rev-parse refs/remotes/origin/origin/master^{commit} # timeout=10
Checking out Revision 04a50b6a2e28011331b3bd168809259ad5c947b2 (refs/remotes/origin/master)
 > git config core.sparsecheckout # timeout=10
 > git checkout -f 04a50b6a2e28011331b3bd168809259ad5c947b2
Commit message: "SOLR-12701: Improve Monte Carlo example"
 > git rev-list --no-walk b72ff3babbaeebb4c754ca905ac62512bf5fc1e7 # timeout=10
Cleaning workspace
 > git rev-parse --verify HEAD # timeout=10
Resetting working tree
 > git reset --hard # timeout=10
 > git clean -fdx # timeout=10
Checking out a fresh workspace because /x1/jenkins/jenkins-slave/workspace/Lucene-Solr-NightlyTests-master/test-data doesn't exist
Cleaning local Directory test-data
Checking out http://svn.apache.org/repos/asf/lucene/test-data at revision '2018-08-28T05:49:47.240 +0000'
A         README.txt
A         enwiki.random.lines.txt
At revision 1839407

No emails were triggered.
[checkout] $ /home/jenkins/tools/ant/apache-ant-1.8.4/bin/ant -file build.xml -Dtests.multiplier=2 -Dtests.linedocsfile=/home/jenkins/jenkins-slave/workspace/Lucene-Solr-NightlyTests-master/test-data/enwiki.random.lines.txt jenkins-nightly
Buildfile: /x1/jenkins/jenkins-slave/workspace/Lucene-Solr-NightlyTests-master/checkout/build.xml

jenkins-nightly:

-print-java-info:
[java-info] java version "1.8.0_172"
[java-info] Java(TM) SE Runtime Environment (1.8.0_172-b11, Oracle Corporation)
[java-info] Java HotSpot(TM) 64-Bit Server VM (25.172-b11, Oracle Corporation)
[java-info] Test args: []

clean:

clean:

clean:

ivy-availability-check:
[loadresource] Do not set property disallowed.ivy.jars.list as its length is 0.

-ivy-fail-disallowed-ivy-version:

ivy-fail:

ivy-configure:
[ivy:configure] :: Apache Ivy 2.4.0 - 20141213170938 :: http://ant.apache.org/ivy/ ::
[ivy:configure] :: loading settings :: file = /x1/jenkins/jenkins-slave/workspace/Lucene-Solr-NightlyTests-master/checkout/lucene/top-level-ivy-settings.xml

resolve-groovy:
[ivy:cachepath] :: resolving dependencies :: org.codehaus.groovy#groovy-all-caller;working
[ivy:cachepath] 	confs: [default]
[ivy:cachepath] 	found org.codehaus.groovy#groovy-all;2.4.15 in public
[ivy:cachepath] :: resolution report :: resolve 121ms :: artifacts dl 2ms
	---------------------------------------------------------------------
	|                  |            modules            ||   artifacts   |
	|       conf       | number| search|dwnlded|evicted|| number|dwnlded|
	---------------------------------------------------------------------
	|      default     |   1   |   0   |   0   |   0   ||   1   |   0   |
	---------------------------------------------------------------------

-test-with-heapdumps-enabled:
     [echo] Java HotSpot(TM) 64-Bit Server VM: Enabling heap dumps on OutOfMemoryError to dir '/x1/jenkins/jenkins-slave/workspace/Lucene-Solr-NightlyTests-master/checkout/heapdumps'.
    [mkdir] Created dir: /x1/jenkins/jenkins-slave/workspace/Lucene-Solr-NightlyTests-master/checkout/heapdumps

ivy-availability-check:
[loadresource] Do not set property disallowed.ivy.jars.list as its length is 0.

-ivy-fail-disallowed-ivy-version:

ivy-fail:

ivy-configure:
[ivy:configure] :: loading settings :: file = /x1/jenkins/jenkins-slave/workspace/Lucene-Solr-NightlyTests-master/checkout/lucene/top-level-ivy-settings.xml

resolve-groovy:

test:

ivy-availability-check:
[loadresource] Do not set property disallowed.ivy.jars.list as its length is 0.

-ivy-fail-disallowed-ivy-version:

ivy-fail:

ivy-configure:
[ivy:configure] :: loading settings :: file = /x1/jenkins/jenkins-slave/workspace/Lucene-Solr-NightlyTests-master/checkout/lucene/top-level-ivy-settings.xml

-clover.load:

resolve-groovy:

-init-totals:

test-core:

-clover.disable:

ivy-availability-check:
[loadresource] Do not set property disallowed.ivy.jars.list as its length is 0.

-ivy-fail-disallowed-ivy-version:

ivy-fail:

ivy-configure:
[ivy:configure] :: loading settings :: file = /x1/jenkins/jenkins-slave/workspace/Lucene-Solr-NightlyTests-master/checkout/lucene/top-level-ivy-settings.xml

-clover.load:

-clover.classpath:

-clover.setup:

clover:

-check-git-state:

-git-cleanroot:

-copy-git-state:
     [copy] Copying 1 file to /x1/jenkins/jenkins-slave/workspace/Lucene-Solr-NightlyTests-master/checkout/lucene/build

git-autoclean:

resolve:

init:

compile-core:
    [mkdir] Created dir: /x1/jenkins/jenkins-slave/workspace/Lucene-Solr-NightlyTests-master/checkout/lucene/build/core/classes/java
    [javac] Compiling 857 source files to /x1/jenkins/jenkins-slave/workspace/Lucene-Solr-NightlyTests-master/checkout/lucene/build/core/classes/java
    [javac] Note: Some input files use or override a deprecated API.
    [javac] Note: Recompile with -Xlint:deprecation for details.
    [javac] Creating empty /x1/jenkins/jenkins-slave/workspace/Lucene-Solr-NightlyTests-master/checkout/lucene/build/core/classes/java/org/apache/lucene/util/graph/package-info.class
    [javac] Creating empty /x1/jenkins/jenkins-slave/workspace/Lucene-Solr-NightlyTests-master/checkout/lucene/build/core/classes/java/org/apache/lucene/document/package-info.class
    [javac] Creating empty /x1/jenkins/jenkins-slave/workspace/Lucene-Solr-NightlyTests-master/checkout/lucene/build/core/classes/java/org/apache/lucene/package-info.class
    [javac] Creating empty /x1/jenkins/jenkins-slave/workspace/Lucene-Solr-NightlyTests-master/checkout/lucene/build/core/classes/java/org/apache/lucene/util/bkd/package-info.class
    [javac] Creating empty /x1/jenkins/jenkins-slave/workspace/Lucene-Solr-NightlyTests-master/checkout/lucene/build/core/classes/java/org/apache/lucene/codecs/compressing/package-info.class
    [javac] Creating empty /x1/jenkins/jenkins-slave/workspace/Lucene-Solr-NightlyTests-master/checkout/lucene/build/core/classes/java/org/apache/lucene/codecs/lucene60/package-info.class
    [javac] Creating empty /x1/jenkins/jenkins-slave/workspace/Lucene-Solr-NightlyTests-master/checkout/lucene/build/core/classes/java/org/apache/lucene/codecs/package-info.class
    [javac] Creating empty /x1/jenkins/jenkins-slave/workspace/Lucene-Solr-NightlyTests-master/checkout/lucene/build/core/classes/java/org/apache/lucene/codecs/lucene80/package-info.class
    [javac] Creating empty /x1/jenkins/jenkins-slave/workspace/Lucene-Solr-NightlyTests-master/checkout/lucene/build/core/classes/java/org/apache/lucene/util/package-info.class
    [javac] Creating empty /x1/jenkins/jenkins-slave/workspace/Lucene-Solr-NightlyTests-master/checkout/lucene/build/core/classes/java/org/apache/lucene/index/package-info.class
    [javac] Creating empty /x1/jenkins/jenkins-slave/workspace/Lucene-Solr-NightlyTests-master/checkout/lucene/build/core/classes/java/org/apache/lucene/util/fst/package-info.class
    [javac] Creating empty /x1/jenkins/jenkins-slave/workspace/Lucene-Solr-NightlyTests-master/checkout/lucene/build/core/classes/java/org/apache/lucene/analysis/tokenattributes/package-info.class
    [javac] Creating empty /x1/jenkins/jenkins-slave/workspace/Lucene-Solr-NightlyTests-master/checkout/lucene/build/core/classes/java/org/apache/lucene/search/package-info.class
    [javac] Creating empty /x1/jenkins/jenkins-slave/workspace/Lucene-Solr-NightlyTests-master/checkout/lucene/build/core/classes/java/org/apache/lucene/util/packed/package-info.class
    [javac] Creating empty /x1/jenkins/jenkins-slave/workspace/Lucene-Solr-NightlyTests-master/checkout/lucene/build/core/classes/java/org/apache/lucene/util/mutable/package-info.class
    [javac] Creating empty /x1/jenkins/jenkins-slave/workspace/Lucene-Solr-NightlyTests-master/checkout/lucene/build/core/classes/java/org/apache/lucene/codecs/lucene70/package-info.class
    [javac] Creating empty /x1/jenkins/jenkins-slave/workspace/Lucene-Solr-NightlyTests-master/checkout/lucene/build/core/classes/java/org/apache/lucene/codecs/perfield/package-info.class
    [javac] Creating empty /x1/jenkins/jenkins-slave/workspace/Lucene-Solr-NightlyTests-master/checkout/lucene/build/core/classes/java/org/apache/lucene/analysis/package-info.class
    [javac] Creating empty /x1/jenkins/jenkins-slave/workspace/Lucene-Solr-NightlyTests-master/checkout/lucene/build/core/classes/java/org/apache/lucene/analysis/standard/package-info.class
    [javac] Creating empty /x1/jenkins/jenkins-slave/workspace/Lucene-Solr-NightlyTests-master/checkout/lucene/build/core/classes/java/org/apache/lucene/store/package-info.class
    [javac] Creating empty /x1/jenkins/jenkins-slave/workspace/Lucene-Solr-NightlyTests-master/checkout/lucene/build/core/classes/java/org/apache/lucene/codecs/blocktree/package-info.class
    [javac] Creating empty /x1/jenkins/jenkins-slave/workspace/Lucene-Solr-NightlyTests-master/checkout/lucene/build/core/classes/java/org/apache/lucene/search/spans/package-info.class
    [javac] Creating empty /x1/jenkins/jenkins-slave/workspace/Lucene-Solr-NightlyTests-master/checkout/lucene/build/core/classes/java/org/apache/lucene/search/similarities/package-info.class
    [javac] Creating empty /x1/jenkins/jenkins-slave/workspace/Lucene-Solr-NightlyTests-master/checkout/lucene/build/core/classes/java/org/apache/lucene/util/automaton/package-info.class
    [javac] Creating empty /x1/jenkins/jenkins-slave/workspace/Lucene-Solr-NightlyTests-master/checkout/lucene/build/core/classes/java/org/apache/lucene/codecs/lucene50/package-info.class
    [javac] Creating empty /x1/jenkins/jenkins-slave/workspace/Lucene-Solr-NightlyTests-master/checkout/lucene/build/core/classes/java/org/apache/lucene/geo/package-info.class
     [copy] Copying 3 files to /x1/jenkins/jenkins-slave/workspace/Lucene-Solr-NightlyTests-master/checkout/lucene/build/core/classes/java

compile-test-framework:

-check-git-state:

-git-cleanroot:

-copy-git-state:

git-autoclean:

ivy-availability-check:
[loadresource] Do not set property disallowed.ivy.jars.list as its length is 0.

-ivy-fail-disallowed-ivy-version:

ivy-fail:

ivy-configure:
[ivy:configure] :: loading settings :: file = /x1/jenkins/jenkins-slave/workspace/Lucene-Solr-NightlyTests-master/checkout/lucene/top-level-ivy-settings.xml

resolve:

init:

compile-lucene-core:

-check-git-state:

-git-cleanroot:

-copy-git-state:

git-autoclean:

ivy-availability-check:
[loadresource] Do not set property disallowed.ivy.jars.list as its length is 0.

-ivy-fail-disallowed-ivy-version:

ivy-fail:

ivy-configure:
[ivy:configure] :: loading settings :: file = /x1/jenkins/jenkins-slave/workspace/Lucene-Solr-NightlyTests-master/checkout/lucene/top-level-ivy-settings.xml

resolve:

init:

-clover.disable:

-clover.load:

-clover.classpath:

-clover.setup:

clover:

compile-core:

compile-codecs:

-check-git-state:

-git-cleanroot:

-copy-git-state:

git-autoclean:

ivy-availability-check:
[loadresource] Do not set property disallowed.ivy.jars.list as its length is 0.

-ivy-fail-disallowed-ivy-version:

ivy-fail:

ivy-configure:
[ivy:configure] :: loading settings :: file = /x1/jenkins/jenkins-slave/workspace/Lucene-Solr-NightlyTests-master/checkout/lucene/top-level-ivy-settings.xml

resolve:

common.init:

compile-lucene-core:

init:

-clover.disable:

-clover.load:

-clover.classpath:

-clover.setup:

clover:

compile-core:
    [mkdir] Created dir: /x1/jenkins/jenkins-slave/workspace/Lucene-Solr-NightlyTests-master/checkout/lucene/build/codecs/classes/java
    [javac] Compiling 63 source files to /x1/jenkins/jenkins-slave/workspace/Lucene-Solr-NightlyTests-master/checkout/lucene/build/codecs/classes/java
    [javac] Note: Some input files use or override a deprecated API.
    [javac] Note: Recompile with -Xlint:deprecation for details.
    [javac] Creating empty /x1/jenkins/jenkins-slave/workspace/Lucene-Solr-NightlyTests-master/checkout/lucene/build/codecs/classes/java/org/apache/lucene/codecs/bloom/package-info.class
    [javac] Creating empty /x1/jenkins/jenkins-slave/workspace/Lucene-Solr-NightlyTests-master/checkout/lucene/build/codecs/classes/java/org/apache/lucene/codecs/memory/package-info.class
    [javac] Creating empty /x1/jenkins/jenkins-slave/workspace/Lucene-Solr-NightlyTests-master/checkout/lucene/build/codecs/classes/java/org/apache/lucene/codecs/simpletext/package-info.class
    [javac] Creating empty /x1/jenkins/jenkins-slave/workspace/Lucene-Solr-NightlyTests-master/checkout/lucene/build/codecs/classes/java/org/apache/lucene/codecs/blockterms/package-info.class
    [javac] Creating empty /x1/jenkins/jenkins-slave/workspace/Lucene-Solr-NightlyTests-master/checkout/lucene/build/codecs/classes/java/org/apache/lucene/codecs/blocktreeords/package-info.class
     [copy] Copying 3 files to /x1/jenkins/jenkins-slave/workspace/Lucene-Solr-NightlyTests-master/checkout/lucene/build/codecs/classes/java

-clover.disable:

-clover.load:

-clover.classpath:

-clover.setup:

clover:

common.compile-core:
    [mkdir] Created dir: /x1/jenkins/jenkins-slave/workspace/Lucene-Solr-NightlyTests-master/checkout/lucene/build/test-framework/classes/java
    [javac] Compiling 194 source files to /x1/jenkins/jenkins-slave/workspace/Lucene-Solr-NightlyTests-master/checkout/lucene/build/test-framework/classes/java
    [javac] /x1/jenkins/jenkins-slave/workspace/Lucene-Solr-NightlyTests-master/checkout/lucene/test-framework/src/java/org/apache/lucene/store/BaseDirectoryTestCase.java:416: warning: [try] auto-closeable resource output is never referenced in body of corresponding try statement
    [javac]             try (IndexOutput output = dir.createOutput(fileName, newIOContext(random()))) {
    [javac]                              ^
    [javac] /x1/jenkins/jenkins-slave/workspace/Lucene-Solr-NightlyTests-master/checkout/lucene/test-framework/src/java/org/apache/lucene/store/BaseDirectoryTestCase.java:440: warning: [try] auto-closeable resource input is never referenced in body of corresponding try statement
    [javac]                 try (IndexInput input = dir.openInput(file, newIOContext(random()))) {
    [javac]                                 ^
    [javac] /x1/jenkins/jenkins-slave/workspace/Lucene-Solr-NightlyTests-master/checkout/lucene/test-framework/src/java/org/apache/lucene/store/BaseDirectoryTestCase.java:1043: warning: [try] auto-closeable resource out is never referenced in body of corresponding try statement
    [javac]       try (IndexOutput out = dir.createOutput(name, IOContext.DEFAULT)) {
    [javac]                        ^
    [javac] /x1/jenkins/jenkins-slave/workspace/Lucene-Solr-NightlyTests-master/checkout/lucene/test-framework/src/java/org/apache/lucene/store/BaseDirectoryTestCase.java:1048: warning: [try] auto-closeable resource out is never referenced in body of corresponding try statement
    [javac]         try (IndexOutput out = dir.createOutput(name, IOContext.DEFAULT)) {
    [javac]                          ^
    [javac] Note: Some input files use or override a deprecated API.
    [javac] Note: Recompile with -Xlint:deprecation for details.
    [javac] 4 warnings
    [javac] Creating empty /x1/jenkins/jenkins-slave/workspace/Lucene-Solr-NightlyTests-master/checkout/lucene/build/test-framework/classes/java/org/apache/lucene/codecs/asserting/package-info.class
    [javac] Creating empty /x1/jenkins/jenkins-slave/workspace/Lucene-Solr-NightlyTests-master/checkout/lucene/build/test-framework/classes/java/org/apache/lucene/codecs/ramonly/package-info.class
    [javac] Creating empty /x1/jenkins/jenkins-slave/workspace/Lucene-Solr-NightlyTests-master/checkout/lucene/build/test-framework/classes/java/org/apache/lucene/mockfile/package-info.class
    [javac] Creating empty /x1/jenkins/jenkins-slave/workspace/Lucene-Solr-NightlyTests-master/checkout/lucene/build/test-framework/classes/java/org/apache/lucene/codecs/cheapbastard/package-info.class
    [javac] Creating empty /x1/jenkins/jenkins-slave/workspace/Lucene-Solr-NightlyTests-master/checkout/lucene/build/test-framework/classes/java/org/apache/lucene/codecs/mockrandom/package-info.class
    [javac] Creating empty /x1/jenkins/jenkins-slave/workspace/Lucene-Solr-NightlyTests-master/checkout/lucene/build/test-framework/classes/java/org/apache/lucene/codecs/cranky/package-info.class
    [javac] Creating empty /x1/jenkins/jenkins-slave/workspace/Lucene-Solr-NightlyTests-master/checkout/lucene/build/test-framework/classes/java/org/apache/lucene/codecs/compressing/dummy/package-info.class
     [copy] Copying 4 files to /x1/jenkins/jenkins-slave/workspace/Lucene-Solr-NightlyTests-master/checkout/lucene/build/test-framework/classes/java

compile-core:

compile-test:
    [mkdir] Created dir: /x1/jenkins/jenkins-slave/workspace/Lucene-Solr-NightlyTests-master/checkout/lucene/build/core/classes/test
    [javac] Compiling 514 source files to /x1/jenkins/jenkins-slave/workspace/Lucene-Solr-NightlyTests-master/checkout/lucene/build/core/classes/test
    [javac] /x1/jenkins/jenkins-slave/workspace/Lucene-Solr-NightlyTests-master/checkout/lucene/core/src/test/org/apache/lucene/index/TestIndexWriter.java:2664: warning: [try] auto-closeable resource closeable is never referenced in body of corresponding try statement
    [javac]          Closeable closeable = () -> IOUtils.close(toClose)) {
    [javac]                    ^
    [javac] Note: Some input files use or override a deprecated API.
    [javac] Note: Recompile with -Xlint:deprecation for details.
    [javac] 1 warning
     [copy] Copying 3 files to /x1/jenkins/jenkins-slave/workspace/Lucene-Solr-NightlyTests-master/checkout/lucene/build/core/classes/test

-mrjar-classes-uptodate:

resolve-groovy:

patch-mrjar-classes:
[patch-cls] Remapped: org/apache/lucene/analysis/tokenattributes/CharTermAttributeImpl
[patch-cls] Remapped: org/apache/lucene/codecs/compressing/LZ4
[patch-cls] Remapped: org/apache/lucene/document/BinaryPoint$2
[patch-cls] Remapped: org/apache/lucene/document/DoubleRange
[patch-cls] Remapped: org/apache/lucene/document/FloatRange
[patch-cls] Remapped: org/apache/lucene/document/IntRange
[patch-cls] Remapped: org/apache/lucene/document/LongRange
[patch-cls] Remapped: org/apache/lucene/index/BitsSlice
[patch-cls] Remapped: org/apache/lucene/index/CodecReader
[patch-cls] Remapped: org/apache/lucene/index/MergeReaderWrapper
[patch-cls] Remapped: org/apache/lucene/search/BooleanScorer$TailPriorityQueue
[patch-cls] Remapped: org/apache/lucene/search/TopFieldCollector
[patch-cls] Remapped: org/apache/lucene/util/BytesRef
[patch-cls] Remapped: org/apache/lucene/util/BytesRefArray
[patch-cls] Remapped: org/apache/lucene/util/CharsRef$UTF16SortedAsUTF8Comparator
[patch-cls] Remapped: org/apache/lucene/util/CharsRef
[patch-cls] Remapped: org/apache/lucene/util/IntsRef
[patch-cls] Remapped: org/apache/lucene/util/LongsRef
[patch-cls] Remapped: org/apache/lucene/util/StringHelper
[patch-cls] Remapped: org/apache/lucene/util/automaton/Automaton$Builder
[patch-cls] Remapped: org/apache/lucene/util/automaton/Automaton
[patch-cls] Remapped 21 class files for Java 9 to: /x1/jenkins/jenkins-slave/workspace/Lucene-Solr-NightlyTests-master/checkout/lucene/build/core/classes/java9
    [touch] Creating /x1/jenkins/jenkins-slave/workspace/Lucene-Solr-NightlyTests-master/checkout/lucene/build/core/patch-mrjar.stamp

install-junit4-taskdef:

validate:

-init-totals:

-test:
    [mkdir] Created dir: /x1/jenkins/jenkins-slave/workspace/Lucene-Solr-NightlyTests-master/checkout/lucene/build/core/test
    [mkdir] Created dir: /x1/jenkins/jenkins-slave/workspace/Lucene-Solr-NightlyTests-master/checkout/lucene/build/core/test/temp
    [mkdir] Created dir: /x1/jenkins/jenkins-slave/workspace/Lucene-Solr-NightlyTests-master/checkout/.caches/test-stats/core
   [junit4] <JUnit4> says ciao! Master seed: F0AC722F23EDB441
   [junit4] Executing 504 suites with 3 JVMs.
   [junit4] 
   [junit4] Started J1 PID(20345@localhost).
   [junit4] Started J2 PID(20347@localhost).
   [junit4] Started J0 PID(20344@localhost).
   [junit4] Suite: org.apache.lucene.index.TestTermdocPerf
   [junit4] Completed [1/504] on J0 in 0.99s, 1 test
   [junit4] 
   [junit4] Suite: org.apache.lucene.util.TestRecyclingIntBlockAllocator
   [junit4] Completed [2/504] on J0 in 0.19s, 3 tests
   [junit4] 
   [junit4] Suite: org.apache.lucene.index.TestFieldsReader
   [junit4] Completed [3/504] on J0 in 2.85s, 2 tests
   [junit4] 
   [junit4] Suite: org.apache.lucene.index.TestTerms
   [junit4] Completed [4/504] on J1 in 5.84s, 2 tests
   [junit4] 
   [junit4] Suite: org.apache.lucene.store.TestFilterDirectory
   [junit4] IGNOR/A 0.03s J0 | TestFilterDirectory.testFsyncDoesntCreateNewFiles
   [junit4]    > Assumption #1: test only works for FSDirectory subclasses
   [junit4] IGNOR/A 0.00s J0 | TestFilterDirectory.testPendingDeletions
   [junit4]    > Assumption #1: we can only install VirusCheckingFS on an FSDirectory
   [junit4] Completed [5/504] on J0 in 1.79s, 43 tests, 2 skipped
   [junit4] 
   [junit4] Suite: org.apache.lucene.index.TestNRTReaderCleanup
   [junit4] Completed [6/504] on J0 in 0.19s, 1 test
   [junit4] 
   [junit4] Suite: org.apache.lucene.util.TestRoaringDocIdSet
   [junit4] Completed [7/504] on J1 in 1.38s, 5 tests
   [junit4] 
   [junit4] Suite: org.apache.lucene.index.TestFilterCodecReader
   [junit4] Completed [8/504] on J1 in 0.05s, 1 test
   [junit4] 
   [junit4] Suite: org.apache.lucene.index.TestMultiFields
   [junit4] Completed [9/504] on J0 in 5.94s, 3 tests
   [junit4] 
   [junit4] Suite: org.apache.lucene.index.TestNeverDelete
   [junit4] Completed [10/504] on J0 in 5.52s, 1 test
   [junit4] 
   [junit4] Suite: org.apache.lucene.store.TestGrowableByteArrayDataOutput
   [junit4] Completed [11/504] on J1 in 12.35s, 2 tests
   [junit4] 
   [junit4] Suite: org.apache.lucene.index.TestNRTReaderWithThreads
   [junit4] Completed [12/504] on J1 in 3.22s, 1 test
   [junit4] 
   [junit4] Suite: org.apache.lucene.index.TestMultiLevelSkipList
   [junit4] Completed [13/504] on J1 in 0.32s, 1 test
   [junit4] 
   [junit4] Suite: org.apache.lucene.index.TestNewestSegment
   [junit4] Completed [14/504] on J1 in 0.12s, 1 test
   [junit4] 
   [junit4] Suite: org.apache.lucene.codecs.lucene70.TestIndexedDISI
   [junit4] Completed [15/504] on J0 in 7.17s, 10 tests
   [junit4] 
   [junit4] Suite: org.apache.lucene.search.TestSimilarity
   [junit4] Completed [16/504] on J0 in 0.15s, 1 test
   [junit4] 
   [junit4] Suite: org.apache.lucene.search.TestAutomatonQueryUnicode
   [junit4] Completed [17/504] on J0 in 0.21s, 1 test
   [junit4] 
   [junit4] HEARTBEAT J2 PID(20347@localhost): 2018-08-28T05:57:08, stalled for 67.4s at: TestTermsEnum.testVaryingTermsPerSegment
   [junit4] HEARTBEAT J0 PID(20344@localhost): 2018-08-28T05:57:20, stalled for 69.1s at: TestControlledRealTimeReopenThread.testControlledRealTimeReopenThread
   [junit4] HEARTBEAT J2 PID(20347@localhost): 2018-08-28T05:58:08, stalled for  127s at: TestTermsEnum.testVaryingTermsPerSegment
   [junit4] HEARTBEAT J0 PID(20344@localhost): 2018-08-28T05:58:20, stalled for  129s at: TestControlledRealTimeReopenThread.testControlledRealTimeReopenThread
   [junit4] HEARTBEAT J2 PID(20347@localhost): 2018-08-28T05:59:08, stalled for  187s at: TestTermsEnum.testVaryingTermsPerSegment
   [junit4] HEARTBEAT J0 PID(20344@localhost): 2018-08-28T05:59:20, stalled for  189s at: TestControlledRealTimeReopenThread.testControlledRealTimeReopenThread
   [junit4] HEARTBEAT J1 PID(20345@localhost): 2018-08-28T05:59:32, stalled for 71.4s at: TestLucene70DocValuesFormat.testTermsEnumVariableWidth
   [junit4] HEARTBEAT J2 PID(20347@localhost): 2018-08-28T06:00:08, stalled for  247s at: TestTermsEnum.testVaryingTermsPerSegment
   [junit4] HEARTBEAT J0 PID(20344@localhost): 2018-08-28T06:00:20, stalled for  249s at: TestControlledRealTimeReopenThread.testControlledRealTimeReopenThread
   [junit4] Suite: org.apache.lucene.index.TestTermsEnum
   [junit4] Completed [18/504] on J2 in 310.72s, 13 tests
   [junit4] 
   [junit4] Suite: org.apache.lucene.util.TestRollingBuffer
   [junit4] Completed [19/504] on J2 in 0.47s, 1 test
   [junit4] 
   [junit4] Suite: org.apache.lucene.index.TestFilterDirectoryReader
   [junit4] Completed [20/504] on J2 in 0.06s, 1 test
   [junit4] 
   [junit4] Suite: org.apache.lucene.store.TestHugeRamFile
   [junit4] Completed [21/504] on J2 in 2.97s, 1 test
   [junit4] 
   [junit4] HEARTBEAT J0 PID(20344@localhost): 2018-08-28T06:01:20, stalled for  309s at: TestControlledRealTimeReopenThread.testControlledRealTimeReopenThread
   [junit4] HEARTBEAT J1 PID(20345@localhost): 2018-08-28T06:01:32, stalled for 70.1s at: TestLucene70DocValuesFormat.testSortedVariableLengthBigVsStoredFields
   [junit4] HEARTBEAT J2 PID(20347@localhost): 2018-08-28T06:02:08, stalled for 68.6s at: TestNRTThreads.testNRTThreads
   [junit4] Suite: org.apache.lucene.search.TestControlledRealTimeReopenThread
   [junit4] IGNOR/A 0.00s J0 | TestControlledRealTimeReopenThread.testCRTReopen
   [junit4]    > Assumption #1: 'awaitsfix' test group is disabled (@AwaitsFix(bugUrl=https://issues.apache.org/jira/browse/LUCENE-5737))
   [junit4] Completed [22/504] on J0 in 361.92s, 6 tests, 1 skipped
   [junit4] 
   [junit4] Suite: org.apache.lucene.index.TestDirectoryReader
   [junit4] Completed [23/504] on J0 in 1.79s, 24 tests
   [junit4] 
   [junit4] Suite: org.apache.lucene.index.TestDocsAndPositions
   [junit4] Completed [24/504] on J0 in 2.52s, 6 tests
   [junit4] 
   [junit4] Suite: org.apache.lucene.index.Test2BTerms
   [junit4] IGNOR/A 0.00s J0 | Test2BTerms.test2BTerms
   [junit4]    > Assumption #1: 'monster' test group is disabled (@Monster(value=very slow, use 5g minimum heap))
   [junit4] Completed [25/504] on J0 in 0.02s, 1 test, 1 skipped
   [junit4] 
   [junit4] Suite: org.apache.lucene.search.TestMatchesIterator
   [junit4] Completed [26/504] on J0 in 1.39s, 25 tests
   [junit4] 
   [junit4] Suite: org.apache.lucene.index.TestTermsEnum2
   [junit4] Completed [27/504] on J0 in 3.08s, 4 tests
   [junit4] 
   [junit4] Suite: org.apache.lucene.index.TestIndexWriterForceMerge
   [junit4] Completed [28/504] on J0 in 6.74s, 4 tests
   [junit4] 
   [junit4] Suite: org.apache.lucene.index.Test2BPostingsBytes
   [junit4] IGNOR/A 0.00s J0 | Test2BPostingsBytes.test
   [junit4]    > Assumption #1: 'monster' test group is disabled (@Monster(value=takes ~20GB-30GB of space and 10 minutes))
   [junit4] Completed [29/504] on J0 in 0.02s, 1 test, 1 skipped
   [junit4] 
   [junit4] Suite: org.apache.lucene.util.TestFutureArrays
   [junit4] Completed [30/504] on J0 in 0.10s, 10 tests
   [junit4] 
   [junit4] Suite: org.apache.lucene.search.TestWildcard
   [junit4] Completed [31/504] on J0 in 0.18s, 8 tests
   [junit4] 
   [junit4] Suite: org.apache.lucene.search.TestSortedSetSelector
   [junit4] Completed [32/504] on J0 in 0.24s, 15 tests
   [junit4] 
   [junit4] HEARTBEAT J2 PID(20347@localhost): 2018-08-28T06:03:08, stalled for  129s at: TestNRTThreads.testNRTThreads
   [junit4] Suite: org.apache.lucene.index.TestIndexSorting
   [junit4] Completed [33/504] on J0 in 41.16s, 52 tests
   [junit4] 
   [junit4] Suite: org.apache.lucene.store.TestByteArrayDataInput
   [junit4] Completed [34/504] on J0 in 0.04s, 1 test
   [junit4] 
   [junit4] Suite: org.apache.lucene.search.TestRegexpRandom
   [junit4] Completed [35/504] on J0 in 1.41s, 1 test
   [junit4] 
   [junit4] Suite: org.apache.lucene.search.spans.TestSpanCollection
   [junit4] Completed [36/504] on J0 in 0.12s, 3 tests
   [junit4] 
   [junit4] Suite: org.apache.lucene.search.TestDocValuesRewriteMethod
   [junit4] Completed [37/504] on J0 in 7.79s, 2 tests
   [junit4] 
   [junit4] Suite: org.apache.lucene.search.similarities.TestAxiomaticF1LOG
   [junit4] Completed [38/504] on J0 in 23.24s, 1 test
   [junit4] 
   [junit4] Suite: org.apache.lucene.search.spans.TestFilterSpans
   [junit4] Completed [39/504] on J0 in 0.04s, 1 test
   [junit4] 
   [junit4] Suite: org.apache.lucene.index.TestSoftDeletesDirectoryReaderWrapper
   [junit4] Completed [40/504] on J0 in 0.16s, 3 tests
   [junit4] 
   [junit4] HEARTBEAT J2 PID(20347@localhost): 2018-08-28T06:04:08, stalled for  189s at: TestNRTThreads.testNRTThreads
   [junit4] HEARTBEAT J0 PID(20344@localhost): 2018-08-28T06:04:44, stalled for 61.2s at: TestBasicModelIn.testRandomScoring
   [junit4] Suite: org.apache.lucene.search.similarities.TestBasicModelIn
   [junit4] Completed [41/504] on J0 in 62.93s, 1 test
   [junit4] 
   [junit4] HEARTBEAT J2 PID(20347@localhost): 2018-08-28T06:05:08, stalled for  249s at: TestNRTThreads.testNRTThreads
   [junit4] HEARTBEAT J1 PID(20345@localhost): 2018-08-28T06:05:20, stalled for 63.2s at: TestLucene70DocValuesFormat.testSortedSetVariableLengthBigVsStoredFields
   [junit4] HEARTBEAT J2 PID(20347@localhost): 2018-08-28T06:06:08, stalled for  309s at: TestNRTThreads.testNRTThreads
   [junit4] HEARTBEAT J0 PID(20344@localhost): 2018-08-28T06:06:20, stalled for 68.1s at: TestDuelingCodecsAtNight.testBigEquals
   [junit4] HEARTBEAT J2 PID(20347@localhost): 2018-08-28T06:07:08, stalled for  369s at: TestNRTThreads.testNRTThreads
   [junit4] Suite: org.apache.lucene.index.TestNRTThreads
   [junit4] Completed [42/504] on J2 in 370.14s, 1 test
   [junit4] 
   [junit4] Suite: org.apache.lucene.index.TestMultiTermsEnum
   [junit4] Completed [43/504] on J2 in 0.18s, 1 test
   [junit4] 
   [junit4] Suite: org.apache.lucene.index.TestNoDeletionPolicy
   [junit4] Completed [44/504] on J2 in 0.26s, 4 tests
   [junit4] 
   [junit4] HEARTBEAT J0 PID(20344@localhost): 2018-08-28T06:07:20, stalled for  128s at: TestDuelingCodecsAtNight.testBigEquals
   [junit4] HEARTBEAT J1 PID(20345@localhost): 2018-08-28T06:08:08, stalled for 68.6s at: TestLucene70DocValuesFormat.testTermsEnumLongSharedPrefixes
   [junit4] HEARTBEAT J0 PID(20344@localhost): 2018-08-28T06:08:20, stalled for  188s at: TestDuelingCodecsAtNight.testBigEquals
   [junit4] HEARTBEAT J2 PID(20347@localhost): 2018-08-28T06:08:32, stalled for 65.7s at: TestLucene70NormsFormat.testSparseNCommonBig
   [junit4] HEARTBEAT J0 PID(20344@localhost): 2018-08-28T06:09:20, stalled for  248s at: TestDuelingCodecsAtNight.testBigEquals
   [junit4] HEARTBEAT J1 PID(20345@localhost): 2018-08-28T06:10:08, stalled for 61.2s at: TestLucene70DocValuesFormat.testTermsEnumRandomMany
   [junit4] HEARTBEAT J0 PID(20344@localhost): 2018-08-28T06:10:20, stalled for  308s at: TestDuelingCodecsAtNight.testBigEquals
   [junit4] HEARTBEAT J2 PID(20347@localhost): 2018-08-28T06:10:56, stalled for 63.0s at: TestLucene70NormsFormat.testNCommonBig
   [junit4] HEARTBEAT J0 PID(20344@localhost): 2018-08-28T06:11:20, stalled for  368s at: TestDuelingCodecsAtNight.testBigEquals
   [junit4] HEARTBEAT J1 PID(20345@localhost): 2018-08-28T06:11:44, stalled for 66.7s at: TestLucene70DocValuesFormat.testSparseDocValuesVsStoredFields
   [junit4] HEARTBEAT J2 PID(20347@localhost): 2018-08-28T06:11:56, stalled for  123s at: TestLucene70NormsFormat.testNCommonBig
   [junit4] HEARTBEAT J0 PID(20344@localhost): 2018-08-28T06:12:20, stalled for  428s at: TestDuelingCodecsAtNight.testBigEquals
   [junit4] Suite: org.apache.lucene.codecs.lucene70.TestLucene70DocValuesFormat
   [junit4] Completed [45/504] on J1 in 996.33s, 126 tests
   [junit4] 
   [junit4] Suite: org.apache.lucene.search.TestSimilarityProvider
   [junit4] Completed [46/504] on J1 in 0.06s, 1 test
   [junit4] 
   [junit4] Suite: org.apache.lucene.search.TestBlendedTermQuery
   [junit4] Completed [47/504] on J1 in 0.02s, 3 tests
   [junit4] 
   [junit4] Suite: org.apache.lucene.search.TestCustomSearcherSort
   [junit4] Completed [48/504] on J1 in 1.39s, 2 tests
   [junit4] 
   [junit4] Suite: org.apache.lucene.index.TestDirectoryReaderReopen
   [junit4] Completed [49/504] on J1 in 2.14s, 15 tests
   [junit4] 
   [junit4] Suite: org.apache.lucene.index.TestDocsWithFieldSet
   [junit4] Completed [50/504] on J1 in 0.04s, 3 tests
   [junit4] 
   [junit4] HEARTBEAT J0 PID(20344@localhost): 2018-08-28T06:13:20, stalled for  488s at: TestDuelingCodecsAtNight.testBigEquals
   [junit4] HEARTBEAT J1 PID(20345@localhost): 2018-08-28T06:13:56, stalled for 67.1s at: Test4GBStoredFields.test
   [junit4] HEARTBEAT J0 PID(20344@localhost): 2018-08-28T06:14:20, stalled for  548s at: TestDuelingCodecsAtNight.testBigEquals
   [junit4] HEARTBEAT J1 PID(20345@localhost): 2018-08-28T06:14:56, stalled for  127s at: Test4GBStoredFields.test
   [junit4] Suite: org.apache.lucene.codecs.lucene70.TestLucene70NormsFormat
   [junit4] IGNOR/A 0.03s J2 | TestLucene70NormsFormat.testMergeStability
   [junit4]    > Assumption #1: The MockRandom PF randomizes content on the fly, so we can't check it
   [junit4] Completed [51/504] on J2 in 471.72s, 29 tests, 1 skipped
   [junit4] 
   [junit4] Suite: org.apache.lucene.search.TestSimpleExplanations
   [junit4] Completed [52/504] on J2 in 2.17s, 70 tests
   [junit4] 
   [junit4] Suite: org.apache.lucene.search.TestBlockMaxConjunction
   [junit4] Completed [53/504] on J2 in 12.43s, 1 test
   [junit4] 
   [junit4] Suite: org.apache.lucene.search.TestDateSort
   [junit4] Completed [54/504] on J2 in 0.14s, 1 test
   [junit4] 
   [junit4] Suite: org.apache.lucene.index.TestDoc
   [junit4] Completed [55/504] on J2 in 0.18s, 1 test
   [junit4] 
   [junit4] Suite: org.apache.lucene.index.TestDocumentWriter
   [junit4] Completed [56/504] on J2 in 0.36s, 6 tests
   [junit4] 
   [junit4] Suite: org.apache.lucene.index.TestAddIndexes
   [junit4] Completed [57/504] on J2 in 6.67s, 28 tests
   [junit4] 
   [junit4] Suite: org.apache.lucene.index.TestDuelingCodecsAtNight
   [junit4] Completed [58/504] on J0 in 638.23s, 3 tests
   [junit4] 
   [junit4] Suite: org.apache.lucene.search.TestPhraseQuery
   [junit4] Completed [59/504] on J0 in 2.47s, 22 tests
   [junit4] 
   [junit4] Suite: org.apache.lucene.store.TestRAMDirectory
   [junit4] IGNOR/A 0.00s J0 | TestRAMDirectory.testFsyncDoesntCreateNewFiles
   [junit4]    > Assumption #1: test only works for FSDirectory subclasses
   [junit4] IGNOR/A 0.00s J0 | TestRAMDirectory.testPendingDeletions
   [junit4]    > Assumption #1: we can only install VirusCheckingFS on an FSDirectory
   [junit4] Completed [60/504] on J0 in 0.87s, 45 tests, 2 skipped
   [junit4] 
   [junit4] Suite: org.apache.lucene.TestMergeSchedulerExternal
   [junit4] Completed [61/504] on J0 in 0.83s, 2 tests
   [junit4] 
   [junit4] Suite: org.apache.lucene.search.TestMinShouldMatch2
   [junit4] Completed [62/504] on J2 in 9.99s, 6 tests
   [junit4] 
   [junit4] Suite: org.apache.lucene.index.TestTieredMergePolicy
   [junit4] Completed [63/504] on J2 in 20.46s, 12 tests
   [junit4] 
   [junit4] Suite: org.apache.lucene.index.TestIndexWriterLockRelease
   [junit4] Completed [64/504] on J2 in 0.03s, 1 test
   [junit4] 
   [junit4] Suite: org.apache.lucene.index.Test2BSortedDocValuesOrds
   [junit4] IGNOR/A 0.00s J2 | Test2BSortedDocValuesOrds.test2BOrds
   [junit4]    > Assumption #1: 'monster' test group is disabled (@Monster(value=Takes ~ 6 hours if the heap is 5gb))
   [junit4] Completed [65/504] on J2 in 0.00s, 1 test, 1 skipped
   [junit4] 
   [junit4] Suite: org.apache.lucene.util.TestIOUtils
   [junit4] Completed [66/504] on J2 in 0.15s, 19 tests
   [junit4] 
   [junit4] HEARTBEAT J1 PID(20345@localhost): 2018-08-28T06:15:56, stalled for  187s at: Test4GBStoredFields.test
   [junit4] Suite: org.apache.lucene.search.spans.TestSpanSearchEquivalence
   [junit4] Completed [67/504] on J0 in 30.64s, 33 tests
   [junit4] 
   [junit4] Suite: org.apache.lucene.analysis.TestGraphTokenizers
   [junit4] Completed [68/504] on J0 in 3.45s, 23 tests
   [junit4] 
   [junit4] Suite: org.apache.lucene.util.TestInPlaceMergeSorter
   [junit4] Completed [69/504] on J0 in 0.27s, 9 tests
   [junit4] 
   [junit4] Suite: org.apache.lucene.document.TestField
   [junit4] Completed [70/504] on J0 in 0.12s, 23 tests
   [junit4] 
   [junit4] Suite: org.apache.lucene.index.TestFieldInfos
   [junit4] Completed [71/504] on J0 in 0.04s, 1 test
   [junit4] 
   [junit4] Suite: org.apache.lucene.search.similarities.TestSimilarityBase
   [junit4] Completed [72/504] on J0 in 0.48s, 27 tests
   [junit4] 
   [junit4] Suite: org.apache.lucene.search.spans.TestSpanExplanationsOfNonMatches
   [junit4] Completed [73/504] on J0 in 0.08s, 30 tests
   [junit4] 
   [junit4] Suite: org.apache.lucene.search.TestFuzzyQuery
   [junit4] Completed [74/504] on J0 in 7.66s, 11 tests
   [junit4] 
   [junit4] Suite: org.apache.lucene.index.TestPersistentSnapshotDeletionPolicy
   [junit4] Completed [75/504] on J0 in 1.54s, 13 tests
   [junit4] 
   [junit4] Suite: org.apache.lucene.search.similarities.TestAxiomaticF1EXP
   [junit4] Completed [76/504] on J2 in 25.24s, 1 test
   [junit4] 
   [junit4] Suite: org.apache.lucene.search.TestSubScorerFreqs
   [junit4] Completed [77/504] on J2 in 0.10s, 3 tests
   [junit4] 
   [junit4] Suite: org.apache.lucene.search.TestBoolean2
   [junit4] Completed [78/504] on J0 in 22.92s, 10 tests
   [junit4] 
   [junit4] Suite: org.apache.lucene.index.TestIndexWriter
   [junit4] Completed [79/504] on J2 in 17.07s, 88 tests, 1 skipped
   [junit4] 
   [junit4] Suite: org.apache.lucene.store.TestFileSwitchDirectory
   [junit4] IGNOR/A 0.00s J2 | TestFileSwitchDirectory.testFsyncDoesntCreateNewFiles
   [junit4]    > Assumption #1: test only works for FSDirectory subclasses
   [junit4] IGNOR/A 0.01s J2 | TestFileSwitchDirectory.testPendingDeletions
   [junit4]    > Assumption #1: we can only install VirusCheckingFS on an FSDirectory
   [junit4] Completed [80/504] on J2 in 2.08s, 42 tests, 2 skipped
   [junit4] 
   [junit4] Suite: org.apache.lucene.search.TestReqExclBulkScorer
   [junit4] Completed [81/504] on J2 in 0.04s, 1 test
   [junit4] 
   [junit4] Suite: org.apache.lucene.search.spans.TestSpanExplanations
   [junit4] Completed [82/504] on J2 in 0.94s, 30 tests
   [junit4] 
   [junit4] Suite: org.apache.lucene.search.TestDoubleValuesSource
   [junit4] Completed [83/504] on J2 in 3.73s, 6 tests
   [junit4] 
   [junit4] HEARTBEAT J1 PID(20345@localhost): 2018-08-28T06:16:56, stalled for  247s at: Test4GBStoredFields.test
   [junit4] Suite: org.apache.lucene.search.similarities.TestAxiomaticF3EXP
   [junit4] Completed [84/504] on J0 in 24.11s, 1 test
   [junit4] 
   [junit4] Suite: org.apache.lucene.index.TestParallelTermEnum
   [junit4] Completed [85/504] on J0 in 0.03s, 1 test
   [junit4] 
   [junit4] Suite: org.apache.lucene.index.TestIndexCommit
   [junit4] Completed [86/504] on J0 in 0.03s, 1 test
   [junit4] 
   [junit4] Suite: org.apache.lucene.codecs.perfield.TestPerFieldPostingsFormat2
   [junit4] Completed [87/504] on J0 in 1.34s, 6 tests
   [junit4] 
   [junit4] Suite: org.apache.lucene.search.similarities.TestAxiomaticF2LOG
   [junit4] Completed [88/504] on J2 in 21.99s, 1 test
   [junit4] 
   [junit4] Suite: org.apache.lucene.search.spans.TestSpanBoostQuery
   [junit4] Completed [89/504] on J2 in 0.05s, 2 tests
   [junit4] 
   [junit4] Suite: org.apache.lucene.index.TestSortedSetDocValues
   [junit4] Completed [90/504] on J2 in 0.05s, 1 test
   [junit4] 
   [junit4] Suite: org.apache.lucene.search.similarities.TestBooleanSimilarity
   [junit4] Completed [91/504] on J2 in 8.36s, 4 tests
   [junit4] 
   [junit4] Suite: org.apache.lucene.index.TestExitableDirectoryReader
   [junit4] Completed [92/504] on J2 in 0.00s, 1 test, 1 skipped
   [junit4] 
   [junit4] Suite: org.apache.lucene.search.TestPositionIncrement
   [junit4] Completed [93/504] on J2 in 0.06s, 2 tests
   [junit4] 
   [junit4] Suite: org.apache.lucene.store.TestSimpleFSDirectory
   [junit4] Completed [94/504] on J2 in 1.32s, 43 tests
   [junit4] 
   [junit4] Suite: org.apache.lucene.TestSearchForDuplicates
   [junit4] Completed [95/504] on J2 in 0.14s, 1 test
   [junit4] 
   [junit4] Suite: org.apache.lucene.search.spans.TestSpans
   [junit4] Completed [96/504] on J2 in 0.75s, 25 tests
   [junit4] 
   [junit4] Suite: org.apache.lucene.analysis.TestStopFilter
   [junit4] Completed [97/504] on J2 in 0.04s, 4 tests
   [junit4] 
   [junit4] Suite: org.apache.lucene.util.TestIntroSelector
   [junit4] Completed [98/504] on J2 in 1.27s, 2 tests
   [junit4] 
   [junit4] Suite: org.apache.lucene.document.TestFloatRange
   [junit4] Completed [99/504] on J2 in 0.04s, 1 test
   [junit4] 
   [junit4] Suite: org.apache.lucene.index.TestFieldReuse
   [junit4] Completed [100/504] on J2 in 0.05s, 2 tests
   [junit4] 
   [junit4] Suite: org.apache.lucene.search.spans.TestFieldMaskingSpanQuery
   [junit4] IGNOR/A 0.00s J2 | TestFieldMaskingSpanQuery.testSimple2
   [junit4]    > Assumption #1: Broken scoring: LUCENE-3723
   [junit4] IGNOR/A 0.00s J2 | TestFieldMaskingSpanQuery.testSpans2
   [junit4]    > Assumption #1: Broken scoring: LUCENE-3723
   [junit4] Completed [101/504] on J2 in 0.20s, 11 tests, 2 skipped
   [junit4] 
   [junit4] Suite: org.apache.lucene.search.spans.TestSpanMultiTermQueryWrapper
   [junit4] Completed [102/504] on J2 in 0.25s, 9 tests
   [junit4] 
   [junit4] Suite: org.apache.lucene.search.TestIndexSearcher
   [junit4] Completed [103/504] on J2 in 0.37s, 6 tests
   [junit4] 
   [junit4] Suite: org.apache.lucene.index.TestPostingsOffsets
   [junit4] Completed [104/504] on J2 in 9.87s, 13 tests
   [junit4] 
   [junit4] Suite: org.apache.lucene.search.TestTopDocsMerge
   [junit4] Completed [105/504] on J0 in 29.31s, 5 tests
   [junit4] 
   [junit4] Suite: org.apache.lucene.search.TestBooleanMinShouldMatch
   [junit4] Completed [106/504] on J2 in 3.28s, 17 tests
   [junit4] 
   [junit4] Suite: org.apache.lucene.search.similarities.TestAxiomaticSimilarity
   [junit4] Completed [107/504] on J2 in 0.05s, 3 tests
   [junit4] 
   [junit4] Suite: org.apache.lucene.search.TestBooleanRewrites
   [junit4] Completed [108/504] on J0 in 2.03s, 12 tests
   [junit4] 
   [junit4] Suite: org.apache.lucene.index.TestPayloadsOnVectors
   [junit4] Completed [109/504] on J2 in 0.07s, 3 tests
   [junit4] 
   [junit4] Suite: org.apache.lucene.index.TestIndexInput
   [junit4] Completed [110/504] on J2 in 1.31s, 2 tests
   [junit4] 
   [junit4] Suite: org.apache.lucene.document.TestDateTools
   [junit4] Completed [111/504] on J2 in 0.06s, 5 tests
   [junit4] 
   [junit4] Suite: org.apache.lucene.util.automaton.TestDeterminizeLexicon
   [junit4] Completed [112/504] on J0 in 3.47s, 1 test
   [junit4] 
   [junit4] Suite: org.apache.lucene.codecs.lucene70.TestLucene70SegmentInfoFormat
   [junit4] Completed [113/504] on J0 in 0.57s, 16 tests
   [junit4] 
   [junit4] Suite: org.apache.lucene.index.TestMixedCodecs
   [junit4] Completed [114/504] on J0 in 4.58s, 1 test
   [junit4] 
   [junit4] Suite: org.apache.lucene.index.TestCodecs
   [junit4] Completed [115/504] on J0 in 0.54s, 3 tests
   [junit4] 
   [junit4] Suite: org.apache.lucene.index.TestAllFilesHaveCodecHeader
   [junit4] Completed [116/504] on J0 in 0.38s, 1 test
   [junit4] 
   [junit4] Suite: org.apache.lucene.index.TestCustomTermFreq
   [junit4] Completed [117/504] on J0 in 0.11s, 12 tests
   [junit4] 
   [junit4] Suite: org.apache.lucene.search.TestDisjunctionMaxQuery
   [junit4] Completed [118/504] on J0 in 4.08s, 13 tests
   [junit4] 
   [junit4] Suite: org.apache.lucene.util.TestTimSorter
   [junit4] Completed [119/504] on J0 in 0.21s, 9 tests
   [junit4] 
   [junit4] HEARTBEAT J1 PID(20345@localhost): 2018-08-28T06:17:56, stalled for  307s at: Test4GBStoredFields.test
   [junit4] Suite: org.apache.lucene.index.Test4GBStoredFields
   [junit4] Completed [120/504] on J1 in 310.98s, 1 test
   [junit4] 
   [junit4] Suite: org.apache.lucene.search.TestMaxScoreSumPropagator
   [junit4] Completed [121/504] on J1 in 0.29s, 6 tests
   [junit4] 
   [junit4] Suite: org.apache.lucene.index.TestThreadedForceMerge
   [junit4] Completed [122/504] on J1 in 0.64s, 1 test
   [junit4] 
   [junit4] Suite: org.apache.lucene.index.TestIndexWriterFromReader
   [junit4] Completed [123/504] on J1 in 2.60s, 12 tests
   [junit4] 
   [junit4] Suite: org.apache.lucene.index.Test2BSortedDocValuesFixedSorted
   [junit4] IGNOR/A 0.01s J1 | Test2BSortedDocValuesFixedSorted.testFixedSorted
   [junit4]    > Assumption #1: 'monster' test group is disabled (@Monster(value=Takes ~ 6 hours if the heap is 5gb))
   [junit4] Completed [124/504] on J1 in 0.01s, 1 test, 1 skipped
   [junit4] 
   [junit4] Suite: org.apache.lucene.util.TestFutureObjects
   [junit4] Completed [125/504] on J1 in 0.03s, 3 tests
   [junit4] 
   [junit4] Suite: org.apache.lucene.search.TestWildcardRandom
   [junit4] Completed [126/504] on J1 in 0.33s, 1 test
   [junit4] 
   [junit4] Suite: org.apache.lucene.search.TestSortedSetSortField
   [junit4] Completed [127/504] on J1 in 0.08s, 7 tests
   [junit4] 
   [junit4] Suite: org.apache.lucene.index.TestIndexTooManyDocs
   [junit4] Completed [128/504] on J1 in 0.51s, 1 test
   [junit4] 
   [junit4] Suite: org.apache.lucene.store.TestDirectory
   [junit4] IGNOR/A 0.00s J1 | TestDirectory.testListAll
   [junit4]    > Assumption #1: this test does not expect extra files
   [junit4] Completed [129/504] on J1 in 0.97s, 4 tests, 1 skipped
   [junit4] 
   [junit4] Suite: org.apache.lucene.search.TestRegexpRandom2
   [junit4] Completed [130/504] on J1 in 6.31s, 1 test
   [junit4] 
   [junit4] Suite: org.apache.lucene.search.spans.TestSpanContainQuery
   [junit4] Completed [131/504] on J1 in 0.10s, 4 tests
   [junit4] 
   [junit4] Suite: org.apache.lucene.index.TestNumericDocValuesUpdates
   [junit4] Completed [132/504] on J0 in 52.85s, 32 tests
   [junit4] 
   [junit4] Suite: org.apache.lucene.search.TestTopFieldCollectorEarlyTermination
   [junit4] Completed [133/504] on J2 in 79.71s, 3 tests
   [junit4] 
   [junit4] Suite: org.apache.lucene.search.TestBoostQuery
   [junit4] Completed [134/504] on J2 in 0.02s, 4 tests
   [junit4] 
   [junit4] Suite: org.apache.lucene.util.automaton.TestMinimize
   [junit4] Completed [135/504] on J2 in 2.61s, 3 tests
   [junit4] 
   [junit4] Suite: org.apache.lucene.search.TestFieldValueQuery
   [junit4] Completed [136/504] on J0 in 22.17s, 6 tests
   [junit4] 
   [junit4] Suite: org.apache.lucene.store.TestTrackingDirectoryWrapper
   [junit4] IGNOR/A 0.00s J0 | TestTrackingDirectoryWrapper.testPendingDeletions
   [junit4]    > Assumption #1: we can only install VirusCheckingFS on an FSDirectory
   [junit4] IGNOR/A 0.00s J0 | TestTrackingDirectoryWrapper.testFsyncDoesntCreateNewFiles
   [junit4]    > Assumption #1: test only works for FSDirectory subclasses
   [junit4] Completed [137/504] on J0 in 1.10s, 46 tests, 2 skipped
   [junit4] 
   [junit4] HEARTBEAT J1 PID(20345@localhost): 2018-08-28T06:19:20, stalled for 64.8s at: TestDoubleRangeFieldQueries.testRandomBig
   [junit4] Suite: org.apache.lucene.search.TestDoubleRangeFieldQueries
   [junit4] Completed [138/504] on J1 in 82.00s, 5 tests
   [junit4] 
   [junit4] Suite: org.apache.lucene.search.similarities.TestAxiomaticF2EXP
   [junit4] Completed [139/504] on J1 in 26.93s, 1 test
   [junit4] 
   [junit4] Suite: org.apache.lucene.search.spans.TestNearSpansOrdered
   [junit4] Completed [140/504] on J1 in 0.60s, 19 tests
   [junit4] 
   [junit4] Suite: org.apache.lucene.index.TestSoftDeletesRetentionMergePolicy
   [junit4] Completed [141/504] on J1 in 1.13s, 13 tests
   [junit4] 
   [junit4] HEARTBEAT J0 PID(20344@localhost): 2018-08-28T06:20:08, stalled for 65.5s at: TestBagOfPostings.test
   [junit4] Suite: org.apache.lucene.codecs.perfield.TestPerFieldPostingsFormat
   [junit4] IGNOR/A 0.00s J2 | TestPerFieldPostingsFormat.testPostingsEnumReuse
   [junit4]    > Assumption #1: The MockRandom PF randomizes content on the fly, so we can't check it
   [junit4] IGNOR/A 0.00s J2 | TestPerFieldPostingsFormat.testMergeStability
   [junit4]    > Assumption #1: The MockRandom PF randomizes content on the fly, so we can't check it
   [junit4] Completed [142/504] on J2 in 79.20s, 25 tests, 2 skipped
   [junit4] 
   [junit4] Suite: org.apache.lucene.index.TestMultiDocValues
   [junit4] Completed [143/504] on J2 in 7.35s, 7 tests
   [junit4] 
   [junit4] Suite: org.apache.lucene.index.TestConsistentFieldNumbers
   [junit4] Completed [144/504] on J2 in 3.51s, 4 tests
   [junit4] 
   [junit4] Suite: org.apache.lucene.index.TestBagOfPostings
   [junit4] Completed [145/504] on J0 in 91.83s, 1 test
   [junit4] 
   [junit4] Suite: org.apache.lucene.search.TestTotalHitCountCollector
   [junit4] Completed [146/504] on J0 in 0.02s, 1 test
   [junit4] 
   [junit4] HEARTBEAT J1 PID(20345@localhost): 2018-08-28T06:21:08, stalled for 65.5s at: TestBasicModelIne.testRandomScoring
   [junit4] Suite: org.apache.lucene.codecs.lucene50.TestLucene50TermVectorsFormat
   [junit4] Completed [147/504] on J0 in 40.10s, 17 tests
   [junit4] 
   [junit4] Suite: org.apache.lucene.search.similarities.TestBasicModelIne
   [junit4] Completed [148/504] on J1 in 80.93s, 1 test
   [junit4] 
   [junit4] Suite: org.apache.lucene.index.TestExceedMaxTermLength
   [junit4] Completed [149/504] on J1 in 0.04s, 1 test
   [junit4] 
   [junit4] HEARTBEAT J2 PID(20347@localhost): 2018-08-28T06:21:32, stalled for 65.8s at: TestBagOfPositions.test
   [junit4] HEARTBEAT J2 PID(20347@localhost): 2018-08-28T06:22:32, stalled for  126s at: TestBagOfPositions.test
   [junit4] HEARTBEAT J0 PID(20344@localhost): 2018-08-28T06:22:32, stalled for 68.2s at: TestLatLonPointQueries.testRandomBig
   [junit4] Suite: org.apache.lucene.search.TestPointQueries
   [junit4] Completed [150/504] on J1 in 90.05s, 49 tests
   [junit4] 
   [junit4] Suite: org.apache.lucene.store.TestRateLimiter
   [junit4] Completed [151/504] on J1 in 0.98s, 2 tests
   [junit4] 
   [junit4] Suite: org.apache.lucene.TestSearch
   [junit4] Completed [152/504] on J1 in 0.13s, 1 test
   [junit4] 
   [junit4] Suite: org.apache.lucene.search.spans.TestSpanTermQuery
   [junit4] Completed [153/504] on J1 in 0.05s, 2 tests
   [junit4] 
   [junit4] Suite: org.apache.lucene.analysis.TestReusableStringReader
   [junit4] Completed [154/504] on J1 in 0.03s, 1 test
   [junit4] 
   [junit4] Suite: org.apache.lucene.util.TestIntArrayDocIdSet
   [junit4] Completed [155/504] on J1 in 0.67s, 5 tests
   [junit4] 
   [junit4] Suite: org.apache.lucene.document.TestFieldType
   [junit4] Completed [156/504] on J1 in 0.06s, 3 tests
   [junit4] 
   [junit4] Suite: org.apache.lucene.index.TestFieldInvertState
   [junit4] Completed [157/504] on J1 in 0.20s, 2 tests
   [junit4] 
   [junit4] Suite: org.apache.lucene.search.spans.TestBasics
   [junit4] Completed [158/504] on J1 in 3.45s, 27 tests
   [junit4] 
   [junit4] Suite: org.apache.lucene.search.spans.TestSpanFirstQuery
   [junit4] Completed [159/504] on J1 in 0.10s, 1 test
   [junit4] 
   [junit4] Suite: org.apache.lucene.search.TestIndexOrDocValuesQuery
   [junit4] Completed [160/504] on J1 in 0.15s, 1 test
   [junit4] 
   [junit4] Suite: org.apache.lucene.index.TestPointValues
   [junit4] Completed [161/504] on J1 in 4.83s, 32 tests
   [junit4] 
   [junit4] Suite: org.apache.lucene.search.TestBoolean2ScorerSupplier
   [junit4] Completed [162/504] on J1 in 0.18s, 10 tests
   [junit4] 
   [junit4] Suite: org.apache.lucene.search.similarities.TestAxiomaticF3LOG
   [junit4] Completed [163/504] on J1 in 20.03s, 1 test
   [junit4] 
   [junit4] Suite: org.apache.lucene.index.TestBagOfPositions
   [junit4] Completed [164/504] on J2 in 178.61s, 1 test
   [junit4] 
   [junit4] Suite: org.apache.lucene.index.TestPayloads
   [junit4] Completed [165/504] on J1 in 0.31s, 7 tests
   [junit4] 
   [junit4] Suite: org.apache.lucene.index.TestIndexFileDeleter
   [junit4] Completed [166/504] on J1 in 2.03s, 10 tests
   [junit4] 
   [junit4] Suite: org.apache.lucene.document.TestBinaryDocument
   [junit4] Completed [167/504] on J1 in 0.01s, 1 test
   [junit4] 
   [junit4] Suite: org.apache.lucene.search.TestTopFieldCollector
   [junit4] Completed [168/504] on J1 in 0.79s, 7 tests
   [junit4] 
   [junit4] HEARTBEAT J0 PID(20344@localhost): 2018-08-28T06:23:32, stalled for  128s at: TestLatLonPointQueries.testRandomBig
   [junit4] Suite: org.apache.lucene.search.TestBooleanScorer
   [junit4] Completed [169/504] on J1 in 19.13s, 5 tests
   [junit4] 
   [junit4] Suite: org.apache.lucene.util.automaton.TestLevenshteinAutomata
   [junit4] Completed [170/504] on J1 in 1.79s, 4 tests
   [junit4] 
   [junit4] HEARTBEAT J2 PID(20347@localhost): 2018-08-28T06:24:32, stalled for 66.8s at: TestDemoParallelLeafReader.testRandomMultipleSchemaGens
   [junit4] Suite: org.apache.lucene.search.TestLatLonPointQueries
   [junit4] Completed [171/504] on J0 in 209.61s, 41 tests
   [junit4] 
   [junit4] Suite: org.apache.lucene.search.spans.TestSpansEnum
   [junit4] Completed [172/504] on J0 in 0.09s, 7 tests
   [junit4] 
   [junit4] HEARTBEAT J1 PID(20345@localhost): 2018-08-28T06:25:08, stalled for 64.0s at: TestPerFieldDocValuesFormat.testRandomAdvanceNumeric
   [junit4] HEARTBEAT J2 PID(20347@localhost): 2018-08-28T06:25:32, stalled for  127s at: TestDemoParallelLeafReader.testRandomMultipleSchemaGens
   [junit4] HEARTBEAT J0 PID(20344@localhost): 2018-08-28T06:25:56, stalled for 71.8s at: TestSearcherManager.testSearcherManager
   [junit4] HEARTBEAT J1 PID(20345@localhost): 2018-08-28T06:26:08, stalled for  124s at: TestPerFieldDocValuesFormat.testRandomAdvanceNumeric
   [junit4] HEARTBEAT J2 PID(20347@localhost): 2018-08-28T06:26:44, stalled for 61.5s at: TestDemoParallelLeafReader.testRandomMultipleSchemaGensSameField
   [junit4] HEARTBEAT J0 PID(20344@localhost): 2018-08-28T06:26:56, stalled for  132s at: TestSearcherManager.testSearcherManager
   [junit4] HEARTBEAT J1 PID(20345@localhost): 2018-08-28T06:27:08, stalled for  184s at: TestPerFieldDocValuesFormat.testRandomAdvanceNumeric
   [junit4] HEARTBEAT J2 PID(20347@localhost): 2018-08-28T06:27:44, stalled for  121s at: TestDemoParallelLeafReader.testRandomMultipleSchemaGensSameField
   [junit4] HEARTBEAT J0 PID(20344@localhost): 2018-08-28T06:27:56, stalled for  192s at: TestSearcherManager.testSearcherManager
   [junit4] HEARTBEAT J1 PID(20345@localhost): 2018-08-28T06:28:08, stalled for  244s at: TestPerFieldDocValuesFormat.testRandomAdvanceNumeric
   [junit4] HEARTBEAT J0 PID(20344@localhost): 2018-08-28T06:28:56, stalled for  252s at: TestSearcherManager.testSearcherManager
   [junit4] HEARTBEAT J1 PID(20345@localhost): 2018-08-28T06:29:08, stalled for  304s at: TestPerFieldDocValuesFormat.testRandomAdvanceNumeric
   [junit4] HEARTBEAT J2 PID(20347@localhost): 2018-08-28T06:29:08, stalled for 62.5s at: TestDemoParallelLeafReader.testRandom
   [junit4] HEARTBEAT J0 PID(20344@localhost): 2018-08-28T06:29:56, stalled for  312s at: TestSearcherManager.testSearcherManager
   [junit4] HEARTBEAT J1 PID(20345@localhost): 2018-08-28T06:30:08, stalled for  364s at: TestPerFieldDocValuesFormat.testRandomAdvanceNumeric
   [junit4] HEARTBEAT J2 PID(20347@localhost): 2018-08-28T06:30:08, stalled for  122s at: TestDemoParallelLeafReader.testRandom
   [junit4] Suite: org.apache.lucene.index.TestDemoParallelLeafReader
   [junit4] Completed [173/504] on J2 in 427.08s, 5 tests
   [junit4] 
   [junit4] Suite: org.apache.lucene.search.TestDocValuesQueries
   [junit4] Completed [174/504] on J2 in 15.65s, 10 tests
   [junit4] 
   [junit4] Suite: org.apache.lucene.util.TestUnicodeUtil
   [junit4] Completed [175/504] on J2 in 0.76s, 5 tests
   [junit4] 
   [junit4] Suite: org.apache.lucene.index.TestOmitPositions
   [junit4] Completed [176/504] on J2 in 0.19s, 3 tests
   [junit4] 
   [junit4] HEARTBEAT J0 PID(20344@localhost): 2018-08-28T06:30:56, stalled for  372s at: TestSearcherManager.testSearcherManager
   [junit4] HEARTBEAT J1 PID(20345@localhost): 2018-08-28T06:31:08, stalled for  424s at: TestPerFieldDocValuesFormat.testRandomAdvanceNumeric
   [junit4] HEARTBEAT J2 PID(20347@localhost): 2018-08-28T06:31:56, stalled for 64.1s at: TestFloatRangeFieldQueries.testRandomBig
   [junit4] HEARTBEAT J0 PID(20344@localhost): 2018-08-28T06:32:08, stalled for 69.9s at: TestSearcherManager.testConcurrentIndexCloseSearchAndRefresh
   [junit4] Suite: org.apache.lucene.search.TestFloatRangeFieldQueries
   [junit4] Completed [177/504] on J2 in 87.77s, 5 tests
   [junit4] 
   [junit4] Suite: org.apache.lucene.search.TestSearcherManager
   [junit4] Completed [178/504] on J0 in 456.67s, 11 tests
   [junit4] 
   [junit4] Suite: org.apache.lucene.util.TestArrayUtil
   [junit4] Completed [179/504] on J2 in 5.11s, 15 tests
   [junit4] 
   [junit4] Suite: org.apache.lucene.index.TestBinaryTerms
   [junit4] Completed [180/504] on J2 in 0.15s, 2 tests
   [junit4] 
   [junit4] Suite: org.apache.lucene.util.automaton.FiniteStringsIteratorTest
   [junit4] Completed [181/504] on J0 in 3.42s, 7 tests
   [junit4] 
   [junit4] Suite: org.apache.lucene.search.TestWANDScorer
   [junit4] Completed [182/504] on J2 in 14.58s, 4 tests
   [junit4] 
   [junit4] Suite: org.apache.lucene.search.similarities.TestLMDirichletSimilarity
   [junit4] Completed [183/504] on J0 in 33.65s, 1 test
   [junit4] 
   [junit4] Suite: org.apache.lucene.search.TestPositiveScoresOnlyCollector
   [junit4] Completed [184/504] on J0 in 0.02s, 1 test
   [junit4] 
   [junit4] Suite: org.apache.lucene.index.TestDocCount
   [junit4] Completed [185/504] on J0 in 0.10s, 1 test
   [junit4] 
   [junit4] Suite: org.apache.lucene.index.TestStressIndexing2
   [junit4] Completed [186/504] on J0 in 1.04s, 3 tests
   [junit4] 
   [junit4] Suite: org.apache.lucene.codecs.lucene60.TestLucene60PointsFormat
   [junit4] IGNOR/A 0.00s J2 | TestLucene60PointsFormat.testMergeStability
   [junit4]    > Assumption #1: merge is not stable
   [junit4] Completed [187/504] on J2 in 29.29s, 20 tests, 1 skipped
   [junit4] 
   [junit4] HEARTBEAT J0 PID(20344@localhost): 2018-08-28T06:34:08, stalled for 64.6s at: TestIntRangeFieldQueries.testRandomBig
   [junit4] Suite: org.apache.lucene.search.TestLongRangeFieldQueries
   [junit4] Completed [188/504] on J2 in 72.78s, 5 tests
   [junit4] 
   [junit4] Suite: org.apache.lucene.store.TestBufferedIndexInput
   [junit4] Completed [189/504] on J2 in 0.33s, 4 tests
   [junit4] 
   [junit4] Suite: org.apache.lucene.search.TestIntRangeFieldQueries
   [junit4] Completed [190/504] on J0 in 80.80s, 5 tests
   [junit4] 
   [junit4] Suite: org.apache.lucene.search.TermInSetQueryTest
   [junit4] Completed [191/504] on J0 in 3.46s, 10 tests
   [junit4] 
   [junit4] Suite: org.apache.lucene.util.automaton.TestCompiledAutomaton
   [junit4] Completed [192/504] on J0 in 0.53s, 6 tests
   [junit4] 
   [junit4] Suite: org.apache.lucene.codecs.perfield.TestPerFieldDocValuesFormat
   [junit4] Completed [193/504] on J1 in 649.88s, 110 tests
   [junit4] 
   [junit4] Suite: org.apache.lucene.search.TestShardSearching
   [junit4] Completed [194/504] on J2 in 22.59s, 1 test
   [junit4] 
   [junit4] Suite: org.apache.lucene.util.automaton.TestAutomaton
   [junit4] Completed [195/504] on J2 in 4.58s, 56 tests
   [junit4] 
   [junit4] Suite: org.apache.lucene.search.similarities.TestSimilarity2
   [junit4] Completed [196/504] on J2 in 0.27s, 8 tests
   [junit4] 
   [junit4] Suite: org.apache.lucene.geo.TestGeoUtils
   [junit4] Completed [197/504] on J0 in 25.10s, 7 tests
   [junit4] 
   [junit4] Suite: org.apache.lucene.search.TestPrefixQuery
   [junit4] Completed [198/504] on J2 in 8.70s, 3 tests
   [junit4] 
   [junit4] Suite: org.apache.lucene.index.TestDocInverterPerFieldErrorInfo
   [junit4] Completed [199/504] on J2 in 0.09s, 2 tests
   [junit4] 
   [junit4] Suite: org.apache.lucene.index.TestSumDocFreq
   [junit4] Completed [200/504] on J2 in 0.30s, 1 test
   [junit4] 
   [junit4] Suite: org.apache.lucene.search.similarities.TestIndependenceChiSquared
   [junit4] Completed [201/504] on J0 in 29.18s, 1 test
   [junit4] 
   [junit4] Suite: org.apache.lucene.index.TestFilterLeafReader
   [junit4] Completed [202/504] on J0 in 0.04s, 3 tests
   [junit4] 
   [junit4] Suite: org.apache.lucene.search.spans.TestSpanNearQuery
   [junit4] Completed [203/504] on J0 in 0.02s, 4 tests
   [junit4] 
   [junit4] Suite: org.apache.lucene.store.TestNIOFSDirectory
   [junit4] Completed [204/504] on J0 in 1.16s, 41 tests
   [junit4] 
   [junit4] Suite: org.apache.lucene.util.TestBytesRefArray
   [junit4] Completed [205/504] on J0 in 0.31s, 2 tests
   [junit4] 
   [junit4] Suite: org.apache.lucene.search.TestReqOptSumScorer
   [junit4] Completed [206/504] on J0 in 1.47s, 5 tests
   [junit4] 
   [junit4] Suite: org.apache.lucene.index.TestMixedDocValuesUpdates
   [junit4] Completed [207/504] on J1 in 63.40s, 10 tests
   [junit4] 
   [junit4] Suite: org.apache.lucene.index.TestConcurrentMergeScheduler
   [junit4] Completed [208/504] on J1 in 14.19s, 16 tests
   [junit4] 
   [junit4] Suite: org.apache.lucene.index.TestAtomicUpdate
   [junit4] Completed [209/504] on J1 in 6.63s, 1 test
   [junit4] 
   [junit4] Suite: org.apache.lucene.index.TestDeletionPolicy
   [junit4] Completed [210/504] on J1 in 4.42s, 6 tests
   [junit4] 
   [junit4] Suite: org.apache.lucene.search.TestDocIdSetIterator
   [junit4] Completed [211/504] on J1 in 0.01s, 5 tests
   [junit4] 
   [junit4] Suite: org.apache.lucene.search.similarities.TestClassicSimilarity
   [junit4] Completed [212/504] on J0 in 46.76s, 12 tests
   [junit4] 
   [junit4] Suite: org.apache.lucene.util.TestRadixSelector
   [junit4] Completed [213/504] on J0 in 1.20s, 2 tests
   [junit4] 
   [junit4] Suite: org.apache.lucene.TestAssertions
   [junit4] Completed [214/504] on J0 in 0.04s, 1 test
   [junit4] 
   [junit4] Suite: org.apache.lucene.TestDemo
   [junit4] Completed [215/504] on J0 in 0.05s, 1 test
   [junit4] 
   [junit4] Suite: org.apache.lucene.TestExternalCodecs
   [junit4] Completed [216/504] on J0 in 1.07s, 1 test
   [junit4] 
   [junit4] Suite: org.apache.lucene.analysis.TestCachingTokenFilter
   [junit4] Completed [217/504] on J0 in 0.03s, 2 tests
   [junit4] 
   [junit4] Suite: org.apache.lucene.analysis.TestCharArrayMap
   [junit4] Completed [218/504] on J0 in 0.14s, 4 tests
   [junit4] 
   [junit4] Suite: org.apache.lucene.analysis.TestCharArraySet
   [junit4] Completed [219/504] on J0 in 0.02s, 15 tests
   [junit4] 
   [junit4] Suite: org.apache.lucene.analysis.TestCharFilter
   [junit4] Completed [220/504] on J0 in 0.01s, 4 tests
   [junit4] 
   [junit4] Suite: org.apache.lucene.analysis.TestCharacterUtils
   [junit4] Completed [221/504] on J0 in 0.02s, 4 tests
   [junit4] 
   [junit4] Suite: org.apache.lucene.analysis.TestDelegatingAnalyzerWrapper
   [junit4] Completed [222/504] on J0 in 0.03s, 3 tests
   [junit4] 
   [junit4] Suite: org.apache.lucene.analysis.TestToken
   [junit4] Completed [223/504] on J0 in 0.03s, 5 tests
   [junit4] 
   [junit4] Suite: org.apache.lucene.analysis.TestWordlistLoader
   [junit4] Completed [224/504] on J0 in 0.03s, 3 tests
   [junit4] 
   [junit4] Suite: org.apache.lucene.util.TestTimSorterWorstCase
   [junit4] Completed [225/504] on J1 in 31.36s, 1 test
   [junit4] 
   [junit4] Suite: org.apache.lucene.index.TestOmitNorms
   [junit4] Completed [226/504] on J1 in 0.70s, 5 tests
   [junit4] 
   [junit4] Suite: org.apache.lucene.search.TestFilterWeight
   [junit4] Completed [227/504] on J1 in 0.01s, 1 test
   [junit4] 
   [junit4] Suite: org.apache.lucene.util.Test2BPagedBytes
   [junit4] IGNOR/A 0.00s J1 | Test2BPagedBytes.test
   [junit4]    > Assumption #1: 'monster' test group is disabled (@Monster(value=You must increase heap to > 2 G to run this))
   [junit4] Completed [228/504] on J1 in 0.00s, 1 test, 1 skipped
   [junit4] 
   [junit4] Suite: org.apache.lucene.analysis.standard.TestStandardAnalyzer
   [junit4] Completed [229/504] on J0 in 29.68s, 36 tests
   [junit4] 
   [junit4] Suite: org.apache.lucene.analysis.tokenattributes.TestBytesRefAttImpl
   [junit4] Completed [230/504] on J0 in 0.01s, 1 test
   [junit4] 
   [junit4] Suite: org.apache.lucene.analysis.tokenattributes.TestCharTermAttributeImpl
   [junit4] Completed [231/504] on J0 in 0.49s, 13 tests
   [junit4] 
   [junit4] Suite: org.apache.lucene.analysis.tokenattributes.TestPackedTokenAttributeImpl
   [junit4] Completed [232/504] on J0 in 0.04s, 4 tests
   [junit4] 
   [junit4] Suite: org.apache.lucene.analysis.tokenattributes.TestSimpleAttributeImpl
   [junit4] Completed [233/504] on J0 in 0.01s, 1 test
   [junit4] 
   [junit4] Suite: org.apache.lucene.codecs.TestCodecLoadingDeadlock
   [junit4] Completed [234/504] on J0 in 1.08s, 1 test
   [junit4] 
   [junit4] Suite: org.apache.lucene.codecs.TestCodecUtil
   [junit4] Completed [235/504] on J0 in 0.07s, 16 tests
   [junit4] 
   [junit4] Suite: org.apache.lucene.codecs.TestCompetitiveFreqNormAccumulator
   [junit4] Completed [236/504] on J0 in 0.02s, 4 tests
   [junit4] 
   [junit4] Suite: org.apache.lucene.codecs.compressing.TestFastCompressionMode
   [junit4] Completed [237/504] on J0 in 1.43s, 11 tests
   [junit4] 
   [junit4] Suite: org.apache.lucene.codecs.compressing.TestFastDecompressionMode
   [junit4] Completed [238/504] on J0 in 4.17s, 11 tests
   [junit4] 
   [junit4] Suite: org.apache.lucene.search.TestLatLonDocValuesQueries
   [junit4] IGNOR/A 0.00s J2 | TestLatLonDocValuesQueries.testSmallSetPoly
   [junit4]    > Assumption #1: Impl does not support polygons
   [junit4] IGNOR/A 0.00s J2 | TestLatLonDocValuesQueries.testPolygonHole
   [junit4]    > Assumption #1: Impl does not support polygons
   [junit4] IGNOR/A 0.00s J2 | TestLatLonDocValuesQueries.testSmallSetPolyWholeMap
   [junit4]    > Assumption #1: Impl does not support polygons
   [junit4] IGNOR/A 0.00s J2 | TestLatLonDocValuesQueries.testPolygonNullField
   [junit4]    > Assumption #1: Impl does not support polygons
   [junit4] IGNOR/A 0.00s J2 | TestLatLonDocValuesQueries.testPolygonBasics
   [junit4]    > Assumption #1: Impl does not support polygons
   [junit4] IGNOR/A 0.00s J2 | TestLatLonDocValuesQueries.testPolygonHoleExcludes
   [junit4]    > Assumption #1: Impl does not support polygons
   [junit4] IGNOR/A 0.00s J2 | TestLatLonDocValuesQueries.testMultiPolygonBasics
   [junit4]    > Assumption #1: Impl does not support polygons
   [junit4] Completed [239/504] on J2 in 117.74s, 40 tests, 7 skipped
   [junit4] 
   [junit4] Suite: org.apache.lucene.codecs.compressing.TestHighCompressionMode
   [junit4] Completed [240/504] on J0 in 1.87s, 7 tests
   [junit4] 
   [junit4] Suite: org.apache.lucene.search.TestAutomatonQuery
   [junit4] Completed [241/504] on J2 in 1.17s, 8 tests
   [junit4] 
   [junit4] Suite: org.apache.lucene.util.automaton.TestDeterminism
   [junit4] Completed [242/504] on J2 in 1.29s, 2 tests
   [junit4] 
   [junit4] Suite: org.apache.lucene.geo.TestPolygon2D
   [junit4] Completed [243/504] on J2 in 13.89s, 12 tests
   [junit4] 
   [junit4] Suite: org.apache.lucene.search.similarities.TestIndependenceStandardized
   [junit4] Completed [244/504] on J2 in 43.68s, 1 test
   [junit4] 
   [junit4] Suite: org.apache.lucene.index.TestFlex
   [junit4] Completed [245/504] on J2 in 0.35s, 2 tests
   [junit4] 
   [junit4] Suite: org.apache.lucene.search.spans.TestSpanOrQuery
   [junit4] Completed [246/504] on J2 in 0.05s, 3 tests
   [junit4] 
   [junit4] HEARTBEAT J1 PID(20345@localhost): 2018-08-28T06:37:56, stalled for 68.2s at: TestBinaryDocValuesUpdates.testTonsOfUpdates
   [junit4] Suite: org.apache.lucene.index.TestBinaryDocValuesUpdates
   [junit4] Completed [247/504] on J1 in 81.27s, 29 tests
   [junit4] 
   [junit4] Suite: org.apache.lucene.search.TestUsageTrackingFilterCachingPolicy
   [junit4] Completed [248/504] on J1 in 0.06s, 4 tests
   [junit4] 
   [junit4] Suite: org.apache.lucene.codecs.lucene50.TestLucene60FieldInfoFormat
   [junit4] Completed [249/504] on J1 in 0.66s, 11 tests
   [junit4] 
   [junit4] Suite: org.apache.lucene.search.TestLiveFieldValues
   [junit4] Completed [250/504] on J1 in 3.77s, 1 test
   [junit4] 
   [junit4] Suite: org.apache.lucene.store.TestBufferedChecksum
   [junit4] Completed [251/504] on J1 in 0.07s, 2 tests
   [junit4] 
   [junit4] Suite: org.apache.lucene.search.TestSegmentCacheables
   [junit4] Completed [252/504] on J1 in 0.02s, 1 test
   [junit4] 
   [junit4] Suite: org.apache.lucene.store.TestNativeFSLockFactory
   [junit4] Completed [253/504] on J2 in 12.03s, 11 tests
   [junit4] 
   [junit4] Suite: org.apache.lucene.util.TestCharsRef
   [junit4] Completed [254/504] on J2 in 0.10s, 6 tests
   [junit4] 
   [junit4] Suite: org.apache.lucene.util.automaton.LimitedFiniteStringsIteratorTest
   [junit4] Completed [255/504] on J1 in 0.39s, 6 tests
   [junit4] 
   [junit4] Suite: org.apache.lucene.search.TestScoreCachingWrappingScorer
   [junit4] Completed [256/504] on J2 in 0.08s, 1 test
   [junit4] 
   [junit4] Suite: org.apache.lucene.search.similarities.TestLMJelinekMercerSimilarity
   [junit4] Completed [257/504] on J1 in 34.66s, 1 test
   [junit4] 
   [junit4] Suite: org.apache.lucene.search.TestPrefixInBooleanQuery
   [junit4] Completed [258/504] on J1 in 3.43s, 4 tests
   [junit4] 
   [junit4] Suite: org.apache.lucene.index.TestDocIDMerger
   [junit4] Completed [259/504] on J1 in 0.05s, 2 tests
   [junit4] 
   [junit4] Suite: org.apache.lucene.index.TestStressNRT
   [junit4] Completed [260/504] on J1 in 4.97s, 1 test
   [junit4] 
   [junit4] Suite: org.apache.lucene.codecs.lucene50.TestBlockPostingsFormat
   [junit4] Completed [261/504] on J0 in 126.70s, 28 tests
   [junit4] 
   [junit4] Suite: org.apache.lucene.codecs.lucene50.TestBlockPostingsFormat2
   [junit4] Completed [262/504] on J0 in 4.97s, 4 tests
   [junit4] 
   [junit4] HEARTBEAT J2 PID(20347@localhost): 2018-08-28T06:39:08, stalled for 62.5s at: TestDistributionSPL.testRandomScoring
   [junit4] Suite: org.apache.lucene.codecs.lucene50.TestBlockPostingsFormat3
   [junit4] Completed [263/504] on J0 in 8.11s, 1 test
   [junit4] 
   [junit4] Suite: org.apache.lucene.codecs.lucene50.TestForUtil
   [junit4] Completed [264/504] on J0 in 0.06s, 1 test
   [junit4] 
   [junit4] Suite: org.apache.lucene.codecs.lucene50.TestLucene50CompoundFormat
   [junit4] Completed [265/504] on J0 in 4.45s, 26 tests
   [junit4] 
   [junit4] Suite: org.apache.lucene.codecs.lucene50.TestLucene50LiveDocsFormat
   [junit4] IGNOR/A 0.00s J0 | TestLucene50LiveDocsFormat.testOverflow
   [junit4]    > Assumption #1: 'monster' test group is disabled (@Monster(value=Uses lots of memory))
   [junit4] Completed [266/504] on J0 in 0.05s, 4 tests, 1 skipped
   [junit4] 
   [junit4] Suite: org.apache.lucene.codecs.lucene50.TestLucene50StoredFieldsFormat
   [junit4] Completed [267/504] on J0 in 10.87s, 17 tests
   [junit4] 
   [junit4] Suite: org.apache.lucene.search.similarities.TestDistributionSPL
   [junit4] Completed [268/504] on J2 in 88.92s, 1 test
   [junit4] 
   [junit4] Suite: org.apache.lucene.util.TestRecyclingByteBlockAllocator
   [junit4] Completed [269/504] on J2 in 0.03s, 3 tests
   [junit4] 
   [junit4] Suite: org.apache.lucene.document.TestDocument
   [junit4] Completed [270/504] on J2 in 0.04s, 12 tests
   [junit4] 
   [junit4] Suite: org.apache.lucene.document.TestDoubleRange
   [junit4] Completed [271/504] on J2 in 0.01s, 1 test
   [junit4] 
   [junit4] Suite: org.apache.lucene.document.TestFeatureField
   [junit4] Completed [272/504] on J2 in 0.33s, 8 tests
   [junit4] 
   [junit4] Suite: org.apache.lucene.document.TestIntRange
   [junit4] Completed [273/504] on J2 in 0.05s, 1 test
   [junit4] 
   [junit4] Suite: org.apache.lucene.search.TestLRUQueryCache
   [junit4] Completed [274/504] on J1 in 47.24s, 23 tests
   [junit4] 
   [junit4] Suite: org.apache.lucene.document.TestLatLonDocValuesField
   [junit4] Completed [275/504] on J2 in 0.03s, 1 test
   [junit4] 
   [junit4] Suite: org.apache.lucene.document.TestLatLonPoint
   [junit4] Completed [276/504] on J2 in 0.02s, 1 test
   [junit4] 
   [junit4] Suite: org.apache.lucene.document.TestLatLonPointDistanceSort
   [junit4] Completed [277/504] on J2 in 14.82s, 4 tests
   [junit4] 
   [junit4] Suite: org.apache.lucene.document.TestLongRange
   [junit4] Completed [278/504] on J2 in 0.05s, 1 test
   [junit4] 
   [junit4] Suite: org.apache.lucene.geo.TestGeoEncodingUtils
   [junit4] Completed [279/504] on J2 in 0.73s, 3 tests
   [junit4] 
   [junit4] Suite: org.apache.lucene.index.Test2BBinaryDocValues
   [junit4] IGNOR/A 0.00s J2 | Test2BBinaryDocValues.testVariableBinary
   [junit4]    > Assumption #1: 'monster' test group is disabled (@Monster(value=takes ~ 6 hours if the heap is 5gb))
   [junit4] IGNOR/A 0.00s J2 | Test2BBinaryDocValues.testFixedBinary
   [junit4]    > Assumption #1: 'monster' test group is disabled (@Monster(value=takes ~ 6 hours if the heap is 5gb))
   [junit4] Completed [280/504] on J2 in 0.00s, 2 tests, 2 skipped
   [junit4] 
   [junit4] Suite: org.apache.lucene.index.Test2BDocs
   [junit4] IGNOR/A 0.00s J2 | Test2BDocs.test2BDocs
   [junit4]    > Assumption #1: 'monster' test group is disabled (@Monster(value=Takes ~30min))
   [junit4] Completed [281/504] on J2 in 0.00s, 1 test, 1 skipped
   [junit4] 
   [junit4] Suite: org.apache.lucene.index.Test2BNumericDocValues
   [junit4] IGNOR/A 0.00s J2 | Test2BNumericDocValues.testNumerics
   [junit4]    > Assumption #1: 'monster' test group is disabled (@Monster(value=takes ~ 2 hours if the heap is 5gb))
   [junit4] Completed [282/504] on J2 in 0.00s, 1 test, 1 skipped
   [junit4] 
   [junit4] Suite: org.apache.lucene.search.TestApproximationSearchEquivalence
   [junit4] Completed [283/504] on J1 in 17.17s, 10 tests
   [junit4] 
   [junit4] Suite: org.apache.lucene.util.automaton.TestDaciukMihovAutomatonBuilder
   [junit4] Completed [284/504] on J1 in 0.02s, 1 test
   [junit4] 
   [junit4] Suite: org.apache.lucene.geo.TestPolygon
   [junit4] Completed [285/504] on J1 in 0.04s, 15 tests
   [junit4] 
   [junit4] Suite: org.apache.lucene.index.Test2BPoints
   [junit4] IGNOR/A 0.00s J2 | Test2BPoints.test2D
   [junit4]    > Assumption #1: 'monster' test group is disabled (@Monster(value=takes at least 4 hours and consumes many GB of temp disk space))
   [junit4] IGNOR/A 0.00s J2 | Test2BPoints.test1D
   [junit4]    > Assumption #1: 'monster' test group is disabled (@Monster(value=takes at least 4 hours and consumes many GB of temp disk space))
   [junit4] Completed [286/504] on J2 in 0.01s, 2 tests, 2 skipped
   [junit4] 
   [junit4] Suite: org.apache.lucene.index.Test2BPositions
   [junit4] IGNOR/A 0.00s J2 | Test2BPositions.test
   [junit4]    > Assumption #1: 'monster' test group is disabled (@Monster(value=uses lots of space and takes a few minutes))
   [junit4] Completed [287/504] on J2 in 0.00s, 1 test, 1 skipped
   [junit4] 
   [junit4] Suite: org.apache.lucene.codecs.lucene50.TestLucene50StoredFieldsFormatHighCompression
   [junit4] Completed [288/504] on J0 in 24.61s, 19 tests
   [junit4] 
   [junit4] Suite: org.apache.lucene.index.TestAllFilesCheckIndexHeader
   [junit4] Completed [289/504] on J0 in 1.70s, 1 test
   [junit4] 
   [junit4] Suite: org.apache.lucene.index.TestAllFilesDetectTruncation
   [junit4] Completed [290/504] on J0 in 2.46s, 1 test
   [junit4] 
   [junit4] Suite: org.apache.lucene.index.TestAllFilesHaveChecksumFooter
   [junit4] Completed [291/504] on J0 in 0.17s, 1 test
   [junit4] 
   [junit4] Suite: org.apache.lucene.index.TestByteSlices
   [junit4] Completed [292/504] on J0 in 5.93s, 1 test
   [junit4] 
   [junit4] Suite: org.apache.lucene.index.TestCheckIndex
   [junit4] Completed [293/504] on J0 in 1.95s, 4 tests
   [junit4] 
   [junit4] Suite: org.apache.lucene.index.TestCodecHoldsOpenFiles
   [junit4] Completed [294/504] on J0 in 0.07s, 1 test
   [junit4] 
   [junit4] Suite: org.apache.lucene.index.TestCrash
   [junit4] Completed [295/504] on J0 in 1.03s, 5 tests
   [junit4] 
   [junit4] Suite: org.apache.lucene.index.TestCrashCausesCorruptIndex
   [junit4] Completed [296/504] on J0 in 0.10s, 1 test
   [junit4] 
   [junit4] Suite: org.apache.lucene.index.TestCustomNorms
   [junit4] Completed [297/504] on J0 in 4.11s, 1 test
   [junit4] 
   [junit4] Suite: org.apache.lucene.index.TestDocValues
   [junit4] Completed [298/504] on J0 in 0.03s, 8 tests
   [junit4] 
   [junit4] Suite: org.apache.lucene.index.TestDocValuesFieldUpdates
   [junit4] Completed [299/504] on J0 in 0.01s, 1 test
   [junit4] 
   [junit4] Suite: org.apache.lucene.index.TestDocValuesIndexing
   [junit4] Completed [300/504] on J0 in 0.41s, 34 tests
   [junit4] 
   [junit4] Suite: org.apache.lucene.index.TestDocumentsWriterDeleteQueue
   [junit4] Completed [301/504] on J0 in 0.23s, 5 tests
   [junit4] 
   [junit4] Suite: org.apache.lucene.search.similarities.TestIndependenceSaturated
   [junit4] Completed [302/504] on J1 in 26.63s, 1 test
   [junit4] 
   [junit4] Suite: org.apache.lucene.index.TestFilterMergePolicy
   [junit4] Completed [303/504] on J1 in 0.01s, 1 test
   [junit4] 
   [junit4] Suite: org.apache.lucene.search.spans.TestSpanNotQuery
   [junit4] Completed [304/504] on J1 in 0.02s, 3 tests
   [junit4] 
   [junit4] Suite: org.apache.lucene.store.TestNRTCachingDirectory
   [junit4] I

[...truncated too long message...]

ore:

check-backward-codecs-uptodate:

jar-backward-codecs:

check-analyzers-phonetic-uptodate:

jar-analyzers-phonetic:

check-analyzers-kuromoji-uptodate:

jar-analyzers-kuromoji:

check-analyzers-nori-uptodate:

jar-analyzers-nori:

check-codecs-uptodate:

jar-codecs:

check-expressions-uptodate:

jar-expressions:

check-suggest-uptodate:

jar-suggest:

check-highlighter-uptodate:

jar-highlighter:

check-memory-uptodate:

jar-memory:

check-misc-uptodate:

jar-misc:

check-spatial-extras-uptodate:

jar-spatial-extras:

check-spatial3d-uptodate:

jar-spatial3d:

check-grouping-uptodate:

jar-grouping:

check-queries-uptodate:

jar-queries:

check-queryparser-uptodate:

jar-queryparser:

check-join-uptodate:

jar-join:

check-sandbox-uptodate:

jar-sandbox:

check-classification-uptodate:

jar-classification:

prep-lucene-jars:

resolve-example:

ivy-availability-check:
[loadresource] Do not set property disallowed.ivy.jars.list as its length is 0.

-ivy-fail-disallowed-ivy-version:

ivy-fail:

ivy-configure:
[ivy:configure] :: loading settings :: file = /x1/jenkins/jenkins-slave/workspace/Lucene-Solr-NightlyTests-master/checkout/lucene/top-level-ivy-settings.xml

resolve:

resolve-server:

ivy-availability-check:
[loadresource] Do not set property disallowed.ivy.jars.list as its length is 0.

-ivy-fail-disallowed-ivy-version:

ivy-fail:

ivy-fail:

ivy-configure:
[ivy:configure] :: loading settings :: file = /x1/jenkins/jenkins-slave/workspace/Lucene-Solr-NightlyTests-master/checkout/lucene/top-level-ivy-settings.xml

resolve:

-check-git-state:

-git-cleanroot:

-copy-git-state:

git-autoclean:

ivy-fail:

resolve:

common.init:

compile-lucene-core:

-check-git-state:

-git-cleanroot:

-copy-git-state:

git-autoclean:

ivy-availability-check:
[loadresource] Do not set property disallowed.ivy.jars.list as its length is 0.

-ivy-fail-disallowed-ivy-version:

ivy-fail:

ivy-configure:
[ivy:configure] :: loading settings :: file = /x1/jenkins/jenkins-slave/workspace/Lucene-Solr-NightlyTests-master/checkout/lucene/top-level-ivy-settings.xml

resolve:

init:

-clover.disable:

-clover.load:

-clover.classpath:

-clover.setup:

clover:

compile-core:

init:

-clover.disable:

-clover.load:

-clover.classpath:

-clover.setup:

clover:

common.compile-core:

compile-core:

resolve-groovy:

check-lucene-core-uptodate:

jar-lucene-core:

check-backward-codecs-uptodate:

jar-backward-codecs:

check-analyzers-phonetic-uptodate:

jar-analyzers-phonetic:

check-analyzers-kuromoji-uptodate:

jar-analyzers-kuromoji:

check-analyzers-nori-uptodate:

jar-analyzers-nori:

check-codecs-uptodate:

jar-codecs:

check-expressions-uptodate:

jar-expressions:

check-suggest-uptodate:

jar-suggest:

check-highlighter-uptodate:

jar-highlighter:

check-memory-uptodate:

jar-memory:

check-misc-uptodate:

jar-misc:

check-spatial-extras-uptodate:

jar-spatial-extras:

check-spatial3d-uptodate:

jar-spatial3d:

check-grouping-uptodate:

jar-grouping:

check-queries-uptodate:

jar-queries:

check-queryparser-uptodate:

jar-queryparser:

check-join-uptodate:

jar-join:

check-sandbox-uptodate:

jar-sandbox:

check-classification-uptodate:

jar-classification:

prep-lucene-jars:

resolve-example:

ivy-availability-check:
[loadresource] Do not set property disallowed.ivy.jars.list as its length is 0.

-ivy-fail-disallowed-ivy-version:

ivy-fail:

ivy-configure:
[ivy:configure] :: loading settings :: file = /x1/jenkins/jenkins-slave/workspace/Lucene-Solr-NightlyTests-master/checkout/lucene/top-level-ivy-settings.xml

resolve:

resolve-server:

ivy-availability-check:
[loadresource] Do not set property disallowed.ivy.jars.list as its length is 0.

-ivy-fail-disallowed-ivy-version:

ivy-fail:

ivy-fail:

ivy-configure:
[ivy:configure] :: loading settings :: file = /x1/jenkins/jenkins-slave/workspace/Lucene-Solr-NightlyTests-master/checkout/lucene/top-level-ivy-settings.xml

resolve:

-check-git-state:

-git-cleanroot:

-copy-git-state:

git-autoclean:

ivy-fail:

resolve:

common.init:

compile-lucene-core:

-check-git-state:

-git-cleanroot:

-copy-git-state:

git-autoclean:

ivy-availability-check:
[loadresource] Do not set property disallowed.ivy.jars.list as its length is 0.

-ivy-fail-disallowed-ivy-version:

ivy-fail:

ivy-configure:
[ivy:configure] :: loading settings :: file = /x1/jenkins/jenkins-slave/workspace/Lucene-Solr-NightlyTests-master/checkout/lucene/top-level-ivy-settings.xml

resolve:

init:

-clover.disable:

-clover.load:

-clover.classpath:

-clover.setup:

clover:

compile-core:

init:

common.compile-core:
    [mkdir] Created dir: /x1/jenkins/jenkins-slave/workspace/Lucene-Solr-NightlyTests-master/checkout/solr/build/contrib/solr-velocity/classes/java
    [javac] Compiling 5 source files to /x1/jenkins/jenkins-slave/workspace/Lucene-Solr-NightlyTests-master/checkout/solr/build/contrib/solr-velocity/classes/java
    [javac] Note: /x1/jenkins/jenkins-slave/workspace/Lucene-Solr-NightlyTests-master/checkout/solr/contrib/velocity/src/java/org/apache/solr/response/VelocityResponseWriter.java uses or overrides a deprecated API.
    [javac] Note: Recompile with -Xlint:deprecation for details.
    [javac] Note: /x1/jenkins/jenkins-slave/workspace/Lucene-Solr-NightlyTests-master/checkout/solr/contrib/velocity/src/java/org/apache/solr/response/VelocityResponseWriter.java uses unchecked or unsafe operations.
    [javac] Note: Recompile with -Xlint:unchecked for details.
     [copy] Copying 13 files to /x1/jenkins/jenkins-slave/workspace/Lucene-Solr-NightlyTests-master/checkout/solr/build/contrib/solr-velocity/classes/java

common-solr.compile-core:

compile-core:

compile-test-framework:

-check-git-state:

-git-cleanroot:

-copy-git-state:

git-autoclean:

ivy-availability-check:
[loadresource] Do not set property disallowed.ivy.jars.list as its length is 0.

-ivy-fail-disallowed-ivy-version:

ivy-fail:

ivy-configure:
[ivy:configure] :: loading settings :: file = /x1/jenkins/jenkins-slave/workspace/Lucene-Solr-NightlyTests-master/checkout/lucene/top-level-ivy-settings.xml

resolve:

init:

compile-lucene-core:

compile-codecs:

-check-git-state:

-git-cleanroot:

-copy-git-state:

git-autoclean:

ivy-availability-check:
[loadresource] Do not set property disallowed.ivy.jars.list as its length is 0.

-ivy-fail-disallowed-ivy-version:

ivy-fail:

ivy-configure:
[ivy:configure] :: loading settings :: file = /x1/jenkins/jenkins-slave/workspace/Lucene-Solr-NightlyTests-master/checkout/lucene/top-level-ivy-settings.xml

resolve:

common.init:

compile-lucene-core:

init:

-clover.disable:

-clover.load:

-clover.classpath:

-clover.setup:

clover:

compile-core:

-clover.disable:

-clover.load:

-clover.classpath:

-clover.setup:

clover:

common.compile-core:

compile-core:

common.compile-test:
    [mkdir] Created dir: /x1/jenkins/jenkins-slave/workspace/Lucene-Solr-NightlyTests-master/checkout/solr/build/contrib/solr-velocity/classes/test
    [javac] Compiling 2 source files to /x1/jenkins/jenkins-slave/workspace/Lucene-Solr-NightlyTests-master/checkout/solr/build/contrib/solr-velocity/classes/test
     [copy] Copying 2 files to /x1/jenkins/jenkins-slave/workspace/Lucene-Solr-NightlyTests-master/checkout/solr/build/contrib/solr-velocity/classes/test

compile-test:

patch-mrjar-classes:

install-junit4-taskdef:

compile-tools:

-check-git-state:

-git-cleanroot:

-copy-git-state:

git-autoclean:

ivy-availability-check:
[loadresource] Do not set property disallowed.ivy.jars.list as its length is 0.

-ivy-fail-disallowed-ivy-version:

ivy-fail:

ivy-configure:
[ivy:configure] :: loading settings :: file = /x1/jenkins/jenkins-slave/workspace/Lucene-Solr-NightlyTests-master/checkout/lucene/top-level-ivy-settings.xml

resolve:

init:

compile-core:

validate:

-init-totals:

-test:
    [mkdir] Created dir: /x1/jenkins/jenkins-slave/workspace/Lucene-Solr-NightlyTests-master/checkout/solr/build/contrib/solr-velocity/test
    [mkdir] Created dir: /x1/jenkins/jenkins-slave/workspace/Lucene-Solr-NightlyTests-master/checkout/solr/build/contrib/solr-velocity/test/temp
    [mkdir] Created dir: /x1/jenkins/jenkins-slave/workspace/Lucene-Solr-NightlyTests-master/checkout/.caches/test-stats/solr-velocity
   [junit4] <JUnit4> says hello! Master seed: 9D6CE6A209826AE4
   [junit4] Executing 1 suite with 1 JVM.
   [junit4] 
   [junit4] Started J0 PID(3531@lucene1-us-west).
   [junit4] Suite: org.apache.solr.velocity.VelocityResponseWriterTest
   [junit4] Completed [1/1] in 5.05s, 13 tests
   [junit4] 
   [junit4] JVM J0:     0.55 ..     6.16 =     5.62s
   [junit4] Execution time total: 6.17 sec.
   [junit4] Tests summary: 1 suite, 13 tests
   [junit4] Could not remove temporary path: /x1/jenkins/jenkins-slave/workspace/Lucene-Solr-NightlyTests-master/checkout/solr/build/contrib/solr-velocity/test/J0 (java.nio.file.DirectoryNotEmptyException: Remaining files: [/x1/jenkins/jenkins-slave/workspace/Lucene-Solr-NightlyTests-master/checkout/solr/build/contrib/solr-velocity/test/J0/temp])
     [echo] 5 slowest tests:
[junit4:tophints]   5.05s | org.apache.solr.velocity.VelocityResponseWriterTest

-check-totals:

common.test:

-check-totals:

test:

ivy-availability-check:

ivy-configure:
[ivy:configure] :: loading settings :: file = /x1/jenkins/jenkins-slave/workspace/Lucene-Solr-NightlyTests-master/checkout/lucene/top-level-ivy-settings.xml

resolve-groovy:

-check-totals:

BUILD FAILED
/x1/jenkins/jenkins-slave/workspace/Lucene-Solr-NightlyTests-master/checkout/build.xml:651: The following error occurred while executing this line:
/x1/jenkins/jenkins-slave/workspace/Lucene-Solr-NightlyTests-master/checkout/build.xml:585: Some of the tests produced a heap dump, but did not fail. Maybe a suppressed OutOfMemoryError? Dumps created:
* java_pid8591.hprof

Total time: 267 minutes 41 seconds
Build step 'Invoke Ant' marked build as failure
Archiving artifacts
Recording test results
Email was triggered for: Failure - Any
Sending email for trigger: Failure - Any

Mime
View raw message