lucene-dev mailing list archives

Site index · List index
Message view « Date » · « Thread »
Top « Date » · « Thread »
From Policeman Jenkins Server <jenk...@thetaphi.de>
Subject [JENKINS] Lucene-Solr-BadApples-master-Linux (32bit/jdk1.8.0_172) - Build # 78 - Unstable!
Date Tue, 14 Aug 2018 04:20:14 GMT
Build: https://jenkins.thetaphi.de/job/Lucene-Solr-BadApples-master-Linux/78/
Java: 32bit/jdk1.8.0_172 -client -XX:+UseConcMarkSweepGC

6 tests failed.
FAILED:  org.apache.solr.cloud.MoveReplicaHDFSTest.testFailedMove

Error Message:
No live SolrServers available to handle this request:[https://127.0.0.1:42167/solr/MoveReplicaHDFSTest_failed_coll_true, https://127.0.0.1:38979/solr/MoveReplicaHDFSTest_failed_coll_true]

Stack Trace:
org.apache.solr.client.solrj.SolrServerException: No live SolrServers available to handle this request:[https://127.0.0.1:42167/solr/MoveReplicaHDFSTest_failed_coll_true, https://127.0.0.1:38979/solr/MoveReplicaHDFSTest_failed_coll_true]
	at __randomizedtesting.SeedInfo.seed([1D6B3C201EBFC3C0:B7A6EFD2A96C1610]:0)
	at org.apache.solr.client.solrj.impl.LBHttpSolrClient.request(LBHttpSolrClient.java:462)
	at org.apache.solr.client.solrj.impl.CloudSolrClient.sendRequest(CloudSolrClient.java:1106)
	at org.apache.solr.client.solrj.impl.CloudSolrClient.requestWithRetryOnStaleState(CloudSolrClient.java:886)
	at org.apache.solr.client.solrj.impl.CloudSolrClient.requestWithRetryOnStaleState(CloudSolrClient.java:993)
	at org.apache.solr.client.solrj.impl.CloudSolrClient.request(CloudSolrClient.java:819)
	at org.apache.solr.client.solrj.SolrRequest.process(SolrRequest.java:194)
	at org.apache.solr.client.solrj.SolrClient.query(SolrClient.java:942)
	at org.apache.solr.cloud.MoveReplicaTest.testFailedMove(MoveReplicaTest.java:292)
	at sun.reflect.NativeMethodAccessorImpl.invoke0(Native Method)
	at sun.reflect.NativeMethodAccessorImpl.invoke(NativeMethodAccessorImpl.java:62)
	at sun.reflect.DelegatingMethodAccessorImpl.invoke(DelegatingMethodAccessorImpl.java:43)
	at java.lang.reflect.Method.invoke(Method.java:498)
	at com.carrotsearch.randomizedtesting.RandomizedRunner.invoke(RandomizedRunner.java:1737)
	at com.carrotsearch.randomizedtesting.RandomizedRunner$8.evaluate(RandomizedRunner.java:934)
	at com.carrotsearch.randomizedtesting.RandomizedRunner$9.evaluate(RandomizedRunner.java:970)
	at com.carrotsearch.randomizedtesting.RandomizedRunner$10.evaluate(RandomizedRunner.java:984)
	at com.carrotsearch.randomizedtesting.rules.SystemPropertiesRestoreRule$1.evaluate(SystemPropertiesRestoreRule.java:57)
	at org.apache.lucene.util.TestRuleSetupTeardownChained$1.evaluate(TestRuleSetupTeardownChained.java:49)
	at org.apache.lucene.util.AbstractBeforeAfterRule$1.evaluate(AbstractBeforeAfterRule.java:45)
	at org.apache.lucene.util.TestRuleThreadAndTestName$1.evaluate(TestRuleThreadAndTestName.java:48)
	at org.apache.lucene.util.TestRuleIgnoreAfterMaxFailures$1.evaluate(TestRuleIgnoreAfterMaxFailures.java:64)
	at org.apache.lucene.util.TestRuleMarkFailure$1.evaluate(TestRuleMarkFailure.java:47)
	at com.carrotsearch.randomizedtesting.rules.StatementAdapter.evaluate(StatementAdapter.java:36)
	at com.carrotsearch.randomizedtesting.ThreadLeakControl$StatementRunner.run(ThreadLeakControl.java:368)
	at com.carrotsearch.randomizedtesting.ThreadLeakControl.forkTimeoutingTask(ThreadLeakControl.java:817)
	at com.carrotsearch.randomizedtesting.ThreadLeakControl$3.evaluate(ThreadLeakControl.java:468)
	at com.carrotsearch.randomizedtesting.RandomizedRunner.runSingleTest(RandomizedRunner.java:943)
	at com.carrotsearch.randomizedtesting.RandomizedRunner$5.evaluate(RandomizedRunner.java:829)
	at com.carrotsearch.randomizedtesting.RandomizedRunner$6.evaluate(RandomizedRunner.java:879)
	at com.carrotsearch.randomizedtesting.RandomizedRunner$7.evaluate(RandomizedRunner.java:890)
	at com.carrotsearch.randomizedtesting.rules.StatementAdapter.evaluate(StatementAdapter.java:36)
	at com.carrotsearch.randomizedtesting.rules.SystemPropertiesRestoreRule$1.evaluate(SystemPropertiesRestoreRule.java:57)
	at org.apache.lucene.util.AbstractBeforeAfterRule$1.evaluate(AbstractBeforeAfterRule.java:45)
	at com.carrotsearch.randomizedtesting.rules.StatementAdapter.evaluate(StatementAdapter.java:36)
	at org.apache.lucene.util.TestRuleStoreClassName$1.evaluate(TestRuleStoreClassName.java:41)
	at com.carrotsearch.randomizedtesting.rules.NoShadowingOrOverridesOnMethodsRule$1.evaluate(NoShadowingOrOverridesOnMethodsRule.java:40)
	at com.carrotsearch.randomizedtesting.rules.NoShadowingOrOverridesOnMethodsRule$1.evaluate(NoShadowingOrOverridesOnMethodsRule.java:40)
	at com.carrotsearch.randomizedtesting.rules.StatementAdapter.evaluate(StatementAdapter.java:36)
	at com.carrotsearch.randomizedtesting.rules.StatementAdapter.evaluate(StatementAdapter.java:36)
	at com.carrotsearch.randomizedtesting.rules.StatementAdapter.evaluate(StatementAdapter.java:36)
	at org.apache.lucene.util.TestRuleAssertionsRequired$1.evaluate(TestRuleAssertionsRequired.java:53)
	at org.apache.lucene.util.TestRuleMarkFailure$1.evaluate(TestRuleMarkFailure.java:47)
	at org.apache.lucene.util.TestRuleIgnoreAfterMaxFailures$1.evaluate(TestRuleIgnoreAfterMaxFailures.java:64)
	at org.apache.lucene.util.TestRuleIgnoreTestSuites$1.evaluate(TestRuleIgnoreTestSuites.java:54)
	at com.carrotsearch.randomizedtesting.rules.StatementAdapter.evaluate(StatementAdapter.java:36)
	at com.carrotsearch.randomizedtesting.ThreadLeakControl$StatementRunner.run(ThreadLeakControl.java:368)
	at java.lang.Thread.run(Thread.java:748)
Caused by: org.apache.solr.client.solrj.impl.HttpSolrClient$RemoteSolrException: Error from server at https://127.0.0.1:42167/solr/MoveReplicaHDFSTest_failed_coll_true: no servers hosting shard: shard2
	at org.apache.solr.client.solrj.impl.HttpSolrClient.executeMethod(HttpSolrClient.java:643)
	at org.apache.solr.client.solrj.impl.HttpSolrClient.request(HttpSolrClient.java:255)
	at org.apache.solr.client.solrj.impl.HttpSolrClient.request(HttpSolrClient.java:244)
	at org.apache.solr.client.solrj.impl.LBHttpSolrClient.doRequest(LBHttpSolrClient.java:483)
	at org.apache.solr.client.solrj.impl.LBHttpSolrClient.request(LBHttpSolrClient.java:436)
	... 46 more


FAILED:  org.apache.solr.cloud.TestWithCollection.testDeleteWithCollection

Error Message:
Error from server at https://127.0.0.1:33783/solr: Could not find collection : testDeleteWithCollection_abc_2

Stack Trace:
org.apache.solr.client.solrj.impl.HttpSolrClient$RemoteSolrException: Error from server at https://127.0.0.1:33783/solr: Could not find collection : testDeleteWithCollection_abc_2
	at __randomizedtesting.SeedInfo.seed([1D6B3C201EBFC3C0:66B2CBCD4725117E]:0)
	at org.apache.solr.client.solrj.impl.HttpSolrClient.executeMethod(HttpSolrClient.java:643)
	at org.apache.solr.client.solrj.impl.HttpSolrClient.request(HttpSolrClient.java:255)
	at org.apache.solr.client.solrj.impl.HttpSolrClient.request(HttpSolrClient.java:244)
	at org.apache.solr.client.solrj.impl.LBHttpSolrClient.doRequest(LBHttpSolrClient.java:483)
	at org.apache.solr.client.solrj.impl.LBHttpSolrClient.request(LBHttpSolrClient.java:413)
	at org.apache.solr.client.solrj.impl.CloudSolrClient.sendRequest(CloudSolrClient.java:1106)
	at org.apache.solr.client.solrj.impl.CloudSolrClient.requestWithRetryOnStaleState(CloudSolrClient.java:886)
	at org.apache.solr.client.solrj.impl.CloudSolrClient.request(CloudSolrClient.java:819)
	at org.apache.solr.client.solrj.SolrRequest.process(SolrRequest.java:194)
	at org.apache.solr.client.solrj.SolrRequest.process(SolrRequest.java:211)
	at org.apache.solr.cloud.TestWithCollection.testDeleteWithCollection(TestWithCollection.java:224)
	at sun.reflect.NativeMethodAccessorImpl.invoke0(Native Method)
	at sun.reflect.NativeMethodAccessorImpl.invoke(NativeMethodAccessorImpl.java:62)
	at sun.reflect.DelegatingMethodAccessorImpl.invoke(DelegatingMethodAccessorImpl.java:43)
	at java.lang.reflect.Method.invoke(Method.java:498)
	at com.carrotsearch.randomizedtesting.RandomizedRunner.invoke(RandomizedRunner.java:1737)
	at com.carrotsearch.randomizedtesting.RandomizedRunner$8.evaluate(RandomizedRunner.java:934)
	at com.carrotsearch.randomizedtesting.RandomizedRunner$9.evaluate(RandomizedRunner.java:970)
	at com.carrotsearch.randomizedtesting.RandomizedRunner$10.evaluate(RandomizedRunner.java:984)
	at com.carrotsearch.randomizedtesting.rules.SystemPropertiesRestoreRule$1.evaluate(SystemPropertiesRestoreRule.java:57)
	at org.apache.lucene.util.TestRuleSetupTeardownChained$1.evaluate(TestRuleSetupTeardownChained.java:49)
	at org.apache.lucene.util.AbstractBeforeAfterRule$1.evaluate(AbstractBeforeAfterRule.java:45)
	at org.apache.lucene.util.TestRuleThreadAndTestName$1.evaluate(TestRuleThreadAndTestName.java:48)
	at org.apache.lucene.util.TestRuleIgnoreAfterMaxFailures$1.evaluate(TestRuleIgnoreAfterMaxFailures.java:64)
	at org.apache.lucene.util.TestRuleMarkFailure$1.evaluate(TestRuleMarkFailure.java:47)
	at com.carrotsearch.randomizedtesting.rules.StatementAdapter.evaluate(StatementAdapter.java:36)
	at com.carrotsearch.randomizedtesting.ThreadLeakControl$StatementRunner.run(ThreadLeakControl.java:368)
	at com.carrotsearch.randomizedtesting.ThreadLeakControl.forkTimeoutingTask(ThreadLeakControl.java:817)
	at com.carrotsearch.randomizedtesting.ThreadLeakControl$3.evaluate(ThreadLeakControl.java:468)
	at com.carrotsearch.randomizedtesting.RandomizedRunner.runSingleTest(RandomizedRunner.java:943)
	at com.carrotsearch.randomizedtesting.RandomizedRunner$5.evaluate(RandomizedRunner.java:829)
	at com.carrotsearch.randomizedtesting.RandomizedRunner$6.evaluate(RandomizedRunner.java:879)
	at com.carrotsearch.randomizedtesting.RandomizedRunner$7.evaluate(RandomizedRunner.java:890)
	at com.carrotsearch.randomizedtesting.rules.StatementAdapter.evaluate(StatementAdapter.java:36)
	at com.carrotsearch.randomizedtesting.rules.SystemPropertiesRestoreRule$1.evaluate(SystemPropertiesRestoreRule.java:57)
	at org.apache.lucene.util.AbstractBeforeAfterRule$1.evaluate(AbstractBeforeAfterRule.java:45)
	at com.carrotsearch.randomizedtesting.rules.StatementAdapter.evaluate(StatementAdapter.java:36)
	at org.apache.lucene.util.TestRuleStoreClassName$1.evaluate(TestRuleStoreClassName.java:41)
	at com.carrotsearch.randomizedtesting.rules.NoShadowingOrOverridesOnMethodsRule$1.evaluate(NoShadowingOrOverridesOnMethodsRule.java:40)
	at com.carrotsearch.randomizedtesting.rules.NoShadowingOrOverridesOnMethodsRule$1.evaluate(NoShadowingOrOverridesOnMethodsRule.java:40)
	at com.carrotsearch.randomizedtesting.rules.StatementAdapter.evaluate(StatementAdapter.java:36)
	at com.carrotsearch.randomizedtesting.rules.StatementAdapter.evaluate(StatementAdapter.java:36)
	at com.carrotsearch.randomizedtesting.rules.StatementAdapter.evaluate(StatementAdapter.java:36)
	at org.apache.lucene.util.TestRuleAssertionsRequired$1.evaluate(TestRuleAssertionsRequired.java:53)
	at org.apache.lucene.util.TestRuleMarkFailure$1.evaluate(TestRuleMarkFailure.java:47)
	at org.apache.lucene.util.TestRuleIgnoreAfterMaxFailures$1.evaluate(TestRuleIgnoreAfterMaxFailures.java:64)
	at org.apache.lucene.util.TestRuleIgnoreTestSuites$1.evaluate(TestRuleIgnoreTestSuites.java:54)
	at com.carrotsearch.randomizedtesting.rules.StatementAdapter.evaluate(StatementAdapter.java:36)
	at com.carrotsearch.randomizedtesting.ThreadLeakControl$StatementRunner.run(ThreadLeakControl.java:368)
	at java.lang.Thread.run(Thread.java:748)


FAILED:  org.apache.solr.cloud.TestWithCollection.testDeleteWithCollection

Error Message:
Error from server at https://127.0.0.1:36429/solr: Could not find collection : testDeleteWithCollection_abc_2

Stack Trace:
org.apache.solr.client.solrj.impl.HttpSolrClient$RemoteSolrException: Error from server at https://127.0.0.1:36429/solr: Could not find collection : testDeleteWithCollection_abc_2
	at __randomizedtesting.SeedInfo.seed([1D6B3C201EBFC3C0:66B2CBCD4725117E]:0)
	at org.apache.solr.client.solrj.impl.HttpSolrClient.executeMethod(HttpSolrClient.java:643)
	at org.apache.solr.client.solrj.impl.HttpSolrClient.request(HttpSolrClient.java:255)
	at org.apache.solr.client.solrj.impl.HttpSolrClient.request(HttpSolrClient.java:244)
	at org.apache.solr.client.solrj.impl.LBHttpSolrClient.doRequest(LBHttpSolrClient.java:483)
	at org.apache.solr.client.solrj.impl.LBHttpSolrClient.request(LBHttpSolrClient.java:413)
	at org.apache.solr.client.solrj.impl.CloudSolrClient.sendRequest(CloudSolrClient.java:1106)
	at org.apache.solr.client.solrj.impl.CloudSolrClient.requestWithRetryOnStaleState(CloudSolrClient.java:886)
	at org.apache.solr.client.solrj.impl.CloudSolrClient.request(CloudSolrClient.java:819)
	at org.apache.solr.client.solrj.SolrRequest.process(SolrRequest.java:194)
	at org.apache.solr.client.solrj.SolrRequest.process(SolrRequest.java:211)
	at org.apache.solr.cloud.TestWithCollection.testDeleteWithCollection(TestWithCollection.java:224)
	at sun.reflect.NativeMethodAccessorImpl.invoke0(Native Method)
	at sun.reflect.NativeMethodAccessorImpl.invoke(NativeMethodAccessorImpl.java:62)
	at sun.reflect.DelegatingMethodAccessorImpl.invoke(DelegatingMethodAccessorImpl.java:43)
	at java.lang.reflect.Method.invoke(Method.java:498)
	at com.carrotsearch.randomizedtesting.RandomizedRunner.invoke(RandomizedRunner.java:1737)
	at com.carrotsearch.randomizedtesting.RandomizedRunner$8.evaluate(RandomizedRunner.java:934)
	at com.carrotsearch.randomizedtesting.RandomizedRunner$9.evaluate(RandomizedRunner.java:970)
	at com.carrotsearch.randomizedtesting.RandomizedRunner$10.evaluate(RandomizedRunner.java:984)
	at com.carrotsearch.randomizedtesting.rules.SystemPropertiesRestoreRule$1.evaluate(SystemPropertiesRestoreRule.java:57)
	at org.apache.lucene.util.TestRuleSetupTeardownChained$1.evaluate(TestRuleSetupTeardownChained.java:49)
	at org.apache.lucene.util.AbstractBeforeAfterRule$1.evaluate(AbstractBeforeAfterRule.java:45)
	at org.apache.lucene.util.TestRuleThreadAndTestName$1.evaluate(TestRuleThreadAndTestName.java:48)
	at org.apache.lucene.util.TestRuleIgnoreAfterMaxFailures$1.evaluate(TestRuleIgnoreAfterMaxFailures.java:64)
	at org.apache.lucene.util.TestRuleMarkFailure$1.evaluate(TestRuleMarkFailure.java:47)
	at com.carrotsearch.randomizedtesting.rules.StatementAdapter.evaluate(StatementAdapter.java:36)
	at com.carrotsearch.randomizedtesting.ThreadLeakControl$StatementRunner.run(ThreadLeakControl.java:368)
	at com.carrotsearch.randomizedtesting.ThreadLeakControl.forkTimeoutingTask(ThreadLeakControl.java:817)
	at com.carrotsearch.randomizedtesting.ThreadLeakControl$3.evaluate(ThreadLeakControl.java:468)
	at com.carrotsearch.randomizedtesting.RandomizedRunner.runSingleTest(RandomizedRunner.java:943)
	at com.carrotsearch.randomizedtesting.RandomizedRunner$5.evaluate(RandomizedRunner.java:829)
	at com.carrotsearch.randomizedtesting.RandomizedRunner$6.evaluate(RandomizedRunner.java:879)
	at com.carrotsearch.randomizedtesting.RandomizedRunner$7.evaluate(RandomizedRunner.java:890)
	at com.carrotsearch.randomizedtesting.rules.StatementAdapter.evaluate(StatementAdapter.java:36)
	at com.carrotsearch.randomizedtesting.rules.SystemPropertiesRestoreRule$1.evaluate(SystemPropertiesRestoreRule.java:57)
	at org.apache.lucene.util.AbstractBeforeAfterRule$1.evaluate(AbstractBeforeAfterRule.java:45)
	at com.carrotsearch.randomizedtesting.rules.StatementAdapter.evaluate(StatementAdapter.java:36)
	at org.apache.lucene.util.TestRuleStoreClassName$1.evaluate(TestRuleStoreClassName.java:41)
	at com.carrotsearch.randomizedtesting.rules.NoShadowingOrOverridesOnMethodsRule$1.evaluate(NoShadowingOrOverridesOnMethodsRule.java:40)
	at com.carrotsearch.randomizedtesting.rules.NoShadowingOrOverridesOnMethodsRule$1.evaluate(NoShadowingOrOverridesOnMethodsRule.java:40)
	at com.carrotsearch.randomizedtesting.rules.StatementAdapter.evaluate(StatementAdapter.java:36)
	at com.carrotsearch.randomizedtesting.rules.StatementAdapter.evaluate(StatementAdapter.java:36)
	at com.carrotsearch.randomizedtesting.rules.StatementAdapter.evaluate(StatementAdapter.java:36)
	at org.apache.lucene.util.TestRuleAssertionsRequired$1.evaluate(TestRuleAssertionsRequired.java:53)
	at org.apache.lucene.util.TestRuleMarkFailure$1.evaluate(TestRuleMarkFailure.java:47)
	at org.apache.lucene.util.TestRuleIgnoreAfterMaxFailures$1.evaluate(TestRuleIgnoreAfterMaxFailures.java:64)
	at org.apache.lucene.util.TestRuleIgnoreTestSuites$1.evaluate(TestRuleIgnoreTestSuites.java:54)
	at com.carrotsearch.randomizedtesting.rules.StatementAdapter.evaluate(StatementAdapter.java:36)
	at com.carrotsearch.randomizedtesting.ThreadLeakControl$StatementRunner.run(ThreadLeakControl.java:368)
	at java.lang.Thread.run(Thread.java:748)


FAILED:  org.apache.solr.cloud.TestWithCollection.testMoveReplicaWithCollection

Error Message:
Expected moving a replica of 'withCollection': testMoveReplicaWithCollection_abc to fail

Stack Trace:
java.lang.AssertionError: Expected moving a replica of 'withCollection': testMoveReplicaWithCollection_abc to fail
	at __randomizedtesting.SeedInfo.seed([1D6B3C201EBFC3C0:527C05838DCD0AB6]:0)
	at org.junit.Assert.fail(Assert.java:93)
	at org.apache.solr.cloud.TestWithCollection.testMoveReplicaWithCollection(TestWithCollection.java:389)
	at sun.reflect.NativeMethodAccessorImpl.invoke0(Native Method)
	at sun.reflect.NativeMethodAccessorImpl.invoke(NativeMethodAccessorImpl.java:62)
	at sun.reflect.DelegatingMethodAccessorImpl.invoke(DelegatingMethodAccessorImpl.java:43)
	at java.lang.reflect.Method.invoke(Method.java:498)
	at com.carrotsearch.randomizedtesting.RandomizedRunner.invoke(RandomizedRunner.java:1737)
	at com.carrotsearch.randomizedtesting.RandomizedRunner$8.evaluate(RandomizedRunner.java:934)
	at com.carrotsearch.randomizedtesting.RandomizedRunner$9.evaluate(RandomizedRunner.java:970)
	at com.carrotsearch.randomizedtesting.RandomizedRunner$10.evaluate(RandomizedRunner.java:984)
	at com.carrotsearch.randomizedtesting.rules.SystemPropertiesRestoreRule$1.evaluate(SystemPropertiesRestoreRule.java:57)
	at org.apache.lucene.util.TestRuleSetupTeardownChained$1.evaluate(TestRuleSetupTeardownChained.java:49)
	at org.apache.lucene.util.AbstractBeforeAfterRule$1.evaluate(AbstractBeforeAfterRule.java:45)
	at org.apache.lucene.util.TestRuleThreadAndTestName$1.evaluate(TestRuleThreadAndTestName.java:48)
	at org.apache.lucene.util.TestRuleIgnoreAfterMaxFailures$1.evaluate(TestRuleIgnoreAfterMaxFailures.java:64)
	at org.apache.lucene.util.TestRuleMarkFailure$1.evaluate(TestRuleMarkFailure.java:47)
	at com.carrotsearch.randomizedtesting.rules.StatementAdapter.evaluate(StatementAdapter.java:36)
	at com.carrotsearch.randomizedtesting.ThreadLeakControl$StatementRunner.run(ThreadLeakControl.java:368)
	at com.carrotsearch.randomizedtesting.ThreadLeakControl.forkTimeoutingTask(ThreadLeakControl.java:817)
	at com.carrotsearch.randomizedtesting.ThreadLeakControl$3.evaluate(ThreadLeakControl.java:468)
	at com.carrotsearch.randomizedtesting.RandomizedRunner.runSingleTest(RandomizedRunner.java:943)
	at com.carrotsearch.randomizedtesting.RandomizedRunner$5.evaluate(RandomizedRunner.java:829)
	at com.carrotsearch.randomizedtesting.RandomizedRunner$6.evaluate(RandomizedRunner.java:879)
	at com.carrotsearch.randomizedtesting.RandomizedRunner$7.evaluate(RandomizedRunner.java:890)
	at com.carrotsearch.randomizedtesting.rules.StatementAdapter.evaluate(StatementAdapter.java:36)
	at com.carrotsearch.randomizedtesting.rules.SystemPropertiesRestoreRule$1.evaluate(SystemPropertiesRestoreRule.java:57)
	at org.apache.lucene.util.AbstractBeforeAfterRule$1.evaluate(AbstractBeforeAfterRule.java:45)
	at com.carrotsearch.randomizedtesting.rules.StatementAdapter.evaluate(StatementAdapter.java:36)
	at org.apache.lucene.util.TestRuleStoreClassName$1.evaluate(TestRuleStoreClassName.java:41)
	at com.carrotsearch.randomizedtesting.rules.NoShadowingOrOverridesOnMethodsRule$1.evaluate(NoShadowingOrOverridesOnMethodsRule.java:40)
	at com.carrotsearch.randomizedtesting.rules.NoShadowingOrOverridesOnMethodsRule$1.evaluate(NoShadowingOrOverridesOnMethodsRule.java:40)
	at com.carrotsearch.randomizedtesting.rules.StatementAdapter.evaluate(StatementAdapter.java:36)
	at com.carrotsearch.randomizedtesting.rules.StatementAdapter.evaluate(StatementAdapter.java:36)
	at com.carrotsearch.randomizedtesting.rules.StatementAdapter.evaluate(StatementAdapter.java:36)
	at org.apache.lucene.util.TestRuleAssertionsRequired$1.evaluate(TestRuleAssertionsRequired.java:53)
	at org.apache.lucene.util.TestRuleMarkFailure$1.evaluate(TestRuleMarkFailure.java:47)
	at org.apache.lucene.util.TestRuleIgnoreAfterMaxFailures$1.evaluate(TestRuleIgnoreAfterMaxFailures.java:64)
	at org.apache.lucene.util.TestRuleIgnoreTestSuites$1.evaluate(TestRuleIgnoreTestSuites.java:54)
	at com.carrotsearch.randomizedtesting.rules.StatementAdapter.evaluate(StatementAdapter.java:36)
	at com.carrotsearch.randomizedtesting.ThreadLeakControl$StatementRunner.run(ThreadLeakControl.java:368)
	at java.lang.Thread.run(Thread.java:748)


FAILED:  org.apache.solr.cloud.TestWithCollection.testDeleteWithCollection

Error Message:
Error from server at https://127.0.0.1:36405/solr: Could not find collection : testDeleteWithCollection_abc_2

Stack Trace:
org.apache.solr.client.solrj.impl.HttpSolrClient$RemoteSolrException: Error from server at https://127.0.0.1:36405/solr: Could not find collection : testDeleteWithCollection_abc_2
	at __randomizedtesting.SeedInfo.seed([1D6B3C201EBFC3C0:66B2CBCD4725117E]:0)
	at org.apache.solr.client.solrj.impl.HttpSolrClient.executeMethod(HttpSolrClient.java:643)
	at org.apache.solr.client.solrj.impl.HttpSolrClient.request(HttpSolrClient.java:255)
	at org.apache.solr.client.solrj.impl.HttpSolrClient.request(HttpSolrClient.java:244)
	at org.apache.solr.client.solrj.impl.LBHttpSolrClient.doRequest(LBHttpSolrClient.java:483)
	at org.apache.solr.client.solrj.impl.LBHttpSolrClient.request(LBHttpSolrClient.java:413)
	at org.apache.solr.client.solrj.impl.CloudSolrClient.sendRequest(CloudSolrClient.java:1106)
	at org.apache.solr.client.solrj.impl.CloudSolrClient.requestWithRetryOnStaleState(CloudSolrClient.java:886)
	at org.apache.solr.client.solrj.impl.CloudSolrClient.request(CloudSolrClient.java:819)
	at org.apache.solr.client.solrj.SolrRequest.process(SolrRequest.java:194)
	at org.apache.solr.client.solrj.SolrRequest.process(SolrRequest.java:211)
	at org.apache.solr.cloud.TestWithCollection.testDeleteWithCollection(TestWithCollection.java:224)
	at sun.reflect.NativeMethodAccessorImpl.invoke0(Native Method)
	at sun.reflect.NativeMethodAccessorImpl.invoke(NativeMethodAccessorImpl.java:62)
	at sun.reflect.DelegatingMethodAccessorImpl.invoke(DelegatingMethodAccessorImpl.java:43)
	at java.lang.reflect.Method.invoke(Method.java:498)
	at com.carrotsearch.randomizedtesting.RandomizedRunner.invoke(RandomizedRunner.java:1737)
	at com.carrotsearch.randomizedtesting.RandomizedRunner$8.evaluate(RandomizedRunner.java:934)
	at com.carrotsearch.randomizedtesting.RandomizedRunner$9.evaluate(RandomizedRunner.java:970)
	at com.carrotsearch.randomizedtesting.RandomizedRunner$10.evaluate(RandomizedRunner.java:984)
	at com.carrotsearch.randomizedtesting.rules.SystemPropertiesRestoreRule$1.evaluate(SystemPropertiesRestoreRule.java:57)
	at org.apache.lucene.util.TestRuleSetupTeardownChained$1.evaluate(TestRuleSetupTeardownChained.java:49)
	at org.apache.lucene.util.AbstractBeforeAfterRule$1.evaluate(AbstractBeforeAfterRule.java:45)
	at org.apache.lucene.util.TestRuleThreadAndTestName$1.evaluate(TestRuleThreadAndTestName.java:48)
	at org.apache.lucene.util.TestRuleIgnoreAfterMaxFailures$1.evaluate(TestRuleIgnoreAfterMaxFailures.java:64)
	at org.apache.lucene.util.TestRuleMarkFailure$1.evaluate(TestRuleMarkFailure.java:47)
	at com.carrotsearch.randomizedtesting.rules.StatementAdapter.evaluate(StatementAdapter.java:36)
	at com.carrotsearch.randomizedtesting.ThreadLeakControl$StatementRunner.run(ThreadLeakControl.java:368)
	at com.carrotsearch.randomizedtesting.ThreadLeakControl.forkTimeoutingTask(ThreadLeakControl.java:817)
	at com.carrotsearch.randomizedtesting.ThreadLeakControl$3.evaluate(ThreadLeakControl.java:468)
	at com.carrotsearch.randomizedtesting.RandomizedRunner.runSingleTest(RandomizedRunner.java:943)
	at com.carrotsearch.randomizedtesting.RandomizedRunner$5.evaluate(RandomizedRunner.java:829)
	at com.carrotsearch.randomizedtesting.RandomizedRunner$6.evaluate(RandomizedRunner.java:879)
	at com.carrotsearch.randomizedtesting.RandomizedRunner$7.evaluate(RandomizedRunner.java:890)
	at com.carrotsearch.randomizedtesting.rules.StatementAdapter.evaluate(StatementAdapter.java:36)
	at com.carrotsearch.randomizedtesting.rules.SystemPropertiesRestoreRule$1.evaluate(SystemPropertiesRestoreRule.java:57)
	at org.apache.lucene.util.AbstractBeforeAfterRule$1.evaluate(AbstractBeforeAfterRule.java:45)
	at com.carrotsearch.randomizedtesting.rules.StatementAdapter.evaluate(StatementAdapter.java:36)
	at org.apache.lucene.util.TestRuleStoreClassName$1.evaluate(TestRuleStoreClassName.java:41)
	at com.carrotsearch.randomizedtesting.rules.NoShadowingOrOverridesOnMethodsRule$1.evaluate(NoShadowingOrOverridesOnMethodsRule.java:40)
	at com.carrotsearch.randomizedtesting.rules.NoShadowingOrOverridesOnMethodsRule$1.evaluate(NoShadowingOrOverridesOnMethodsRule.java:40)
	at com.carrotsearch.randomizedtesting.rules.StatementAdapter.evaluate(StatementAdapter.java:36)
	at com.carrotsearch.randomizedtesting.rules.StatementAdapter.evaluate(StatementAdapter.java:36)
	at com.carrotsearch.randomizedtesting.rules.StatementAdapter.evaluate(StatementAdapter.java:36)
	at org.apache.lucene.util.TestRuleAssertionsRequired$1.evaluate(TestRuleAssertionsRequired.java:53)
	at org.apache.lucene.util.TestRuleMarkFailure$1.evaluate(TestRuleMarkFailure.java:47)
	at org.apache.lucene.util.TestRuleIgnoreAfterMaxFailures$1.evaluate(TestRuleIgnoreAfterMaxFailures.java:64)
	at org.apache.lucene.util.TestRuleIgnoreTestSuites$1.evaluate(TestRuleIgnoreTestSuites.java:54)
	at com.carrotsearch.randomizedtesting.rules.StatementAdapter.evaluate(StatementAdapter.java:36)
	at com.carrotsearch.randomizedtesting.ThreadLeakControl$StatementRunner.run(ThreadLeakControl.java:368)
	at java.lang.Thread.run(Thread.java:748)


FAILED:  org.apache.solr.cloud.TestWithCollection.testMoveReplicaWithCollection

Error Message:
Expected moving a replica of 'withCollection': testMoveReplicaWithCollection_abc to fail

Stack Trace:
java.lang.AssertionError: Expected moving a replica of 'withCollection': testMoveReplicaWithCollection_abc to fail
	at __randomizedtesting.SeedInfo.seed([1D6B3C201EBFC3C0:527C05838DCD0AB6]:0)
	at org.junit.Assert.fail(Assert.java:93)
	at org.apache.solr.cloud.TestWithCollection.testMoveReplicaWithCollection(TestWithCollection.java:389)
	at sun.reflect.NativeMethodAccessorImpl.invoke0(Native Method)
	at sun.reflect.NativeMethodAccessorImpl.invoke(NativeMethodAccessorImpl.java:62)
	at sun.reflect.DelegatingMethodAccessorImpl.invoke(DelegatingMethodAccessorImpl.java:43)
	at java.lang.reflect.Method.invoke(Method.java:498)
	at com.carrotsearch.randomizedtesting.RandomizedRunner.invoke(RandomizedRunner.java:1737)
	at com.carrotsearch.randomizedtesting.RandomizedRunner$8.evaluate(RandomizedRunner.java:934)
	at com.carrotsearch.randomizedtesting.RandomizedRunner$9.evaluate(RandomizedRunner.java:970)
	at com.carrotsearch.randomizedtesting.RandomizedRunner$10.evaluate(RandomizedRunner.java:984)
	at com.carrotsearch.randomizedtesting.rules.SystemPropertiesRestoreRule$1.evaluate(SystemPropertiesRestoreRule.java:57)
	at org.apache.lucene.util.TestRuleSetupTeardownChained$1.evaluate(TestRuleSetupTeardownChained.java:49)
	at org.apache.lucene.util.AbstractBeforeAfterRule$1.evaluate(AbstractBeforeAfterRule.java:45)
	at org.apache.lucene.util.TestRuleThreadAndTestName$1.evaluate(TestRuleThreadAndTestName.java:48)
	at org.apache.lucene.util.TestRuleIgnoreAfterMaxFailures$1.evaluate(TestRuleIgnoreAfterMaxFailures.java:64)
	at org.apache.lucene.util.TestRuleMarkFailure$1.evaluate(TestRuleMarkFailure.java:47)
	at com.carrotsearch.randomizedtesting.rules.StatementAdapter.evaluate(StatementAdapter.java:36)
	at com.carrotsearch.randomizedtesting.ThreadLeakControl$StatementRunner.run(ThreadLeakControl.java:368)
	at com.carrotsearch.randomizedtesting.ThreadLeakControl.forkTimeoutingTask(ThreadLeakControl.java:817)
	at com.carrotsearch.randomizedtesting.ThreadLeakControl$3.evaluate(ThreadLeakControl.java:468)
	at com.carrotsearch.randomizedtesting.RandomizedRunner.runSingleTest(RandomizedRunner.java:943)
	at com.carrotsearch.randomizedtesting.RandomizedRunner$5.evaluate(RandomizedRunner.java:829)
	at com.carrotsearch.randomizedtesting.RandomizedRunner$6.evaluate(RandomizedRunner.java:879)
	at com.carrotsearch.randomizedtesting.RandomizedRunner$7.evaluate(RandomizedRunner.java:890)
	at com.carrotsearch.randomizedtesting.rules.StatementAdapter.evaluate(StatementAdapter.java:36)
	at com.carrotsearch.randomizedtesting.rules.SystemPropertiesRestoreRule$1.evaluate(SystemPropertiesRestoreRule.java:57)
	at org.apache.lucene.util.AbstractBeforeAfterRule$1.evaluate(AbstractBeforeAfterRule.java:45)
	at com.carrotsearch.randomizedtesting.rules.StatementAdapter.evaluate(StatementAdapter.java:36)
	at org.apache.lucene.util.TestRuleStoreClassName$1.evaluate(TestRuleStoreClassName.java:41)
	at com.carrotsearch.randomizedtesting.rules.NoShadowingOrOverridesOnMethodsRule$1.evaluate(NoShadowingOrOverridesOnMethodsRule.java:40)
	at com.carrotsearch.randomizedtesting.rules.NoShadowingOrOverridesOnMethodsRule$1.evaluate(NoShadowingOrOverridesOnMethodsRule.java:40)
	at com.carrotsearch.randomizedtesting.rules.StatementAdapter.evaluate(StatementAdapter.java:36)
	at com.carrotsearch.randomizedtesting.rules.StatementAdapter.evaluate(StatementAdapter.java:36)
	at com.carrotsearch.randomizedtesting.rules.StatementAdapter.evaluate(StatementAdapter.java:36)
	at org.apache.lucene.util.TestRuleAssertionsRequired$1.evaluate(TestRuleAssertionsRequired.java:53)
	at org.apache.lucene.util.TestRuleMarkFailure$1.evaluate(TestRuleMarkFailure.java:47)
	at org.apache.lucene.util.TestRuleIgnoreAfterMaxFailures$1.evaluate(TestRuleIgnoreAfterMaxFailures.java:64)
	at org.apache.lucene.util.TestRuleIgnoreTestSuites$1.evaluate(TestRuleIgnoreTestSuites.java:54)
	at com.carrotsearch.randomizedtesting.rules.StatementAdapter.evaluate(StatementAdapter.java:36)
	at com.carrotsearch.randomizedtesting.ThreadLeakControl$StatementRunner.run(ThreadLeakControl.java:368)
	at java.lang.Thread.run(Thread.java:748)




Build Log:
[...truncated 13820 lines...]
   [junit4] Suite: org.apache.solr.cloud.MoveReplicaHDFSTest
   [junit4]   2> Creating dataDir: /home/jenkins/workspace/Lucene-Solr-BadApples-master-Linux/solr/build/solr-core/test/J2/temp/solr.cloud.MoveReplicaHDFSTest_1D6B3C201EBFC3C0-001/init-core-data-001
   [junit4]   2> 2402235 INFO  (SUITE-MoveReplicaHDFSTest-seed#[1D6B3C201EBFC3C0]-worker) [    ] o.a.s.c.MiniSolrCloudCluster Starting cluster of 4 servers in /home/jenkins/workspace/Lucene-Solr-BadApples-master-Linux/solr/build/solr-core/test/J2/temp/solr.cloud.MoveReplicaHDFSTest_1D6B3C201EBFC3C0-001/tempDir-001
   [junit4]   2> 2402235 INFO  (SUITE-MoveReplicaHDFSTest-seed#[1D6B3C201EBFC3C0]-worker) [    ] o.a.s.c.ZkTestServer STARTING ZK TEST SERVER
   [junit4]   2> 2402236 INFO  (Thread-4566) [    ] o.a.s.c.ZkTestServer client port:0.0.0.0/0.0.0.0:0
   [junit4]   2> 2402236 INFO  (Thread-4566) [    ] o.a.s.c.ZkTestServer Starting server
   [junit4]   2> 2402238 ERROR (Thread-4566) [    ] o.a.z.s.ZooKeeperServer ZKShutdownHandler is not registered, so ZooKeeper server won't take any action on ERROR or SHUTDOWN server state changes
   [junit4]   2> 2402336 INFO  (SUITE-MoveReplicaHDFSTest-seed#[1D6B3C201EBFC3C0]-worker) [    ] o.a.s.c.ZkTestServer start zk server on port:39447
   [junit4]   2> 2402338 INFO  (zkConnectionManagerCallback-4970-thread-1) [    ] o.a.s.c.c.ConnectionManager zkClient has connected
   [junit4]   2> 2402349 INFO  (jetty-launcher-4967-thread-1) [    ] o.e.j.s.Server jetty-9.4.11.v20180605; built: 2018-06-05T18:24:03.829Z; git: d5fc0523cfa96bfebfbda19606cad384d772f04c; jvm 1.8.0_172-b11
   [junit4]   2> 2402349 INFO  (jetty-launcher-4967-thread-2) [    ] o.e.j.s.Server jetty-9.4.11.v20180605; built: 2018-06-05T18:24:03.829Z; git: d5fc0523cfa96bfebfbda19606cad384d772f04c; jvm 1.8.0_172-b11
   [junit4]   2> 2402350 INFO  (jetty-launcher-4967-thread-3) [    ] o.e.j.s.Server jetty-9.4.11.v20180605; built: 2018-06-05T18:24:03.829Z; git: d5fc0523cfa96bfebfbda19606cad384d772f04c; jvm 1.8.0_172-b11
   [junit4]   2> 2402351 INFO  (jetty-launcher-4967-thread-4) [    ] o.e.j.s.Server jetty-9.4.11.v20180605; built: 2018-06-05T18:24:03.829Z; git: d5fc0523cfa96bfebfbda19606cad384d772f04c; jvm 1.8.0_172-b11
   [junit4]   2> 2402357 INFO  (jetty-launcher-4967-thread-2) [    ] o.e.j.s.session DefaultSessionIdManager workerName=node0
   [junit4]   2> 2402357 INFO  (jetty-launcher-4967-thread-2) [    ] o.e.j.s.session No SessionScavenger set, using defaults
   [junit4]   2> 2402357 INFO  (jetty-launcher-4967-thread-2) [    ] o.e.j.s.session node0 Scavenging every 600000ms
   [junit4]   2> 2402358 INFO  (jetty-launcher-4967-thread-3) [    ] o.e.j.s.session DefaultSessionIdManager workerName=node0
   [junit4]   2> 2402358 INFO  (jetty-launcher-4967-thread-3) [    ] o.e.j.s.session No SessionScavenger set, using defaults
   [junit4]   2> 2402358 INFO  (jetty-launcher-4967-thread-2) [    ] o.e.j.s.h.ContextHandler Started o.e.j.s.ServletContextHandler@8cd014{/solr,null,AVAILABLE}
   [junit4]   2> 2402358 INFO  (jetty-launcher-4967-thread-3) [    ] o.e.j.s.session node0 Scavenging every 660000ms
   [junit4]   2> 2402358 INFO  (jetty-launcher-4967-thread-3) [    ] o.e.j.s.h.ContextHandler Started o.e.j.s.ServletContextHandler@54f619{/solr,null,AVAILABLE}
   [junit4]   2> 2402362 INFO  (jetty-launcher-4967-thread-2) [    ] o.e.j.s.AbstractConnector Started ServerConnector@1eadfef{SSL,[ssl, http/1.1]}{127.0.0.1:42993}
   [junit4]   2> 2402362 INFO  (jetty-launcher-4967-thread-1) [    ] o.e.j.s.session DefaultSessionIdManager workerName=node0
   [junit4]   2> 2402362 INFO  (jetty-launcher-4967-thread-1) [    ] o.e.j.s.session No SessionScavenger set, using defaults
   [junit4]   2> 2402362 INFO  (jetty-launcher-4967-thread-2) [    ] o.e.j.s.Server Started @2402420ms
   [junit4]   2> 2402363 INFO  (jetty-launcher-4967-thread-1) [    ] o.e.j.s.session node0 Scavenging every 660000ms
   [junit4]   2> 2402363 INFO  (jetty-launcher-4967-thread-2) [    ] o.a.s.c.s.e.JettySolrRunner Jetty properties: {hostContext=/solr, hostPort=42993}
   [junit4]   2> 2402363 ERROR (jetty-launcher-4967-thread-2) [    ] o.a.s.u.StartupLoggingUtils Missing Java Option solr.log.dir. Logging may be missing or incomplete.
   [junit4]   2> 2402363 INFO  (jetty-launcher-4967-thread-1) [    ] o.e.j.s.h.ContextHandler Started o.e.j.s.ServletContextHandler@1285476{/solr,null,AVAILABLE}
   [junit4]   2> 2402363 INFO  (jetty-launcher-4967-thread-2) [    ] o.a.s.s.SolrDispatchFilter Using logger factory org.apache.logging.slf4j.Log4jLoggerFactory
   [junit4]   2> 2402364 INFO  (jetty-launcher-4967-thread-4) [    ] o.e.j.s.session DefaultSessionIdManager workerName=node0
   [junit4]   2> 2402364 INFO  (jetty-launcher-4967-thread-4) [    ] o.e.j.s.session No SessionScavenger set, using defaults
   [junit4]   2> 2402364 INFO  (jetty-launcher-4967-thread-4) [    ] o.e.j.s.session node0 Scavenging every 660000ms
   [junit4]   2> 2402364 INFO  (jetty-launcher-4967-thread-3) [    ] o.e.j.s.AbstractConnector Started ServerConnector@10e6036{SSL,[ssl, http/1.1]}{127.0.0.1:39821}
   [junit4]   2> 2402364 INFO  (jetty-launcher-4967-thread-3) [    ] o.e.j.s.Server Started @2402422ms
   [junit4]   2> 2402364 INFO  (jetty-launcher-4967-thread-3) [    ] o.a.s.c.s.e.JettySolrRunner Jetty properties: {hostContext=/solr, hostPort=39821}
   [junit4]   2> 2402364 INFO  (jetty-launcher-4967-thread-4) [    ] o.e.j.s.h.ContextHandler Started o.e.j.s.ServletContextHandler@296609{/solr,null,AVAILABLE}
   [junit4]   2> 2402364 ERROR (jetty-launcher-4967-thread-3) [    ] o.a.s.u.StartupLoggingUtils Missing Java Option solr.log.dir. Logging may be missing or incomplete.
   [junit4]   2> 2402365 INFO  (jetty-launcher-4967-thread-3) [    ] o.a.s.s.SolrDispatchFilter Using logger factory org.apache.logging.slf4j.Log4jLoggerFactory
   [junit4]   2> 2402365 INFO  (jetty-launcher-4967-thread-3) [    ] o.a.s.s.SolrDispatchFilter  ___      _       Welcome to Apache Solr? version 8.0.0
   [junit4]   2> 2402365 INFO  (jetty-launcher-4967-thread-3) [    ] o.a.s.s.SolrDispatchFilter / __| ___| |_ _   Starting in cloud mode on port null
   [junit4]   2> 2402365 INFO  (jetty-launcher-4967-thread-3) [    ] o.a.s.s.SolrDispatchFilter \__ \/ _ \ | '_|  Install dir: null
   [junit4]   2> 2402365 INFO  (jetty-launcher-4967-thread-3) [    ] o.a.s.s.SolrDispatchFilter |___/\___/_|_|    Start time: 2018-08-14T03:31:22.725Z
   [junit4]   2> 2402365 INFO  (jetty-launcher-4967-thread-4) [    ] o.e.j.s.AbstractConnector Started ServerConnector@49bf8d{SSL,[ssl, http/1.1]}{127.0.0.1:42167}
   [junit4]   2> 2402365 INFO  (jetty-launcher-4967-thread-4) [    ] o.e.j.s.Server Started @2402423ms
   [junit4]   2> 2402365 INFO  (jetty-launcher-4967-thread-4) [    ] o.a.s.c.s.e.JettySolrRunner Jetty properties: {hostContext=/solr, hostPort=42167}
   [junit4]   2> 2402365 ERROR (jetty-launcher-4967-thread-4) [    ] o.a.s.u.StartupLoggingUtils Missing Java Option solr.log.dir. Logging may be missing or incomplete.
   [junit4]   2> 2402366 INFO  (jetty-launcher-4967-thread-4) [    ] o.a.s.s.SolrDispatchFilter Using logger factory org.apache.logging.slf4j.Log4jLoggerFactory
   [junit4]   2> 2402366 INFO  (jetty-launcher-4967-thread-4) [    ] o.a.s.s.SolrDispatchFilter  ___      _       Welcome to Apache Solr? version 8.0.0
   [junit4]   2> 2402366 INFO  (jetty-launcher-4967-thread-4) [    ] o.a.s.s.SolrDispatchFilter / __| ___| |_ _   Starting in cloud mode on port null
   [junit4]   2> 2402366 INFO  (jetty-launcher-4967-thread-4) [    ] o.a.s.s.SolrDispatchFilter \__ \/ _ \ | '_|  Install dir: null
   [junit4]   2> 2402366 INFO  (jetty-launcher-4967-thread-4) [    ] o.a.s.s.SolrDispatchFilter |___/\___/_|_|    Start time: 2018-08-14T03:31:22.726Z
   [junit4]   2> 2402364 INFO  (jetty-launcher-4967-thread-1) [    ] o.e.j.s.AbstractConnector Started ServerConnector@19975dc{SSL,[ssl, http/1.1]}{127.0.0.1:39611}
   [junit4]   2> 2402364 INFO  (jetty-launcher-4967-thread-2) [    ] o.a.s.s.SolrDispatchFilter  ___      _       Welcome to Apache Solr? version 8.0.0
   [junit4]   2> 2402367 INFO  (jetty-launcher-4967-thread-1) [    ] o.e.j.s.Server Started @2402424ms
   [junit4]   2> 2402367 INFO  (jetty-launcher-4967-thread-2) [    ] o.a.s.s.SolrDispatchFilter / __| ___| |_ _   Starting in cloud mode on port null
   [junit4]   2> 2402367 INFO  (jetty-launcher-4967-thread-1) [    ] o.a.s.c.s.e.JettySolrRunner Jetty properties: {hostContext=/solr, hostPort=39611}
   [junit4]   2> 2402367 INFO  (jetty-launcher-4967-thread-2) [    ] o.a.s.s.SolrDispatchFilter \__ \/ _ \ | '_|  Install dir: null
   [junit4]   2> 2402367 INFO  (jetty-launcher-4967-thread-2) [    ] o.a.s.s.SolrDispatchFilter |___/\___/_|_|    Start time: 2018-08-14T03:31:22.727Z
   [junit4]   2> 2402367 ERROR (jetty-launcher-4967-thread-1) [    ] o.a.s.u.StartupLoggingUtils Missing Java Option solr.log.dir. Logging may be missing or incomplete.
   [junit4]   2> 2402367 INFO  (jetty-launcher-4967-thread-1) [    ] o.a.s.s.SolrDispatchFilter Using logger factory org.apache.logging.slf4j.Log4jLoggerFactory
   [junit4]   2> 2402367 INFO  (jetty-launcher-4967-thread-1) [    ] o.a.s.s.SolrDispatchFilter  ___      _       Welcome to Apache Solr? version 8.0.0
   [junit4]   2> 2402367 INFO  (jetty-launcher-4967-thread-1) [    ] o.a.s.s.SolrDispatchFilter / __| ___| |_ _   Starting in cloud mode on port null
   [junit4]   2> 2402367 INFO  (jetty-launcher-4967-thread-1) [    ] o.a.s.s.SolrDispatchFilter \__ \/ _ \ | '_|  Install dir: null
   [junit4]   2> 2402367 INFO  (jetty-launcher-4967-thread-1) [    ] o.a.s.s.SolrDispatchFilter |___/\___/_|_|    Start time: 2018-08-14T03:31:22.727Z
   [junit4]   2> 2402369 INFO  (zkConnectionManagerCallback-4974-thread-1) [    ] o.a.s.c.c.ConnectionManager zkClient has connected
   [junit4]   2> 2402369 INFO  (jetty-launcher-4967-thread-4) [    ] o.a.s.s.SolrDispatchFilter solr.xml found in ZooKeeper. Loading...
   [junit4]   2> 2402377 INFO  (zkConnectionManagerCallback-4978-thread-1) [    ] o.a.s.c.c.ConnectionManager zkClient has connected
   [junit4]   2> 2402378 INFO  (zkConnectionManagerCallback-4972-thread-1) [    ] o.a.s.c.c.ConnectionManager zkClient has connected
   [junit4]   2> 2402379 INFO  (jetty-launcher-4967-thread-1) [    ] o.a.s.s.SolrDispatchFilter solr.xml found in ZooKeeper. Loading...
   [junit4]   2> 2402379 INFO  (jetty-launcher-4967-thread-3) [    ] o.a.s.s.SolrDispatchFilter solr.xml found in ZooKeeper. Loading...
   [junit4]   2> 2402379 INFO  (zkConnectionManagerCallback-4976-thread-1) [    ] o.a.s.c.c.ConnectionManager zkClient has connected
   [junit4]   2> 2402399 INFO  (jetty-launcher-4967-thread-2) [    ] o.a.s.s.SolrDispatchFilter solr.xml found in ZooKeeper. Loading...
   [junit4]   2> 2403459 INFO  (jetty-launcher-4967-thread-3) [    ] o.a.s.c.ZkContainer Zookeeper client=127.0.0.1:39447/solr
   [junit4]   2> 2403468 INFO  (zkConnectionManagerCallback-4982-thread-1) [    ] o.a.s.c.c.ConnectionManager zkClient has connected
   [junit4]   2> 2403469 DEBUG (jetty-launcher-4967-thread-3) [n:127.0.0.1:39821_solr    ] o.a.s.c.ZkController Added new OnReconnect listener org.apache.solr.cloud.ZkController$$Lambda$42/4209756@2c2784
   [junit4]   2> 2403479 INFO  (zkConnectionManagerCallback-4984-thread-1) [    ] o.a.s.c.c.ConnectionManager zkClient has connected
   [junit4]   2> 2403530 DEBUG (SyncThread:0) [    ] o.a.s.c.ZkTestServer Watch added: data: /solr/clusterprops.json
   [junit4]   2> 2403530 DEBUG (SyncThread:0) [    ] o.a.s.c.ZkTestServer Watch added: children: /solr/live_nodes
   [junit4]   2> 2403530 DEBUG (SyncThread:0) [    ] o.a.s.c.ZkTestServer Watch added: data: /solr/clusterstate.json
   [junit4]   2> 2403530 DEBUG (SyncThread:0) [    ] o.a.s.c.ZkTestServer Watch added: children: /solr/collections
   [junit4]   2> 2403530 DEBUG (SyncThread:0) [    ] o.a.s.c.ZkTestServer Watch added: create/delete: /solr/aliases.json
   [junit4]   2> 2403531 DEBUG (SyncThread:0) [    ] o.a.s.c.ZkTestServer Watch added: create/delete: /solr/security.json
   [junit4]   2> 2403532 DEBUG (jetty-launcher-4967-thread-3) [n:127.0.0.1:39821_solr    ] o.a.s.c.LeaderElector Joined leadership election with path: /overseer_elect/election/72157193518448646-127.0.0.1:39821_solr-n_0000000000
   [junit4]   2> 2403532 INFO  (jetty-launcher-4967-thread-3) [n:127.0.0.1:39821_solr    ] o.a.s.c.OverseerElectionContext I am going to be the leader 127.0.0.1:39821_solr
   [junit4]   2> 2403533 INFO  (jetty-launcher-4967-thread-3) [n:127.0.0.1:39821_solr    ] o.a.s.c.Overseer Overseer (id=72157193518448646-127.0.0.1:39821_solr-n_0000000000) starting
   [junit4]   2> 2403540 INFO  (zkConnectionManagerCallback-4991-thread-1) [    ] o.a.s.c.c.ConnectionManager zkClient has connected
   [junit4]   2> 2403541 DEBUG (SyncThread:0) [    ] o.a.s.c.ZkTestServer Watch added: data: /solr/clusterprops.json
   [junit4]   2> 2403541 DEBUG (SyncThread:0) [    ] o.a.s.c.ZkTestServer Watch added: children: /solr/live_nodes
   [junit4]   2> 2403541 DEBUG (SyncThread:0) [    ] o.a.s.c.ZkTestServer Watch added: data: /solr/clusterstate.json
   [junit4]   2> 2403541 DEBUG (SyncThread:0) [    ] o.a.s.c.ZkTestServer Watch added: children: /solr/collections
   [junit4]   2> 2403541 DEBUG (SyncThread:0) [    ] o.a.s.c.ZkTestServer Watch added: create/delete: /solr/aliases.json
   [junit4]   2> 2403542 INFO  (jetty-launcher-4967-thread-3) [n:127.0.0.1:39821_solr    ] o.a.s.c.s.i.ZkClientClusterStateProvider Cluster at 127.0.0.1:39447/solr ready
   [junit4]   2> 2403548 INFO  (OverseerStateUpdate-72157193518448646-127.0.0.1:39821_solr-n_0000000000) [    ] o.a.s.c.Overseer Starting to work on the main queue : 127.0.0.1:39821_solr
   [junit4]   2> 2403549 DEBUG (SyncThread:0) [    ] o.a.s.c.ZkTestServer Watch added: children: /solr/overseer/queue-work
   [junit4]   2> 2403549 DEBUG (SyncThread:0) [    ] o.a.s.c.ZkTestServer Watch added: children: /solr/overseer/queue
   [junit4]   2> 2403556 DEBUG (OverseerCollectionConfigSetProcessor-72157193518448646-127.0.0.1:39821_solr-n_0000000000) [    ] o.a.s.c.OverseerTaskProcessor Process current queue of overseer operations
   [junit4]   2> 2403557 DEBUG (OverseerAutoScalingTriggerThread-72157193518448646-127.0.0.1:39821_solr-n_0000000000) [    ] o.a.s.c.a.OverseerTriggerThread Adding .auto_add_replicas and .scheduled_maintenance triggers
   [junit4]   2> 2403557 INFO  (jetty-launcher-4967-thread-3) [n:127.0.0.1:39821_solr    ] o.a.s.c.ZkController Register node as live in ZooKeeper:/live_nodes/127.0.0.1:39821_solr
   [junit4]   2> 2403557 DEBUG (SyncThread:0) [    ] o.a.s.c.ZkTestServer Watch added: data: /solr/autoscaling.json
   [junit4]   2> 2403558 DEBUG (OverseerAutoScalingTriggerThread-72157193518448646-127.0.0.1:39821_solr-n_0000000000) [    ] o.a.s.c.a.OverseerTriggerThread Refreshing /autoscaling.json with znode version 1
   [junit4]   2> 2403558 DEBUG (SyncThread:0) [    ] o.a.s.c.ZkTestServer Watch fired: children: /solr/live_nodes
   [junit4]   2> 2403558 DEBUG (SyncThread:0) [    ] o.a.s.c.ZkTestServer Watch fired: children: /solr/live_nodes
   [junit4]   2> 2403558 DEBUG (OverseerAutoScalingTriggerThread-72157193518448646-127.0.0.1:39821_solr-n_0000000000) [    ] o.a.s.c.a.OverseerTriggerThread Current znodeVersion 1, lastZnodeVersion -1
   [junit4]   2> 2403558 DEBUG (OverseerAutoScalingTriggerThread-72157193518448646-127.0.0.1:39821_solr-n_0000000000) [    ] o.a.s.c.a.OverseerTriggerThread Processed trigger updates upto znodeVersion 1
   [junit4]   2> 2403559 DEBUG (OverseerCollectionConfigSetProcessor-72157193518448646-127.0.0.1:39821_solr-n_0000000000) [    ] o.a.s.c.OverseerTaskProcessor Cleaning up work-queue. #Running tasks: 0
   [junit4]   2> 2403559 DEBUG (OverseerCollectionConfigSetProcessor-72157193518448646-127.0.0.1:39821_solr-n_0000000000) [    ] o.a.s.c.OverseerTaskProcessor RunningTasks: []
   [junit4]   2> 2403559 DEBUG (OverseerCollectionConfigSetProcessor-72157193518448646-127.0.0.1:39821_solr-n_0000000000) [    ] o.a.s.c.OverseerTaskProcessor BlockedTasks: []
   [junit4]   2> 2403559 DEBUG (OverseerCollectionConfigSetProcessor-72157193518448646-127.0.0.1:39821_solr-n_0000000000) [    ] o.a.s.c.OverseerTaskProcessor CompletedTasks: []
   [junit4]   2> 2403559 DEBUG (OverseerCollectionConfigSetProcessor-72157193518448646-127.0.0.1:39821_solr-n_0000000000) [    ] o.a.s.c.OverseerTaskProcessor RunningZKTasks: []
   [junit4]   2> 2403559 DEBUG (OverseerCollectionConfigSetProcessor-72157193518448646-127.0.0.1:39821_solr-n_0000000000) [    ] o.a.s.c.OverseerTaskQueue Peeking for top 100 elements. ExcludeSet: []
   [junit4]   2> 2403560 DEBUG (SyncThread:0) [    ] o.a.s.c.ZkTestServer Watch added: children: /solr/overseer/collection-queue-work
   [junit4]   2> 2403564 DEBUG (SyncThread:0) [    ] o.a.s.c.ZkTestServer Watch added: children: /solr/live_nodes
   [junit4]   2> 2403564 INFO  (zkCallback-4983-thread-1) [    ] o.a.s.c.c.ZkStateReader Updated live nodes from ZooKeeper... (0) -> (1)
   [junit4]   2> 2403574 DEBUG (SyncThread:0) [    ] o.a.s.c.ZkTestServer Watch added: children: /solr/autoscaling/events/.scheduled_maintenance
   [junit4]   2> 2403575 DEBUG (OverseerAutoScalingTriggerThread-72157193518448646-127.0.0.1:39821_solr-n_0000000000) [    ] o.a.s.c.a.NodeLostTrigger NodeLostTrigger .auto_add_replicas - Initial livenodes: []
   [junit4]   2> 2403584 DEBUG (SyncThread:0) [    ] o.a.s.c.ZkTestServer Watch added: children: /solr/live_nodes
   [junit4]   2> 2403585 INFO  (zkCallback-4990-thread-1) [    ] o.a.s.c.c.ZkStateReader Updated live nodes from ZooKeeper... (0) -> (1)
   [junit4]   2> 2403592 DEBUG (SyncThread:0) [    ] o.a.s.c.ZkTestServer Watch added: children: /solr/autoscaling/events/.auto_add_replicas
   [junit4]   2> 2403593 DEBUG (ScheduledTrigger-8199-thread-1) [    ] o.a.s.c.a.NodeLostTrigger Running NodeLostTrigger: .auto_add_replicas with currently live nodes: 1
   [junit4]   2> 2403596 DEBUG (OverseerAutoScalingTriggerThread-72157193518448646-127.0.0.1:39821_solr-n_0000000000) [    ] o.a.s.c.a.OverseerTriggerThread -- clean old nodeAdded markers
   [junit4]   2> 2403596 DEBUG (OverseerAutoScalingTriggerThread-72157193518448646-127.0.0.1:39821_solr-n_0000000000) [    ] o.a.s.c.a.OverseerTriggerThread Current znodeVersion 1, lastZnodeVersion 1
   [junit4]   2> 2403600 INFO  (jetty-launcher-4967-thread-3) [n:127.0.0.1:39821_solr    ] o.a.s.h.a.MetricsHistoryHandler No .system collection, keeping metrics history in memory.
   [junit4]   2> 2403630 INFO  (jetty-launcher-4967-thread-3) [n:127.0.0.1:39821_solr    ] o.a.s.m.r.SolrJmxReporter JMX monitoring for 'solr_39821.solr.node' (registry 'solr.node') enabled at server: com.sun.jmx.mbeanserver.JmxMBeanServer@15273fa
   [junit4]   2> 2403642 INFO  (jetty-launcher-4967-thread-3) [n:127.0.0.1:39821_solr    ] o.a.s.m.r.SolrJmxReporter JMX monitoring for 'solr_39821.solr.jvm' (registry 'solr.jvm') enabled at server: com.sun.jmx.mbeanserver.JmxMBeanServer@15273fa
   [junit4]   2> 2403642 INFO  (jetty-launcher-4967-thread-3) [n:127.0.0.1:39821_solr    ] o.a.s.m.r.SolrJmxReporter JMX monitoring for 'solr_39821.solr.jetty' (registry 'solr.jetty') enabled at server: com.sun.jmx.mbeanserver.JmxMBeanServer@15273fa
   [junit4]   2> 2403644 INFO  (jetty-launcher-4967-thread-3) [n:127.0.0.1:39821_solr    ] o.a.s.c.CorePropertiesLocator Found 0 core definitions underneath /home/jenkins/workspace/Lucene-Solr-BadApples-master-Linux/solr/build/solr-core/test/J2/temp/solr.cloud.MoveReplicaHDFSTest_1D6B3C201EBFC3C0-001/tempDir-001/node3/.
   [junit4]   2> 2403701 INFO  (jetty-launcher-4967-thread-4) [    ] o.a.s.c.ZkContainer Zookeeper client=127.0.0.1:39447/solr
   [junit4]   2> 2403702 INFO  (zkConnectionManagerCallback-4996-thread-1) [    ] o.a.s.c.c.ConnectionManager zkClient has connected
   [junit4]   2> 2403703 DEBUG (jetty-launcher-4967-thread-4) [n:127.0.0.1:42167_solr    ] o.a.s.c.ZkController Added new OnReconnect listener org.apache.solr.cloud.ZkController$$Lambda$42/4209756@443ed1
   [junit4]   2> 2403708 INFO  (zkConnectionManagerCallback-4998-thread-1) [    ] o.a.s.c.c.ConnectionManager zkClient has connected
   [junit4]   2> 2403712 DEBUG (SyncThread:0) [    ] o.a.s.c.ZkTestServer Watch added: data: /solr/clusterprops.json
   [junit4]   2> 2403713 DEBUG (SyncThread:0) [    ] o.a.s.c.ZkTestServer Watch added: children: /solr/live_nodes
   [junit4]   2> 2403713 INFO  (jetty-launcher-4967-thread-4) [n:127.0.0.1:42167_solr    ] o.a.s.c.c.ZkStateReader Updated live nodes from ZooKeeper... (0) -> (1)
   [junit4]   2> 2403713 DEBUG (SyncThread:0) [    ] o.a.s.c.ZkTestServer Watch added: data: /solr/clusterstate.json
   [junit4]   2> 2403713 DEBUG (SyncThread:0) [    ] o.a.s.c.ZkTestServer Watch added: children: /solr/collections
   [junit4]   2> 2403713 DEBUG (SyncThread:0) [    ] o.a.s.c.ZkTestServer Watch added: create/delete: /solr/aliases.json
   [junit4]   2> 2403714 DEBUG (SyncThread:0) [    ] o.a.s.c.ZkTestServer Watch added: create/delete: /solr/security.json
   [junit4]   2> 2403715 DEBUG (jetty-launcher-4967-thread-4) [n:127.0.0.1:42167_solr    ] o.a.s.c.LeaderElector Joined leadership election with path: /overseer_elect/election/72157193518448649-127.0.0.1:42167_solr-n_0000000001
   [junit4]   2> 2403715 DEBUG (SyncThread:0) [    ] o.a.s.c.ZkTestServer Watch added: data: /solr/overseer_elect/election/72157193518448646-127.0.0.1:39821_solr-n_0000000000
   [junit4]   2> 2403715 DEBUG (jetty-launcher-4967-thread-4) [n:127.0.0.1:42167_solr    ] o.a.s.c.LeaderElector Watching path /overseer_elect/election/72157193518448646-127.0.0.1:39821_solr-n_0000000000 to know if I could be the leader
   [junit4]   2> 2403715 DEBUG (jetty-launcher-4967-thread-4) [n:127.0.0.1:42167_solr    ] o.a.s.c.ZkController Publish node=127.0.0.1:42167_solr as DOWN
   [junit4]   2> 2403716 DEBUG (SyncThread:0) [    ] o.a.s.c.ZkTestServer Watch fired: children: /solr/overseer/queue
   [junit4]   2> 2403716 INFO  (jetty-launcher-4967-thread-4) [n:127.0.0.1:42167_solr    ] o.a.s.c.TransientSolrCoreCacheDefault Allocating transient cache for 2147483647 transient cores
   [junit4]   2> 2403716 INFO  (jetty-launcher-4967-thread-4) [n:127.0.0.1:42167_solr    ] o.a.s.c.ZkController Register node as live in ZooKeeper:/live_nodes/127.0.0.1:42167_solr
   [junit4]   2> 2403716 DEBUG (SyncThread:0) [    ] o.a.s.c.ZkTestServer Watch added: children: /solr/overseer/queue
   [junit4]   2> 2403716 DEBUG (SyncThread:0) [    ] o.a.s.c.ZkTestServer Watch fired: children: /solr/live_nodes
   [junit4]   2> 2403716 DEBUG (SyncThread:0) [    ] o.a.s.c.ZkTestServer Watch fired: children: /solr/live_nodes
   [junit4]   2> 2403716 DEBUG (SyncThread:0) [    ] o.a.s.c.ZkTestServer Watch fired: children: /solr/live_nodes
   [junit4]   2> 2403717 DEBUG (SyncThread:0) [    ] o.a.s.c.ZkTestServer Watch added: children: /solr/live_nodes
   [junit4]   2> 2403717 DEBUG (SyncThread:0) [    ] o.a.s.c.ZkTestServer Watch added: children: /solr/live_nodes
   [junit4]   2> 2403717 INFO  (zkCallback-4990-thread-1) [    ] o.a.s.c.c.ZkStateReader Updated live nodes from ZooKeeper... (1) -> (2)
   [junit4]   2> 2403717 INFO  (zkCallback-4983-thread-1) [    ] o.a.s.c.c.ZkStateReader Updated live nodes from ZooKeeper... (1) -> (2)
   [junit4]   2> 2403719 DEBUG (SyncThread:0) [    ] o.a.s.c.ZkTestServer Watch added: children: /solr/live_nodes
   [junit4]   2> 2403719 INFO  (zkCallback-4997-thread-1) [    ] o.a.s.c.c.ZkStateReader Updated live nodes from ZooKeeper... (1) -> (2)
   [junit4]   2> 2403741 INFO  (zkConnectionManagerCallback-5005-thread-1) [    ] o.a.s.c.c.ConnectionManager zkClient has connected
   [junit4]   2> 2403742 DEBUG (SyncThread:0) [    ] o.a.s.c.ZkTestServer Watch added: data: /solr/clusterprops.json
   [junit4]   2> 2403742 DEBUG (SyncThread:0) [    ] o.a.s.c.ZkTestServer Watch added: children: /solr/live_nodes
   [junit4]   2> 2403742 INFO  (jetty-launcher-4967-thread-4) [n:127.0.0.1:42167_solr    ] o.a.s.c.c.ZkStateReader Updated live nodes from ZooKeeper... (0) -> (2)
   [junit4]   2> 2403742 DEBUG (SyncThread:0) [    ] o.a.s.c.ZkTestServer Watch added: data: /solr/clusterstate.json
   [junit4]   2> 2403742 DEBUG (SyncThread:0) [    ] o.a.s.c.ZkTestServer Watch added: children: /solr/collections
   [junit4]   2> 2403743 DEBUG (SyncThread:0) [    ] o.a.s.c.ZkTestServer Watch added: create/delete: /solr/aliases.json
   [junit4]   2> 2403743 INFO  (jetty-launcher-4967-thread-4) [n:127.0.0.1:42167_solr    ] o.a.s.c.s.i.ZkClientClusterStateProvider Cluster at 127.0.0.1:39447/solr ready
   [junit4]   2> 2403744 INFO  (jetty-launcher-4967-thread-4) [n:127.0.0.1:42167_solr    ] o.a.s.h.a.MetricsHistoryHandler No .system collection, keeping metrics history in memory.
   [junit4]   2> 2403763 INFO  (jetty-launcher-4967-thread-4) [n:127.0.0.1:42167_solr    ] o.a.s.m.r.SolrJmxReporter JMX monitoring for 'solr_42167.solr.node' (registry 'solr.node') enabled at server: com.sun.jmx.mbeanserver.JmxMBeanServer@15273fa
   [junit4]   2> 2403772 INFO  (jetty-launcher-4967-thread-4) [n:127.0.0.1:42167_solr    ] o.a.s.m.r.SolrJmxReporter JMX monitoring for 'solr_42167.solr.jvm' (registry 'solr.jvm') enabled at server: com.sun.jmx.mbeanserver.JmxMBeanServer@15273fa
   [junit4]   2> 2403773 INFO  (jetty-launcher-4967-thread-4) [n:127.0.0.1:42167_solr    ] o.a.s.m.r.SolrJmxReporter JMX monitoring for 'solr_42167.solr.jetty' (registry 'solr.jetty') enabled at server: com.sun.jmx.mbeanserver.JmxMBeanServer@15273fa
   [junit4]   2> 2403774 INFO  (jetty-launcher-4967-thread-4) [n:127.0.0.1:42167_solr    ] o.a.s.c.CorePropertiesLocator Found 0 core definitions underneath /home/jenkins/workspace/Lucene-Solr-BadApples-master-Linux/solr/build/solr-core/test/J2/temp/solr.cloud.MoveReplicaHDFSTest_1D6B3C201EBFC3C0-001/tempDir-001/node4/.
   [junit4]   2> 2403817 DEBUG (SyncThread:0) [    ] o.a.s.c.ZkTestServer Watch fired: children: /solr/overseer/queue
   [junit4]   2> 2403817 DEBUG (SyncThread:0) [    ] o.a.s.c.ZkTestServer Watch added: children: /solr/overseer/queue
   [junit4]   2> 2403943 INFO  (jetty-launcher-4967-thread-1) [    ] o.a.s.c.ZkContainer Zookeeper client=127.0.0.1:39447/solr
   [junit4]   2> 2403944 INFO  (zkConnectionManagerCallback-5010-thread-1) [    ] o.a.s.c.c.ConnectionManager zkClient has connected
   [junit4]   2> 2403950 DEBUG (jetty-launcher-4967-thread-1) [n:127.0.0.1:39611_solr    ] o.a.s.c.ZkController Added new OnReconnect listener org.apache.solr.cloud.ZkController$$Lambda$42/4209756@25cfb3
   [junit4]   2> 2403951 INFO  (zkConnectionManagerCallback-5012-thread-1) [    ] o.a.s.c.c.ConnectionManager zkClient has connected
   [junit4]   2> 2403955 DEBUG (SyncThread:0) [    ] o.a.s.c.ZkTestServer Watch added: data: /solr/clusterprops.json
   [junit4]   2> 2403955 DEBUG (SyncThread:0) [    ] o.a.s.c.ZkTestServer Watch added: children: /solr/live_nodes
   [junit4]   2> 2403955 INFO  (jetty-launcher-4967-thread-1) [n:127.0.0.1:39611_solr    ] o.a.s.c.c.ZkStateReader Updated live nodes from ZooKeeper... (0) -> (2)
   [junit4]   2> 2403955 DEBUG (SyncThread:0) [    ] o.a.s.c.ZkTestServer Watch added: data: /solr/clusterstate.json
   [junit4]   2> 2403955 DEBUG (SyncThread:0) [    ] o.a.s.c.ZkTestServer Watch added: children: /solr/collections
   [junit4]   2> 2403955 DEBUG (SyncThread:0) [    ] o.a.s.c.ZkTestServer Watch added: create/delete: /solr/aliases.json
   [junit4]   2> 2403956 DEBUG (SyncThread:0) [    ] o.a.s.c.ZkTestServer Watch added: create/delete: /solr/security.json
   [junit4]   2> 2403956 DEBUG (jetty-launcher-4967-thread-1) [n:127.0.0.1:39611_solr    ] o.a.s.c.LeaderElector Joined leadership election with path: /overseer_elect/election/72157193518448652-127.0.0.1:39611_solr-n_0000000002
   [junit4]   2> 2403957 DEBUG (SyncThread:0) [    ] o.a.s.c.ZkTestServer Watch added: data: /solr/overseer_elect/election/72157193518448649-127.0.0.1:42167_solr-n_0000000001
   [junit4]   2> 2403957 DEBUG (jetty-launcher-4967-thread-1) [n:127.0.0.1:39611_solr    ] o.a.s.c.LeaderElector Watching path /overseer_elect/election/72157193518448649-127.0.0.1:42167_solr-n_0000000001 to know if I could be the leader
   [junit4]   2> 2403957 DEBUG (jetty-launcher-4967-thread-1) [n:127.0.0.1:39611_solr    ] o.a.s.c.ZkController Publish node=127.0.0.1:39611_solr as DOWN
   [junit4]   2> 2403958 DEBUG (SyncThread:0) [    ] o.a.s.c.ZkTestServer Watch fired: children: /solr/overseer/queue
   [junit4]   2> 2403958 INFO  (jetty-launcher-4967-thread-1) [n:127.0.0.1:39611_solr    ] o.a.s.c.TransientSolrCoreCacheDefault Allocating transient cache for 2147483647 transient cores
   [junit4]   2> 2403958 DEBUG (SyncThread:0) [    ] o.a.s.c.ZkTestServer Watch added: children: /solr/overseer/queue
   [junit4]   2> 2403958 INFO  (jetty-launcher-4967-thread-1) [n:127.0.0.1:39611_solr    ] o.a.s.c.ZkController Register node as live in ZooKeeper:/live_nodes/127.0.0.1:39611_solr
   [junit4]   2> 2403958 DEBUG (SyncThread:0) [    ] o.a.s.c.ZkTestServer Watch fired: children: /solr/live_nodes
   [junit4]   2> 2403958 DEBUG (SyncThread:0) [    ] o.a.s.c.ZkTestServer Watch fired: children: /solr/live_nodes
   [junit4]   2> 2403958 DEBUG (SyncThread:0) [    ] o.a.s.c.ZkTestServer Watch fired: children: /solr/live_nodes
   [junit4]   2> 2403958 DEBUG (SyncThread:0) [    ] o.a.s.c.ZkTestServer Watch fired: children: /solr/live_nodes
   [junit4]   2> 2403959 DEBUG (SyncThread:0) [    ] o.a.s.c.ZkTestServer Watch fired: children: /solr/live_nodes
   [junit4]   2> 2403959 DEBUG (SyncThread:0) [    ] o.a.s.c.ZkTestServer Watch added: children: /solr/live_nodes
   [junit4]   2> 2403959 DEBUG (SyncThread:0) [    ] o.a.s.c.ZkTestServer Watch added: children: /solr/live_nodes
   [junit4]   2> 2403959 INFO  (zkCallback-4990-thread-1) [    ] o.a.s.c.c.ZkStateReader Updated live nodes from ZooKeeper... (2) -> (3)
   [junit4]   2> 2403959 INFO  (zkCallback-4983-thread-1) [    ] o.a.s.c.c.ZkStateReader Updated live nodes from ZooKeeper... (2) -> (3)
   [junit4]   2> 2403959 DEBUG (SyncThread:0) [    ] o.a.s.c.ZkTestServer Watch added: children: /solr/live_nodes
   [junit4]   2> 2403959 DEBUG (SyncThread:0) [    ] o.a.s.c.ZkTestServer Watch added: children: /solr/live_nodes
   [junit4]   2> 2403959 INFO  (zkCallback-4997-thread-1) [    ] o.a.s.c.c.ZkStateReader Updated live nodes from ZooKeeper... (2) -> (3)
   [junit4]   2> 2403959 INFO  (zkCallback-5011-thread-1) [    ] o.a.s.c.c.ZkStateReader Updated live nodes from ZooKeeper... (2) -> (3)
   [junit4]   2> 2403960 DEBUG (SyncThread:0) [    ] o.a.s.c.ZkTestServer Watch added: children: /solr/live_nodes
   [junit4]   2> 2403960 INFO  (zkCallback-5004-thread-1) [    ] o.a.s.c.c.ZkStateReader Updated live nodes from ZooKeeper... (2) -> (3)
   [junit4]   2> 2403984 INFO  (zkConnectionManagerCallback-5019-thread-1) [    ] o.a.s.c.c.ConnectionManager zkClient has connected
   [junit4]   2> 2403984 DEBUG (SyncThread:0) [    ] o.a.s.c.ZkTestServer Watch added: data: /solr/clusterprops.json
   [junit4]   2> 2403984 DEBUG (SyncThread:0) [    ] o.a.s.c.ZkTestServer Watch added: children: /solr/live_nodes
   [junit4]   2> 2403985 INFO  (jetty-launcher-4967-thread-1) [n:127.0.0.1:39611_solr    ] o.a.s.c.c.ZkStateReader Updated live nodes from ZooKeeper... (0) -> (3)
   [junit4]   2> 2403985 DEBUG (SyncThread:0) [    ] o.a.s.c.ZkTestServer Watch added: data: /solr/clusterstate.json
   [junit4]   2> 2403985 DEBUG (SyncThread:0) [    ] o.a.s.c.ZkTestServer Watch added: children: /solr/collections
   [junit4]   2> 2403985 DEBUG (SyncThread:0) [    ] o.a.s.c.ZkTestServer Watch added: create/delete: /solr/aliases.json
   [junit4]   2> 2403985 INFO  (jetty-launcher-4967-thread-1) [n:127.0.0.1:39611_solr    ] o.a.s.c.s.i.ZkClientClusterStateProvider Cluster at 127.0.0.1:39447/solr ready
   [junit4]   2> 2403985 INFO  (jetty-launcher-4967-thread-1) [n:127.0.0.1:39611_solr    ] o.a.s.h.a.MetricsHistoryHandler No .system collection, keeping metrics history in memory.
   [junit4]   2> 2404003 INFO  (jetty-launcher-4967-thread-1) [n:127.0.0.1:39611_solr    ] o.a.s.m.r.SolrJmxReporter JMX monitoring for 'solr_39611.solr.node' (registry 'solr.node') enabled at server: com.sun.jmx.mbeanserver.JmxMBeanServer@15273fa
   [junit4]   2> 2404011 INFO  (jetty-launcher-4967-thread-1) [n:127.0.0.1:39611_solr    ] o.a.s.m.r.SolrJmxReporter JMX monitoring for 'solr_39611.solr.jvm' (registry 'solr.jvm') enabled at server: com.sun.jmx.mbeanserver.JmxMBeanServer@15273fa
   [junit4]   2> 2404011 INFO  (jetty-launcher-4967-thread-1) [n:127.0.0.1:39611_solr    ] o.a.s.m.r.SolrJmxReporter JMX monitoring for 'solr_39611.solr.jetty' (registry 'solr.jetty') enabled at server: com.sun.jmx.mbeanserver.JmxMBeanServer@15273fa
   [junit4]   2> 2404012 INFO  (jetty-launcher-4967-thread-1) [n:127.0.0.1:39611_solr    ] o.a.s.c.CorePropertiesLocator Found 0 core definitions underneath /home/jenkins/workspace/Lucene-Solr-BadApples-master-Linux/solr/build/solr-core/test/J2/temp/solr.cloud.MoveReplicaHDFSTest_1D6B3C201EBFC3C0-001/tempDir-001/node1/.
   [junit4]   2> 2404058 DEBUG (SyncThread:0) [    ] o.a.s.c.ZkTestServer Watch fired: children: /solr/overseer/queue
   [junit4]   2> 2404059 DEBUG (SyncThread:0) [    ] o.a.s.c.ZkTestServer Watch added: children: /solr/overseer/queue
   [junit4]   2> 2404308 INFO  (jetty-launcher-4967-thread-2) [    ] o.a.s.c.ZkContainer Zookeeper client=127.0.0.1:39447/solr
   [junit4]   2> 2404309 INFO  (zkConnectionManagerCallback-5024-thread-1) [    ] o.a.s.c.c.ConnectionManager zkClient has connected
   [junit4]   2> 2404310 DEBUG (jetty-launcher-4967-thread-2) [n:127.0.0.1:42993_solr    ] o.a.s.c.ZkController Added new OnReconnect listener org.apache.solr.cloud.ZkController$$Lambda$42/4209756@1abdf9b
   [junit4]   2> 2404311 INFO  (zkConnectionManagerCallback-5026-thread-1) [    ] o.a.s.c.c.ConnectionManager zkClient has connected
   [junit4]   2> 2404314 DEBUG (SyncThread:0) [    ] o.a.s.c.ZkTestServer Watch added: data: /solr/clusterprops.json
   [junit4]   2> 2404314 DEBUG (SyncThread:0) [    ] o.a.s.c.ZkTestServer Watch added: children: /solr/live_nodes
   [junit4]   2> 2404315 INFO  (jetty-launcher-4967-thread-2) [n:127.0.0.1:42993_solr    ] o.a.s.c.c.ZkStateReader Updated live nodes from ZooKeeper... (0) -> (3)
   [junit4]   2> 2404315 DEBUG (SyncThread:0) [    ] o.a.s.c.ZkTestServer Watch added: data: /solr/clusterstate.json
   [junit4]   2> 2404315 DEBUG (SyncThread:0) [    ] o.a.s.c.ZkTestServer Watch added: children: /solr/collections
   [junit4]   2> 2404315 DEBUG (SyncThread:0) [    ] o.a.s.c.ZkTestServer Watch added: create/delete: /solr/aliases.json
   [junit4]   2> 2404315 DEBUG (SyncThread:0) [    ] o.a.s.c.ZkTestServer Watch added: create/delete: /solr/security.json
   [junit4]   2> 2404316 DEBUG (jetty-launcher-4967-thread-2) [n:127.0.0.1:42993_solr    ] o.a.s.c.LeaderElector Joined leadership election with path: /overseer_elect/election/72157193518448655-127.0.0.1:42993_solr-n_0000000003
   [junit4]   2> 2404317 DEBUG (SyncThread:0) [    ] o.a.s.c.ZkTestServer Watch added: data: /solr/overseer_elect/election/72157193518448652-127.0.0.1:39611_solr-n_0000000002
   [junit4]   2> 2404317 DEBUG (jetty-launcher-4967-thread-2) [n:127.0.0.1:42993_solr    ] o.a.s.c.LeaderElector Watching path /overseer_elect/election/72157193518448652-127.0.0.1:39611_solr-n_0000000002 to know if I could be the leader
   [junit4]   2> 2404317 DEBUG (jetty-launcher-4967-thread-2) [n:127.0.0.1:42993_solr    ] o.a.s.c.ZkController Publish node=127.0.0.1:42993_solr as DOWN
   [junit4]   2> 2404317 DEBUG (SyncThread:0) [    ] o.a.s.c.ZkTestServer Watch fired: children: /solr/overseer/queue
   [junit4]   2> 2404318 INFO  (jetty-launcher-4967-thread-2) [n:127.0.0.1:42993_solr    ] o.a.s.c.TransientSolrCoreCacheDefault Allocating transient cache for 2147483647 transient cores
   [junit4]   2> 2404318 DEBUG (SyncThread:0) [    ] o.a.s.c.ZkTestServer Watch added: children: /solr/overseer/queue
   [junit4]   2> 2404318 INFO  (jetty-launcher-4967-thread-2) [n:127.0.0.1:42993_solr    ] o.a.s.c.ZkController Register node as live in ZooKeeper:/live_nodes/127.0.0.1:42993_solr
   [junit4]   2> 2404318 DEBUG (SyncThread:0) [    ] o.a.s.c.ZkTestServer Watch fired: children: /solr/live_nodes
   [junit4]   2> 2404318 DEBUG (SyncThread:0) [    ] o.a.s.c.ZkTestServer Watch fired: children: /solr/live_nodes
   [junit4]   2> 2404318 DEBUG (SyncThread:0) [    ] o.a.s.c.ZkTestServer Watch fired: children: /solr/live_nodes
   [junit4]   2> 2404318 DEBUG (SyncThread:0) [    ] o.a.s.c.ZkTestServer Watch fired: children: /solr/live_nodes
   [junit4]   2> 2404318 DEBUG (SyncThread:0) [    ] o.a.s.c.ZkTestServer Watch fired: children: /solr/live_nodes
   [junit4]   2> 2404318 DEBUG (SyncThread:0) [    ] o.a.s.c.ZkTestServer Watch fired: children: /solr/live_nodes
   [junit4]   2> 2404319 DEBUG (SyncThread:0) [    ] o.a.s.c.ZkTestServer Watch fired: children: /solr/live_nodes
   [junit4]   2> 2404319 DEBUG (SyncThread:0) [    ] o.a.s.c.ZkTestServer Watch added: children: /solr/live_nodes
   [junit4]   2> 2404319 DEBUG (SyncThread:0) [    ] o.a.s.c.ZkTestServer Watch added: children: /solr/live_nodes
   [junit4]   2> 2404319 INFO  (zkCallback-4990-thread-1) [    ] o.a.s.c.c.ZkStateReader Updated live nodes from ZooKeeper... (3) -> (4)
   [junit4]   2> 2404319 DEBUG (SyncThread:0) [    ] o.a.s.c.ZkTestServer Watch added: children: /solr/live_nodes
   [junit4]   2> 2404319 INFO  (zkCallback-5004-thread-1) [    ] o.a.s.c.c.ZkStateReader Updated live nodes from ZooKeeper... (3) -> (4)
   [junit4]   2> 2404319 DEBUG (SyncThread:0) [    ] o.a.s.c.ZkTestServer Watch added: children: /solr/live_nodes
   [junit4]   2> 2404319 DEBUG (SyncThread:0) [    ] o.a.s.c.ZkTestServer Watch added: children: /solr/live_nodes
   [junit4]   2> 2404319 INFO  (zkCallback-5011-thread-1) [    ] o.a.s.c.c.ZkStateReader Updated live nodes from ZooKeeper... (3) -> (4)
   [junit4]   2> 2404319 INFO  (zkCallback-5018-thread-1) [    ] o.a.s.c.c.ZkStateReader Updated live nodes from ZooKeeper... (3) -> (4)
   [junit4]   2> 2404319 INFO  (zkCallback-4983-thread-1) [    ] o.a.s.c.c.ZkStateReader Updated live nodes from ZooKeeper... (3) -> (4)
   [junit4]   2> 2404319 DEBUG (SyncThread:0) [    ] o.a.s.c.ZkTestServer Watch added: children: /solr/live_nodes
   [junit4]   2> 2404319 DEBUG (SyncThread:0) [    ] o.a.s.c.ZkTestServer Watch added: children: /solr/live_nodes
   [junit4]   2> 2404319 INFO  (zkCallback-4997-thread-1) [    ] o.a.s.c.c.ZkStateReader Updated live nodes from ZooKeeper... (3) -> (4)
   [junit4]   2> 2404319 INFO  (zkCallback-5025-thread-1) [    ] o.a.s.c.c.ZkStateReader Updated live nodes from ZooKeeper... (3) -> (4)
   [junit4]   2> 2404343 INFO  (zkConnectionManagerCallback-5033-thread-1) [    ] o.a.s.c.c.ConnectionManager zkClient has connected
   [junit4]   2> 2404344 DEBUG (SyncThread:0) [    ] o.a.s.c.ZkTestServer Watch added: data: /solr/clusterprops.json
   [junit4]   2> 2404344 DEBUG (SyncThread:0) [    ] o.a.s.c.ZkTestServer Watch added: children: /solr/live_nodes
   [junit4]   2> 2404344 INFO  (jetty-launcher-4967-thread-2) [n:127.0.0.1:42993_solr    ] o.a.s.c.c.ZkStateReader Updated live nodes from ZooKeeper... (0) -> (4)
   [junit4]   2> 2404344 DEBUG (SyncThread:0) [    ] o.a.s.c.ZkTestServer Watch added: data: /solr/clusterstate.json
   [junit4]   2> 2404345 DEBUG (SyncThread:0) [    ] o.a.s.c.ZkTestServer Watch added: children: /solr/collections
   [junit4]   2> 2404345 DEBUG (SyncThread:0) [    ] o.a.s.c.ZkTestServer Watch added: create/delete: /solr/aliases.json
   [junit4]   2> 2404345 INFO  (jetty-launcher-4967-thread-2) [n:127.0.0.1:42993_solr    ] o.a.s.c.s.i.ZkClientClusterStateProvider Cluster at 127.0.0.1:39447/solr ready
   [junit4]   2> 2404345 INFO  (jetty-launcher-4967-thread-2) [n:127.0.0.1:42993_solr    ] o.a.s.h.a.MetricsHistoryHandler No .system collection, keeping metrics history in memory.
   [junit4]   2> 2404371 INFO  (jetty-launcher-4967-thread-2) [n:127.0.0.1:42993_solr    ] o.a.s.m.r.SolrJmxReporter JMX monitoring for 'solr_42993.solr.node' (registry 'solr.node') enabled at server: com.sun.jmx.mbeanserver.JmxMBeanServer@15273fa
   [junit4]   2> 2404382 INFO  (jetty-launcher-4967-thread-2) [n:127.0.0.1:42993_solr    ] o.a.s.m.r.SolrJmxReporter JMX monitoring for 'solr_42993.solr.jvm' (registry 'solr.jvm') enabled at server: com.sun.jmx.mbeanserver.JmxMBeanServer@15273fa
   [junit4]   2> 2404382 INFO  (jetty-launcher-4967-thread-2) [n:127.0.0.1:42993_solr    ] o.a.s.m.r.SolrJmxReporter JMX monitoring for 'solr_42993.solr.jetty' (registry 'solr.jetty') enabled at server: com.sun.jmx.mbeanserver.JmxMBeanServer@15273fa
   [junit4]   2> 2404384 INFO  (jetty-launcher-4967-thread-2) [n:127.0.0.1:42993_solr    ] o.a.s.c.CorePropertiesLocator Found 0 core definitions underneath /home/jenkins/workspace/Lucene-Solr-BadApples-master-Linux/solr/build/solr-core/test/J2/temp/solr.cloud.MoveReplicaHDFSTest_1D6B3C201EBFC3C0-001/tempDir-001/node2/.
   [junit4]   2> 2404418 DEBUG (SyncThread:0) [    ] o.a.s.c.ZkTestServer Watch fired: children: /solr/overseer/queue
   [junit4]   2> 2404419 DEBUG (SyncThread:0) [    ] o.a.s.c.ZkTestServer Watch added: children: /solr/overseer/queue
   [junit4]   2> 2404425 INFO  (zkConnectionManagerCallback-5036-thread-1) [    ] o.a.s.c.c.ConnectionManager zkClient has connected
   [junit4]   2> 2404429 INFO  (zkConnectionManagerCallback-5041-thread-1) [    ] o.a.s.c.c.ConnectionManager zkClient has connected
   [junit4]   2> 2404429 DEBUG (SyncThread:0) [    ] o.a.s.c.ZkTestServer Watch added: data: /solr/clusterprops.json
   [junit4]   2> 2404430 DEBUG (SyncThread:0) [    ] o.a.s.c.ZkTestServer Watch added: children: /solr/live_nodes
   [junit4]   2> 2404430 INFO  (SUITE-MoveReplicaHDFSTest-seed#[1D6B3C201EBFC3C0]-worker) [    ] o.a.s.c.c.ZkStateReader Updated live nodes from ZooKeeper... (0) -> (4)
   [junit4]   2> 2404430 DEBUG (SyncThread:0) [    ] o.a.s.c.ZkTestServer Watch added: data: /solr/clusterstate.json
   [junit4]   2> 2404430 DEBUG (SyncThread:0) [    ] o.a.s.c.ZkTestServer Watch added: children: /solr/collections
   [junit4]   2> 2404430 DEBUG (SyncThread:0) [    ] o.a.s.c.ZkTestServer Watch added: create/delete: /solr/aliases.json
   [junit4]   2> 2404431 INFO  (SUITE-MoveReplicaHDFSTest-seed#[1D6B3C201EBFC3C0]-worker) [    ] o.a.s.c.s.i.ZkClientClusterStateProvider Cluster at 127.0.0.1:39447/solr ready
   [junit4]   2> 2404507 INFO  (qtp17973271-19961) [n:127.0.0.1:39821_solr    ] o.a.s.h.a.CollectionsHandler Invoked Collection Action :overseerstatus with params action=OVERSEERSTATUS&wt=javabin&version=2 and sendToOCPQueue=true
   [junit4]   2> 2404508 DEBUG (SyncThread:0) [    ] o.a.s.c.ZkTestServer Watch fired: children: /solr/overseer/collection-queue-work
   [junit4]   2> 2404508 DEBUG (SyncThread:0) [    ] o.a.s.c.ZkTestServer Watch added: children: /solr/overseer/collection-queue-work
   [junit4]   2> 2404508 DEBUG (SyncThread:0) [    ] o.a.s.c.ZkTestServer Watch added: create/delete: /solr/overseer/collection-queue-work/qnr-0000000000
   [junit4]   2> 2404508 DEBUG (OverseerCollectionConfigSetProcessor-72157193518448646-127.0.0.1:39821_solr-n_0000000000) [    ] o.a.s.c.ZkDistributedQueue Found child node with improper name: qnr-0000000000
   [junit4]   2> 2404508 DEBUG (SyncThread:0) [    ] o.a.s.c.ZkTestServer Watch fired: children: /solr/overseer/collection-queue-work
   [junit4]   2> 2404509 DEBUG (SyncThread:0) [    ] o.a.s.c.ZkTestServer Watch added: children: /solr/overseer/collection-queue-work
   [junit4]   2> 2404509 DEBUG (OverseerCollectionConfigSetProcessor-72157193518448646-127.0.0.1:39821_solr-n_0000000000) [    ] o.a.s.c.ZkDistributedQueue Found child node with improper name: qnr-0000000000
   [junit4]   2> 2404509 DEBUG (OverseerCollectionConfigSetProcessor-72157193518448646-127.0.0.1:39821_solr-n_0000000000) [    ] o.a.s.c.OverseerTaskQueue Returning topN elements: [/overseer/collection-queue-work/qn-0000000000, ]
   [junit4]   2> 2404509 DEBUG (OverseerCollectionConfigSetProcessor-72157193518448646-127.0.0.1:39821_solr-n_0000000000) [    ] o.a.s.c.OverseerTaskProcessor Got 1 tasks from work-queue : [[org.apache.solr.cloud.OverseerTaskQueue$QueueEvent@2e684ecf]]
   [junit4]   2> 2404509 DEBUG (OverseerCollectionConfigSetProcessor-72157193518448646-127.0.0.1:39821_solr-n_0000000000) [    ] o.a.s.c.OverseerTaskProcessor Marked task [/overseer/collection-queue-work/qn-0000000000] as running
   [junit4]   2> 2404509 DEBUG (OverseerCollectionConfigSetProcessor-72157193518448646-127.0.0.1:39821_solr-n_0000000000) [    ] o.a.s.c.OverseerTaskProcessor Overseer Collection Message Handler: Get the message id:/overseer/collection-queue-work/qn-0000000000 message:{"operation":"overseerstatus"}
   [junit4]   2> 2404510 DEBUG (OverseerThreadFactory-8201-thread-1) [    ] o.a.s.c.OverseerTaskProcessor Runner processing /overseer/collection-queue-work/qn-0000000000
   [junit4]   2> 2404510 DEBUG (OverseerThreadFactory-8201-thread-1) [    ] o.a.s.c.a.c.OverseerCollectionMessageHandler OverseerCollectionMessageHandler.processMessage : overseerstatus , {"operation":"overseerstatus"}
   [junit4]   2> 2404510 DEBUG (OverseerCollectionConfigSetProcessor-72157193518448646-127.0.0.1:39821_solr-n_0000000000) [    ] o.a.s.c.OverseerTaskProcessor Cleaning up work-queue. #Running tasks: 1
   [junit4]   2> 2404510 DEBUG (OverseerCollectionConfigSetProcessor-72157193518448646-127.0.0.1:39821_solr-n_0000000000) [    ] o.a.s.c.OverseerTaskProcessor RunningTasks: [/overseer/collection-queue-work/qn-0000000000]
   [junit4]   2> 2404510 DEBUG (OverseerCollectionConfigSetProcessor-72157193518448646-127.0.0.1:39821_solr-n_0000000000) [    ] o.a.s.c.OverseerTaskProcessor BlockedTasks: []
   [junit4]   2> 2404510 DEBUG (OverseerCollectionConfigSetProcessor-72157193518448646-127.0.0.1:39821_solr-n_0000000000) [    ] o.a.s.c.OverseerTaskProcessor CompletedTasks: []
   [junit4]   2> 2404510 DEBUG (OverseerCollectionConfigSetProcessor-72157193518448646-127.0.0.1:39821_solr-n_0000000000) [    ] o.a.s.c.OverseerTaskProcessor RunningZKTasks: [/overseer/collection-queue-work/qn-0000000000]
   [junit4]   2> 2404510 DEBUG (OverseerCollectionConfigSetProcessor-72157193518448646-127.0.0.1:39821_solr-n_0000000000) [    ] o.a.s.c.OverseerTaskQueue Peeking for top 99 elements. ExcludeSet: [/overseer/collection-queue-work/qn-0000000000],[]
   [junit4]   2> 2404512 DEBUG (OverseerThreadFactory-8201-thread-1) [    ] o.a.s.c.OverseerTaskProcessor Completed task:[/overseer/collection-queue-work/qn-0000000000]
   [junit4]   2> 2404512 DEBUG (SyncThread:0) [    ] o.a.s.c.ZkTestServer Watch fired: data: /solr/overseer/collection-queue-work/qnr-0000000000
   [junit4]   2> 2404512 DEBUG (zkCallback-4983-thread-1) [    ] o.a.s.c.OverseerTaskQueue NodeDataChanged fired on path /overseer/collection-queue-work/qnr-0000000000 state SyncConnected latchEventType null
   [junit4]   2> 2404513 DEBUG (SyncThread:0) [    ] o.a.s.c.ZkTestServer Watch fired: children: /solr/overseer/collection-queue-work
   [junit4]   2> 2404513 DEBUG (OverseerThreadFactory-8201-thread-1) [    ] o.a.s.c.OverseerTaskProcessor Marked task [/overseer/collection-queue-work/qn-0000000000] as completed.
   [junit4]   2> 2404513 DEBUG (OverseerThreadFactory-8201-thread-1) [    ] o.a.s.c.OverseerTaskProcessor RunningTasks: []
   [junit4]   2> 2404513 DEBUG (OverseerThreadFactory-8201-thread-1) [    ] o.a.s.c.OverseerTaskProcessor BlockedTasks: []
   [junit4]   2> 2404513 DEBUG (SyncThread:0) [    ] o.a.s.c.ZkTestServer Watch added: children: /solr/overseer/collection-queue-work
   [junit4]   2> 2404513 DEBUG (OverseerThreadFactory-8201-thread-1) [    ] o.a.s.c.OverseerTaskProcessor CompletedTasks: [/overseer/collection-queue-work/qn-0000000000]
   [junit4]   2> 2404513 DEBUG (OverseerThreadFactory-8201-thread-1) [    ] o.a.s.c.OverseerTaskProcessor RunningZKTasks: [/overseer/collection-queue-work/qn-0000000000]
   [junit4]   2> 2404513 DEBUG (SyncThread:0) [    ] o.a.s.c.ZkTestServer Watch fired: children: /solr/overseer/collection-queue-work
   [junit4]   2> 2404513 DEBUG (OverseerCollectionConfigSetProcessor-72157193518448646-127.0.0.1:39821_solr-n_0000000000) [    ] o.a.s.c.ZkDistributedQueue Found child node with improper name: qnr-0000000000
   [junit4]   2> 2404513 DEBUG (OverseerThreadFactory-8201-thread-1) [    ] o.a.s.c.OverseerTaskProcessor Overseer Collection Message Handler: Message id:/overseer/collection-queue-work/qn-0000000000 complete, response:{leader=127.0.0.1:39821_solr,overseer_queue_size=0,overseer_work_queue_size=0,overseer_collection_queue_size=2,overseer_operations={am_i_leader={requests=5,errors=0,avgRequestsPerSecond=5.197566428295564,5minRateRequestsPerSecond=0.0,15minRateRequestsPerSecond=0.0,avgTimePerRequest=0.1997596198036966,medianRequestTime=0.224743,75thPcRequestTime=0.227814,95thPcRequestTime=0.257295,99thPcRequestTime=0.257295,999thPcRequestTime=0.257295},downnode={requests=3,errors=0,avgRequestsPerSecond=3.778667850827277,5minRateRequestsPerSecond=0.0,15minRateRequestsPerSecond=0.0,avgTimePerRequest=0.013862,medianRequestTime=0.010964,75thPcRequestTime=0.022366,95thPcRequestTime=0.022366,99thPcRequestTime=0.022366,999thPcRequestTime=0.022366}},collection_operations={am_i_leader={requests=3,errors=0,avgRequestsPerSecond=3.1451325306219853,5minRateRequestsPerSecond=0.0,15minRateRequestsPerSecond=0.0,avgTimePerRequest=0.6097485565160999,medianRequestTime=0.152141,75thPcRequestTime=1.561264,95thPcRequestTime=1.561264,99thPcRequestTime=1.561264,999thPcRequestTime=1.561264},overseerstatus={requests=0,errors=0,avgRequestsPerSecond=0.0,5minRateRequestsPerSecond=0.0,15minRateRequestsPerSecond=0.0,avgTimePerRequest=0.0,medianRequestTime=0.0,75thPcRequestTime=0.0,95thPcRequestTime=0.0,99thPcRequestTime=0.0,999thPcRequestTime=0.0}},overseer_queue={},overseer_internal_queue={peek={avgRequestsPerSecond=1.0404165877124862,5minRateRequestsPerSecond=0.0,15minRateRequestsPerSecond=0.0,avgTimePerRequest=0.172899,medianRequestTime=0.172899,75thPcRequestTime=0.172899,95thPcRequestTime=0.172899,99thPcRequestTime=0.172899,999thPcRequestTime=0.172899}},collection_queue={peektopn_wait2000={avgRequestsPerSecond=1.0513779081826562,5minRateRequestsPerSecond=0.0,15minRateRequestsPerSecond=0.0,avgTimePerRequest=949.94215,medianRequestTime=949.94215,75thPcRequestTime=949.94215,95thPcRequestTime=949.94215,99thPcRequestTime=949.94215,999thPcRequestTime=949.94215}}}
   [junit4]   2> 2404513 DEBUG (SyncThread:0) [    ] o.a.s.c.ZkTestServer Watch added: children: /solr/overseer/collection-queue-work
   [junit4]   2> 2404515 INFO  (qtp17973271-19961) [n:127.0.0.1:39821_solr    ] o.a.s.s.HttpSolrCall [admin] webapp=null path=/admin/collections params={action=OVERSEERSTATUS&wt=javabin&version=2} status=0 QTime=7
   [junit4]   1> Formatting using clusterid: testClusterID
   [junit4]   2> 2404588 WARN  (SUITE-MoveReplicaHDFSTest-seed#[1D6B3C201EBFC3C0]-worker) [    ] o.a.h.m.i.MetricsConfig Cannot locate configuration: tried hadoop-metrics2-namenode.properties,hadoop-metrics2.properties
   [junit4]   2> 2404594 DEBUG (ScheduledTrigger-8199-thread-2) [    ] o.a.s.c.a.NodeLostTrigger Running NodeLostTrigger: .auto_add_replicas with currently live nodes: 4
   [junit4]   2> 2404596 WARN  (SUITE-MoveReplicaHDFSTest-seed#[1D6B3C201EBFC3C0]-worker) [    ] o.a.h.h.HttpRequestLog Jetty request log can only be enabled using Log4j
   [junit4]   2> 2404598 INFO  (SUITE-MoveReplicaHDFSTest-seed#[1D6B3C201EBFC3C0]-worker) [    ] o.m.log jetty-6.1.26
   [junit4]   2> 2404609 INFO  (SUITE-MoveReplicaHDFSTest-seed#[1D6B3C201EBFC3C0]-worker) [    ] o.m.log Extract jar:file:/home/jenkins/.ivy2/cache/org.apache.hadoop/hadoop-hdfs/tests/hadoop-hdfs-2.7.4-tests.jar!/webapps/hdfs to ./temp/Jetty_localhost_localdomain_42147_hdfs____bk0xlc/webapp
   [junit4]   2> 2405138 INFO  (SUITE-MoveReplicaHDFSTest-seed#[1D6B3C201EBFC3C0]-worker) [    ] o.m.log Started HttpServer2$SelectChannelConnectorWithSafeStartup@localhost.localdomain:42147
   [junit4]   2> 2405461 WARN  (SUITE-MoveReplicaHDFSTest-seed#[1D6B3C201EBFC3C0]-worker) [    ] o.a.h.h.HttpRequestLog Jetty request log can only be enabled using Log4j
   [junit4]   2> 2405463 INFO  (SUITE-MoveReplicaHDFSTest-seed#[1D6B3C201EBFC3C0]-worker) [    ] o.m.log jetty-6.1.26
   [junit4]   2> 2405476 INFO  (SUITE-MoveReplicaHDFSTest-seed#[1D6B3C201EBFC3C0]-worker) [    ] o.m.log Extract jar:file:/home/jenkins/.ivy2/cache/org.apache.hadoop/hadoop-hdfs/tests/hadoop-hdfs-2.7.4-tests.jar!/webapps/datanode to ./temp/Jetty_localhost_39357_datanode____.f6bh62/webapp
   [junit4]   2> 2405595 DEBUG (ScheduledTrigger-8199-thread-4) [    ] o.a.s.c.a.NodeLostTrigger Running NodeLostTrigger: .auto_add_replicas with currently live nodes: 4
   [junit4]   2> 2405954 INFO  (SUITE-MoveReplicaHDFSTest-seed#[1D6B3C201EBFC3C0]-worker) [    ] o.m.log Started HttpServer2$SelectChannelConnectorWithSafeStartup@localhost:39357
   [junit4]   2> 2405997 WARN  (SUITE-MoveReplicaHDFSTest-seed#[1D6B3C201EBFC3C0]-worker) [    ] o.a.h.h.HttpRequestLog Jetty request log can only be enabled using Log4j
   [junit4]   2> 2405998 INFO  (SUITE-MoveReplicaHDFSTest-seed#[1D6B3C201EBFC3C0]-worker) [    ] o.m.log jetty-6.1.26
   [junit4]   2> 2406016 INFO  (SUITE-MoveReplicaHDFSTest-seed#[1D6B3C201EBFC3C0]-worker) [    ] o.m.log Extract jar:file:/home/jenkins/.ivy2/cache/org.apache.hadoop/hadoop-hdfs/tests/hadoop-hdfs-2.7.4-tests.jar!/webapps/datanode to ./temp/Jetty_localhost_38241_datanode____5t6pw1/webapp
   [junit4]   2> 2406468 INFO  (SUITE-MoveReplicaHDFSTest-seed#[1D6B3C201EBFC3C0]-worker) [    ] o.m.log Started HttpServer2$SelectChannelConnectorWithSafeStartup@localhost:38241
   [junit4]   2> 2406510 DEBUG (OverseerCollectionConfigSetProcessor-72157193518448646-127.0.0.1:39821_solr-n_0000000000) [    ] o.a.s.c.OverseerTaskProcessor Got 0 tasks from work-queue : [[]]
   [junit4]   2> 2406511 DEBUG (OverseerCollectionConfigSetProcessor-72157193518448646-127.0.0.1:39821_solr-n_0000000000) [    ] o.a.s.c.OverseerTaskProcessor Cleaning up work-queue. #Running tasks: 0
   [junit4]   2> 2406512 INFO  (OverseerCollectionConfigSetProcessor-72157193518448646-127.0.0.1:39821_solr-n_0000000000) [    ] o.a.s.c.OverseerTaskQueue Response ZK path: /overseer/collection-queue-work/qnr-0000000000 doesn't exist.  Requestor may have disconnected from ZooKeeper
   [junit4]   2> 2406512 DEBUG (OverseerCollectionConfigSetProcessor-72157193518448646-127.0.0.1:39821_solr-n_0000000000) [    ] o.a.s.c.OverseerTaskProcessor RunningTasks: []
   [junit4]   2> 2406512 DEBUG (OverseerCollectionConfigSetProcessor-72157193518448646-127.0.0.1:39821_solr-n_0000000000) [    ] o.a.s.c.OverseerTaskProcessor BlockedTasks: []
   [junit4]   2> 2406512 DEBUG (OverseerCollectionConfigSetProcessor-72157193518448646-127.0.0.1:39821_solr-n_0000000000) [    ] o.a.s.c.OverseerTaskProcessor CompletedTasks: []
   [junit4]   2> 2406512 DEBUG (OverseerCollectionConfigSetProcessor-72157193518448646-127.0.0.1:39821_solr-n_0000000000) [    ] o.a.s.c.OverseerTaskProcessor RunningZKTasks: []
   [junit4]   2> 2406512 DEBUG (OverseerCollectionConfigSetProcessor-72157193518448646-127.0.0.1:39821_solr-n_0000000000) [    ] o.a.s.c.OverseerTaskQueue Peeking for top 100 elements. ExcludeSet: []
   [junit4]   2> 2406595 DEBUG (ScheduledTrigger-8199-thread-2) [    ] o.a.s.c.a.NodeLostTrigger Running NodeLostTrigger: .auto_add_replicas with currently live nodes: 4
   [junit4]   2> 2407388 ERROR (DataNode: [[[DISK]file:/home/jenkins/workspace/Lucene-Solr-BadApples-master-Linux/solr/build/solr-core/test/J2/temp/solr.cloud.MoveReplicaHDFSTest_1D6B3C201EBFC3C0-001/tempDir-002/hdfsBaseDir/data/data3/, [DISK]file:/home/jenkins/workspace/Lucene-Solr-BadApples-master-Linux/solr/build/solr-core/test/J2/temp/solr.cloud.MoveReplicaHDFSTest_1D6B3C201EBFC3C0-001/tempDir-002/hdfsBaseDir/data/data4/]]  heartbeating to localhost.localdomain/127.0.0.1:42569) [    ] o.a.h.h.s.d.DirectoryScanner dfs.datanode.directoryscan.throttle.limit.ms.per.sec set to value below 1 ms/sec. Assuming default value of 1000
   [junit4]   2> 2407404 ERROR (DataNode: [[[DISK]file:/home/jenkins/workspace/Lucene-Solr-BadApples-master-Linux/solr/build/solr-core/test/J2/temp/solr.cloud.MoveReplicaHDFSTest_1D6B3C201EBFC3C0-001/tempDir-002/hdfsBaseDir/data/data1/, [DISK]file:/home/jenkins/workspace/Lucene-Solr-BadApples-master-Linux/solr/build/solr-core/test/J2/temp/solr.cloud.MoveReplicaHDFSTest_1D6B3C201EBFC3C0-001/tempDir-002/hdfsBaseDir/data/data2/]]  heartbeating to localhost.localdomain/127.0.0.1:42569) [    ] o.a.h.h.s.d.DirectoryScanner dfs.datanode.directoryscan.throttle.limit.ms.per.sec set to value below 1 ms/sec. Assuming default value of 1000
   [junit4]   2> 2407414 INFO  (Block report processor) [    ] BlockStateChange BLOCK* processReport 0x56639a4719d68: from storage DS-2468e6cc-d038-4f82-94d6-ca11a47af12a node DatanodeRegistration(127.0.0.1:43677, datanodeUuid=fcda7960-5a5f-4bde-99e8-d697c90435c4, infoPort=44111, infoSecurePort=0, ipcPort=36969, storageInfo=lv=-56;cid=testClusterID;nsid=1245291026;c=0), blocks: 0, hasStaleStorage: true, processing time: 0 msecs
   [junit4]   2> 2407415 INFO  (Block report processor) [    ] BlockStateChange BLOCK* processReport 0x56639a4719d68: from storage DS-cd7aa2c7-c970-4170-bc45-8a222d5b397c node DatanodeRegistration(127.0.0.1:43677, datanodeUuid=fcda7960-5a5f-4bde-99e8-d697c90435c4, infoPort=44111, infoSecurePort=0, ipcPort=36969, storageInfo=lv=-56;cid=testClusterID;nsid=1245291026;c=0), blocks: 0, hasStaleStorage: false, processing time: 0 msecs
   [junit4]   2> 2407415 INFO  (Block report processor) [    ] BlockStateChange BLOCK* processReport 0x56639a4846ec5: from storage DS-c04d0dce-63c0-42db-848d-eeaea827f0c5 node DatanodeRegistration(127.0.0.1:44785, datanodeUuid=5f63d35c-ba57-4fe3-ac6b-f8189469c7b7, infoPort=34349, infoSecurePort=0, ipcPort=43073, storageInfo=lv=-56;cid=testClusterID;nsid=1245291026;c=0), blocks: 0, hasStaleStorage: true, processing time: 0 msecs
   [junit4]   2> 2407416 INFO  (Block report processor) [    ] BlockStateChange BLOCK* processReport 0x56639a4846ec5: from storage DS-e3aaa5c4-f97a-420d-a5c7-9b54c08ff88c node DatanodeRegistration(127.0.0.1:44785, datanodeUuid=5f63d35c-ba57-4fe3-ac6b-f8189469c7b7, infoPort=34349, infoSecurePort=0, ipcPort=43073, storageInfo=lv=-56;cid=testClusterID;nsid=1245291026;c=0), blocks: 0, hasStaleStorage: false, processing time: 0 msecs
   [junit4]   2> 2407595 DEBUG (ScheduledTrigger-8199-thread-1) [    ] o.a.s.c.a.NodeLostTrigger Running NodeLostTrigger: .auto_add_replicas with currently live nodes: 4
   [junit4]   2> 2407602 DEBUG (SyncThread:0) [    ] o.a.s.c.ZkTestServer Watch added: data: /solr/clusterprops.json
   [junit4]   2> 2407602 DEBUG (SyncThread:0) [    ] o.a.s.c.ZkTestServer Watch added: children: /solr/live_nodes
   [junit4]   2> 2407602 INFO  (TEST-MoveReplicaHDFSTest.testNormalMove-seed#[1D6B3C201EBFC3C0]) [    ] o.a.s.c.c.ZkStateReader Updated live nodes from ZooKeeper... (0) -> (4)
   [junit4]   2> 2407602 DEBUG (SyncThread:0) [    ] o.a.s.c.ZkTestServer Watch added: data: /solr/clusterstate.json
   [junit4]   2> 2407602 DEBUG (SyncThread:0) [    ] o.a.s.c.ZkTestServer Watch added: children: /solr/collections
   [junit4]   2> 2407603 DEBUG (SyncThread:0) [    ] o.a.s.c.ZkTestServer Watch added: create/delete: /solr/aliases.json
   [junit4]   2> 2407606 DEBUG (SyncThread:0) [    ] o.a.s.c.ZkTestServer Watch fired: data: /solr/aliases.json
   [junit4]   2> 2407606 DEBUG (SyncThread:0) [    ] o.a.s.c.ZkTestServer Watch fired: data: /solr/aliases.json
   [junit4]   2> 2407607 DEBUG (SyncThread:0) [    ] o.a.s.c.ZkTestServer Watch fired: data: /solr/aliases.json
   [junit4]   2> 2407607 DEBUG (SyncThread:0

[...truncated too long message...]

g.eclipse.jetty.util.thread.QueuedThreadPool$2.run(QueuedThreadPool.java:680)
   [junit4]   2> 	at java.lang.Thread.run(Thread.java:748)
   [junit4]   2> 
   [junit4]   2> 307118 INFO  (qtp16062204-5354) [n:127.0.0.1:34813_solr    x:testMultipleWithCollections_xyz2_shard1_replica_n1] o.a.s.s.HttpSolrCall [admin] webapp=null path=/admin/cores params={nodeName=127.0.0.1:33501_solr&onlyIfLeaderActive=true&core=testMultipleWithCollections_xyz2_shard1_replica_n1&coreNodeName=core_node4&action=PREPRECOVERY&checkLive=true&state=recovering&onlyIfLeader=true&wt=javabin&version=2} status=400 QTime=14005
   [junit4]   2> 307118 ERROR (SUITE-TestWithCollection-seed#[1D6B3C201EBFC3C0]-worker) [    ] o.a.z.s.ZooKeeperServer ZKShutdownHandler is not registered, so ZooKeeper server won't take any action on ERROR or SHUTDOWN server state changes
   [junit4]   2> 307118 INFO  (SUITE-TestWithCollection-seed#[1D6B3C201EBFC3C0]-worker) [    ] o.a.s.c.ZkTestServer connecting to 127.0.0.1:42583 42583
   [junit4]   2> 307914 INFO  (Thread-4250) [    ] o.a.s.c.ZkTestServer connecting to 127.0.0.1:42583 42583
   [junit4]   2> 307915 WARN  (Thread-4250) [    ] o.a.s.c.ZkTestServer Watch limit violations: 
   [junit4]   2> Maximum concurrent create/delete watches above limit:
   [junit4]   2> 
   [junit4]   2> 	25	/solr/collections/testNodeAdded_xyz/terms/shard1
   [junit4]   2> 	23	/solr/collections/testNodeAdded_abc/terms/shard1
   [junit4]   2> 	20	/solr/aliases.json
   [junit4]   2> 	12	/solr/collections/testMultipleWithCollections_abc2/terms/shard1
   [junit4]   2> 	12	/solr/collections/testAddReplicaWithPolicy_abc/terms/shard1
   [junit4]   2> 	12	/solr/collections/testMultipleWithCollections_abc/terms/shard1
   [junit4]   2> 	12	/solr/collections/testMoveReplicaMainCollection_xyz/terms/shard1
   [junit4]   2> 	12	/solr/collections/testMultipleWithCollections_xyz/terms/shard1
   [junit4]   2> 	11	/solr/collections/testMoveReplicaMainCollection_abc/terms/shard1
   [junit4]   2> 	11	/solr/collections/testAddReplica_abc/terms/shard1
   [junit4]   2> 	10	/solr/collections/testMultipleWithCollections_xyz2/terms/shard1
   [junit4]   2> 	10	/solr/collections/testAddReplica_xyz/terms/shard1
   [junit4]   2> 	10	/solr/collections/testAddReplicaWithPolicy_xyz/terms/shard1
   [junit4]   2> 	5	/solr/security.json
   [junit4]   2> 	3	/solr/configs/testNodeAdded_xyz.AUTOCREATED
   [junit4]   2> 	3	/solr/collections/testCreateCollection_abc/terms/shard1
   [junit4]   2> 	3	/solr/configs/testNodeAdded_abc.AUTOCREATED/managed-schema
   [junit4]   2> 	3	/solr/collections/testMoveReplicaWithCollection_abc/terms/shard1
   [junit4]   2> 	3	/solr/collections/testDeleteWithCollection_abc_2/terms/shard1
   [junit4]   2> 	3	/solr/configs/testNodeAdded_xyz.AUTOCREATED/managed-schema
   [junit4]   2> 	3	/solr/collections/testCreateCollection_xyz/terms/shard1
   [junit4]   2> 	3	/solr/configs/testNodeAdded_abc.AUTOCREATED
   [junit4]   2> 	3	/solr/collections/testDeleteWithCollection_xyz/terms/shard1
   [junit4]   2> 	3	/solr/collections/testMoveReplicaWithCollection_xyz/terms/shard1
   [junit4]   2> 	3	/solr/collections/testDeleteWithCollection_abc/terms/shard1
   [junit4]   2> 	3	/solr/collections/testDeleteWithCollection_xyz_2/terms/shard1
   [junit4]   2> 	2	/solr/configs/testAddReplicaWithPolicy_xyz.AUTOCREATED
   [junit4]   2> 	2	/solr/configs/testAddReplica_abc.AUTOCREATED
   [junit4]   2> 	2	/solr/collections/testCreateCollectionNoWithCollection_abc/terms/shard2
   [junit4]   2> 	2	/solr/collections/testCreateCollectionNoWithCollection_abc/terms/shard1
   [junit4]   2> 	2	/solr/configs/testCreateCollectionNoWithCollection_abc.AUTOCREATED
   [junit4]   2> 	2	/solr/configs/testMoveReplicaMainCollection_xyz.AUTOCREATED
   [junit4]   2> 	2	/solr/configs/testMultipleWithCollections_xyz2.AUTOCREATED
   [junit4]   2> 	2	/solr/configs/testAddReplica_abc.AUTOCREATED/managed-schema
   [junit4]   2> 	2	/solr/configs/testMultipleWithCollections_abc2.AUTOCREATED/managed-schema
   [junit4]   2> 	2	/solr/configs/testAddReplicaWithPolicy_abc.AUTOCREATED/managed-schema
   [junit4]   2> 	2	/solr/configs/testAddReplicaWithPolicy_abc.AUTOCREATED
   [junit4]   2> 	2	/solr/configs/testMultipleWithCollections_abc.AUTOCREATED/managed-schema
   [junit4]   2> 	2	/solr/configs/testMultipleWithCollections_abc2.AUTOCREATED
   [junit4]   2> 	2	/solr/configs/testMultipleWithCollections_xyz.AUTOCREATED/managed-schema
   [junit4]   2> 	2	/solr/configs/testMoveReplicaMainCollection_abc.AUTOCREATED
   [junit4]   2> 	2	/solr/configs/testAddReplica_xyz.AUTOCREATED/managed-schema
   [junit4]   2> 	2	/solr/configs/testAddReplicaWithPolicy_xyz.AUTOCREATED/managed-schema
   [junit4]   2> 	2	/solr/configs/testAddReplica_xyz.AUTOCREATED
   [junit4]   2> 	2	/solr/configs/testCreateCollectionNoWithCollection_abc.AUTOCREATED/managed-schema
   [junit4]   2> 	2	/solr/configs/testMoveReplicaMainCollection_abc.AUTOCREATED/managed-schema
   [junit4]   2> 	2	/solr/configs/testMultipleWithCollections_abc.AUTOCREATED
   [junit4]   2> 	2	/solr/configs/testMultipleWithCollections_xyz2.AUTOCREATED/managed-schema
   [junit4]   2> 	2	/solr/configs/testMoveReplicaMainCollection_xyz.AUTOCREATED/managed-schema
   [junit4]   2> 	2	/solr/configs/testMultipleWithCollections_xyz.AUTOCREATED
   [junit4]   2> 
   [junit4]   2> Maximum concurrent data watches above limit:
   [junit4]   2> 
   [junit4]   2> 	45	/solr/aliases.json
   [junit4]   2> 	20	/solr/clusterprops.json
   [junit4]   2> 	20	/solr/clusterstate.json
   [junit4]   2> 	6	/solr/collections/testNodeAdded_xyz/state.json
   [junit4]   2> 	6	/solr/collections/testMoveReplicaMainCollection_xyz/state.json
   [junit4]   2> 	6	/solr/collections/testMultipleWithCollections_abc2/state.json
   [junit4]   2> 	6	/solr/collections/testNodeAdded_abc/state.json
   [junit4]   2> 	5	/solr/collections/testMultipleWithCollections_abc/state.json
   [junit4]   2> 	5	/solr/collections/testAddReplicaWithPolicy_abc/state.json
   [junit4]   2> 	5	/solr/collections/testMultipleWithCollections_xyz/state.json
   [junit4]   2> 	4	/solr/collections/testMultipleWithCollections_xyz2/state.json
   [junit4]   2> 	4	/solr/collections/testAddReplica_xyz/state.json
   [junit4]   2> 	3	/solr/collections/testAddReplicaWithPolicy_xyz/state.json
   [junit4]   2> 	2	/solr/overseer_elect/election/72157368798871559-127.0.0.1:34813_solr-n_0000000001
   [junit4]   2> 	2	/solr/collections/testMoveReplicaMainCollection_abc/state.json
   [junit4]   2> 	2	/solr/collections/testAddReplica_abc/state.json
   [junit4]   2> 	2	/solr/collections/testCreateCollectionNoWithCollection_abc/state.json
   [junit4]   2> 	2	/solr/collections/testNodeAdded_abc/leader_elect/shard1/election/72157368798871559-core_node2-n_0000000000
   [junit4]   2> 
   [junit4]   2> Maximum concurrent children watches above limit:
   [junit4]   2> 
   [junit4]   2> 	225	/solr/collections
   [junit4]   2> 	57	/solr/live_nodes
   [junit4]   2> 
   [junit4]   2> NOTE: leaving temporary files on disk at: /home/jenkins/workspace/Lucene-Solr-BadApples-master-Linux/solr/build/solr-core/test/J2/temp/solr.cloud.TestWithCollection_1D6B3C201EBFC3C0-001
   [junit4]   2> NOTE: test params are: codec=FastDecompressionCompressingStoredFields(storedFieldsFormat=CompressingStoredFieldsFormat(compressionMode=FAST_DECOMPRESSION, chunkSize=21792, maxDocsPerChunk=991, blockSize=895), termVectorsFormat=CompressingTermVectorsFormat(compressionMode=FAST_DECOMPRESSION, chunkSize=21792, blockSize=895)), sim=Asserting(org.apache.lucene.search.similarities.AssertingSimilarity@11d1ac2), locale=es-HN, timezone=Etc/GMT-4
   [junit4]   2> NOTE: Linux 4.15.0-29-generic i386/Oracle Corporation 1.8.0_172 (32-bit)/cpus=8,threads=1,free=92800528,total=337903616
   [junit4]   2> NOTE: All tests run in this JVM: [MoveReplicaHDFSTest, MoveReplicaHDFSTest, TestWithCollection]
   [junit4] Completed [8/10 (3!)] on J2 in 105.02s, 9 tests, 1 error <<< FAILURES!

[...truncated 28 lines...]
BUILD FAILED
/home/jenkins/workspace/Lucene-Solr-BadApples-master-Linux/lucene/common-build.xml:1568: The following error occurred while executing this line:
/home/jenkins/workspace/Lucene-Solr-BadApples-master-Linux/lucene/common-build.xml:1092: There were test failures: 10 suites, 65 tests, 3 errors, 1 failure [seed: 1D6B3C201EBFC3C0]

Total time: 6 minutes 30 seconds

[repro] Setting last failure code to 256

[repro] Failures:
[repro]   0/5 failed: org.apache.solr.cloud.MoveReplicaHDFSTest
[repro]   3/5 failed: org.apache.solr.cloud.TestWithCollection
[repro] Exiting with code 256
+ mv lucene/build lucene/build.repro
+ mv solr/build solr/build.repro
+ mv lucene/build.orig lucene/build
+ mv solr/build.orig solr/build
Archiving artifacts
Setting ANT_1_8_2_HOME=/var/lib/jenkins/tools/hudson.tasks.Ant_AntInstallation/ANT_1.8.2
[WARNINGS] Parsing warnings in console log with parser Java Compiler (javac)
Setting ANT_1_8_2_HOME=/var/lib/jenkins/tools/hudson.tasks.Ant_AntInstallation/ANT_1.8.2
Setting ANT_1_8_2_HOME=/var/lib/jenkins/tools/hudson.tasks.Ant_AntInstallation/ANT_1.8.2
<Git Blamer> Using GitBlamer to create author and commit information for all warnings.
<Git Blamer> GIT_COMMIT=baf3b8f20c3088f145949b77bc1118db0b87bb17, workspace=/var/lib/jenkins/workspace/Lucene-Solr-BadApples-master-Linux
[WARNINGS] Computing warning deltas based on reference build #77
Recording test results
Setting ANT_1_8_2_HOME=/var/lib/jenkins/tools/hudson.tasks.Ant_AntInstallation/ANT_1.8.2
Build step 'Publish JUnit test result report' changed build result to UNSTABLE
Email was triggered for: Unstable (Test Failures)
Sending email for trigger: Unstable (Test Failures)
Setting ANT_1_8_2_HOME=/var/lib/jenkins/tools/hudson.tasks.Ant_AntInstallation/ANT_1.8.2
Setting ANT_1_8_2_HOME=/var/lib/jenkins/tools/hudson.tasks.Ant_AntInstallation/ANT_1.8.2
Setting ANT_1_8_2_HOME=/var/lib/jenkins/tools/hudson.tasks.Ant_AntInstallation/ANT_1.8.2
Setting ANT_1_8_2_HOME=/var/lib/jenkins/tools/hudson.tasks.Ant_AntInstallation/ANT_1.8.2

Mime
View raw message