lucene-dev mailing list archives

Site index · List index
Message view « Date » · « Thread »
Top « Date » · « Thread »
From Policeman Jenkins Server <jenk...@thetaphi.de>
Subject [JENKINS] Lucene-Solr-7.x-Linux (64bit/jdk1.8.0_172) - Build # 2475 - Unstable!
Date Fri, 03 Aug 2018 13:18:40 GMT
Build: https://jenkins.thetaphi.de/job/Lucene-Solr-7.x-Linux/2475/
Java: 64bit/jdk1.8.0_172 -XX:-UseCompressedOops -XX:+UseParallelGC

1 tests failed.
FAILED:  org.apache.solr.cloud.TestWithCollection.testMoveReplicaWithCollection

Error Message:
Expected moving a replica of 'withCollection': testMoveReplicaWithCollection_abc to fail

Stack Trace:
java.lang.AssertionError: Expected moving a replica of 'withCollection': testMoveReplicaWithCollection_abc to fail
	at __randomizedtesting.SeedInfo.seed([63194DEC6D9081F2:2C0E744FFEE24884]:0)
	at org.junit.Assert.fail(Assert.java:93)
	at org.apache.solr.cloud.TestWithCollection.testMoveReplicaWithCollection(TestWithCollection.java:389)
	at sun.reflect.NativeMethodAccessorImpl.invoke0(Native Method)
	at sun.reflect.NativeMethodAccessorImpl.invoke(NativeMethodAccessorImpl.java:62)
	at sun.reflect.DelegatingMethodAccessorImpl.invoke(DelegatingMethodAccessorImpl.java:43)
	at java.lang.reflect.Method.invoke(Method.java:498)
	at com.carrotsearch.randomizedtesting.RandomizedRunner.invoke(RandomizedRunner.java:1737)
	at com.carrotsearch.randomizedtesting.RandomizedRunner$8.evaluate(RandomizedRunner.java:934)
	at com.carrotsearch.randomizedtesting.RandomizedRunner$9.evaluate(RandomizedRunner.java:970)
	at com.carrotsearch.randomizedtesting.RandomizedRunner$10.evaluate(RandomizedRunner.java:984)
	at com.carrotsearch.randomizedtesting.rules.SystemPropertiesRestoreRule$1.evaluate(SystemPropertiesRestoreRule.java:57)
	at org.apache.lucene.util.TestRuleSetupTeardownChained$1.evaluate(TestRuleSetupTeardownChained.java:49)
	at org.apache.lucene.util.AbstractBeforeAfterRule$1.evaluate(AbstractBeforeAfterRule.java:45)
	at org.apache.lucene.util.TestRuleThreadAndTestName$1.evaluate(TestRuleThreadAndTestName.java:48)
	at org.apache.lucene.util.TestRuleIgnoreAfterMaxFailures$1.evaluate(TestRuleIgnoreAfterMaxFailures.java:64)
	at org.apache.lucene.util.TestRuleMarkFailure$1.evaluate(TestRuleMarkFailure.java:47)
	at com.carrotsearch.randomizedtesting.rules.StatementAdapter.evaluate(StatementAdapter.java:36)
	at com.carrotsearch.randomizedtesting.ThreadLeakControl$StatementRunner.run(ThreadLeakControl.java:368)
	at com.carrotsearch.randomizedtesting.ThreadLeakControl.forkTimeoutingTask(ThreadLeakControl.java:817)
	at com.carrotsearch.randomizedtesting.ThreadLeakControl$3.evaluate(ThreadLeakControl.java:468)
	at com.carrotsearch.randomizedtesting.RandomizedRunner.runSingleTest(RandomizedRunner.java:943)
	at com.carrotsearch.randomizedtesting.RandomizedRunner$5.evaluate(RandomizedRunner.java:829)
	at com.carrotsearch.randomizedtesting.RandomizedRunner$6.evaluate(RandomizedRunner.java:879)
	at com.carrotsearch.randomizedtesting.RandomizedRunner$7.evaluate(RandomizedRunner.java:890)
	at com.carrotsearch.randomizedtesting.rules.StatementAdapter.evaluate(StatementAdapter.java:36)
	at com.carrotsearch.randomizedtesting.rules.SystemPropertiesRestoreRule$1.evaluate(SystemPropertiesRestoreRule.java:57)
	at org.apache.lucene.util.AbstractBeforeAfterRule$1.evaluate(AbstractBeforeAfterRule.java:45)
	at com.carrotsearch.randomizedtesting.rules.StatementAdapter.evaluate(StatementAdapter.java:36)
	at org.apache.lucene.util.TestRuleStoreClassName$1.evaluate(TestRuleStoreClassName.java:41)
	at com.carrotsearch.randomizedtesting.rules.NoShadowingOrOverridesOnMethodsRule$1.evaluate(NoShadowingOrOverridesOnMethodsRule.java:40)
	at com.carrotsearch.randomizedtesting.rules.NoShadowingOrOverridesOnMethodsRule$1.evaluate(NoShadowingOrOverridesOnMethodsRule.java:40)
	at com.carrotsearch.randomizedtesting.rules.StatementAdapter.evaluate(StatementAdapter.java:36)
	at com.carrotsearch.randomizedtesting.rules.StatementAdapter.evaluate(StatementAdapter.java:36)
	at com.carrotsearch.randomizedtesting.rules.StatementAdapter.evaluate(StatementAdapter.java:36)
	at org.apache.lucene.util.TestRuleAssertionsRequired$1.evaluate(TestRuleAssertionsRequired.java:53)
	at org.apache.lucene.util.TestRuleMarkFailure$1.evaluate(TestRuleMarkFailure.java:47)
	at org.apache.lucene.util.TestRuleIgnoreAfterMaxFailures$1.evaluate(TestRuleIgnoreAfterMaxFailures.java:64)
	at org.apache.lucene.util.TestRuleIgnoreTestSuites$1.evaluate(TestRuleIgnoreTestSuites.java:54)
	at com.carrotsearch.randomizedtesting.rules.StatementAdapter.evaluate(StatementAdapter.java:36)
	at com.carrotsearch.randomizedtesting.ThreadLeakControl$StatementRunner.run(ThreadLeakControl.java:368)
	at java.lang.Thread.run(Thread.java:748)




Build Log:
[...truncated 14055 lines...]
   [junit4] Suite: org.apache.solr.cloud.TestWithCollection
   [junit4]   2> Creating dataDir: /home/jenkins/workspace/Lucene-Solr-7.x-Linux/solr/build/solr-core/test/J0/temp/solr.cloud.TestWithCollection_63194DEC6D9081F2-001/init-core-data-001
   [junit4]   2> 1320314 WARN  (SUITE-TestWithCollection-seed#[63194DEC6D9081F2]-worker) [    ] o.a.s.SolrTestCaseJ4 startTrackingSearchers: numOpens=608 numCloses=608
   [junit4]   2> 1320314 INFO  (SUITE-TestWithCollection-seed#[63194DEC6D9081F2]-worker) [    ] o.a.s.SolrTestCaseJ4 Using TrieFields (NUMERIC_POINTS_SYSPROP=false) w/NUMERIC_DOCVALUES_SYSPROP=true
   [junit4]   2> 1320315 INFO  (SUITE-TestWithCollection-seed#[63194DEC6D9081F2]-worker) [    ] o.a.s.SolrTestCaseJ4 Randomized ssl (false) and clientAuth (true) via: @org.apache.solr.util.RandomizeSSL(reason=, ssl=NaN, value=NaN, clientAuth=NaN)
   [junit4]   2> 1320315 INFO  (SUITE-TestWithCollection-seed#[63194DEC6D9081F2]-worker) [    ] o.a.s.SolrTestCaseJ4 SecureRandom sanity checks: test.solr.allowed.securerandom=null & java.security.egd=file:/dev/./urandom
   [junit4]   2> 1320316 INFO  (SUITE-TestWithCollection-seed#[63194DEC6D9081F2]-worker) [    ] o.a.s.c.MiniSolrCloudCluster Starting cluster of 2 servers in /home/jenkins/workspace/Lucene-Solr-7.x-Linux/solr/build/solr-core/test/J0/temp/solr.cloud.TestWithCollection_63194DEC6D9081F2-001/tempDir-001
   [junit4]   2> 1320316 INFO  (SUITE-TestWithCollection-seed#[63194DEC6D9081F2]-worker) [    ] o.a.s.c.ZkTestServer STARTING ZK TEST SERVER
   [junit4]   2> 1320316 INFO  (Thread-3143) [    ] o.a.s.c.ZkTestServer client port:0.0.0.0/0.0.0.0:0
   [junit4]   2> 1320316 INFO  (Thread-3143) [    ] o.a.s.c.ZkTestServer Starting server
   [junit4]   2> 1320317 ERROR (Thread-3143) [    ] o.a.z.s.ZooKeeperServer ZKShutdownHandler is not registered, so ZooKeeper server won't take any action on ERROR or SHUTDOWN server state changes
   [junit4]   2> 1320416 INFO  (SUITE-TestWithCollection-seed#[63194DEC6D9081F2]-worker) [    ] o.a.s.c.ZkTestServer start zk server on port:33355
   [junit4]   2> 1320418 INFO  (zkConnectionManagerCallback-9235-thread-1) [    ] o.a.s.c.c.ConnectionManager zkClient has connected
   [junit4]   2> 1320420 INFO  (jetty-launcher-9232-thread-1) [    ] o.e.j.s.Server jetty-9.4.11.v20180605; built: 2018-06-05T18:24:03.829Z; git: d5fc0523cfa96bfebfbda19606cad384d772f04c; jvm 1.8.0_172-b11
   [junit4]   2> 1320420 INFO  (jetty-launcher-9232-thread-2) [    ] o.e.j.s.Server jetty-9.4.11.v20180605; built: 2018-06-05T18:24:03.829Z; git: d5fc0523cfa96bfebfbda19606cad384d772f04c; jvm 1.8.0_172-b11
   [junit4]   2> 1320421 INFO  (jetty-launcher-9232-thread-1) [    ] o.e.j.s.session DefaultSessionIdManager workerName=node0
   [junit4]   2> 1320421 INFO  (jetty-launcher-9232-thread-1) [    ] o.e.j.s.session No SessionScavenger set, using defaults
   [junit4]   2> 1320421 INFO  (jetty-launcher-9232-thread-1) [    ] o.e.j.s.session node0 Scavenging every 660000ms
   [junit4]   2> 1320421 INFO  (jetty-launcher-9232-thread-1) [    ] o.e.j.s.h.ContextHandler Started o.e.j.s.ServletContextHandler@633c00ec{/solr,null,AVAILABLE}
   [junit4]   2> 1320421 INFO  (jetty-launcher-9232-thread-2) [    ] o.e.j.s.session DefaultSessionIdManager workerName=node0
   [junit4]   2> 1320421 INFO  (jetty-launcher-9232-thread-2) [    ] o.e.j.s.session No SessionScavenger set, using defaults
   [junit4]   2> 1320421 INFO  (jetty-launcher-9232-thread-2) [    ] o.e.j.s.session node0 Scavenging every 660000ms
   [junit4]   2> 1320421 INFO  (jetty-launcher-9232-thread-2) [    ] o.e.j.s.h.ContextHandler Started o.e.j.s.ServletContextHandler@b17220b{/solr,null,AVAILABLE}
   [junit4]   2> 1320422 INFO  (jetty-launcher-9232-thread-2) [    ] o.e.j.s.AbstractConnector Started ServerConnector@1846b993{HTTP/1.1,[http/1.1]}{127.0.0.1:45789}
   [junit4]   2> 1320422 INFO  (jetty-launcher-9232-thread-1) [    ] o.e.j.s.AbstractConnector Started ServerConnector@a03f6d3{HTTP/1.1,[http/1.1]}{127.0.0.1:37353}
   [junit4]   2> 1320422 INFO  (jetty-launcher-9232-thread-2) [    ] o.e.j.s.Server Started @1320468ms
   [junit4]   2> 1320422 INFO  (jetty-launcher-9232-thread-1) [    ] o.e.j.s.Server Started @1320468ms
   [junit4]   2> 1320422 INFO  (jetty-launcher-9232-thread-2) [    ] o.a.s.c.s.e.JettySolrRunner Jetty properties: {hostContext=/solr, hostPort=45789}
   [junit4]   2> 1320422 INFO  (jetty-launcher-9232-thread-1) [    ] o.a.s.c.s.e.JettySolrRunner Jetty properties: {hostContext=/solr, hostPort=37353}
   [junit4]   2> 1320422 ERROR (jetty-launcher-9232-thread-2) [    ] o.a.s.u.StartupLoggingUtils Missing Java Option solr.log.dir. Logging may be missing or incomplete.
   [junit4]   2> 1320422 INFO  (jetty-launcher-9232-thread-2) [    ] o.a.s.s.SolrDispatchFilter Using logger factory org.apache.logging.slf4j.Log4jLoggerFactory
   [junit4]   2> 1320422 ERROR (jetty-launcher-9232-thread-1) [    ] o.a.s.u.StartupLoggingUtils Missing Java Option solr.log.dir. Logging may be missing or incomplete.
   [junit4]   2> 1320422 INFO  (jetty-launcher-9232-thread-2) [    ] o.a.s.s.SolrDispatchFilter  ___      _       Welcome to Apache Solr? version 7.5.0
   [junit4]   2> 1320422 INFO  (jetty-launcher-9232-thread-1) [    ] o.a.s.s.SolrDispatchFilter Using logger factory org.apache.logging.slf4j.Log4jLoggerFactory
   [junit4]   2> 1320422 INFO  (jetty-launcher-9232-thread-2) [    ] o.a.s.s.SolrDispatchFilter / __| ___| |_ _   Starting in cloud mode on port null
   [junit4]   2> 1320422 INFO  (jetty-launcher-9232-thread-2) [    ] o.a.s.s.SolrDispatchFilter \__ \/ _ \ | '_|  Install dir: null
   [junit4]   2> 1320422 INFO  (jetty-launcher-9232-thread-1) [    ] o.a.s.s.SolrDispatchFilter  ___      _       Welcome to Apache Solr? version 7.5.0
   [junit4]   2> 1320422 INFO  (jetty-launcher-9232-thread-2) [    ] o.a.s.s.SolrDispatchFilter |___/\___/_|_|    Start time: 2018-08-03T12:46:56.041Z
   [junit4]   2> 1320422 INFO  (jetty-launcher-9232-thread-1) [    ] o.a.s.s.SolrDispatchFilter / __| ___| |_ _   Starting in cloud mode on port null
   [junit4]   2> 1320422 INFO  (jetty-launcher-9232-thread-1) [    ] o.a.s.s.SolrDispatchFilter \__ \/ _ \ | '_|  Install dir: null
   [junit4]   2> 1320422 INFO  (jetty-launcher-9232-thread-1) [    ] o.a.s.s.SolrDispatchFilter |___/\___/_|_|    Start time: 2018-08-03T12:46:56.041Z
   [junit4]   2> 1320426 INFO  (zkConnectionManagerCallback-9238-thread-1) [    ] o.a.s.c.c.ConnectionManager zkClient has connected
   [junit4]   2> 1320426 INFO  (zkConnectionManagerCallback-9239-thread-1) [    ] o.a.s.c.c.ConnectionManager zkClient has connected
   [junit4]   2> 1320426 INFO  (jetty-launcher-9232-thread-2) [    ] o.a.s.s.SolrDispatchFilter solr.xml found in ZooKeeper. Loading...
   [junit4]   2> 1320426 INFO  (jetty-launcher-9232-thread-1) [    ] o.a.s.s.SolrDispatchFilter solr.xml found in ZooKeeper. Loading...
   [junit4]   2> 1320561 INFO  (jetty-launcher-9232-thread-1) [    ] o.a.s.c.ZkContainer Zookeeper client=127.0.0.1:33355/solr
   [junit4]   2> 1320562 INFO  (zkConnectionManagerCallback-9243-thread-1) [    ] o.a.s.c.c.ConnectionManager zkClient has connected
   [junit4]   2> 1320563 INFO  (zkConnectionManagerCallback-9245-thread-1) [    ] o.a.s.c.c.ConnectionManager zkClient has connected
   [junit4]   2> 1320593 INFO  (jetty-launcher-9232-thread-2) [    ] o.a.s.c.ZkContainer Zookeeper client=127.0.0.1:33355/solr
   [junit4]   2> 1320594 INFO  (zkConnectionManagerCallback-9251-thread-1) [    ] o.a.s.c.c.ConnectionManager zkClient has connected
   [junit4]   2> 1320595 INFO  (zkConnectionManagerCallback-9253-thread-1) [    ] o.a.s.c.c.ConnectionManager zkClient has connected
   [junit4]   2> 1320596 INFO  (jetty-launcher-9232-thread-1) [n:127.0.0.1:37353_solr    ] o.a.s.c.OverseerElectionContext I am going to be the leader 127.0.0.1:37353_solr
   [junit4]   2> 1320597 INFO  (jetty-launcher-9232-thread-1) [n:127.0.0.1:37353_solr    ] o.a.s.c.Overseer Overseer (id=72097092637753348-127.0.0.1:37353_solr-n_0000000000) starting
   [junit4]   2> 1320598 INFO  (jetty-launcher-9232-thread-2) [n:127.0.0.1:45789_solr    ] o.a.s.c.ZkController Register node as live in ZooKeeper:/live_nodes/127.0.0.1:45789_solr
   [junit4]   2> 1320599 INFO  (zkCallback-9244-thread-1) [    ] o.a.s.c.c.ZkStateReader Updated live nodes from ZooKeeper... (0) -> (1)
   [junit4]   2> 1320599 INFO  (zkCallback-9252-thread-1) [    ] o.a.s.c.c.ZkStateReader Updated live nodes from ZooKeeper... (0) -> (1)
   [junit4]   2> 1320600 INFO  (zkConnectionManagerCallback-9260-thread-1) [    ] o.a.s.c.c.ConnectionManager zkClient has connected
   [junit4]   2> 1320600 INFO  (jetty-launcher-9232-thread-1) [n:127.0.0.1:37353_solr    ] o.a.s.c.c.ZkStateReader Updated live nodes from ZooKeeper... (0) -> (1)
   [junit4]   2> 1320601 INFO  (jetty-launcher-9232-thread-1) [n:127.0.0.1:37353_solr    ] o.a.s.c.s.i.ZkClientClusterStateProvider Cluster at 127.0.0.1:33355/solr ready
   [junit4]   2> 1320601 INFO  (OverseerStateUpdate-72097092637753348-127.0.0.1:37353_solr-n_0000000000) [    ] o.a.s.c.Overseer Starting to work on the main queue : 127.0.0.1:37353_solr
   [junit4]   2> 1320601 DEBUG (OverseerAutoScalingTriggerThread-72097092637753348-127.0.0.1:37353_solr-n_0000000000) [    ] o.a.s.c.a.OverseerTriggerThread Adding .auto_add_replicas and .scheduled_maintenance triggers
   [junit4]   2> 1320604 DEBUG (OverseerAutoScalingTriggerThread-72097092637753348-127.0.0.1:37353_solr-n_0000000000) [    ] o.a.s.c.a.OverseerTriggerThread Refreshing /autoscaling.json with znode version 1
   [junit4]   2> 1320604 INFO  (jetty-launcher-9232-thread-1) [n:127.0.0.1:37353_solr    ] o.a.s.c.TransientSolrCoreCacheDefault Allocating transient cache for 2147483647 transient cores
   [junit4]   2> 1320604 DEBUG (OverseerAutoScalingTriggerThread-72097092637753348-127.0.0.1:37353_solr-n_0000000000) [    ] o.a.s.c.a.OverseerTriggerThread Current znodeVersion 1, lastZnodeVersion -1
   [junit4]   2> 1320604 INFO  (jetty-launcher-9232-thread-1) [n:127.0.0.1:37353_solr    ] o.a.s.c.ZkController Register node as live in ZooKeeper:/live_nodes/127.0.0.1:37353_solr
   [junit4]   2> 1320604 DEBUG (OverseerAutoScalingTriggerThread-72097092637753348-127.0.0.1:37353_solr-n_0000000000) [    ] o.a.s.c.a.OverseerTriggerThread Processed trigger updates upto znodeVersion 1
   [junit4]   2> 1320605 INFO  (zkCallback-9244-thread-1) [    ] o.a.s.c.c.ZkStateReader Updated live nodes from ZooKeeper... (1) -> (2)
   [junit4]   2> 1320605 INFO  (zkCallback-9252-thread-1) [    ] o.a.s.c.c.ZkStateReader Updated live nodes from ZooKeeper... (1) -> (2)
   [junit4]   2> 1320605 INFO  (zkCallback-9259-thread-1) [    ] o.a.s.c.c.ZkStateReader Updated live nodes from ZooKeeper... (1) -> (2)
   [junit4]   2> 1320607 DEBUG (OverseerAutoScalingTriggerThread-72097092637753348-127.0.0.1:37353_solr-n_0000000000) [    ] o.a.s.c.a.NodeLostTrigger NodeLostTrigger .auto_add_replicas - Initial livenodes: [127.0.0.1:45789_solr, 127.0.0.1:37353_solr]
   [junit4]   2> 1320608 DEBUG (ScheduledTrigger-6826-thread-1) [    ] o.a.s.c.a.NodeLostTrigger Running NodeLostTrigger: .auto_add_replicas with currently live nodes: 2
   [junit4]   2> 1320609 DEBUG (OverseerAutoScalingTriggerThread-72097092637753348-127.0.0.1:37353_solr-n_0000000000) [    ] o.a.s.c.a.OverseerTriggerThread -- clean old nodeAdded markers
   [junit4]   2> 1320609 DEBUG (OverseerAutoScalingTriggerThread-72097092637753348-127.0.0.1:37353_solr-n_0000000000) [    ] o.a.s.c.a.OverseerTriggerThread Current znodeVersion 1, lastZnodeVersion 1
   [junit4]   2> 1320613 INFO  (jetty-launcher-9232-thread-1) [n:127.0.0.1:37353_solr    ] o.a.s.h.a.MetricsHistoryHandler No .system collection, keeping metrics history in memory.
   [junit4]   2> 1320613 INFO  (zkConnectionManagerCallback-9266-thread-1) [    ] o.a.s.c.c.ConnectionManager zkClient has connected
   [junit4]   2> 1320614 INFO  (jetty-launcher-9232-thread-2) [n:127.0.0.1:45789_solr    ] o.a.s.c.c.ZkStateReader Updated live nodes from ZooKeeper... (0) -> (2)
   [junit4]   2> 1320614 INFO  (jetty-launcher-9232-thread-2) [n:127.0.0.1:45789_solr    ] o.a.s.c.s.i.ZkClientClusterStateProvider Cluster at 127.0.0.1:33355/solr ready
   [junit4]   2> 1320615 INFO  (jetty-launcher-9232-thread-2) [n:127.0.0.1:45789_solr    ] o.a.s.h.a.MetricsHistoryHandler No .system collection, keeping metrics history in memory.
   [junit4]   2> 1320633 INFO  (jetty-launcher-9232-thread-1) [n:127.0.0.1:37353_solr    ] o.a.s.m.r.SolrJmxReporter JMX monitoring for 'solr_37353.solr.node' (registry 'solr.node') enabled at server: com.sun.jmx.mbeanserver.JmxMBeanServer@3d488fe8
   [junit4]   2> 1320633 INFO  (jetty-launcher-9232-thread-2) [n:127.0.0.1:45789_solr    ] o.a.s.m.r.SolrJmxReporter JMX monitoring for 'solr_45789.solr.node' (registry 'solr.node') enabled at server: com.sun.jmx.mbeanserver.JmxMBeanServer@3d488fe8
   [junit4]   2> 1320641 INFO  (jetty-launcher-9232-thread-2) [n:127.0.0.1:45789_solr    ] o.a.s.m.r.SolrJmxReporter JMX monitoring for 'solr_45789.solr.jvm' (registry 'solr.jvm') enabled at server: com.sun.jmx.mbeanserver.JmxMBeanServer@3d488fe8
   [junit4]   2> 1320641 INFO  (jetty-launcher-9232-thread-1) [n:127.0.0.1:37353_solr    ] o.a.s.m.r.SolrJmxReporter JMX monitoring for 'solr_37353.solr.jvm' (registry 'solr.jvm') enabled at server: com.sun.jmx.mbeanserver.JmxMBeanServer@3d488fe8
   [junit4]   2> 1320641 INFO  (jetty-launcher-9232-thread-2) [n:127.0.0.1:45789_solr    ] o.a.s.m.r.SolrJmxReporter JMX monitoring for 'solr_45789.solr.jetty' (registry 'solr.jetty') enabled at server: com.sun.jmx.mbeanserver.JmxMBeanServer@3d488fe8
   [junit4]   2> 1320641 INFO  (jetty-launcher-9232-thread-1) [n:127.0.0.1:37353_solr    ] o.a.s.m.r.SolrJmxReporter JMX monitoring for 'solr_37353.solr.jetty' (registry 'solr.jetty') enabled at server: com.sun.jmx.mbeanserver.JmxMBeanServer@3d488fe8
   [junit4]   2> 1320642 INFO  (jetty-launcher-9232-thread-2) [n:127.0.0.1:45789_solr    ] o.a.s.c.CorePropertiesLocator Found 0 core definitions underneath /home/jenkins/workspace/Lucene-Solr-7.x-Linux/solr/build/solr-core/test/J0/temp/solr.cloud.TestWithCollection_63194DEC6D9081F2-001/tempDir-001/node2/.
   [junit4]   2> 1320642 INFO  (jetty-launcher-9232-thread-1) [n:127.0.0.1:37353_solr    ] o.a.s.c.CorePropertiesLocator Found 0 core definitions underneath /home/jenkins/workspace/Lucene-Solr-7.x-Linux/solr/build/solr-core/test/J0/temp/solr.cloud.TestWithCollection_63194DEC6D9081F2-001/tempDir-001/node1/.
   [junit4]   2> 1320665 INFO  (zkConnectionManagerCallback-9269-thread-1) [    ] o.a.s.c.c.ConnectionManager zkClient has connected
   [junit4]   2> 1320666 INFO  (zkConnectionManagerCallback-9274-thread-1) [    ] o.a.s.c.c.ConnectionManager zkClient has connected
   [junit4]   2> 1320668 INFO  (SUITE-TestWithCollection-seed#[63194DEC6D9081F2]-worker) [    ] o.a.s.c.c.ZkStateReader Updated live nodes from ZooKeeper... (0) -> (2)
   [junit4]   2> 1320668 INFO  (SUITE-TestWithCollection-seed#[63194DEC6D9081F2]-worker) [    ] o.a.s.c.s.i.ZkClientClusterStateProvider Cluster at 127.0.0.1:33355/solr ready
   [junit4]   2> 1320678 INFO  (TEST-TestWithCollection.testDeleteWithCollection-seed#[63194DEC6D9081F2]) [    ] o.a.s.SolrTestCaseJ4 ###Starting testDeleteWithCollection
   [junit4]   2> 1320679 DEBUG (zkCallback-9259-thread-1) [    ] o.a.s.c.a.OverseerTriggerThread Refreshing /autoscaling.json with znode version 2
   [junit4]   2> 1320679 DEBUG (OverseerAutoScalingTriggerThread-72097092637753348-127.0.0.1:37353_solr-n_0000000000) [    ] o.a.s.c.a.OverseerTriggerThread Processed trigger updates upto znodeVersion 2
   [junit4]   2> 1320679 INFO  (TEST-TestWithCollection.testDeleteWithCollection-seed#[63194DEC6D9081F2]) [    ] o.a.s.c.c.ZkStateReader Updated live nodes from ZooKeeper... (0) -> (2)
   [junit4]   2> 1320680 DEBUG (OverseerAutoScalingTriggerThread-72097092637753348-127.0.0.1:37353_solr-n_0000000000) [    ] o.a.s.c.a.OverseerTriggerThread -- clean old nodeLost markers
   [junit4]   2> 1320680 DEBUG (OverseerAutoScalingTriggerThread-72097092637753348-127.0.0.1:37353_solr-n_0000000000) [    ] o.a.s.c.a.OverseerTriggerThread -- clean old nodeAdded markers
   [junit4]   2> 1320680 DEBUG (OverseerAutoScalingTriggerThread-72097092637753348-127.0.0.1:37353_solr-n_0000000000) [    ] o.a.s.c.a.OverseerTriggerThread Current znodeVersion 2, lastZnodeVersion 2
   [junit4]   2> 1320682 INFO  (qtp562212117-23994) [n:127.0.0.1:45789_solr    ] o.a.s.h.a.CollectionsHandler Invoked Collection Action :create with params pullReplicas=0&name=testDeleteWithCollection_abc&nrtReplicas=1&action=CREATE&numShards=1&tlogReplicas=0&wt=javabin&version=2 and sendToOCPQueue=true
   [junit4]   2> 1320682 INFO  (OverseerThreadFactory-6828-thread-1) [    ] o.a.s.c.a.c.CreateCollectionCmd Create collection testDeleteWithCollection_abc
   [junit4]   2> 1320682 INFO  (OverseerThreadFactory-6828-thread-1) [    ] o.a.s.c.c.ZkConfigManager Copying zk node /configs/_default/protwords.txt to /configs/testDeleteWithCollection_abc.AUTOCREATED/protwords.txt
   [junit4]   2> 1320683 INFO  (OverseerThreadFactory-6828-thread-1) [    ] o.a.s.c.c.ZkConfigManager Copying zk node /configs/_default/managed-schema to /configs/testDeleteWithCollection_abc.AUTOCREATED/managed-schema
   [junit4]   2> 1320684 INFO  (OverseerThreadFactory-6828-thread-1) [    ] o.a.s.c.c.ZkConfigManager Copying zk node /configs/_default/solrconfig.xml to /configs/testDeleteWithCollection_abc.AUTOCREATED/solrconfig.xml
   [junit4]   2> 1320684 INFO  (OverseerThreadFactory-6828-thread-1) [    ] o.a.s.c.c.ZkConfigManager Copying zk node /configs/_default/synonyms.txt to /configs/testDeleteWithCollection_abc.AUTOCREATED/synonyms.txt
   [junit4]   2> 1320685 INFO  (OverseerThreadFactory-6828-thread-1) [    ] o.a.s.c.c.ZkConfigManager Copying zk node /configs/_default/stopwords.txt to /configs/testDeleteWithCollection_abc.AUTOCREATED/stopwords.txt
   [junit4]   2> 1320685 INFO  (OverseerThreadFactory-6828-thread-1) [    ] o.a.s.c.c.ZkConfigManager Copying zk node /configs/_default/lang/contractions_it.txt to /configs/testDeleteWithCollection_abc.AUTOCREATED/lang/contractions_it.txt
   [junit4]   2> 1320686 INFO  (OverseerThreadFactory-6828-thread-1) [    ] o.a.s.c.c.ZkConfigManager Copying zk node /configs/_default/lang/stemdict_nl.txt to /configs/testDeleteWithCollection_abc.AUTOCREATED/lang/stemdict_nl.txt
   [junit4]   2> 1320686 INFO  (OverseerThreadFactory-6828-thread-1) [    ] o.a.s.c.c.ZkConfigManager Copying zk node /configs/_default/lang/stopwords_hy.txt to /configs/testDeleteWithCollection_abc.AUTOCREATED/lang/stopwords_hy.txt
   [junit4]   2> 1320686 INFO  (OverseerThreadFactory-6828-thread-1) [    ] o.a.s.c.c.ZkConfigManager Copying zk node /configs/_default/lang/stopwords_no.txt to /configs/testDeleteWithCollection_abc.AUTOCREATED/lang/stopwords_no.txt
   [junit4]   2> 1320687 INFO  (OverseerThreadFactory-6828-thread-1) [    ] o.a.s.c.c.ZkConfigManager Copying zk node /configs/_default/lang/contractions_ca.txt to /configs/testDeleteWithCollection_abc.AUTOCREATED/lang/contractions_ca.txt
   [junit4]   2> 1320687 INFO  (OverseerThreadFactory-6828-thread-1) [    ] o.a.s.c.c.ZkConfigManager Copying zk node /configs/_default/lang/stopwords_id.txt to /configs/testDeleteWithCollection_abc.AUTOCREATED/lang/stopwords_id.txt
   [junit4]   2> 1320688 INFO  (OverseerThreadFactory-6828-thread-1) [    ] o.a.s.c.c.ZkConfigManager Copying zk node /configs/_default/lang/stopwords_ga.txt to /configs/testDeleteWithCollection_abc.AUTOCREATED/lang/stopwords_ga.txt
   [junit4]   2> 1320688 INFO  (OverseerThreadFactory-6828-thread-1) [    ] o.a.s.c.c.ZkConfigManager Copying zk node /configs/_default/lang/stopwords_hi.txt to /configs/testDeleteWithCollection_abc.AUTOCREATED/lang/stopwords_hi.txt
   [junit4]   2> 1320689 INFO  (OverseerThreadFactory-6828-thread-1) [    ] o.a.s.c.c.ZkConfigManager Copying zk node /configs/_default/lang/stopwords_da.txt to /configs/testDeleteWithCollection_abc.AUTOCREATED/lang/stopwords_da.txt
   [junit4]   2> 1320690 INFO  (OverseerThreadFactory-6828-thread-1) [    ] o.a.s.c.c.ZkConfigManager Copying zk node /configs/_default/lang/stopwords_ja.txt to /configs/testDeleteWithCollection_abc.AUTOCREATED/lang/stopwords_ja.txt
   [junit4]   2> 1320690 INFO  (OverseerThreadFactory-6828-thread-1) [    ] o.a.s.c.c.ZkConfigManager Copying zk node /configs/_default/lang/stopwords_pt.txt to /configs/testDeleteWithCollection_abc.AUTOCREATED/lang/stopwords_pt.txt
   [junit4]   2> 1320690 INFO  (OverseerThreadFactory-6828-thread-1) [    ] o.a.s.c.c.ZkConfigManager Copying zk node /configs/_default/lang/stopwords_hu.txt to /configs/testDeleteWithCollection_abc.AUTOCREATED/lang/stopwords_hu.txt
   [junit4]   2> 1320691 INFO  (OverseerThreadFactory-6828-thread-1) [    ] o.a.s.c.c.ZkConfigManager Copying zk node /configs/_default/lang/stopwords_el.txt to /configs/testDeleteWithCollection_abc.AUTOCREATED/lang/stopwords_el.txt
   [junit4]   2> 1320691 INFO  (OverseerThreadFactory-6828-thread-1) [    ] o.a.s.c.c.ZkConfigManager Copying zk node /configs/_default/lang/stopwords_ru.txt to /configs/testDeleteWithCollection_abc.AUTOCREATED/lang/stopwords_ru.txt
   [junit4]   2> 1320692 INFO  (OverseerThreadFactory-6828-thread-1) [    ] o.a.s.c.c.ZkConfigManager Copying zk node /configs/_default/lang/stopwords_tr.txt to /configs/testDeleteWithCollection_abc.AUTOCREATED/lang/stopwords_tr.txt
   [junit4]   2> 1320693 INFO  (OverseerThreadFactory-6828-thread-1) [    ] o.a.s.c.c.ZkConfigManager Copying zk node /configs/_default/lang/stopwords_ar.txt to /configs/testDeleteWithCollection_abc.AUTOCREATED/lang/stopwords_ar.txt
   [junit4]   2> 1320693 INFO  (OverseerThreadFactory-6828-thread-1) [    ] o.a.s.c.c.ZkConfigManager Copying zk node /configs/_default/lang/userdict_ja.txt to /configs/testDeleteWithCollection_abc.AUTOCREATED/lang/userdict_ja.txt
   [junit4]   2> 1320693 INFO  (OverseerThreadFactory-6828-thread-1) [    ] o.a.s.c.c.ZkConfigManager Copying zk node /configs/_default/lang/stopwords_eu.txt to /configs/testDeleteWithCollection_abc.AUTOCREATED/lang/stopwords_eu.txt
   [junit4]   2> 1320694 INFO  (OverseerThreadFactory-6828-thread-1) [    ] o.a.s.c.c.ZkConfigManager Copying zk node /configs/_default/lang/stopwords_it.txt to /configs/testDeleteWithCollection_abc.AUTOCREATED/lang/stopwords_it.txt
   [junit4]   2> 1320694 INFO  (OverseerThreadFactory-6828-thread-1) [    ] o.a.s.c.c.ZkConfigManager Copying zk node /configs/_default/lang/stopwords_cz.txt to /configs/testDeleteWithCollection_abc.AUTOCREATED/lang/stopwords_cz.txt
   [junit4]   2> 1320695 INFO  (OverseerThreadFactory-6828-thread-1) [    ] o.a.s.c.c.ZkConfigManager Copying zk node /configs/_default/lang/stoptags_ja.txt to /configs/testDeleteWithCollection_abc.AUTOCREATED/lang/stoptags_ja.txt
   [junit4]   2> 1320696 INFO  (OverseerThreadFactory-6828-thread-1) [    ] o.a.s.c.c.ZkConfigManager Copying zk node /configs/_default/lang/contractions_fr.txt to /configs/testDeleteWithCollection_abc.AUTOCREATED/lang/contractions_fr.txt
   [junit4]   2> 1320696 INFO  (OverseerThreadFactory-6828-thread-1) [    ] o.a.s.c.c.ZkConfigManager Copying zk node /configs/_default/lang/stopwords_de.txt to /configs/testDeleteWithCollection_abc.AUTOCREATED/lang/stopwords_de.txt
   [junit4]   2> 1320697 INFO  (OverseerThreadFactory-6828-thread-1) [    ] o.a.s.c.c.ZkConfigManager Copying zk node /configs/_default/lang/stopwords_fa.txt to /configs/testDeleteWithCollection_abc.AUTOCREATED/lang/stopwords_fa.txt
   [junit4]   2> 1320697 INFO  (OverseerThreadFactory-6828-thread-1) [    ] o.a.s.c.c.ZkConfigManager Copying zk node /configs/_default/lang/contractions_ga.txt to /configs/testDeleteWithCollection_abc.AUTOCREATED/lang/contractions_ga.txt
   [junit4]   2> 1320698 INFO  (OverseerThreadFactory-6828-thread-1) [    ] o.a.s.c.c.ZkConfigManager Copying zk node /configs/_default/lang/stopwords_ca.txt to /configs/testDeleteWithCollection_abc.AUTOCREATED/lang/stopwords_ca.txt
   [junit4]   2> 1320698 INFO  (OverseerThreadFactory-6828-thread-1) [    ] o.a.s.c.c.ZkConfigManager Copying zk node /configs/_default/lang/stopwords_nl.txt to /configs/testDeleteWithCollection_abc.AUTOCREATED/lang/stopwords_nl.txt
   [junit4]   2> 1320699 INFO  (OverseerThreadFactory-6828-thread-1) [    ] o.a.s.c.c.ZkConfigManager Copying zk node /configs/_default/lang/stopwords_bg.txt to /configs/testDeleteWithCollection_abc.AUTOCREATED/lang/stopwords_bg.txt
   [junit4]   2> 1320699 INFO  (OverseerThreadFactory-6828-thread-1) [    ] o.a.s.c.c.ZkConfigManager Copying zk node /configs/_default/lang/stopwords_lv.txt to /configs/testDeleteWithCollection_abc.AUTOCREATED/lang/stopwords_lv.txt
   [junit4]   2> 1320700 INFO  (OverseerThreadFactory-6828-thread-1) [    ] o.a.s.c.c.ZkConfigManager Copying zk node /configs/_default/lang/stopwords_en.txt to /configs/testDeleteWithCollection_abc.AUTOCREATED/lang/stopwords_en.txt
   [junit4]   2> 1320700 INFO  (OverseerThreadFactory-6828-thread-1) [    ] o.a.s.c.c.ZkConfigManager Copying zk node /configs/_default/lang/stopwords_es.txt to /configs/testDeleteWithCollection_abc.AUTOCREATED/lang/stopwords_es.txt
   [junit4]   2> 1320700 INFO  (OverseerThreadFactory-6828-thread-1) [    ] o.a.s.c.c.ZkConfigManager Copying zk node /configs/_default/lang/stopwords_th.txt to /configs/testDeleteWithCollection_abc.AUTOCREATED/lang/stopwords_th.txt
   [junit4]   2> 1320701 INFO  (OverseerThreadFactory-6828-thread-1) [    ] o.a.s.c.c.ZkConfigManager Copying zk node /configs/_default/lang/stopwords_ro.txt to /configs/testDeleteWithCollection_abc.AUTOCREATED/lang/stopwords_ro.txt
   [junit4]   2> 1320707 INFO  (OverseerThreadFactory-6828-thread-1) [    ] o.a.s.c.c.ZkConfigManager Copying zk node /configs/_default/lang/stopwords_fr.txt to /configs/testDeleteWithCollection_abc.AUTOCREATED/lang/stopwords_fr.txt
   [junit4]   2> 1320708 INFO  (OverseerThreadFactory-6828-thread-1) [    ] o.a.s.c.c.ZkConfigManager Copying zk node /configs/_default/lang/stopwords_sv.txt to /configs/testDeleteWithCollection_abc.AUTOCREATED/lang/stopwords_sv.txt
   [junit4]   2> 1320708 INFO  (OverseerThreadFactory-6828-thread-1) [    ] o.a.s.c.c.ZkConfigManager Copying zk node /configs/_default/lang/stopwords_fi.txt to /configs/testDeleteWithCollection_abc.AUTOCREATED/lang/stopwords_fi.txt
   [junit4]   2> 1320709 INFO  (OverseerThreadFactory-6828-thread-1) [    ] o.a.s.c.c.ZkConfigManager Copying zk node /configs/_default/lang/hyphenations_ga.txt to /configs/testDeleteWithCollection_abc.AUTOCREATED/lang/hyphenations_ga.txt
   [junit4]   2> 1320709 INFO  (OverseerThreadFactory-6828-thread-1) [    ] o.a.s.c.c.ZkConfigManager Copying zk node /configs/_default/lang/stopwords_gl.txt to /configs/testDeleteWithCollection_abc.AUTOCREATED/lang/stopwords_gl.txt
   [junit4]   2> 1320710 INFO  (OverseerThreadFactory-6828-thread-1) [    ] o.a.s.c.c.ZkConfigManager Copying zk node /configs/_default/params.json to /configs/testDeleteWithCollection_abc.AUTOCREATED/params.json
   [junit4]   2> 1320815 INFO  (OverseerStateUpdate-72097092637753348-127.0.0.1:37353_solr-n_0000000000) [    ] o.a.s.c.o.SliceMutator createReplica() {
   [junit4]   2>   "operation":"ADDREPLICA",
   [junit4]   2>   "collection":"testDeleteWithCollection_abc",
   [junit4]   2>   "shard":"shard1",
   [junit4]   2>   "core":"testDeleteWithCollection_abc_shard1_replica_n1",
   [junit4]   2>   "state":"down",
   [junit4]   2>   "base_url":"http://127.0.0.1:45789/solr",
   [junit4]   2>   "type":"NRT",
   [junit4]   2>   "waitForFinalState":"false"} 
   [junit4]   2> 1321017 INFO  (qtp562212117-23985) [n:127.0.0.1:45789_solr    x:testDeleteWithCollection_abc_shard1_replica_n1] o.a.s.h.a.CoreAdminOperation core create command qt=/admin/cores&coreNodeName=core_node2&collection.configName=testDeleteWithCollection_abc.AUTOCREATED&newCollection=true&name=testDeleteWithCollection_abc_shard1_replica_n1&action=CREATE&numShards=1&collection=testDeleteWithCollection_abc&shard=shard1&wt=javabin&version=2&replicaType=NRT
   [junit4]   2> 1321018 INFO  (qtp562212117-23985) [n:127.0.0.1:45789_solr    x:testDeleteWithCollection_abc_shard1_replica_n1] o.a.s.c.TransientSolrCoreCacheDefault Allocating transient cache for 2147483647 transient cores
   [junit4]   2> 1322025 INFO  (qtp562212117-23985) [n:127.0.0.1:45789_solr c:testDeleteWithCollection_abc s:shard1 r:core_node2 x:testDeleteWithCollection_abc_shard1_replica_n1] o.a.s.c.RequestParams conf resource params.json loaded . version : 0 
   [junit4]   2> 1322025 INFO  (qtp562212117-23985) [n:127.0.0.1:45789_solr c:testDeleteWithCollection_abc s:shard1 r:core_node2 x:testDeleteWithCollection_abc_shard1_replica_n1] o.a.s.c.RequestParams request params refreshed to version 0
   [junit4]   2> 1322026 WARN  (qtp562212117-23985) [n:127.0.0.1:45789_solr c:testDeleteWithCollection_abc s:shard1 r:core_node2 x:testDeleteWithCollection_abc_shard1_replica_n1] o.a.s.c.SolrConfig Couldn't add files from /home/jenkins/workspace/Lucene-Solr-7.x-Linux/solr/build/solr-core/test/J0/temp/solr.cloud.TestWithCollection_63194DEC6D9081F2-001/tempDir-001/node2/testDeleteWithCollection_abc_shard1_replica_n1/../../../../contrib/extraction/lib filtered by .*\.jar to classpath: /home/jenkins/workspace/Lucene-Solr-7.x-Linux/solr/build/solr-core/test/J0/temp/solr.cloud.TestWithCollection_63194DEC6D9081F2-001/tempDir-001/node2/testDeleteWithCollection_abc_shard1_replica_n1/../../../../contrib/extraction/lib
   [junit4]   2> 1322026 WARN  (qtp562212117-23985) [n:127.0.0.1:45789_solr c:testDeleteWithCollection_abc s:shard1 r:core_node2 x:testDeleteWithCollection_abc_shard1_replica_n1] o.a.s.c.SolrConfig Couldn't add files from /home/jenkins/workspace/Lucene-Solr-7.x-Linux/solr/build/solr-core/test/J0/temp/solr.cloud.TestWithCollection_63194DEC6D9081F2-001/tempDir-001/node2/testDeleteWithCollection_abc_shard1_replica_n1/../../../../dist filtered by solr-cell-\d.*\.jar to classpath: /home/jenkins/workspace/Lucene-Solr-7.x-Linux/solr/build/solr-core/test/J0/temp/solr.cloud.TestWithCollection_63194DEC6D9081F2-001/tempDir-001/node2/testDeleteWithCollection_abc_shard1_replica_n1/../../../../dist
   [junit4]   2> 1322026 WARN  (qtp562212117-23985) [n:127.0.0.1:45789_solr c:testDeleteWithCollection_abc s:shard1 r:core_node2 x:testDeleteWithCollection_abc_shard1_replica_n1] o.a.s.c.SolrConfig Couldn't add files from /home/jenkins/workspace/Lucene-Solr-7.x-Linux/solr/build/solr-core/test/J0/temp/solr.cloud.TestWithCollection_63194DEC6D9081F2-001/tempDir-001/node2/testDeleteWithCollection_abc_shard1_replica_n1/../../../../contrib/clustering/lib filtered by .*\.jar to classpath: /home/jenkins/workspace/Lucene-Solr-7.x-Linux/solr/build/solr-core/test/J0/temp/solr.cloud.TestWithCollection_63194DEC6D9081F2-001/tempDir-001/node2/testDeleteWithCollection_abc_shard1_replica_n1/../../../../contrib/clustering/lib
   [junit4]   2> 1322026 WARN  (qtp562212117-23985) [n:127.0.0.1:45789_solr c:testDeleteWithCollection_abc s:shard1 r:core_node2 x:testDeleteWithCollection_abc_shard1_replica_n1] o.a.s.c.SolrConfig Couldn't add files from /home/jenkins/workspace/Lucene-Solr-7.x-Linux/solr/build/solr-core/test/J0/temp/solr.cloud.TestWithCollection_63194DEC6D9081F2-001/tempDir-001/node2/testDeleteWithCollection_abc_shard1_replica_n1/../../../../dist filtered by solr-clustering-\d.*\.jar to classpath: /home/jenkins/workspace/Lucene-Solr-7.x-Linux/solr/build/solr-core/test/J0/temp/solr.cloud.TestWithCollection_63194DEC6D9081F2-001/tempDir-001/node2/testDeleteWithCollection_abc_shard1_replica_n1/../../../../dist
   [junit4]   2> 1322026 WARN  (qtp562212117-23985) [n:127.0.0.1:45789_solr c:testDeleteWithCollection_abc s:shard1 r:core_node2 x:testDeleteWithCollection_abc_shard1_replica_n1] o.a.s.c.SolrConfig Couldn't add files from /home/jenkins/workspace/Lucene-Solr-7.x-Linux/solr/build/solr-core/test/J0/temp/solr.cloud.TestWithCollection_63194DEC6D9081F2-001/tempDir-001/node2/testDeleteWithCollection_abc_shard1_replica_n1/../../../../contrib/langid/lib filtered by .*\.jar to classpath: /home/jenkins/workspace/Lucene-Solr-7.x-Linux/solr/build/solr-core/test/J0/temp/solr.cloud.TestWithCollection_63194DEC6D9081F2-001/tempDir-001/node2/testDeleteWithCollection_abc_shard1_replica_n1/../../../../contrib/langid/lib
   [junit4]   2> 1322026 WARN  (qtp562212117-23985) [n:127.0.0.1:45789_solr c:testDeleteWithCollection_abc s:shard1 r:core_node2 x:testDeleteWithCollection_abc_shard1_replica_n1] o.a.s.c.SolrConfig Couldn't add files from /home/jenkins/workspace/Lucene-Solr-7.x-Linux/solr/build/solr-core/test/J0/temp/solr.cloud.TestWithCollection_63194DEC6D9081F2-001/tempDir-001/node2/testDeleteWithCollection_abc_shard1_replica_n1/../../../../dist filtered by solr-langid-\d.*\.jar to classpath: /home/jenkins/workspace/Lucene-Solr-7.x-Linux/solr/build/solr-core/test/J0/temp/solr.cloud.TestWithCollection_63194DEC6D9081F2-001/tempDir-001/node2/testDeleteWithCollection_abc_shard1_replica_n1/../../../../dist
   [junit4]   2> 1322026 WARN  (qtp562212117-23985) [n:127.0.0.1:45789_solr c:testDeleteWithCollection_abc s:shard1 r:core_node2 x:testDeleteWithCollection_abc_shard1_replica_n1] o.a.s.c.SolrConfig Couldn't add files from /home/jenkins/workspace/Lucene-Solr-7.x-Linux/solr/build/solr-core/test/J0/temp/solr.cloud.TestWithCollection_63194DEC6D9081F2-001/tempDir-001/node2/testDeleteWithCollection_abc_shard1_replica_n1/../../../../contrib/velocity/lib filtered by .*\.jar to classpath: /home/jenkins/workspace/Lucene-Solr-7.x-Linux/solr/build/solr-core/test/J0/temp/solr.cloud.TestWithCollection_63194DEC6D9081F2-001/tempDir-001/node2/testDeleteWithCollection_abc_shard1_replica_n1/../../../../contrib/velocity/lib
   [junit4]   2> 1322027 WARN  (qtp562212117-23985) [n:127.0.0.1:45789_solr c:testDeleteWithCollection_abc s:shard1 r:core_node2 x:testDeleteWithCollection_abc_shard1_replica_n1] o.a.s.c.SolrConfig Couldn't add files from /home/jenkins/workspace/Lucene-Solr-7.x-Linux/solr/build/solr-core/test/J0/temp/solr.cloud.TestWithCollection_63194DEC6D9081F2-001/tempDir-001/node2/testDeleteWithCollection_abc_shard1_replica_n1/../../../../dist filtered by solr-velocity-\d.*\.jar to classpath: /home/jenkins/workspace/Lucene-Solr-7.x-Linux/solr/build/solr-core/test/J0/temp/solr.cloud.TestWithCollection_63194DEC6D9081F2-001/tempDir-001/node2/testDeleteWithCollection_abc_shard1_replica_n1/../../../../dist
   [junit4]   2> 1322032 INFO  (qtp562212117-23985) [n:127.0.0.1:45789_solr c:testDeleteWithCollection_abc s:shard1 r:core_node2 x:testDeleteWithCollection_abc_shard1_replica_n1] o.a.s.c.SolrConfig Using Lucene MatchVersion: 7.5.0
   [junit4]   2> 1322048 INFO  (qtp562212117-23985) [n:127.0.0.1:45789_solr c:testDeleteWithCollection_abc s:shard1 r:core_node2 x:testDeleteWithCollection_abc_shard1_replica_n1] o.a.s.s.IndexSchema [testDeleteWithCollection_abc_shard1_replica_n1] Schema name=default-config
   [junit4]   2> 1322149 INFO  (qtp562212117-23985) [n:127.0.0.1:45789_solr c:testDeleteWithCollection_abc s:shard1 r:core_node2 x:testDeleteWithCollection_abc_shard1_replica_n1] o.a.s.s.IndexSchema Loaded schema default-config/1.6 with uniqueid field id
   [junit4]   2> 1322159 INFO  (qtp562212117-23985) [n:127.0.0.1:45789_solr c:testDeleteWithCollection_abc s:shard1 r:core_node2 x:testDeleteWithCollection_abc_shard1_replica_n1] o.a.s.c.CoreContainer Creating SolrCore 'testDeleteWithCollection_abc_shard1_replica_n1' using configuration from collection testDeleteWithCollection_abc, trusted=true
   [junit4]   2> 1322160 INFO  (qtp562212117-23985) [n:127.0.0.1:45789_solr c:testDeleteWithCollection_abc s:shard1 r:core_node2 x:testDeleteWithCollection_abc_shard1_replica_n1] o.a.s.m.r.SolrJmxReporter JMX monitoring for 'solr_45789.solr.core.testDeleteWithCollection_abc.shard1.replica_n1' (registry 'solr.core.testDeleteWithCollection_abc.shard1.replica_n1') enabled at server: com.sun.jmx.mbeanserver.JmxMBeanServer@3d488fe8
   [junit4]   2> 1322160 INFO  (qtp562212117-23985) [n:127.0.0.1:45789_solr c:testDeleteWithCollection_abc s:shard1 r:core_node2 x:testDeleteWithCollection_abc_shard1_replica_n1] o.a.s.c.SolrCore solr.RecoveryStrategy.Builder
   [junit4]   2> 1322160 INFO  (qtp562212117-23985) [n:127.0.0.1:45789_solr c:testDeleteWithCollection_abc s:shard1 r:core_node2 x:testDeleteWithCollection_abc_shard1_replica_n1] o.a.s.c.SolrCore [[testDeleteWithCollection_abc_shard1_replica_n1] ] Opening new SolrCore at [/home/jenkins/workspace/Lucene-Solr-7.x-Linux/solr/build/solr-core/test/J0/temp/solr.cloud.TestWithCollection_63194DEC6D9081F2-001/tempDir-001/node2/testDeleteWithCollection_abc_shard1_replica_n1], dataDir=[/home/jenkins/workspace/Lucene-Solr-7.x-Linux/solr/build/solr-core/test/J0/temp/solr.cloud.TestWithCollection_63194DEC6D9081F2-001/tempDir-001/node2/./testDeleteWithCollection_abc_shard1_replica_n1/data/]
   [junit4]   2> 1322162 INFO  (qtp562212117-23985) [n:127.0.0.1:45789_solr c:testDeleteWithCollection_abc s:shard1 r:core_node2 x:testDeleteWithCollection_abc_shard1_replica_n1] o.a.s.r.XSLTResponseWriter xsltCacheLifetimeSeconds=5
   [junit4]   2> 1322187 INFO  (qtp562212117-23985) [n:127.0.0.1:45789_solr c:testDeleteWithCollection_abc s:shard1 r:core_node2 x:testDeleteWithCollection_abc_shard1_replica_n1] o.a.s.u.UpdateHandler Using UpdateLog implementation: org.apache.solr.update.UpdateLog
   [junit4]   2> 1322187 INFO  (qtp562212117-23985) [n:127.0.0.1:45789_solr c:testDeleteWithCollection_abc s:shard1 r:core_node2 x:testDeleteWithCollection_abc_shard1_replica_n1] o.a.s.u.UpdateLog Initializing UpdateLog: dataDir= defaultSyncLevel=FLUSH numRecordsToKeep=100 maxNumLogsToKeep=10 numVersionBuckets=65536
   [junit4]   2> 1322188 INFO  (qtp562212117-23985) [n:127.0.0.1:45789_solr c:testDeleteWithCollection_abc s:shard1 r:core_node2 x:testDeleteWithCollection_abc_shard1_replica_n1] o.a.s.u.CommitTracker Hard AutoCommit: if uncommited for 15000ms; 
   [junit4]   2> 1322188 INFO  (qtp562212117-23985) [n:127.0.0.1:45789_solr c:testDeleteWithCollection_abc s:shard1 r:core_node2 x:testDeleteWithCollection_abc_shard1_replica_n1] o.a.s.u.CommitTracker Soft AutoCommit: disabled
   [junit4]   2> 1322189 INFO  (qtp562212117-23985) [n:127.0.0.1:45789_solr c:testDeleteWithCollection_abc s:shard1 r:core_node2 x:testDeleteWithCollection_abc_shard1_replica_n1] o.a.s.s.SolrIndexSearcher Opening [Searcher@4e20fbfd[testDeleteWithCollection_abc_shard1_replica_n1] main]
   [junit4]   2> 1322190 INFO  (qtp562212117-23985) [n:127.0.0.1:45789_solr c:testDeleteWithCollection_abc s:shard1 r:core_node2 x:testDeleteWithCollection_abc_shard1_replica_n1] o.a.s.r.ManagedResourceStorage Configured ZooKeeperStorageIO with znodeBase: /configs/testDeleteWithCollection_abc.AUTOCREATED
   [junit4]   2> 1322190 INFO  (qtp562212117-23985) [n:127.0.0.1:45789_solr c:testDeleteWithCollection_abc s:shard1 r:core_node2 x:testDeleteWithCollection_abc_shard1_replica_n1] o.a.s.r.ManagedResourceStorage Loaded null at path _rest_managed.json using ZooKeeperStorageIO:path=/configs/testDeleteWithCollection_abc.AUTOCREATED
   [junit4]   2> 1322190 INFO  (qtp562212117-23985) [n:127.0.0.1:45789_solr c:testDeleteWithCollection_abc s:shard1 r:core_node2 x:testDeleteWithCollection_abc_shard1_replica_n1] o.a.s.s.ZkIndexSchemaReader Creating ZooKeeper watch for the managed schema at /configs/testDeleteWithCollection_abc.AUTOCREATED/managed-schema
   [junit4]   2> 1322191 INFO  (qtp562212117-23985) [n:127.0.0.1:45789_solr c:testDeleteWithCollection_abc s:shard1 r:core_node2 x:testDeleteWithCollection_abc_shard1_replica_n1] o.a.s.s.ZkIndexSchemaReader Current schema version 0 is already the latest
   [junit4]   2> 1322191 INFO  (qtp562212117-23985) [n:127.0.0.1:45789_solr c:testDeleteWithCollection_abc s:shard1 r:core_node2 x:testDeleteWithCollection_abc_shard1_replica_n1] o.a.s.h.c.SpellCheckComponent Initializing spell checkers
   [junit4]   2> 1322191 INFO  (qtp562212117-23985) [n:127.0.0.1:45789_solr c:testDeleteWithCollection_abc s:shard1 r:core_node2 x:testDeleteWithCollection_abc_shard1_replica_n1] o.a.s.s.DirectSolrSpellChecker init: {name=default,field=_text_,classname=solr.DirectSolrSpellChecker,distanceMeasure=internal,accuracy=0.5,maxEdits=2,minPrefix=1,maxInspections=5,minQueryLength=4,maxQueryFrequency=0.01}
   [junit4]   2> 1322192 INFO  (qtp562212117-23985) [n:127.0.0.1:45789_solr c:testDeleteWithCollection_abc s:shard1 r:core_node2 x:testDeleteWithCollection_abc_shard1_replica_n1] o.a.s.h.ReplicationHandler Commits will be reserved for 10000ms.
   [junit4]   2> 1322192 INFO  (searcherExecutor-6837-thread-1-processing-n:127.0.0.1:45789_solr x:testDeleteWithCollection_abc_shard1_replica_n1 c:testDeleteWithCollection_abc s:shard1 r:core_node2) [n:127.0.0.1:45789_solr c:testDeleteWithCollection_abc s:shard1 r:core_node2 x:testDeleteWithCollection_abc_shard1_replica_n1] o.a.s.c.QuerySenderListener QuerySenderListener sending requests to Searcher@4e20fbfd[testDeleteWithCollection_abc_shard1_replica_n1] main{ExitableDirectoryReader(UninvertingDirectoryReader())}
   [junit4]   2> 1322192 INFO  (qtp562212117-23985) [n:127.0.0.1:45789_solr c:testDeleteWithCollection_abc s:shard1 r:core_node2 x:testDeleteWithCollection_abc_shard1_replica_n1] o.a.s.u.UpdateLog Could not find max version in index or recent updates, using new clock 1607782018906587136
   [junit4]   2> 1322192 INFO  (searcherExecutor-6837-thread-1-processing-n:127.0.0.1:45789_solr x:testDeleteWithCollection_abc_shard1_replica_n1 c:testDeleteWithCollection_abc s:shard1 r:core_node2) [n:127.0.0.1:45789_solr c:testDeleteWithCollection_abc s:shard1 r:core_node2 x:testDeleteWithCollection_abc_shard1_replica_n1] o.a.s.c.QuerySenderListener QuerySenderListener done.
   [junit4]   2> 1322192 INFO  (searcherExecutor-6837-thread-1-processing-n:127.0.0.1:45789_solr x:testDeleteWithCollection_abc_shard1_replica_n1 c:testDeleteWithCollection_abc s:shard1 r:core_node2) [n:127.0.0.1:45789_solr c:testDeleteWithCollection_abc s:shard1 r:core_node2 x:testDeleteWithCollection_abc_shard1_replica_n1] o.a.s.h.c.SpellCheckComponent Loading spell index for spellchecker: default
   [junit4]   2> 1322193 INFO  (searcherExecutor-6837-thread-1-processing-n:127.0.0.1:45789_solr x:testDeleteWithCollection_abc_shard1_replica_n1 c:testDeleteWithCollection_abc s:shard1 r:core_node2) [n:127.0.0.1:45789_solr c:testDeleteWithCollection_abc s:shard1 r:core_node2 x:testDeleteWithCollection_abc_shard1_replica_n1] o.a.s.c.SolrCore [testDeleteWithCollection_abc_shard1_replica_n1] Registered new searcher Searcher@4e20fbfd[testDeleteWithCollection_abc_shard1_replica_n1] main{ExitableDirectoryReader(UninvertingDirectoryReader())}
   [junit4]   2> 1322196 INFO  (qtp562212117-23985) [n:127.0.0.1:45789_solr c:testDeleteWithCollection_abc s:shard1 r:core_node2 x:testDeleteWithCollection_abc_shard1_replica_n1] o.a.s.c.ZkShardTerms Successful update of terms at /collections/testDeleteWithCollection_abc/terms/shard1 to Terms{values={core_node2=0}, version=0}
   [junit4]   2> 1322198 INFO  (qtp562212117-23985) [n:127.0.0.1:45789_solr c:testDeleteWithCollection_abc s:shard1 r:core_node2 x:testDeleteWithCollection_abc_shard1_replica_n1] o.a.s.c.ShardLeaderElectionContext Enough replicas found to continue.
   [junit4]   2> 1322198 INFO  (qtp562212117-23985) [n:127.0.0.1:45789_solr c:testDeleteWithCollection_abc s:shard1 r:core_node2 x:testDeleteWithCollection_abc_shard1_replica_n1] o.a.s.c.ShardLeaderElectionContext I may be the new leader - try and sync
   [junit4]   2> 1322198 INFO  (qtp562212117-23985) [n:127.0.0.1:45789_solr c:testDeleteWithCollection_abc s:shard1 r:core_node2 x:testDeleteWithCollection_abc_shard1_replica_n1] o.a.s.c.SyncStrategy Sync replicas to http://127.0.0.1:45789/solr/testDeleteWithCollection_abc_shard1_replica_n1/
   [junit4]   2> 1322198 INFO  (qtp562212117-23985) [n:127.0.0.1:45789_solr c:testDeleteWithCollection_abc s:shard1 r:core_node2 x:testDeleteWithCollection_abc_shard1_replica_n1] o.a.s.c.SyncStrategy Sync Success - now sync replicas to me
   [junit4]   2> 1322198 INFO  (qtp562212117-23985) [n:127.0.0.1:45789_solr c:testDeleteWithCollection_abc s:shard1 r:core_node2 x:testDeleteWithCollection_abc_shard1_replica_n1] o.a.s.c.SyncStrategy http://127.0.0.1:45789/solr/testDeleteWithCollection_abc_shard1_replica_n1/ has no replicas
   [junit4]   2> 1322198 INFO  (qtp562212117-23985) [n:127.0.0.1:45789_solr c:testDeleteWithCollection_abc s:shard1 r:core_node2 x:testDeleteWithCollection_abc_shard1_replica_n1] o.a.s.c.ShardLeaderElectionContext Found all replicas participating in election, clear LIR
   [junit4]   2> 1322199 INFO  (qtp562212117-23985) [n:127.0.0.1:45789_solr c:testDeleteWithCollection_abc s:shard1 r:core_node2 x:testDeleteWithCollection_abc_shard1_replica_n1] o.a.s.c.ShardLeaderElectionContext I am the new leader: http://127.0.0.1:45789/solr/testDeleteWithCollection_abc_shard1_replica_n1/ shard1
   [junit4]   2> 1322300 INFO  (qtp562212117-23985) [n:127.0.0.1:45789_solr c:testDeleteWithCollection_abc s:shard1 r:core_node2 x:testDeleteWithCollection_abc_shard1_replica_n1] o.a.s.c.ZkController I am the leader, no recovery necessary
   [junit4]   2> 1322305 INFO  (qtp562212117-23985) [n:127.0.0.1:45789_solr c:testDeleteWithCollection_abc s:shard1 r:core_node2 x:testDeleteWithCollection_abc_shard1_replica_n1] o.a.s.s.HttpSolrCall [admin] webapp=null path=/admin/cores params={qt=/admin/cores&coreNodeName=core_node2&collection.configName=testDeleteWithCollection_abc.AUTOCREATED&newCollection=true&name=testDeleteWithCollection_abc_shard1_replica_n1&action=CREATE&numShards=1&collection=testDeleteWithCollection_abc&shard=shard1&wt=javabin&version=2&replicaType=NRT} status=0 QTime=1287
   [junit4]   2> 1322307 INFO  (qtp562212117-23994) [n:127.0.0.1:45789_solr    ] o.a.s.h.a.CollectionsHandler Wait for new collection to be active for at most 30 seconds. Check all shard replicas
   [junit4]   2> 1322402 INFO  (zkCallback-9252-thread-1) [    ] o.a.s.c.c.ZkStateReader A cluster state change: [WatchedEvent state:SyncConnected type:NodeDataChanged path:/collections/testDeleteWithCollection_abc/state.json] for collection [testDeleteWithCollection_abc] has occurred - updating... (live nodes size: [2])
   [junit4]   2> 1322683 INFO  (OverseerCollectionConfigSetProcessor-72097092637753348-127.0.0.1:37353_solr-n_0000000000) [    ] o.a.s.c.OverseerTaskQueue Response ZK path: /overseer/collection-queue-work/qnr-0000000000 doesn't exist.  Requestor may have disconnected from ZooKeeper
   [junit4]   2> 1323307 INFO  (qtp562212117-23994) [n:127.0.0.1:45789_solr    ] o.a.s.s.HttpSolrCall [admin] webapp=null path=/admin/collections params={pullReplicas=0&name=testDeleteWithCollection_abc&nrtReplicas=1&action=CREATE&numShards=1&tlogReplicas=0&wt=javabin&version=2} status=0 QTime=2625
   [junit4]   2> 1323307 INFO  (qtp562212117-23983) [n:127.0.0.1:45789_solr    ] o.a.s.h.a.CollectionsHandler Invoked Collection Action :create with params pullReplicas=0&withCollection=testDeleteWithCollection_abc&name=testDeleteWithCollection_xyz&nrtReplicas=1&action=CREATE&numShards=1&tlogReplicas=0&wt=javabin&version=2 and sendToOCPQueue=true
   [junit4]   2> 1323309 INFO  (OverseerThreadFactory-6828-thread-2) [    ] o.a.s.c.a.c.CreateCollectionCmd Create collection testDeleteWithCollection_xyz
   [junit4]   2> 1323310 INFO  (OverseerThreadFactory-6828-thread-2) [    ] o.a.s.c.c.ZkConfigManager Copying zk node /configs/_default/protwords.txt to /configs/testDeleteWithCollection_xyz.AUTOCREATED/protwords.txt
   [junit4]   2> 1323311 INFO  (OverseerThreadFactory-6828-thread-2) [    ] o.a.s.c.c.ZkConfigManager Copying zk node /configs/_default/managed-schema to /configs/testDeleteWithCollection_xyz.AUTOCREATED/managed-schema
   [junit4]   2> 1323312 INFO  (OverseerThreadFactory-6828-thread-2) [    ] o.a.s.c.c.ZkConfigManager Copying zk node /configs/_default/solrconfig.xml to /configs/testDeleteWithCollection_xyz.AUTOCREATED/solrconfig.xml
   [junit4]   2> 1323317 INFO  (OverseerThreadFactory-6828-thread-2) [    ] o.a.s.c.c.ZkConfigManager Copying zk node /configs/_default/synonyms.txt to /configs/testDeleteWithCollection_xyz.AUTOCREATED/synonyms.txt
   [junit4]   2> 1323317 INFO  (OverseerThreadFactory-6828-thread-2) [    ] o.a.s.c.c.ZkConfigManager Copying zk node /configs/_default/stopwords.txt to /configs/testDeleteWithCollection_xyz.AUTOCREATED/stopwords.txt
   [junit4]   2> 1323318 INFO  (OverseerThreadFactory-6828-thread-2) [    ] o.a.s.c.c.ZkConfigManager Copying zk node /configs/_default/lang/contractions_it.txt to /configs/testDeleteWithCollection_xyz.AUTOCREATED/lang/contractions_it.txt
   [junit4]   2> 1323319 INFO  (OverseerThreadFactory-6828-thread-2) [    ] o.a.s.c.c.ZkConfigManager Copying zk node /configs/_default/lang/stemdict_nl.txt to /configs/testDeleteWithCollection_xyz.AUTOCREATED/lang/stemdict_nl.txt
   [junit4]   2> 1323319 INFO  (OverseerThreadFactory-6828-thread-2) [    ] o.a.s.c.c.ZkConfigManager Copying zk node /configs/_default/lang/stopwords_hy.txt to /configs/testDeleteWithCollection_xyz.AUTOCREATED/lang/stopwords_hy.txt
   [junit4]   2> 1323320 INFO  (OverseerThreadFactory-6828-thread-2) [    ] o.a.s.c.c.ZkConfigManager Copying zk node /configs/_default/lang/stopwords_no.txt to /configs/testDeleteWithCollection_xyz.AUTOCREATED/lang/stopwords_no.txt
   [junit4]   2> 1323320 INFO  (OverseerThreadFactory-6828-thread-2) [    ] o.a.s.c.c.ZkConfigManager Copying zk node /configs/_default/lang/contractions_ca.txt to /configs/testDeleteWithCollection_xyz.AUTOCREATED/lang/contractions_ca.txt
   [junit4]   2> 1323321 INFO  (OverseerThreadFactory-6828-thread-2) [    ] o.a.s.c.c.ZkConfigManager Copying zk node /configs/_default/lang/stopwords_id.txt to /configs/testDeleteWithCollection_xyz.AUTOCREATED/lang/stopwords_id.txt
   [junit4]   2> 1323322 INFO  (OverseerThreadFactory-6828-thread-2) [    ] o.a.s.c.c.ZkConfigManager Copying zk node /configs/_default/lang/stopwords_ga.txt to /configs/testDeleteWithCollection_xyz.AUTOCREATED/lang/stopwords_ga.txt
   [junit4]   2> 1323322 INFO  (OverseerThreadFactory-6828-thread-2) [    ] o.a.s.c.c.ZkConfigManager Copying zk node /configs/_default/lang/stopwords_hi.txt to /configs/testDeleteWithCollection_xyz.AUTOCREATED/lang/stopwords_hi.txt
   [junit4]   2> 1323323 INFO  (OverseerThreadFactory-6828-thread-2) [    ] o.a.s.c.c.ZkConfigManager Copying zk node /configs/_default/lang/stopwords_da.txt to /configs/testDeleteWithCollection_xyz.AUTOCREATED/lang/stopwords_da.txt
   [junit4]   2> 1323323 INFO  (OverseerThreadFactory-6828-thread-2) [    ] o.a.s.c.c.ZkConfigManager Copying zk node /configs/_default/lang/stopwords_ja.txt to /configs/testDeleteWithCollection_xyz.AUTOCREATED/lang/stopwords_ja.txt
   [junit4]   2> 1323324 INFO  (OverseerThreadFactory-6828-thread-2) [    ] o.a.s.c.c.ZkConfigManager Copying zk node /configs/_default/lang/stopwords_pt.txt to /configs/testDeleteWithCollection_xyz.AUTOCREATED/lang/stopwords_pt.txt
   [junit4]   2> 1323324 INFO  (OverseerThreadFactory-6828-thread-2) [    ] o.a.s.c.c.ZkConfigManager Copying zk node /configs/_default/lang/stopwords_hu.txt to /configs/testDeleteWithCollection_xyz.AUTOCREATED/lang/stopwords_hu.txt
   [junit4]   2> 1323325 INFO  (OverseerThreadFactory-6828-thread-2) [    ] o.a.s.c.c.ZkConfigManager Copying zk node /configs/_default/lang/stopwords_el.txt to /configs/testDeleteWithCollection_xyz.AUTOCREATED/lang/stopwords_el.txt
   [junit4]   2> 1323325 INFO  (OverseerThreadFactory-6828-thread-2) [    ] o.a.s.c.c.ZkConfigManager Copying zk node /configs/_default/lang/stopwords_ru.txt to /configs/testDeleteWithCollection_xyz.AUTOCREATED/lang/stopwords_ru.txt
   [junit4]   2> 1323326 INFO  (OverseerThreadFactory-6828-thread-2) [    ] o.a.s.c.c.ZkConfigManager Copying zk node /configs/_default/lang/stopwords_tr.txt to /configs/testDeleteWithCollection_xyz.AUTOCREATED/lang/stopwords_tr.txt
   [junit4]   2> 1323326 INFO  (OverseerThreadFactory-6828-thread-2) [    ] o.a.s.c.c.ZkConfigManager Copying zk node /configs/_default/lang/stopwords_ar.txt to /configs/testDeleteWithCollection_xyz.AUTOCREATED/lang/stopwords_ar.txt
   [junit4]   2> 1323327 INFO  (OverseerThreadFactory-6828-thread-2) [    ] o.a.s.c.c.ZkConfigManager Copying zk node /configs/_default/lang/userdict_ja.txt to /configs/testDeleteWithCollection_xyz.AUTOCREATED/lang/userdict_ja.txt
   [junit4]   2> 1323327 INFO  (OverseerThreadFactory-6828-thread-2) [    ] o.a.s.c.c.ZkConfigManager Copying zk node /configs/_default/lang/stopwords_eu.txt to /configs/testDeleteWithCollection_xyz.AUTOCREATED/lang/stopwords_eu.txt
   [junit4]   2> 1323328 INFO  (OverseerThreadFactory-6828-thread-2) [    ] o.a.s.c.c.ZkConfigManager Copying zk node /configs/_default/lang/stopwords_it.txt to /configs/testDeleteWithCollection_xyz.AUTOCREATED/lang/stopwords_it.txt
   [junit4]   2> 1323328 INFO  (OverseerThreadFactory-6828-thread-2) [    ] o.a.s.c.c.ZkConfigManager Copying zk node /configs/_default/lang/stopwords_cz.txt to /configs/testDeleteWithCollection_xyz.AUTOCREATED/lang/stopwords_cz.txt
   [junit4]   2> 1323329 INFO  (OverseerThreadFactory-6828-thread-2) [    ] o.a.s.c.c.ZkConfigManager Copying zk node /configs/_default/lang/stoptags_ja.txt to /configs/testDeleteWithCollection_xyz.AUTOCREATED/lang/stoptags_ja.txt
   [junit4]   2> 1323330 INFO  (OverseerThreadFactory-6828-thread-2) [    ] o.a.s.c.c.ZkConfigManager Copying zk node /configs/_default/lang/contractions_fr.txt to /configs/testDeleteWithCollection_xyz.AUTOCREATED/lang/contractions_fr.txt
   [junit4]   2> 1323330 INFO  (OverseerThreadFactory-6828-thread-2) [    ] o.a.s.c.c.ZkConfigManager Copying zk node /configs/_default/lang/stopwords_de.txt to /configs/testDeleteWithCollection_xyz.AUTOCREATED/lang/stopwords_de.txt
   [junit4]   2> 1323331 INFO  (OverseerThreadFactory-6828-thread-2) [    ] o.a.s.c.c.ZkConfigManager Copying zk node /configs/_default/lang/stopwords_fa.txt to /configs/testDeleteWithCollection_xyz.AUTOCREATED/lang/stopwords_fa.txt
   [junit4]   2> 1323331 INFO  (OverseerThreadFactory-6828-thread-2) [    ] o.a.s.c.c.ZkConfigManager Copying zk node /configs/_default/lang/contractions_ga.txt to /configs/testDeleteWithCollection_xyz.AUTOCREATED/lang/contractions_ga.txt
   [junit4]   2> 1323332 INFO  (OverseerThreadFactory-6828-thread-2) [    ] o.a.s.c.c.ZkConfigManager Copying zk node /configs/_default/lang/stopwords_ca.txt to /configs/testDeleteWithCollection_xyz.AUTOCREATED/lang/stopwords_ca.txt
   [junit4]   2> 1323332 INFO  (OverseerThreadFactory-6828-thread-2) [    ] o.a.s.c.c.ZkConfigManager Copying zk node /configs/_default/lang/stopwords_nl.txt to /configs/testDeleteWithCollection_xyz.AUTOCREATED/lang/stopwords_nl.txt
   [junit4]   2> 1323333 INFO  (OverseerThreadFactory-6828-thread-2) [    ] o.a.s.c.c.ZkConfigManager Copying zk node /configs/_default/lang/stopwords_bg.txt to /configs/testDeleteWithCollection_xyz.AUTOCREATED/lang/stopwords_bg.txt
   [junit4]   2> 1323333 INFO  (OverseerThreadFactory-6828-thread-2) [    ] o.a.s.c.c.ZkConfigManager Copying zk node /configs/_default/lang/stopwords_lv.txt to /configs/testDeleteWithCollection_xyz.AUTOCREATED/lang/stopwords_lv.txt
   [junit4]   2> 1323334 INFO  (OverseerThreadFactory-6828-thread-2) [    ] o.a.s.c.c.ZkConfigManager Copying zk node /configs/_default/lang/stopwords_en.txt to /configs/testDeleteWithCollection_xyz.AUTOCREATED/lang/stopwords_en.txt
   [junit4]   2> 1323334 INFO  (OverseerThreadFactory-6828-thread-2) [    ] o.a.s.c.c.ZkConfigManager Copying zk node /configs/_default/lang/stopwords_es.txt to /configs/testDeleteWithCollection_xyz.AUTOCREATED/lang/stopwords_es.txt
   [junit4]   2> 1323335 INFO  (OverseerThreadFactory-6828-thread-2) [    ] o.a.s.c.c.ZkConfigManager Copying zk node /configs/_default/lang/stopwords_th.txt to /configs/testDeleteWithCollection_xyz.AUTOCREATED/lang/stopwords_th.txt
   [junit4]   2> 1323335 INFO  (OverseerThreadFactory-6828-thread-2) [    ] o.a.s.c.c.ZkConfigManager Copying zk node /configs/_default/lang/stopwords_ro.txt to /configs/testDeleteWithCollection_xyz.AUTOCREATED/lang/stopwords_ro.txt
   [junit4]   2> 1323336 INFO  (OverseerThreadFactory-6828-thread-2) [    ] o.a.s.c.c.ZkConfigManager Copying zk node /configs/_default/lang/stopwords_fr.txt to /configs/testDeleteWithCollection_xyz.AUTOCREATED/lang/stopwords_fr.txt
   [junit4]   2> 1323336 INFO  (OverseerThreadFactory-6828-thread-2) [    ] o.a.s.c.c.ZkConfigManager Copying zk node /configs/_default/lang/stopwords_sv.txt to /configs/testDeleteWithCollection_xyz.AUTOCREATED/lang/stopwords_sv.txt
   [junit4]   2> 1323337 INFO  (OverseerThreadFactory-6828-thread-2) [    ] o.a.s.c.c.ZkConfigManager Copying zk node /configs/_default/lang/stopwords_fi.txt to /configs/testDeleteWithCollection_xyz.AUTOCREATED/lang/stopwords_fi.txt
   [junit4]   2> 1323337 INFO  (OverseerThreadFactory-6828-thread-2) [    ] o.a.s.c.c.ZkConfigManager Copying zk node /configs/_default/lang/hyphenations_ga.txt to /configs/testDeleteWithCollection_xyz.AUTOCREATED/lang/hyphenations_ga.txt
   [junit4]   2> 1323338 INFO  (OverseerThreadFactory-6828-thread-2) [    ] o.a.s.c.c.ZkConfigManager Copying zk node /configs/_default/lang/stopwords_gl.txt to /configs/testDeleteWithCollection_xyz.AUTOCREATED/lang/stopwords_gl.txt
   [junit4]   2> 1323338 INFO  (OverseerThreadFactory-6828-thread-2) [    ] o.a.s.c.c.ZkConfigManager Copying zk node /configs/_default/params.json to /configs/testDeleteWithCollection_xyz.AUTOCREATED/params.json
   [junit4]   2> 1323543 INFO  (OverseerThreadFactory-6828-thread-2) [    ] o.a.s.c.a.c.AddReplicaCmd Node Identified 127.0.0.1:37353_solr for creating new replica of shard shard1
   [junit4]   2> 1323545 INFO  (OverseerStateUpdate-72097092637753348-127.0.0.1:37353_solr-n_0000000000) [    ] o.a.s.c.o.SliceMutator createReplica() {
   [junit4]   2>   "operation":"addreplica",
   [junit4]   2>   "collection":"testDeleteWithCollection_abc",
   [junit4]   2>   "shard":"shard1",
   [junit4]   2>   "core":"testDeleteWithCollection_abc_shard1_replica_n3",
   [junit4]   2>   "state":"down",
   [junit4]   2>   "base_url":"http://127.0.0.1:37353/solr",
   [junit4]   2>   "node_name":"127.0.0.1:37353_solr",
   [junit4]   2>   "type":"NRT"} 
   [junit4]   2> 1323646 INFO  (zkCallback-9252-thread-1) [    ] o.a.s.c.c.ZkStateReader A cluster state change: [WatchedEvent state:SyncConnected type:NodeDataChanged path:/collections/testDeleteWithCollection_abc/state.json] for collection [testDeleteWithCollection_abc] has occurred - updating... (live nodes size: [2])
   [junit4]   2> 1323748 INFO  (qtp457300738-23990) [n:127.0.0.1:37353_solr    x:testDeleteWithCollection_abc_shard1_replica_n3] o.a.s.h.a.CoreAdminOperation core create command qt=/admin/cores&coreNodeName=core_node4&collection.configName=testDeleteWithCollection_abc.AUTOCREATED&name=testDeleteWithCollection_abc_shard1_replica_n3&action=CREATE&collection=testDeleteWithCollection_abc&shard=shard1&wt=javabin&version=2&replicaType=NRT
   [junit4]   2> 1323755 INFO  (qtp457300738-23990) [n:127.0.0.1:37353_solr c:testDeleteWithCollection_abc s:shard1 r:core_node4 x:testDeleteWithCollection_abc_shard1_replica_n3] o.a.s.c.RequestParams conf resource params.json loaded . version : 0 
   [junit4]   2> 1323755 INFO  (qtp457300738-23990) [n:127.0.0.1:37353_solr c:testDeleteWithCollection_abc s:shard1 r:core_node4 x:testDeleteWithCollection_abc_shard1_replica_n3] o.a.s.c.RequestParams request params refreshed to version 0
   [junit4]   2> 1323755 WARN  (qtp457300738-23990) [n:127.0.0.1:37353_solr c:testDeleteWithCollection_abc s:shard1 r:core_node4 x:testDeleteWithCollection_abc_shard1_replica_n3] o.a.s.c.SolrConfig Couldn't add files from /home/jenkins/workspace/Lucene-Solr-7.x-Linux/solr/build/solr-core/test/J0/temp/solr.cloud.TestWithCollection_63194DEC6D9081F2-001/tempDir-001/node1/testDeleteWithCollection_abc_shard1_replica_n3/../../../../contrib/extraction/lib filtered by .*\.jar to classpath: /home/jenkins/workspace/Lucene-Solr-7.x-Linux/solr/build/solr-core/test/J0/temp/solr.cloud.TestWithCollection_63194DEC6D9081F2-001/tempDir-001/node1/testDeleteWithCollection_abc_shard1_replica_n3/../../../../contrib/extraction/lib
   [junit4]   2> 1323755 WARN  (qtp457300738-23990) [n:127.0.0.1:37353_solr c:testDeleteWithCollection_abc s:shard1 r:core_node4 x:testDeleteWithCollection_abc_shard1_replica_n3] o.a.s.c.SolrConfig Couldn't add files from /home/jenkins/workspace/Lucene-Solr-7.x-Linux/solr/build/solr-core/test/J0/temp/solr.cloud.TestWithCollection_63194DEC6D9081F2-001/tempDir-001/node1/testDeleteWithCollection_abc_shard1_replica_n3/../../../../dist filtered by solr-cell-\d.*\.jar to classpath: /home/jenkins/workspace/Lucene-Solr-7.x-Linux/solr/build/solr-core/test/J0/temp/solr.cloud.TestWithCollection_63194DEC6D9081F2-001/tempDir-001/node1/testDeleteWithCollection_abc_shard1_replica_n3/../../../../dist
   [junit4]   2> 1323756 WARN  (qtp457300738-23990) [n:127.0.0.1:37353_solr c:testDeleteWithCollection_abc s:shard1 r:core_node4 x:testDeleteWithCollection_abc_shard1_replica_n3] o.a.s.c.SolrConfig Couldn't add files from /home/jenkins/workspace/Lucene-Solr-7.x-Linux/solr/build/solr-core/test/J0/temp/solr.cloud.TestWithCollection_63194DEC6D9081F2-001/tempDir-001/node1/testDeleteWithCollection_abc_shard1_replica_n3/../../../../contrib/clustering/lib filtered by .*\.jar to classpath: /home/jenkins/workspace/Lucene-Solr-7.x-Linux/solr/build/solr-core/test/J0/temp/solr.cloud.TestWithCollection_63194DEC6D9081F2-001/tempDir-001/node1/testDeleteWithCollection_abc_shard1_replica_n3/../../../../contrib/clustering/lib
   [junit4]   2> 1323756 WARN  (qtp457300738-23990) [n:127.0.0.1:37353_solr c:testDeleteWithCollection_abc s:shard1 r:core_node4 x:testDeleteWithCollection_abc_shard1_replica_n3] o.a.s.c.SolrConfig Couldn't add files from /home/jenkins/workspace/Lucene-Solr-7.x-Linux/solr/build/solr-core/test/J0/temp/solr.cloud.TestWithCollection_63194DEC6D9081F2-001/tempDir-001/node1/testDeleteWithCollection_abc_shard1_replica_n3/../../../../dist filtered by solr-clustering-\d.*\.jar to classpath: /home/jenkins/workspace/Lucene-Solr-7.x-Linux/solr/build/solr-core/test/J0/temp/solr.cloud.TestWithCollection_63194DEC6D9081F2-001/tempDir-001/node1/testDeleteWithCollection_abc_shard1_replica_n3/../../../../dist
   [junit4]   2> 1323756 WARN  (qtp457300738-23990) [n:127.0.0.1:37353_solr c:testDeleteWithCollection_abc s:shard1 r:core_node4 x:testDeleteWithCollection_abc_shard1_replica_n3] o.a.s.c.SolrConfig Couldn't add files from /home/jenkins/workspace/Lucene-Solr-7.x-Linux/solr/build/solr-core/test/J0/temp/solr.cloud.TestWithCollection_63194DEC6D9081F2-001/tempDir-001/node1/testDeleteWithCollection_abc_shard1_replica_n3/../../../../contrib/langid/lib filtered by .*\.jar to classpath: /home/jenkins/workspace/Lucene-Solr-7.x-Linux/solr/build/solr-core/test/J0/temp/solr.cloud.TestWithCollection_63194DEC6D9081F2-001/tempDir-001/node1/testDeleteWithCollection_abc_shard1_replica_n3/../../../../contrib/langid/lib
   [junit4]   2> 1323756 WARN  (qtp457300738-23990) [n:127.0.0.1:37353_solr c:testDeleteWithCollection_abc s:shard1 r:core_node4 x:testDeleteWithCollection_abc_shard1_replica_n3] o.a.s.c.SolrConfig Couldn't add files from /home/jenkins/workspace/Lucene-Solr-7.x-Linux/solr/build/solr-core/test/J0/temp/solr.cloud.TestWithCollection_63194DEC6D9081F2-001/tempDir-001/node1/testDeleteWithCollection_abc_shard1_replica_n3/../../../../dist filtered by solr-langid-\d.*\.jar to classpath: /home/jenkins/workspace/Lucene-Solr-7.x-Linux/solr/build/solr-core/test/J0/temp/solr.cloud.TestWithCollection_63194DEC6D9081F2-001/tempDir-001/node1/testDeleteWithCollection_abc_shard1_replica_n3/../../../../dist
   [junit4]   2> 1323756 WARN  (qtp457300738-23990) [n:127.0.0.1:37353_solr c:testDeleteWithCollection_abc s:shard1 r:core_node4 x:testDeleteWithCollection_abc_shard1_replica_n3] o.a.s.c.SolrConfig Couldn't add files from /home/jenkins/workspace/Lucene-Solr-7.x-Linux/solr/build/solr-core/test/J0/temp/solr.cloud.TestWithCollection_63194DEC6D9081F2-001/tempDir-001/node1/testDeleteWithCollection_abc_shard1_replica_n3/../../../../contrib/velocity/lib filtered by .*\.jar to classpath: /home/jenkins/workspace/Lucene-Solr-7.x-Linux/solr/build/solr-core/test/J0/temp/solr.cloud.TestWithCollection_63194DEC6D9081F2-001/tempDir-001/node1/testDeleteWithCollection_abc_shard1_replica_n3/../../../../contrib/velocity/lib
   [junit4]   2> 1323756 WARN  (qtp457300738-23990) [n:127.0.0.1:37353_solr c:testDeleteWithCollection_abc s:shard1 r:core_node4 x:testDeleteWithCollection_abc_shard1_replica_n3] o.a.s.c.SolrConfig Couldn't add files from /home/jenkins/workspace/Lucene-Solr-7.x-Linux/solr/build/solr-core/test/J0/temp/solr.cloud.TestWithCollection_63194DEC6D9081F2-001/tempDir-001/node1/testDeleteWithCollection_abc_shard1_replica_n3/../../../../dist filtered by solr-velocity-\d.*\.jar to classpath: /home/jenkins/workspace/Lucene-Solr-7.x-Linux/solr/build/solr-core/test/J0/temp/solr.cloud.TestWithCollection_63194DEC6D9081F2-001/tempDir-001/node1/testDeleteWithCollection_abc_shard1_replica_n3/../../../../dist
   [junit4]   2> 1323761 INFO  (qtp457300738-23990) [n:127.0.0.1:37353_solr c:testDeleteWithCollection_abc s:shard1 r:core_node4 x:testDeleteWithCollection_abc_shard1_replica_n3] o.a.s.c.SolrConfig Using Lucene MatchVersion: 7.5.0
   [junit4]   2> 1323775 INFO  (qtp457300738-23990) [n:127.0.0.1:37353_solr c:testDeleteWithCollection_abc s:shard1 r:core_node4 x:testDeleteWithCollection_abc_shard1_replica_n3] o.a.s.s.IndexSchema [testDeleteWithCollection_abc_shard1_replica_n3] Schema name=default-config
   [junit4]   2> 1323851 INFO  (zkCallback-9244-thread-1) [    ] o.a.s.c.c.ZkStateReader A cluster state change: [WatchedEvent state:SyncConnected type:NodeDataChanged path:/collections/testDeleteWithCollection_abc/state.json] for collection [testDeleteWithCollection_abc] has occurred - updating... (live nodes size: [2])
   [junit4]   2> 1323851 INFO  (zkCallback-9252-thread-1) [    ] o.a.s.c.c.ZkStateReader A cluster state change: [WatchedEvent state:SyncConnected type:NodeDataChanged path:/collections/testDeleteWithCollection_abc/state.json] for collection [testDeleteWithCollection_abc] has occurred - updating... (live nodes size: [2])
   [junit4]   2> 1323851 INFO  (zkCallback-9244-thread-2) [    ] o.a.s.c.c.ZkStateReader A cluster state change: [WatchedEvent state:SyncConnected type:NodeDataChanged path:/collections/testDeleteWithCollection_abc/state.json] for collection [testDeleteWithCollection_abc] has occurred - updating... (live nodes size: [2])
   [junit4]   2> 1323876 INFO  (qtp457300738-23990) [n:127.0.0.1:37353_solr c:testDeleteWithCollection_abc s:shard1 r:core_node4 x:testDeleteWithCollection_abc_shard1_replica_n3] o.a.s.s.IndexSchema Loaded schema default-config/1.6 with uniqueid field id
   [junit4]   2> 1323886 INFO  (qtp457300738-23990) [n:127.0.0.1:37353_solr c:testDeleteWithCollection_abc s:shard1 r:core_node4 x:testDeleteWithCollection_abc_shard1_replica_n3] o.a.s.c.CoreContainer Creating SolrCore 'testDeleteWithCollection_abc_shard1_replica_n3' using configuration from collection testDeleteWithCollection_abc, trusted=true
   [junit4]   2> 1323887 INFO  (qtp457300738-23990) [n:127.0.0.1:37353_solr c:testDeleteWithCollection_abc s:shard1 r:core_node4 x:testDeleteWithCollection_abc_shard1_replica_n3] o.a.s.m.r.SolrJmxReporter JMX monitoring for 'solr_37353.solr.core.testDeleteWithCollection_abc.shard1.replica_n3' (registry 'solr.core.testDeleteWithCollection_abc.shard1.replica_n3') enabled at server: com.sun.jmx.mbeanserver.JmxMBeanServer@3d488fe8
   [junit4]   2> 1323887 INFO  (qtp457300738-23990) [n:127.0.0.1:37353_solr c:testDeleteWithCollection_abc s:shard1 r:core_node4 x:testDeleteWithCollection_abc_shard1_replica_n3] o.a.s.c.SolrCore solr.RecoveryStrategy.Builder
   [junit4]   2> 1323887 INFO  (qtp457300738-23990) [n:127.0.0.1:37353_solr c:testDeleteWithCollection_abc s:shard1 r:core_node4 x:testDeleteWithCollection_abc_shard1_replica_n3] o.a.s.c.SolrCore [[testDeleteWithCollection_abc_shard1_replica_n3] ] Opening new SolrCore at [/home/jenkins/workspace/Lucene-Solr-7.x-Linux/solr/build/solr-core/test/J0/temp/solr.cloud.TestWithCollection_63194DEC6D9081F2-001/tempDir-001/node1/testDeleteWithCollection_abc_shard1_replica_n3], dataDir=[/home/jenkins/workspace/Lucene-Solr-7.x-Linux/solr/build/solr-core/test/J0/temp/solr.cloud.TestWithCollection_63194DEC6D9081F2-001/tempDir-001/node1/./testDeleteWithCollection_abc_shard1_replica_n3/data/]
   [junit4]   2> 1323889 INFO  (qtp457300738-23990) [n:127.0.0.1:37353_solr c:testDeleteWithCollection_abc s:shard1 r:core_node4 x:testDeleteWithCollection_abc_shard1_replica_n3] o.a.s.r.XSLTResponseWriter xsltCacheLifetimeSeconds=5
   [junit4]   2> 1323914 INFO  (qtp457300738-23990) [n:127.0.0.1:37353_solr c:testDeleteWithCollection_abc s:shard1 r:core_node4 x:testDeleteWithCollection_abc_shard1_replica_n3] o.a.s.u.UpdateHandler Using UpdateLog implementation: org.apache.solr.update.UpdateLog
   [junit4]   2> 1323914 INFO  (qtp457300738-23990) [n:127.0.0.1:37353_solr c:testDeleteWithCollection_abc s:shard1 r:core_node4 x:testDeleteWithCollection_abc_shard1_replica_n3] o.a.s.u.UpdateLog Initializing UpdateLog: dataDir= defaultSyncLevel=FLUSH numRecordsToKeep=100 maxNumLogsToKeep=10 numVersionBuckets=65536
   [junit4]   2> 1323915 INFO  (qtp457300738-23990) [n:127.0.0.1:37353_solr c:testDeleteWithCollection_abc s:shard1 r:core_node4 x:testDeleteWithCollection_abc_shard1_replica_n3] o.a.s.u.CommitTracker Hard AutoCommit: if uncommited for 15000ms; 
   [junit4]   2> 1323915 INFO  (qtp457300738-23990) [n:127.0.0.1:37353_solr c:testDeleteWithCollection_abc s:shard1 r:core_node4 x:testDeleteWithCollection_abc_shard1_replica_n3] o.a.s.u.CommitTracker Soft AutoCommit: disabled
   [junit4]   2> 1323916 INFO  (qtp457300738-23990) [n:127.0.0.1:37353_solr c:testDeleteWithCollection_abc s:shard1 r:core_node4 x:testDeleteWithCollection_abc_shard1_replica_n3] o.a.s.s.SolrIndexSearcher Opening [Searcher@7f61e31c[testDeleteWithCollection_abc_shard1_replica_n3] main]
   [junit4]   2> 1323916 INFO  (qtp457300738-23990) [n:127.0.0.1:37353_solr c:testDeleteWithCollection_abc s:shard1 r:core_node4 x:testDeleteWithCollection_abc_shard1_replica_n3] o.a.s.r.ManagedResourceStorage Configured ZooKeeperStorageIO with znodeBase: /configs/testDeleteWithCollection_abc.AUTOCREATED
   [junit4]   2> 1323917 INFO  (qtp457300738-23990) [n:127.0.0.1:37353_solr c:testDeleteWithCollection_abc s:shard1 r:core_node4 x:testDeleteWithCollection_abc_shard1_replica_n3] o.a.s.r.ManagedResourceStorage Loaded null at path _rest_managed.json using ZooKeeperStorageIO:path=/configs/testDeleteWithCollection_abc.AUTOCREATED
   [junit4]   2> 1323917 INFO  (qtp457300738-23990) [n:127.0.0.1:37353_solr c:testDeleteWithCollection_abc s:shard1 r:core_node4 x:testDeleteWithCollection_abc_shard1_replica_n3] o.a.s.s.ZkIndexSchemaReader Creating ZooKeeper watch for the managed schema at /configs/testDeleteWithCollection_abc.AUTOCREATED/managed-schema
   [junit4]   2> 1323922 INFO  (qtp457300738-23990) [n:127.0.0.1:37353_solr c:testDeleteWithCollection_abc s:shard1 r:core_node4 x:testDeleteWithCollection_abc_shard1_replica_n3] o.a.s.s.ZkIndexSchemaReader Current schema version 0 is already the latest
   [junit4]   2> 1323922 INFO  (qtp457300738-23990) [n:127.0.0.1:37353_solr c:testDeleteWithCollection_abc s:shard1 r:core_node4 x:testDeleteWithCollection_abc_shard1_replica_n3] o.a.s.h.c.SpellCheckComponent Initializing spell checkers
   [junit4]   2> 1323922 INFO  (qtp457300738-23990) [n:127.0.0.1:37353_solr c:testDeleteWithCollection_abc s:shard1 r:core_node4 x:testDeleteWithCollection_abc_shard1_replica_n3] o.a.s.s.DirectSolrSpellChecker init: {name=default,field=_text_,classname=solr.DirectSolrSpellChecker,distanceMeasure=internal,accuracy=0.5,maxEdits=2,minPrefix=1,maxInspections=5,minQueryLength=4,maxQueryFrequency=0.01}
   [junit4]   2> 1323923 INFO  (qtp457300738-23990) [n:127.0.0.1:37353_solr c:testDeleteWithCollection_abc s:shard1 r:core_node4 x:testDeleteWithCollection_abc_shard1_replica_n3] o.a.s.h.ReplicationHandler Commits will be reserved for 10000ms.
   [junit4]   2> 1323923 INFO  (qtp457300738-23990) [n:127.0.0.1:37353_solr c:testDeleteWithCollection_abc s:shard1 r:core_node4 x:testDeleteWithCollection_abc_shard1_replica_n3] o.a.s.u.UpdateLog Could not find max version in index or recent updates, using new clock 1607782020721672192
   [junit4]   2> 1323923 INFO  (searcherExecutor-6842-thread-1-processing-n:127.0.0.1:37353_solr x:testDeleteWithCollection_abc_shard1_replica_n3 c:testDeleteWithCollection_abc s:shard1 r:core_node4) [n:127.0.0.1:37353_solr c:testDeleteWithCollection_abc s:shard1 r:core_node4 x:testDeleteWithCollection_abc_shard1_replica_n3] o.a.s.c.QuerySenderListener QuerySenderListener sending requests to Searcher@7f61e31c[testDeleteWithCollection_abc_shard1_replica_n3] main{ExitableDirectoryReader(UninvertingDirectoryReader())}
   [junit4]   2> 1323924 INFO  (searcherExecutor-6842-thread-1-processing-n:127.0.0.1:37353_solr x:testDeleteWithCollection_abc_shard1_replica_n3 c:testDeleteWithCollection_abc s:shard1 r:core_node4) [n:127.0.0.1:37353_solr c:testDeleteWithCollection_abc s:shard1 r:core_node4 x:testDeleteWithCollection_abc_shard1_replica_n3] o.a.s.c.QuerySenderListener QuerySenderListener done.
   [junit4]   2> 1323924 INFO  (searcherExecutor-6842-thread-1-processing-n:127.0.0.1:37353_solr x:testDeleteWithCollection_abc_shard1_replica_n3 c:testDeleteWithCollection_abc s:shard1 r:core_node4) [n:127.0.0.1:37353_solr c:testDeleteWithCollection_abc s:shard1 r:core_node4 x:testDeleteWithCollection_abc_shard1_replica_n3] o.a.s.h.c.SpellCheckComponent Loading spell index for spellchecker: default
   [junit4]   2> 1323924 INFO  (searcherExecutor-6842-thread-1-processing-n:127.0.0.1:37353_solr x:testDeleteWithCollection_abc_shard1_replica_n3 c:testDeleteWithCollection_abc s:shard1 r:core_node4) [n:127.0.0.1:37353_solr c:testDeleteWithCollection_abc s:shard1 r:core_node4 x:testDeleteWithCollection_abc_shard1_replica_n3] o.a.s.c.SolrCore [testDeleteWithCollection_abc_shard1_replica_n3] Registered new searcher Searcher@7f61e31c[testDeleteWithCollection_abc_shard1_replica_n3] main{ExitableDirectoryReader(UninvertingDirectoryReader())}
   [junit4]   2> 1323926 INFO  (qtp457300738-23990) [n:127.0.0.1:37353_solr c:testDeleteWithCollection_abc s:shard1 r:core_node4 x:testDeleteWithCollection_abc_shard1_replica_n3] o.a.s.c.ZkShardTerms Successful update of terms at /collections/testDeleteWithCollection_abc/terms/shard1 to Terms{values={core_node2=0, core_node4=0}, version=1}
   [junit4]   2> 1323927 INFO  (qtp457300738-23990) [n:127.0.0.1:37353_solr c:testDeleteWithCollection_abc s:shard1 r:core_node4 x:testDeleteWithCollection_abc_shard1_replica_n3] o.a.s.c.ZkController Core needs to recover:testDeleteWithCollection_abc_shard1_replica_n3
   [junit4]   2> 1323927 INFO  (updateExecutor-9240-thread-1-processing-n:127.0.0.1:37353_solr x:testDeleteWithCollection_abc_shard1_replica_n3 c:testDeleteWithCollection_abc s:shard1 r:core_node4) [n:127.0.0.1:37353_solr c:testDeleteWithCollection_abc s:shard1 r:core_node4 x:testDeleteWithCollection_abc_shard1_replica_n3] o.a.s.u.DefaultSolrCoreState Running recovery
   [junit4]   2> 1323928 INFO  (recoveryExecutor-9241-thread-1-processing-n:127.0.0.1:37353_solr x:testDeleteWithCollection_abc_shard1_replica_n3 c:testDeleteWithCollection_abc s:shard1 r:core_node4) [n:127.0.0.1:37353_solr c:testDeleteWithCollection_abc s:shard1 r:core_node4 x:testDeleteWithCollection_abc_shard1_replica_n3] o.a.s.c.RecoveryStrategy Starting recovery process. recoveringAfterStartup=true
   [junit4]   2> 1323928 INFO  (recoveryExecutor-9241-thread-1-processing-n:127.0.0.1:37353_solr x:testDeleteWithCollection_abc_shard1_replica_n3 c:testDeleteWithCollection_abc s:shard1 r:core_node4) [n:127.0.0.1:37353_solr c:testDeleteWithCollection_abc s:shard1 r:core_node4 x:testDeleteWithCollection_abc_shard1_replica_n3] o.a.s.c.RecoveryStrategy ###### startupVersions=[[]]
   [junit4]   2> 1323928 INFO  (qtp457300738-23990) [n:127.0.0.1:37353_solr c:testDeleteWithCollection_abc s:shard1 r:core_node4 x:testDeleteWithCollection_abc_shard1_replica_n3] o.a.s.s.HttpSolrCall [admin] webapp=null path=/admin/cores params={qt=/admin/cores&coreNodeName=core_node4&collection.configName=testDeleteWithCollection_abc.AUTOCREATED&name=testDeleteWithCollection_abc_shard1_replica_n3&action=CREATE&collection=testDeleteWithCollection_abc&shard=shard1&wt=javabin&version=2&replicaType=NRT} status=0 QTime=180
   [junit4]   2> 1323930 INFO  (qtp562212117-23987) [n:127.0.0.1:45789_solr c:testDeleteWithCollection_abc s:shard1 r:core_node2 x:testDeleteWithCollection_abc_shard1_replica_n1] o.a.s.c.S.Request [testDeleteWithCollection_abc_shard1_replica_n1]  webapp=/solr path=/admin/ping params={wt=javabin&version=2} hits=0 status=0 QTime=0
   [junit4]   2> 1323930 INFO  (qtp562212117-23987) [n:127.0.0.1:45789_solr c:testDeleteWithCollection_abc s:shard1 r:core_node2 x:testDeleteWithCollection_abc_shard1_replica_n1] o.a.s.c.S.Request [testDeleteWithCollection_abc_shard1_replica_n1]  webapp=/solr path=/admin/ping params={wt=javabin&version=2} status=0 QTime=0
   [junit4]   2> 1323930 INFO  (recoveryExecutor-9241-thread-1-processing-n:127.0.0.1:37353_solr x:testDeleteWithCollection_abc_shard1_replica_n3 c:testDeleteWithCollection_abc s:shard1 r:core_node4) [n:127.0.0.1:37353_solr c:testDeleteWithCollection_abc s:shard1 r:core_node4 x:testDeleteWithCollection_abc_shard1_replica_n3] o.a.s.c.RecoveryStrategy Begin buffering updates. core=[testDeleteWithCollection_abc_shard1_replica_n3]
   [junit4]   2> 1323930 INFO  (recoveryExecutor-9241-thread-1-processing-n:127.0.0.1:37353_solr x:testDeleteWithCollection_abc_shard1_replica_n3 c:testDeleteWithCollection_abc s:shard1 r:core_node4) [n:127.0.0.1:37353_solr c:testDeleteWithCollection_abc s:shard1 r:core_node4 x:testDeleteWithCollection_abc_shard1_replica_n3] o.a.s.u.UpdateLog Starting to buffer updates. FSUpdateLog{state=ACTIVE, tlog=null}
   [junit4]   2> 1323930 INFO  (recoveryExecutor-9241-thread-1-processing-n:127.0.0.1:37353_solr x:testDeleteWithCollection_abc_shard1_replica_n3 c:testDeleteWithCollection_abc s:shard1 r:core_node4) [n:127.0.0.1:37353_solr c:testDeleteWithCollection_abc s:shard1 r:core_node4 x:testDeleteWithCollection_abc_shard1_replica_n3] o.a.s.c.RecoveryStrategy Publishing state of core [testDeleteWithCollection_abc_shard1_replica_n3] as recovering, leader is [http://127.0.0.1:45789/solr/testDeleteWithCollection_abc_shard1_replica_n1/] and I am [http://127.0.0.1:37353/solr/testDeleteWithCollection_abc_shard1_replica_n3/]
   [junit4]   2> 1323931 INFO  (recoveryExecutor-9241-thread-1-processing-n:127.0.0.1:37353_solr x:testDeleteWithCollection_abc_shard1_replica_n3 c:testDeleteWithCollection_abc s:shard1 r:core_node4) [n:127.0.0.1:37353_solr c:testDeleteWithCollection_abc s:shard1 r:core_node4 x:testDeleteWithCollection_abc_shard1_replica_n3] o.a.s.c.ZkShardTerms Successful update of terms at /collections/testDeleteWithCollection_abc/terms/shard1 to Terms{values={core_node2=0, core_node4_recovering=0, core_node4=0}, version=2}
   [junit4]   2> 1323932 INFO  (recoveryExecutor-9241-thread-1-processing-n:127.0.0.1:37353_solr x:testDeleteWithCollection_abc_shard1_replica_n3 c:testDeleteWithCollection_abc s:shard1 r:core_node4) [n:127.0.0.1:37353_solr c:testDeleteWithCollection_abc s:shard1 r:core_node4 x:testDeleteWithCollection_abc_shard1_replica_n3] o.a.s.c.RecoveryStrategy Sending prep recovery command to [http://127.0.0.1:45789/solr]; [WaitForState: action=PREPRECOVERY&core=testDeleteWithCollection_abc_shard1_replica_n1&nodeName=127.0.0.1:37353_solr&coreNodeName=core_node4&state=recovering&checkLive=true&onlyIfLeader=true&onlyIfLeaderActive=true]
   [junit4]   2> 1323932 INFO  (qtp562212117-23979) [n:127.0.0.1:45789_solr    x:testDeleteWithCollection_abc_shard1_replica_n1] o.a.s.h.a.PrepRecoveryOp Going to wait for coreNodeName: core_node4, state: recovering, checkLive: true, onlyIfLeader: true, onlyIfLeaderActive: true, maxTime: 183 s
   [junit4]   2> 1323932 INFO  (qtp562212117-23979) [n:127.0.0.1:45789_solr    x:testDeleteWithCollection_abc_shard1_replica_n1] o.a.s.h.a.PrepRecoveryOp In WaitForState(recovering): collection=testDeleteWithCollection_abc, shard=shard1, thisCore=testDeleteWithCollection_abc_shard1_replica_n1, leaderDoesNotNeedRecovery=false, isLeader? true, live=true, checkLive=true, currentState=down, localState=active, nodeName=127.0.0.1:37353_solr, coreNodeName=core_node4, onlyIfActiveCheckResult=false, nodeProps: core_node4:{"core":"testDeleteWithCollection_abc_shard1_replica_n3","base_url":"http://127.0.0.1:37353/solr","node_name":"127.0.0.1:37353_solr","state":"down","type":"NRT","force_set_state":"false"}
   [junit4]   2> 1324032 INFO  (zkCallback-9252-thread-1) [    ] o.a.s.c.c.ZkStateReader A cluster state change: [WatchedEvent state:SyncConnected type:NodeDataChanged path:/collections/testDeleteWithCollection_abc/state.json] for collection [testDeleteWithCollection_abc] has occurred - updating... (live nodes size: [2])
   [junit4]   2> 1324032 INFO  (zkCallback-9244-thread-2) [    ] o.a.s.c.c.ZkStateReader A cluster state change: [WatchedEvent state:SyncConnected type:NodeDataChanged path:/collections/testDeleteWithCollection_abc/state.json] for collection [testDeleteWithCollection_abc] has occurred - updating... (live nodes size: [2])
   [junit4]   2> 1324032 INFO  (zkCallback-9244-thread-3) [    ] o.a.s.c.c.ZkStateReader A cluster state change: [WatchedEvent state:SyncConnected type:NodeDataChanged path:/collections/testDeleteWithCollection_abc/state.json] for collection [testDeleteWithCollection_abc] has occurred - updating... (live nodes size: [2])
   [junit4]   2> 1324932 INFO  (qtp562212117-23979) [n:127.0.0.1:45789_solr    x:testDeleteWithCollection_abc_shard1_replica_n1] o.a.s.h.a.PrepRecoveryOp In WaitForState(recovering): collection=testDeleteWithCollection_abc, shard=shard1, thisCore=testDeleteWithCollection_abc_shard1_replica_n1, leaderDoesNotNeedRecovery=false, isLeader? true, live=true, checkLive=true, currentState=recovering, localState=active, nodeName=127.0.0.1:37353_solr, coreNodeName=core_node4, onlyIfActiveCheckResult=false, nodeProps: core_node4:{"core":"testDeleteWithCollection_abc_shard1_replica_n3","base_url":"http://127.0.0.1:37353/solr","node_name":"127.0.0.1:37353_solr","state":"recovering","type":"NRT","force_set_state":"false"}
   [junit4]   2> 1324933 INFO  (qtp562212117-23979) [n:127.0.0.1:45789_solr    x:testDeleteWithCollection_abc_shard1_replica_n1] o.a.s.h.a.PrepRecoveryOp Waited coreNodeName: core_node4, state: recovering, checkLive: true, onlyIfLeader: true for: 1 seconds.
   [junit4]   2> 1324933 INFO  (qtp562212117-23979) [n:127.0.0.1:45789_solr    x:testDeleteWithCollection_abc_shard1_replica_n1] o.a.s.s.HttpSolrCall [admin] webapp=null path=/admin/cores params={nodeName=127.0.0.1:37353_solr&onlyIfLeaderActive=true&core=testDeleteWithCollection_abc_shard1_replica_n1&coreNodeName=core_node4&action=PREPRECOVERY&checkLive=true&state=recovering&onlyIfLeader=true&wt=javabin&version=2} status=0 QTime=1000
   [junit4]   2> 1325433 INFO  (recoveryExecutor-9241-thread-1-processing-n:127.0.0.1:37353_solr x:testDeleteWithCollection_abc_shard1_replica_n3 c:testDeleteWithCollection_abc s:shard1 r:core_node4) [n:127.0.0.1:37353_solr c:testDeleteWithCollection_abc s:shard1 r:core_node4 x:testDeleteWithCollection_abc_shard1_replica_n3] o.a.s.c.RecoveryStrategy Attempting to PeerSync from [http://127.0.0.1:45789/solr/testDeleteWithCollection_abc_shard1_replica_n1/] - recoveringAfterStartup=[true]
   [junit4]   2> 1325433 WARN  (recoveryExecutor-9241-thread-1-processing-n:127.0.0.1:37353_solr x:testDeleteWithCollection_abc_shard1_replica_n3 c:testDeleteWithCollection_abc s:shard1 r:core_node4) [n:127.0.0.1:37353_solr c:testDeleteWithCollection_abc s:shard1 r:core_node4 x:testDeleteWithCollection_abc_shard1_replica_n3] o.a.s.u.PeerSyncWithLeader no frame of reference to tell if we've missed updates
   [junit4]   2> 1325433 INFO  (recoveryExecutor-9241-thread-1-processing-n:127.0.0.1:37353_solr x:testDeleteWithCollection_abc_shard1_replica_n3 c:testDeleteWithCollection_abc s:shard1 r:core_node4) [n:127.0.0.1:37353_solr c:testDeleteWithCollection_abc s:shard1 r:core_node4 x:testDeleteWithCollection_abc_shard1_replica_n3] o.a.s.c.RecoveryStrategy PeerSync Recovery was not successful - trying replication.
   [junit4]   2> 1325433 INFO  (recoveryExecutor-9241-thread-1-processing-n:127.0.0.1:37353_solr x:testDeleteWithCollection_abc_shard1_replica_n3 c:testDeleteWithCollection_abc s:shard1 r:core_node4) [n:127.0.0.1:37353_solr c:testDeleteWithCollection_abc s:shard1 r:core_node4 x:testDeleteWithCollection_abc_shard1_replica_n3] o.a.s.c.RecoveryStrategy Starting Replication Recovery.
   [junit4]   2> 1325433 INFO  (recoveryExecutor-9241-thread-1-processing-n:127.0.0.1:37353_solr x:testDeleteWithCollection_abc_shard1_replica_n3 c:testDeleteWithCollection_abc s:shard1 r:core_node4) [n:127.0.0.1:37353_solr c:testDeleteWithCollection_abc s:shard1 r:core_node4 x:testDeleteWithCollection_abc_shard1_replica_n3] o.a.s.c.RecoveryStrategy Attempting to replicate from [http://127.0.0.1:45789/solr/testDeleteWithCollection_abc_shard1_replica_n1/].
   [junit4]   2> 1325435 INFO  (qtp562212117-24060) [n:127.0.0.1:45789_solr c:testDel

[...truncated too long message...]

.ivy.jars.list as its length is 0.

-ivy-fail-disallowed-ivy-version:

ivy-fail:

resolve-groovy:
[ivy:cachepath] :: resolving dependencies :: org.codehaus.groovy#groovy-all-caller;working
[ivy:cachepath] 	confs: [default]
[ivy:cachepath] 	found org.codehaus.groovy#groovy-all;2.4.15 in public
[ivy:cachepath] :: resolution report :: resolve 17ms :: artifacts dl 1ms
	---------------------------------------------------------------------
	|                  |            modules            ||   artifacts   |
	|       conf       | number| search|dwnlded|evicted|| number|dwnlded|
	---------------------------------------------------------------------
	|      default     |   1   |   0   |   0   |   0   ||   1   |   0   |
	---------------------------------------------------------------------

-init-totals:

-test:
    [mkdir] Created dir: /home/jenkins/workspace/Lucene-Solr-7.x-Linux/solr/build/solr-core/test
[junit4:pickseed] Seed property 'tests.seed' already defined: 63194DEC6D9081F2
    [mkdir] Created dir: /home/jenkins/workspace/Lucene-Solr-7.x-Linux/solr/build/solr-core/test/temp
   [junit4] <JUnit4> says cześć! Master seed: 63194DEC6D9081F2
   [junit4] Executing 5 suites with 3 JVMs.
   [junit4] 
   [junit4] Started J1 PID(28541@serv1.sd-datasolutions.de).
   [junit4] Started J2 PID(28540@serv1.sd-datasolutions.de).
   [junit4] Started J0 PID(28539@serv1.sd-datasolutions.de).
   [junit4] Suite: org.apache.solr.cloud.TestWithCollection
   [junit4] OK      19.2s J1 | TestWithCollection.testDeleteWithCollection
   [junit4] OK      9.51s J1 | TestWithCollection.testAddReplicaWithPolicy
   [junit4] OK      12.0s J1 | TestWithCollection.testMoveReplicaMainCollection
   [junit4] OK      19.4s J1 | TestWithCollection.testNodeAdded
   [junit4] OK      7.20s J1 | TestWithCollection.testCreateCollection
   [junit4] OK      4.38s J1 | TestWithCollection.testCreateCollectionNoWithCollection
   [junit4] OK      8.64s J1 | TestWithCollection.testAddReplicaSimple
   [junit4] OK      18.6s J1 | TestWithCollection.testMultipleWithCollections
   [junit4] OK      8.53s J1 | TestWithCollection.testMoveReplicaWithCollection
   [junit4] Completed [1/5] on J1 in 112.82s, 9 tests
   [junit4] 
   [junit4] Suite: org.apache.solr.cloud.TestWithCollection
   [junit4] OK      19.0s J0 | TestWithCollection.testDeleteWithCollection
   [junit4] OK      9.48s J0 | TestWithCollection.testAddReplicaWithPolicy
   [junit4] OK      11.9s J0 | TestWithCollection.testMoveReplicaMainCollection
   [junit4] OK      19.3s J0 | TestWithCollection.testNodeAdded
   [junit4] OK      7.27s J0 | TestWithCollection.testCreateCollection
   [junit4] OK      4.41s J0 | TestWithCollection.testCreateCollectionNoWithCollection
   [junit4] OK      8.66s J0 | TestWithCollection.testAddReplicaSimple
   [junit4] OK      18.6s J0 | TestWithCollection.testMultipleWithCollections
   [junit4] OK      8.56s J0 | TestWithCollection.testMoveReplicaWithCollection
   [junit4] Completed [2/5] on J0 in 113.59s, 9 tests
   [junit4] 
   [junit4] Duplicate suite name used with XML reports: org.apache.solr.cloud.TestWithCollection. This may confuse tools that process XML reports. Set 'ignoreDuplicateSuites' to true to skip this message.
   [junit4] Suite: org.apache.solr.cloud.TestWithCollection
   [junit4] OK      19.3s J2 | TestWithCollection.testDeleteWithCollection
   [junit4] OK      9.51s J2 | TestWithCollection.testAddReplicaWithPolicy
   [junit4] OK      11.9s J2 | TestWithCollection.testMoveReplicaMainCollection
   [junit4] OK      19.4s J2 | TestWithCollection.testNodeAdded
   [junit4] OK      7.27s J2 | TestWithCollection.testCreateCollection
   [junit4] OK      4.39s J2 | TestWithCollection.testCreateCollectionNoWithCollection
   [junit4] OK      8.67s J2 | TestWithCollection.testAddReplicaSimple
   [junit4] OK      18.2s J2 | TestWithCollection.testMultipleWithCollections
   [junit4] OK      8.67s J2 | TestWithCollection.testMoveReplicaWithCollection
   [junit4] Completed [3/5] on J2 in 113.83s, 9 tests
   [junit4] 
   [junit4] Suite: org.apache.solr.cloud.TestWithCollection
   [junit4] OK      15.4s J0 | TestWithCollection.testDeleteWithCollection
   [junit4] OK      8.69s J0 | TestWithCollection.testAddReplicaWithPolicy
   [junit4] OK      11.2s J0 | TestWithCollection.testMoveReplicaMainCollection
   [junit4] OK      18.3s J0 | TestWithCollection.testNodeAdded
   [junit4] OK      6.96s J0 | TestWithCollection.testCreateCollection
   [junit4] OK      4.62s J0 | TestWithCollection.testCreateCollectionNoWithCollection
   [junit4] OK      8.60s J0 | TestWithCollection.testAddReplicaSimple
   [junit4] OK      16.0s J0 | TestWithCollection.testMultipleWithCollections
   [junit4] OK      8.53s J0 | TestWithCollection.testMoveReplicaWithCollection
   [junit4] Completed [4/5] on J0 in 100.28s, 9 tests
   [junit4] 
   [junit4] Suite: org.apache.solr.cloud.TestWithCollection
   [junit4] OK      15.2s J1 | TestWithCollection.testDeleteWithCollection
   [junit4] OK      8.66s J1 | TestWithCollection.testAddReplicaWithPolicy
   [junit4] OK      11.2s J1 | TestWithCollection.testMoveReplicaMainCollection
   [junit4] OK      18.3s J1 | TestWithCollection.testNodeAdded
   [junit4] OK      7.36s J1 | TestWithCollection.testCreateCollection
   [junit4] OK      4.18s J1 | TestWithCollection.testCreateCollectionNoWithCollection
   [junit4] OK      8.56s J1 | TestWithCollection.testAddReplicaSimple
   [junit4] OK      17.8s J1 | TestWithCollection.testMultipleWithCollections
   [junit4] OK      8.54s J1 | TestWithCollection.testMoveReplicaWithCollection
   [junit4] Completed [5/5] on J1 in 101.63s, 9 tests
   [junit4] 
   [junit4] JVM J0:     0.43 ..   215.22 =   214.80s
   [junit4] JVM J1:     0.41 ..   216.06 =   215.65s
   [junit4] JVM J2:     0.41 ..   115.10 =   114.68s
   [junit4] Execution time total: 3 minutes 36 seconds
   [junit4] Tests summary: 5 suites, 45 tests
   [junit4] Could not remove temporary path: /home/jenkins/workspace/Lucene-Solr-7.x-Linux/solr/build/solr-core/test/J0 (java.nio.file.DirectoryNotEmptyException: Remaining files: [/home/jenkins/workspace/Lucene-Solr-7.x-Linux/solr/build/solr-core/test/J0/temp])
   [junit4] Could not remove temporary path: /home/jenkins/workspace/Lucene-Solr-7.x-Linux/solr/build/solr-core/test/J2 (java.nio.file.DirectoryNotEmptyException: Remaining files: [/home/jenkins/workspace/Lucene-Solr-7.x-Linux/solr/build/solr-core/test/J2/temp])
   [junit4] Could not remove temporary path: /home/jenkins/workspace/Lucene-Solr-7.x-Linux/solr/build/solr-core/test/J1 (java.nio.file.DirectoryNotEmptyException: Remaining files: [/home/jenkins/workspace/Lucene-Solr-7.x-Linux/solr/build/solr-core/test/J1/temp])
     [echo] 5 slowest tests:
[junit4:tophints] 116.77s | org.apache.solr.update.SoftAutoCommitTest
[junit4:tophints] 112.85s | org.apache.solr.cloud.ZkFailoverTest
[junit4:tophints] 108.23s | org.apache.solr.cloud.TestWithCollection
[junit4:tophints] 103.67s | org.apache.solr.cloud.TestPullReplicaErrorHandling
[junit4:tophints] 100.86s | org.apache.solr.search.TestStressRecovery

-check-totals:

test-nocompile:

BUILD SUCCESSFUL
Total time: 3 minutes 37 seconds
[repro] Failures:
[repro]   0/5 failed: org.apache.solr.cloud.TestWithCollection
[repro] Exiting with code 0
+ mv lucene/build lucene/build.repro
+ mv solr/build solr/build.repro
+ mv lucene/build.orig lucene/build
+ mv solr/build.orig solr/build
Archiving artifacts
Setting ANT_1_8_2_HOME=/var/lib/jenkins/tools/hudson.tasks.Ant_AntInstallation/ANT_1.8.2
java.lang.InterruptedException: no matches found within 10000
	at hudson.FilePath$ValidateAntFileMask.hasMatch(FilePath.java:2845)
	at hudson.FilePath$ValidateAntFileMask.invoke(FilePath.java:2724)
	at hudson.FilePath$ValidateAntFileMask.invoke(FilePath.java:2705)
	at hudson.FilePath.act(FilePath.java:1076)
	at hudson.FilePath.act(FilePath.java:1059)
	at hudson.FilePath.validateAntFileMask(FilePath.java:2703)
	at hudson.tasks.ArtifactArchiver.perform(ArtifactArchiver.java:243)
	at hudson.tasks.BuildStepCompatibilityLayer.perform(BuildStepCompatibilityLayer.java:81)
	at hudson.tasks.BuildStepMonitor$1.perform(BuildStepMonitor.java:20)
	at hudson.model.AbstractBuild$AbstractBuildExecution.perform(AbstractBuild.java:744)
	at hudson.model.AbstractBuild$AbstractBuildExecution.performAllBuildSteps(AbstractBuild.java:690)
	at hudson.model.Build$BuildExecution.post2(Build.java:186)
	at hudson.model.AbstractBuild$AbstractBuildExecution.post(AbstractBuild.java:635)
	at hudson.model.Run.execute(Run.java:1840)
	at hudson.model.FreeStyleBuild.run(FreeStyleBuild.java:43)
	at hudson.model.ResourceController.execute(ResourceController.java:97)
	at hudson.model.Executor.run(Executor.java:429)
No artifacts found that match the file pattern "**/*.events,heapdumps/**,**/*_pid*.log". Configuration error?
[WARNINGS] Parsing warnings in console log with parser Java Compiler (javac)
Setting ANT_1_8_2_HOME=/var/lib/jenkins/tools/hudson.tasks.Ant_AntInstallation/ANT_1.8.2
Setting ANT_1_8_2_HOME=/var/lib/jenkins/tools/hudson.tasks.Ant_AntInstallation/ANT_1.8.2
<Git Blamer> Using GitBlamer to create author and commit information for all warnings.
<Git Blamer> GIT_COMMIT=cb15cd5a3ec6f7a003c9316a4295d11ec0a87a89, workspace=/var/lib/jenkins/workspace/Lucene-Solr-7.x-Linux
[WARNINGS] Computing warning deltas based on reference build #2474
Recording test results
Setting ANT_1_8_2_HOME=/var/lib/jenkins/tools/hudson.tasks.Ant_AntInstallation/ANT_1.8.2
Build step 'Publish JUnit test result report' changed build result to UNSTABLE
Email was triggered for: Unstable (Test Failures)
Sending email for trigger: Unstable (Test Failures)
Setting ANT_1_8_2_HOME=/var/lib/jenkins/tools/hudson.tasks.Ant_AntInstallation/ANT_1.8.2
Setting ANT_1_8_2_HOME=/var/lib/jenkins/tools/hudson.tasks.Ant_AntInstallation/ANT_1.8.2
Setting ANT_1_8_2_HOME=/var/lib/jenkins/tools/hudson.tasks.Ant_AntInstallation/ANT_1.8.2
Setting ANT_1_8_2_HOME=/var/lib/jenkins/tools/hudson.tasks.Ant_AntInstallation/ANT_1.8.2

Mime
View raw message