lucene-dev mailing list archives

Site index · List index
Message view « Date » · « Thread »
Top « Date » · « Thread »
From Policeman Jenkins Server <jenk...@thetaphi.de>
Subject [JENKINS] Lucene-Solr-7.x-Linux (64bit/jdk1.8.0_172) - Build # 2316 - Still Unstable!
Date Fri, 13 Jul 2018 16:54:30 GMT
Build: https://jenkins.thetaphi.de/job/Lucene-Solr-7.x-Linux/2316/
Java: 64bit/jdk1.8.0_172 -XX:+UseCompressedOops -XX:+UseConcMarkSweepGC

9 tests failed.
FAILED:  junit.framework.TestSuite.org.apache.solr.handler.TestHdfsBackupRestoreCore

Error Message:
Suite timeout exceeded (>= 7200000 msec).

Stack Trace:
java.lang.Exception: Suite timeout exceeded (>= 7200000 msec).
	at __randomizedtesting.SeedInfo.seed([6B7AB9A74EAE55C5]:0)


FAILED:  org.apache.solr.cloud.LeaderTragicEventTest.testOtherReplicasAreNotActive

Error Message:
Jetty Connector is not open: -2

Stack Trace:
java.lang.IllegalStateException: Jetty Connector is not open: -2
	at __randomizedtesting.SeedInfo.seed([6B7AB9A74EAE55C5:EECE95D07251EC5D]:0)
	at org.apache.solr.client.solrj.embedded.JettySolrRunner.getBaseUrl(JettySolrRunner.java:499)
	at org.apache.solr.cloud.MiniSolrCloudCluster.getReplicaJetty(MiniSolrCloudCluster.java:539)
	at org.apache.solr.cloud.LeaderTragicEventTest.corruptLeader(LeaderTragicEventTest.java:100)
	at org.apache.solr.cloud.LeaderTragicEventTest.testOtherReplicasAreNotActive(LeaderTragicEventTest.java:150)
	at sun.reflect.NativeMethodAccessorImpl.invoke0(Native Method)
	at sun.reflect.NativeMethodAccessorImpl.invoke(NativeMethodAccessorImpl.java:62)
	at sun.reflect.DelegatingMethodAccessorImpl.invoke(DelegatingMethodAccessorImpl.java:43)
	at java.lang.reflect.Method.invoke(Method.java:498)
	at com.carrotsearch.randomizedtesting.RandomizedRunner.invoke(RandomizedRunner.java:1737)
	at com.carrotsearch.randomizedtesting.RandomizedRunner$8.evaluate(RandomizedRunner.java:934)
	at com.carrotsearch.randomizedtesting.RandomizedRunner$9.evaluate(RandomizedRunner.java:970)
	at com.carrotsearch.randomizedtesting.RandomizedRunner$10.evaluate(RandomizedRunner.java:984)
	at com.carrotsearch.randomizedtesting.rules.SystemPropertiesRestoreRule$1.evaluate(SystemPropertiesRestoreRule.java:57)
	at org.apache.lucene.util.TestRuleSetupTeardownChained$1.evaluate(TestRuleSetupTeardownChained.java:49)
	at org.apache.lucene.util.AbstractBeforeAfterRule$1.evaluate(AbstractBeforeAfterRule.java:45)
	at org.apache.lucene.util.TestRuleThreadAndTestName$1.evaluate(TestRuleThreadAndTestName.java:48)
	at org.apache.lucene.util.TestRuleIgnoreAfterMaxFailures$1.evaluate(TestRuleIgnoreAfterMaxFailures.java:64)
	at org.apache.lucene.util.TestRuleMarkFailure$1.evaluate(TestRuleMarkFailure.java:47)
	at com.carrotsearch.randomizedtesting.rules.StatementAdapter.evaluate(StatementAdapter.java:36)
	at com.carrotsearch.randomizedtesting.ThreadLeakControl$StatementRunner.run(ThreadLeakControl.java:368)
	at com.carrotsearch.randomizedtesting.ThreadLeakControl.forkTimeoutingTask(ThreadLeakControl.java:817)
	at com.carrotsearch.randomizedtesting.ThreadLeakControl$3.evaluate(ThreadLeakControl.java:468)
	at com.carrotsearch.randomizedtesting.RandomizedRunner.runSingleTest(RandomizedRunner.java:943)
	at com.carrotsearch.randomizedtesting.RandomizedRunner$5.evaluate(RandomizedRunner.java:829)
	at com.carrotsearch.randomizedtesting.RandomizedRunner$6.evaluate(RandomizedRunner.java:879)
	at com.carrotsearch.randomizedtesting.RandomizedRunner$7.evaluate(RandomizedRunner.java:890)
	at com.carrotsearch.randomizedtesting.rules.StatementAdapter.evaluate(StatementAdapter.java:36)
	at com.carrotsearch.randomizedtesting.rules.SystemPropertiesRestoreRule$1.evaluate(SystemPropertiesRestoreRule.java:57)
	at org.apache.lucene.util.AbstractBeforeAfterRule$1.evaluate(AbstractBeforeAfterRule.java:45)
	at com.carrotsearch.randomizedtesting.rules.StatementAdapter.evaluate(StatementAdapter.java:36)
	at org.apache.lucene.util.TestRuleStoreClassName$1.evaluate(TestRuleStoreClassName.java:41)
	at com.carrotsearch.randomizedtesting.rules.NoShadowingOrOverridesOnMethodsRule$1.evaluate(NoShadowingOrOverridesOnMethodsRule.java:40)
	at com.carrotsearch.randomizedtesting.rules.NoShadowingOrOverridesOnMethodsRule$1.evaluate(NoShadowingOrOverridesOnMethodsRule.java:40)
	at com.carrotsearch.randomizedtesting.rules.StatementAdapter.evaluate(StatementAdapter.java:36)
	at com.carrotsearch.randomizedtesting.rules.StatementAdapter.evaluate(StatementAdapter.java:36)
	at com.carrotsearch.randomizedtesting.rules.StatementAdapter.evaluate(StatementAdapter.java:36)
	at org.apache.lucene.util.TestRuleAssertionsRequired$1.evaluate(TestRuleAssertionsRequired.java:53)
	at org.apache.lucene.util.TestRuleMarkFailure$1.evaluate(TestRuleMarkFailure.java:47)
	at org.apache.lucene.util.TestRuleIgnoreAfterMaxFailures$1.evaluate(TestRuleIgnoreAfterMaxFailures.java:64)
	at org.apache.lucene.util.TestRuleIgnoreTestSuites$1.evaluate(TestRuleIgnoreTestSuites.java:54)
	at com.carrotsearch.randomizedtesting.rules.StatementAdapter.evaluate(StatementAdapter.java:36)
	at com.carrotsearch.randomizedtesting.ThreadLeakControl$StatementRunner.run(ThreadLeakControl.java:368)
	at java.lang.Thread.run(Thread.java:748)


FAILED:  org.apache.solr.cloud.LeaderTragicEventTest.test

Error Message:
Error from server at https://127.0.0.1:41927/solr: collection already exists: collection1

Stack Trace:
org.apache.solr.client.solrj.impl.HttpSolrClient$RemoteSolrException: Error from server at https://127.0.0.1:41927/solr: collection already exists: collection1
	at __randomizedtesting.SeedInfo.seed([6B7AB9A74EAE55C5:E32E867DE052383D]:0)
	at org.apache.solr.client.solrj.impl.HttpSolrClient.executeMethod(HttpSolrClient.java:643)
	at org.apache.solr.client.solrj.impl.HttpSolrClient.request(HttpSolrClient.java:255)
	at org.apache.solr.client.solrj.impl.HttpSolrClient.request(HttpSolrClient.java:244)
	at org.apache.solr.client.solrj.impl.LBHttpSolrClient.doRequest(LBHttpSolrClient.java:483)
	at org.apache.solr.client.solrj.impl.LBHttpSolrClient.request(LBHttpSolrClient.java:413)
	at org.apache.solr.client.solrj.impl.CloudSolrClient.sendRequest(CloudSolrClient.java:1106)
	at org.apache.solr.client.solrj.impl.CloudSolrClient.requestWithRetryOnStaleState(CloudSolrClient.java:886)
	at org.apache.solr.client.solrj.impl.CloudSolrClient.request(CloudSolrClient.java:819)
	at org.apache.solr.client.solrj.SolrRequest.process(SolrRequest.java:194)
	at org.apache.solr.client.solrj.SolrRequest.process(SolrRequest.java:211)
	at org.apache.solr.cloud.LeaderTragicEventTest.test(LeaderTragicEventTest.java:70)
	at sun.reflect.NativeMethodAccessorImpl.invoke0(Native Method)
	at sun.reflect.NativeMethodAccessorImpl.invoke(NativeMethodAccessorImpl.java:62)
	at sun.reflect.DelegatingMethodAccessorImpl.invoke(DelegatingMethodAccessorImpl.java:43)
	at java.lang.reflect.Method.invoke(Method.java:498)
	at com.carrotsearch.randomizedtesting.RandomizedRunner.invoke(RandomizedRunner.java:1737)
	at com.carrotsearch.randomizedtesting.RandomizedRunner$8.evaluate(RandomizedRunner.java:934)
	at com.carrotsearch.randomizedtesting.RandomizedRunner$9.evaluate(RandomizedRunner.java:970)
	at com.carrotsearch.randomizedtesting.RandomizedRunner$10.evaluate(RandomizedRunner.java:984)
	at com.carrotsearch.randomizedtesting.rules.SystemPropertiesRestoreRule$1.evaluate(SystemPropertiesRestoreRule.java:57)
	at org.apache.lucene.util.TestRuleSetupTeardownChained$1.evaluate(TestRuleSetupTeardownChained.java:49)
	at org.apache.lucene.util.AbstractBeforeAfterRule$1.evaluate(AbstractBeforeAfterRule.java:45)
	at org.apache.lucene.util.TestRuleThreadAndTestName$1.evaluate(TestRuleThreadAndTestName.java:48)
	at org.apache.lucene.util.TestRuleIgnoreAfterMaxFailures$1.evaluate(TestRuleIgnoreAfterMaxFailures.java:64)
	at org.apache.lucene.util.TestRuleMarkFailure$1.evaluate(TestRuleMarkFailure.java:47)
	at com.carrotsearch.randomizedtesting.rules.StatementAdapter.evaluate(StatementAdapter.java:36)
	at com.carrotsearch.randomizedtesting.ThreadLeakControl$StatementRunner.run(ThreadLeakControl.java:368)
	at com.carrotsearch.randomizedtesting.ThreadLeakControl.forkTimeoutingTask(ThreadLeakControl.java:817)
	at com.carrotsearch.randomizedtesting.ThreadLeakControl$3.evaluate(ThreadLeakControl.java:468)
	at com.carrotsearch.randomizedtesting.RandomizedRunner.runSingleTest(RandomizedRunner.java:943)
	at com.carrotsearch.randomizedtesting.RandomizedRunner$5.evaluate(RandomizedRunner.java:829)
	at com.carrotsearch.randomizedtesting.RandomizedRunner$6.evaluate(RandomizedRunner.java:879)
	at com.carrotsearch.randomizedtesting.RandomizedRunner$7.evaluate(RandomizedRunner.java:890)
	at com.carrotsearch.randomizedtesting.rules.StatementAdapter.evaluate(StatementAdapter.java:36)
	at com.carrotsearch.randomizedtesting.rules.SystemPropertiesRestoreRule$1.evaluate(SystemPropertiesRestoreRule.java:57)
	at org.apache.lucene.util.AbstractBeforeAfterRule$1.evaluate(AbstractBeforeAfterRule.java:45)
	at com.carrotsearch.randomizedtesting.rules.StatementAdapter.evaluate(StatementAdapter.java:36)
	at org.apache.lucene.util.TestRuleStoreClassName$1.evaluate(TestRuleStoreClassName.java:41)
	at com.carrotsearch.randomizedtesting.rules.NoShadowingOrOverridesOnMethodsRule$1.evaluate(NoShadowingOrOverridesOnMethodsRule.java:40)
	at com.carrotsearch.randomizedtesting.rules.NoShadowingOrOverridesOnMethodsRule$1.evaluate(NoShadowingOrOverridesOnMethodsRule.java:40)
	at com.carrotsearch.randomizedtesting.rules.StatementAdapter.evaluate(StatementAdapter.java:36)
	at com.carrotsearch.randomizedtesting.rules.StatementAdapter.evaluate(StatementAdapter.java:36)
	at com.carrotsearch.randomizedtesting.rules.StatementAdapter.evaluate(StatementAdapter.java:36)
	at org.apache.lucene.util.TestRuleAssertionsRequired$1.evaluate(TestRuleAssertionsRequired.java:53)
	at org.apache.lucene.util.TestRuleMarkFailure$1.evaluate(TestRuleMarkFailure.java:47)
	at org.apache.lucene.util.TestRuleIgnoreAfterMaxFailures$1.evaluate(TestRuleIgnoreAfterMaxFailures.java:64)
	at org.apache.lucene.util.TestRuleIgnoreTestSuites$1.evaluate(TestRuleIgnoreTestSuites.java:54)
	at com.carrotsearch.randomizedtesting.rules.StatementAdapter.evaluate(StatementAdapter.java:36)
	at com.carrotsearch.randomizedtesting.ThreadLeakControl$StatementRunner.run(ThreadLeakControl.java:368)
	at java.lang.Thread.run(Thread.java:748)


FAILED:  org.apache.solr.cloud.LeaderTragicEventTest.testOtherReplicasAreNotActive

Error Message:
Jetty Connector is not open: -2

Stack Trace:
java.lang.IllegalStateException: Jetty Connector is not open: -2
	at __randomizedtesting.SeedInfo.seed([6B7AB9A74EAE55C5:EECE95D07251EC5D]:0)
	at org.apache.solr.client.solrj.embedded.JettySolrRunner.getBaseUrl(JettySolrRunner.java:499)
	at org.apache.solr.cloud.MiniSolrCloudCluster.getReplicaJetty(MiniSolrCloudCluster.java:539)
	at org.apache.solr.cloud.LeaderTragicEventTest.corruptLeader(LeaderTragicEventTest.java:100)
	at org.apache.solr.cloud.LeaderTragicEventTest.testOtherReplicasAreNotActive(LeaderTragicEventTest.java:150)
	at sun.reflect.NativeMethodAccessorImpl.invoke0(Native Method)
	at sun.reflect.NativeMethodAccessorImpl.invoke(NativeMethodAccessorImpl.java:62)
	at sun.reflect.DelegatingMethodAccessorImpl.invoke(DelegatingMethodAccessorImpl.java:43)
	at java.lang.reflect.Method.invoke(Method.java:498)
	at com.carrotsearch.randomizedtesting.RandomizedRunner.invoke(RandomizedRunner.java:1737)
	at com.carrotsearch.randomizedtesting.RandomizedRunner$8.evaluate(RandomizedRunner.java:934)
	at com.carrotsearch.randomizedtesting.RandomizedRunner$9.evaluate(RandomizedRunner.java:970)
	at com.carrotsearch.randomizedtesting.RandomizedRunner$10.evaluate(RandomizedRunner.java:984)
	at com.carrotsearch.randomizedtesting.rules.SystemPropertiesRestoreRule$1.evaluate(SystemPropertiesRestoreRule.java:57)
	at org.apache.lucene.util.TestRuleSetupTeardownChained$1.evaluate(TestRuleSetupTeardownChained.java:49)
	at org.apache.lucene.util.AbstractBeforeAfterRule$1.evaluate(AbstractBeforeAfterRule.java:45)
	at org.apache.lucene.util.TestRuleThreadAndTestName$1.evaluate(TestRuleThreadAndTestName.java:48)
	at org.apache.lucene.util.TestRuleIgnoreAfterMaxFailures$1.evaluate(TestRuleIgnoreAfterMaxFailures.java:64)
	at org.apache.lucene.util.TestRuleMarkFailure$1.evaluate(TestRuleMarkFailure.java:47)
	at com.carrotsearch.randomizedtesting.rules.StatementAdapter.evaluate(StatementAdapter.java:36)
	at com.carrotsearch.randomizedtesting.ThreadLeakControl$StatementRunner.run(ThreadLeakControl.java:368)
	at com.carrotsearch.randomizedtesting.ThreadLeakControl.forkTimeoutingTask(ThreadLeakControl.java:817)
	at com.carrotsearch.randomizedtesting.ThreadLeakControl$3.evaluate(ThreadLeakControl.java:468)
	at com.carrotsearch.randomizedtesting.RandomizedRunner.runSingleTest(RandomizedRunner.java:943)
	at com.carrotsearch.randomizedtesting.RandomizedRunner$5.evaluate(RandomizedRunner.java:829)
	at com.carrotsearch.randomizedtesting.RandomizedRunner$6.evaluate(RandomizedRunner.java:879)
	at com.carrotsearch.randomizedtesting.RandomizedRunner$7.evaluate(RandomizedRunner.java:890)
	at com.carrotsearch.randomizedtesting.rules.StatementAdapter.evaluate(StatementAdapter.java:36)
	at com.carrotsearch.randomizedtesting.rules.SystemPropertiesRestoreRule$1.evaluate(SystemPropertiesRestoreRule.java:57)
	at org.apache.lucene.util.AbstractBeforeAfterRule$1.evaluate(AbstractBeforeAfterRule.java:45)
	at com.carrotsearch.randomizedtesting.rules.StatementAdapter.evaluate(StatementAdapter.java:36)
	at org.apache.lucene.util.TestRuleStoreClassName$1.evaluate(TestRuleStoreClassName.java:41)
	at com.carrotsearch.randomizedtesting.rules.NoShadowingOrOverridesOnMethodsRule$1.evaluate(NoShadowingOrOverridesOnMethodsRule.java:40)
	at com.carrotsearch.randomizedtesting.rules.NoShadowingOrOverridesOnMethodsRule$1.evaluate(NoShadowingOrOverridesOnMethodsRule.java:40)
	at com.carrotsearch.randomizedtesting.rules.StatementAdapter.evaluate(StatementAdapter.java:36)
	at com.carrotsearch.randomizedtesting.rules.StatementAdapter.evaluate(StatementAdapter.java:36)
	at com.carrotsearch.randomizedtesting.rules.StatementAdapter.evaluate(StatementAdapter.java:36)
	at org.apache.lucene.util.TestRuleAssertionsRequired$1.evaluate(TestRuleAssertionsRequired.java:53)
	at org.apache.lucene.util.TestRuleMarkFailure$1.evaluate(TestRuleMarkFailure.java:47)
	at org.apache.lucene.util.TestRuleIgnoreAfterMaxFailures$1.evaluate(TestRuleIgnoreAfterMaxFailures.java:64)
	at org.apache.lucene.util.TestRuleIgnoreTestSuites$1.evaluate(TestRuleIgnoreTestSuites.java:54)
	at com.carrotsearch.randomizedtesting.rules.StatementAdapter.evaluate(StatementAdapter.java:36)
	at com.carrotsearch.randomizedtesting.ThreadLeakControl$StatementRunner.run(ThreadLeakControl.java:368)
	at java.lang.Thread.run(Thread.java:748)


FAILED:  org.apache.solr.cloud.LeaderTragicEventTest.test

Error Message:
Error from server at https://127.0.0.1:46121/solr: collection already exists: collection1

Stack Trace:
org.apache.solr.client.solrj.impl.HttpSolrClient$RemoteSolrException: Error from server at https://127.0.0.1:46121/solr: collection already exists: collection1
	at __randomizedtesting.SeedInfo.seed([6B7AB9A74EAE55C5:E32E867DE052383D]:0)
	at org.apache.solr.client.solrj.impl.HttpSolrClient.executeMethod(HttpSolrClient.java:643)
	at org.apache.solr.client.solrj.impl.HttpSolrClient.request(HttpSolrClient.java:255)
	at org.apache.solr.client.solrj.impl.HttpSolrClient.request(HttpSolrClient.java:244)
	at org.apache.solr.client.solrj.impl.LBHttpSolrClient.doRequest(LBHttpSolrClient.java:483)
	at org.apache.solr.client.solrj.impl.LBHttpSolrClient.request(LBHttpSolrClient.java:413)
	at org.apache.solr.client.solrj.impl.CloudSolrClient.sendRequest(CloudSolrClient.java:1106)
	at org.apache.solr.client.solrj.impl.CloudSolrClient.requestWithRetryOnStaleState(CloudSolrClient.java:886)
	at org.apache.solr.client.solrj.impl.CloudSolrClient.request(CloudSolrClient.java:819)
	at org.apache.solr.client.solrj.SolrRequest.process(SolrRequest.java:194)
	at org.apache.solr.client.solrj.SolrRequest.process(SolrRequest.java:211)
	at org.apache.solr.cloud.LeaderTragicEventTest.test(LeaderTragicEventTest.java:70)
	at sun.reflect.NativeMethodAccessorImpl.invoke0(Native Method)
	at sun.reflect.NativeMethodAccessorImpl.invoke(NativeMethodAccessorImpl.java:62)
	at sun.reflect.DelegatingMethodAccessorImpl.invoke(DelegatingMethodAccessorImpl.java:43)
	at java.lang.reflect.Method.invoke(Method.java:498)
	at com.carrotsearch.randomizedtesting.RandomizedRunner.invoke(RandomizedRunner.java:1737)
	at com.carrotsearch.randomizedtesting.RandomizedRunner$8.evaluate(RandomizedRunner.java:934)
	at com.carrotsearch.randomizedtesting.RandomizedRunner$9.evaluate(RandomizedRunner.java:970)
	at com.carrotsearch.randomizedtesting.RandomizedRunner$10.evaluate(RandomizedRunner.java:984)
	at com.carrotsearch.randomizedtesting.rules.SystemPropertiesRestoreRule$1.evaluate(SystemPropertiesRestoreRule.java:57)
	at org.apache.lucene.util.TestRuleSetupTeardownChained$1.evaluate(TestRuleSetupTeardownChained.java:49)
	at org.apache.lucene.util.AbstractBeforeAfterRule$1.evaluate(AbstractBeforeAfterRule.java:45)
	at org.apache.lucene.util.TestRuleThreadAndTestName$1.evaluate(TestRuleThreadAndTestName.java:48)
	at org.apache.lucene.util.TestRuleIgnoreAfterMaxFailures$1.evaluate(TestRuleIgnoreAfterMaxFailures.java:64)
	at org.apache.lucene.util.TestRuleMarkFailure$1.evaluate(TestRuleMarkFailure.java:47)
	at com.carrotsearch.randomizedtesting.rules.StatementAdapter.evaluate(StatementAdapter.java:36)
	at com.carrotsearch.randomizedtesting.ThreadLeakControl$StatementRunner.run(ThreadLeakControl.java:368)
	at com.carrotsearch.randomizedtesting.ThreadLeakControl.forkTimeoutingTask(ThreadLeakControl.java:817)
	at com.carrotsearch.randomizedtesting.ThreadLeakControl$3.evaluate(ThreadLeakControl.java:468)
	at com.carrotsearch.randomizedtesting.RandomizedRunner.runSingleTest(RandomizedRunner.java:943)
	at com.carrotsearch.randomizedtesting.RandomizedRunner$5.evaluate(RandomizedRunner.java:829)
	at com.carrotsearch.randomizedtesting.RandomizedRunner$6.evaluate(RandomizedRunner.java:879)
	at com.carrotsearch.randomizedtesting.RandomizedRunner$7.evaluate(RandomizedRunner.java:890)
	at com.carrotsearch.randomizedtesting.rules.StatementAdapter.evaluate(StatementAdapter.java:36)
	at com.carrotsearch.randomizedtesting.rules.SystemPropertiesRestoreRule$1.evaluate(SystemPropertiesRestoreRule.java:57)
	at org.apache.lucene.util.AbstractBeforeAfterRule$1.evaluate(AbstractBeforeAfterRule.java:45)
	at com.carrotsearch.randomizedtesting.rules.StatementAdapter.evaluate(StatementAdapter.java:36)
	at org.apache.lucene.util.TestRuleStoreClassName$1.evaluate(TestRuleStoreClassName.java:41)
	at com.carrotsearch.randomizedtesting.rules.NoShadowingOrOverridesOnMethodsRule$1.evaluate(NoShadowingOrOverridesOnMethodsRule.java:40)
	at com.carrotsearch.randomizedtesting.rules.NoShadowingOrOverridesOnMethodsRule$1.evaluate(NoShadowingOrOverridesOnMethodsRule.java:40)
	at com.carrotsearch.randomizedtesting.rules.StatementAdapter.evaluate(StatementAdapter.java:36)
	at com.carrotsearch.randomizedtesting.rules.StatementAdapter.evaluate(StatementAdapter.java:36)
	at com.carrotsearch.randomizedtesting.rules.StatementAdapter.evaluate(StatementAdapter.java:36)
	at org.apache.lucene.util.TestRuleAssertionsRequired$1.evaluate(TestRuleAssertionsRequired.java:53)
	at org.apache.lucene.util.TestRuleMarkFailure$1.evaluate(TestRuleMarkFailure.java:47)
	at org.apache.lucene.util.TestRuleIgnoreAfterMaxFailures$1.evaluate(TestRuleIgnoreAfterMaxFailures.java:64)
	at org.apache.lucene.util.TestRuleIgnoreTestSuites$1.evaluate(TestRuleIgnoreTestSuites.java:54)
	at com.carrotsearch.randomizedtesting.rules.StatementAdapter.evaluate(StatementAdapter.java:36)
	at com.carrotsearch.randomizedtesting.ThreadLeakControl$StatementRunner.run(ThreadLeakControl.java:368)
	at java.lang.Thread.run(Thread.java:748)


FAILED:  org.apache.solr.cloud.LeaderTragicEventTest.testOtherReplicasAreNotActive

Error Message:
Jetty Connector is not open: -2

Stack Trace:
java.lang.IllegalStateException: Jetty Connector is not open: -2
	at __randomizedtesting.SeedInfo.seed([6B7AB9A74EAE55C5:EECE95D07251EC5D]:0)
	at org.apache.solr.client.solrj.embedded.JettySolrRunner.getBaseUrl(JettySolrRunner.java:499)
	at org.apache.solr.cloud.MiniSolrCloudCluster.getReplicaJetty(MiniSolrCloudCluster.java:539)
	at org.apache.solr.cloud.LeaderTragicEventTest.corruptLeader(LeaderTragicEventTest.java:100)
	at org.apache.solr.cloud.LeaderTragicEventTest.testOtherReplicasAreNotActive(LeaderTragicEventTest.java:150)
	at sun.reflect.NativeMethodAccessorImpl.invoke0(Native Method)
	at sun.reflect.NativeMethodAccessorImpl.invoke(NativeMethodAccessorImpl.java:62)
	at sun.reflect.DelegatingMethodAccessorImpl.invoke(DelegatingMethodAccessorImpl.java:43)
	at java.lang.reflect.Method.invoke(Method.java:498)
	at com.carrotsearch.randomizedtesting.RandomizedRunner.invoke(RandomizedRunner.java:1737)
	at com.carrotsearch.randomizedtesting.RandomizedRunner$8.evaluate(RandomizedRunner.java:934)
	at com.carrotsearch.randomizedtesting.RandomizedRunner$9.evaluate(RandomizedRunner.java:970)
	at com.carrotsearch.randomizedtesting.RandomizedRunner$10.evaluate(RandomizedRunner.java:984)
	at com.carrotsearch.randomizedtesting.rules.SystemPropertiesRestoreRule$1.evaluate(SystemPropertiesRestoreRule.java:57)
	at org.apache.lucene.util.TestRuleSetupTeardownChained$1.evaluate(TestRuleSetupTeardownChained.java:49)
	at org.apache.lucene.util.AbstractBeforeAfterRule$1.evaluate(AbstractBeforeAfterRule.java:45)
	at org.apache.lucene.util.TestRuleThreadAndTestName$1.evaluate(TestRuleThreadAndTestName.java:48)
	at org.apache.lucene.util.TestRuleIgnoreAfterMaxFailures$1.evaluate(TestRuleIgnoreAfterMaxFailures.java:64)
	at org.apache.lucene.util.TestRuleMarkFailure$1.evaluate(TestRuleMarkFailure.java:47)
	at com.carrotsearch.randomizedtesting.rules.StatementAdapter.evaluate(StatementAdapter.java:36)
	at com.carrotsearch.randomizedtesting.ThreadLeakControl$StatementRunner.run(ThreadLeakControl.java:368)
	at com.carrotsearch.randomizedtesting.ThreadLeakControl.forkTimeoutingTask(ThreadLeakControl.java:817)
	at com.carrotsearch.randomizedtesting.ThreadLeakControl$3.evaluate(ThreadLeakControl.java:468)
	at com.carrotsearch.randomizedtesting.RandomizedRunner.runSingleTest(RandomizedRunner.java:943)
	at com.carrotsearch.randomizedtesting.RandomizedRunner$5.evaluate(RandomizedRunner.java:829)
	at com.carrotsearch.randomizedtesting.RandomizedRunner$6.evaluate(RandomizedRunner.java:879)
	at com.carrotsearch.randomizedtesting.RandomizedRunner$7.evaluate(RandomizedRunner.java:890)
	at com.carrotsearch.randomizedtesting.rules.StatementAdapter.evaluate(StatementAdapter.java:36)
	at com.carrotsearch.randomizedtesting.rules.SystemPropertiesRestoreRule$1.evaluate(SystemPropertiesRestoreRule.java:57)
	at org.apache.lucene.util.AbstractBeforeAfterRule$1.evaluate(AbstractBeforeAfterRule.java:45)
	at com.carrotsearch.randomizedtesting.rules.StatementAdapter.evaluate(StatementAdapter.java:36)
	at org.apache.lucene.util.TestRuleStoreClassName$1.evaluate(TestRuleStoreClassName.java:41)
	at com.carrotsearch.randomizedtesting.rules.NoShadowingOrOverridesOnMethodsRule$1.evaluate(NoShadowingOrOverridesOnMethodsRule.java:40)
	at com.carrotsearch.randomizedtesting.rules.NoShadowingOrOverridesOnMethodsRule$1.evaluate(NoShadowingOrOverridesOnMethodsRule.java:40)
	at com.carrotsearch.randomizedtesting.rules.StatementAdapter.evaluate(StatementAdapter.java:36)
	at com.carrotsearch.randomizedtesting.rules.StatementAdapter.evaluate(StatementAdapter.java:36)
	at com.carrotsearch.randomizedtesting.rules.StatementAdapter.evaluate(StatementAdapter.java:36)
	at org.apache.lucene.util.TestRuleAssertionsRequired$1.evaluate(TestRuleAssertionsRequired.java:53)
	at org.apache.lucene.util.TestRuleMarkFailure$1.evaluate(TestRuleMarkFailure.java:47)
	at org.apache.lucene.util.TestRuleIgnoreAfterMaxFailures$1.evaluate(TestRuleIgnoreAfterMaxFailures.java:64)
	at org.apache.lucene.util.TestRuleIgnoreTestSuites$1.evaluate(TestRuleIgnoreTestSuites.java:54)
	at com.carrotsearch.randomizedtesting.rules.StatementAdapter.evaluate(StatementAdapter.java:36)
	at com.carrotsearch.randomizedtesting.ThreadLeakControl$StatementRunner.run(ThreadLeakControl.java:368)
	at java.lang.Thread.run(Thread.java:748)


FAILED:  org.apache.solr.cloud.LeaderTragicEventTest.test

Error Message:
Error from server at https://127.0.0.1:34397/solr: collection already exists: collection1

Stack Trace:
org.apache.solr.client.solrj.impl.HttpSolrClient$RemoteSolrException: Error from server at https://127.0.0.1:34397/solr: collection already exists: collection1
	at __randomizedtesting.SeedInfo.seed([6B7AB9A74EAE55C5:E32E867DE052383D]:0)
	at org.apache.solr.client.solrj.impl.HttpSolrClient.executeMethod(HttpSolrClient.java:643)
	at org.apache.solr.client.solrj.impl.HttpSolrClient.request(HttpSolrClient.java:255)
	at org.apache.solr.client.solrj.impl.HttpSolrClient.request(HttpSolrClient.java:244)
	at org.apache.solr.client.solrj.impl.LBHttpSolrClient.doRequest(LBHttpSolrClient.java:483)
	at org.apache.solr.client.solrj.impl.LBHttpSolrClient.request(LBHttpSolrClient.java:413)
	at org.apache.solr.client.solrj.impl.CloudSolrClient.sendRequest(CloudSolrClient.java:1106)
	at org.apache.solr.client.solrj.impl.CloudSolrClient.requestWithRetryOnStaleState(CloudSolrClient.java:886)
	at org.apache.solr.client.solrj.impl.CloudSolrClient.request(CloudSolrClient.java:819)
	at org.apache.solr.client.solrj.SolrRequest.process(SolrRequest.java:194)
	at org.apache.solr.client.solrj.SolrRequest.process(SolrRequest.java:211)
	at org.apache.solr.cloud.LeaderTragicEventTest.test(LeaderTragicEventTest.java:70)
	at sun.reflect.NativeMethodAccessorImpl.invoke0(Native Method)
	at sun.reflect.NativeMethodAccessorImpl.invoke(NativeMethodAccessorImpl.java:62)
	at sun.reflect.DelegatingMethodAccessorImpl.invoke(DelegatingMethodAccessorImpl.java:43)
	at java.lang.reflect.Method.invoke(Method.java:498)
	at com.carrotsearch.randomizedtesting.RandomizedRunner.invoke(RandomizedRunner.java:1737)
	at com.carrotsearch.randomizedtesting.RandomizedRunner$8.evaluate(RandomizedRunner.java:934)
	at com.carrotsearch.randomizedtesting.RandomizedRunner$9.evaluate(RandomizedRunner.java:970)
	at com.carrotsearch.randomizedtesting.RandomizedRunner$10.evaluate(RandomizedRunner.java:984)
	at com.carrotsearch.randomizedtesting.rules.SystemPropertiesRestoreRule$1.evaluate(SystemPropertiesRestoreRule.java:57)
	at org.apache.lucene.util.TestRuleSetupTeardownChained$1.evaluate(TestRuleSetupTeardownChained.java:49)
	at org.apache.lucene.util.AbstractBeforeAfterRule$1.evaluate(AbstractBeforeAfterRule.java:45)
	at org.apache.lucene.util.TestRuleThreadAndTestName$1.evaluate(TestRuleThreadAndTestName.java:48)
	at org.apache.lucene.util.TestRuleIgnoreAfterMaxFailures$1.evaluate(TestRuleIgnoreAfterMaxFailures.java:64)
	at org.apache.lucene.util.TestRuleMarkFailure$1.evaluate(TestRuleMarkFailure.java:47)
	at com.carrotsearch.randomizedtesting.rules.StatementAdapter.evaluate(StatementAdapter.java:36)
	at com.carrotsearch.randomizedtesting.ThreadLeakControl$StatementRunner.run(ThreadLeakControl.java:368)
	at com.carrotsearch.randomizedtesting.ThreadLeakControl.forkTimeoutingTask(ThreadLeakControl.java:817)
	at com.carrotsearch.randomizedtesting.ThreadLeakControl$3.evaluate(ThreadLeakControl.java:468)
	at com.carrotsearch.randomizedtesting.RandomizedRunner.runSingleTest(RandomizedRunner.java:943)
	at com.carrotsearch.randomizedtesting.RandomizedRunner$5.evaluate(RandomizedRunner.java:829)
	at com.carrotsearch.randomizedtesting.RandomizedRunner$6.evaluate(RandomizedRunner.java:879)
	at com.carrotsearch.randomizedtesting.RandomizedRunner$7.evaluate(RandomizedRunner.java:890)
	at com.carrotsearch.randomizedtesting.rules.StatementAdapter.evaluate(StatementAdapter.java:36)
	at com.carrotsearch.randomizedtesting.rules.SystemPropertiesRestoreRule$1.evaluate(SystemPropertiesRestoreRule.java:57)
	at org.apache.lucene.util.AbstractBeforeAfterRule$1.evaluate(AbstractBeforeAfterRule.java:45)
	at com.carrotsearch.randomizedtesting.rules.StatementAdapter.evaluate(StatementAdapter.java:36)
	at org.apache.lucene.util.TestRuleStoreClassName$1.evaluate(TestRuleStoreClassName.java:41)
	at com.carrotsearch.randomizedtesting.rules.NoShadowingOrOverridesOnMethodsRule$1.evaluate(NoShadowingOrOverridesOnMethodsRule.java:40)
	at com.carrotsearch.randomizedtesting.rules.NoShadowingOrOverridesOnMethodsRule$1.evaluate(NoShadowingOrOverridesOnMethodsRule.java:40)
	at com.carrotsearch.randomizedtesting.rules.StatementAdapter.evaluate(StatementAdapter.java:36)
	at com.carrotsearch.randomizedtesting.rules.StatementAdapter.evaluate(StatementAdapter.java:36)
	at com.carrotsearch.randomizedtesting.rules.StatementAdapter.evaluate(StatementAdapter.java:36)
	at org.apache.lucene.util.TestRuleAssertionsRequired$1.evaluate(TestRuleAssertionsRequired.java:53)
	at org.apache.lucene.util.TestRuleMarkFailure$1.evaluate(TestRuleMarkFailure.java:47)
	at org.apache.lucene.util.TestRuleIgnoreAfterMaxFailures$1.evaluate(TestRuleIgnoreAfterMaxFailures.java:64)
	at org.apache.lucene.util.TestRuleIgnoreTestSuites$1.evaluate(TestRuleIgnoreTestSuites.java:54)
	at com.carrotsearch.randomizedtesting.rules.StatementAdapter.evaluate(StatementAdapter.java:36)
	at com.carrotsearch.randomizedtesting.ThreadLeakControl$StatementRunner.run(ThreadLeakControl.java:368)
	at java.lang.Thread.run(Thread.java:748)


FAILED:  org.apache.solr.cloud.LeaderTragicEventTest.testOtherReplicasAreNotActive

Error Message:
Jetty Connector is not open: -2

Stack Trace:
java.lang.IllegalStateException: Jetty Connector is not open: -2
	at __randomizedtesting.SeedInfo.seed([6B7AB9A74EAE55C5:EECE95D07251EC5D]:0)
	at org.apache.solr.client.solrj.embedded.JettySolrRunner.getBaseUrl(JettySolrRunner.java:499)
	at org.apache.solr.cloud.MiniSolrCloudCluster.getReplicaJetty(MiniSolrCloudCluster.java:539)
	at org.apache.solr.cloud.LeaderTragicEventTest.corruptLeader(LeaderTragicEventTest.java:100)
	at org.apache.solr.cloud.LeaderTragicEventTest.testOtherReplicasAreNotActive(LeaderTragicEventTest.java:150)
	at sun.reflect.NativeMethodAccessorImpl.invoke0(Native Method)
	at sun.reflect.NativeMethodAccessorImpl.invoke(NativeMethodAccessorImpl.java:62)
	at sun.reflect.DelegatingMethodAccessorImpl.invoke(DelegatingMethodAccessorImpl.java:43)
	at java.lang.reflect.Method.invoke(Method.java:498)
	at com.carrotsearch.randomizedtesting.RandomizedRunner.invoke(RandomizedRunner.java:1737)
	at com.carrotsearch.randomizedtesting.RandomizedRunner$8.evaluate(RandomizedRunner.java:934)
	at com.carrotsearch.randomizedtesting.RandomizedRunner$9.evaluate(RandomizedRunner.java:970)
	at com.carrotsearch.randomizedtesting.RandomizedRunner$10.evaluate(RandomizedRunner.java:984)
	at com.carrotsearch.randomizedtesting.rules.SystemPropertiesRestoreRule$1.evaluate(SystemPropertiesRestoreRule.java:57)
	at org.apache.lucene.util.TestRuleSetupTeardownChained$1.evaluate(TestRuleSetupTeardownChained.java:49)
	at org.apache.lucene.util.AbstractBeforeAfterRule$1.evaluate(AbstractBeforeAfterRule.java:45)
	at org.apache.lucene.util.TestRuleThreadAndTestName$1.evaluate(TestRuleThreadAndTestName.java:48)
	at org.apache.lucene.util.TestRuleIgnoreAfterMaxFailures$1.evaluate(TestRuleIgnoreAfterMaxFailures.java:64)
	at org.apache.lucene.util.TestRuleMarkFailure$1.evaluate(TestRuleMarkFailure.java:47)
	at com.carrotsearch.randomizedtesting.rules.StatementAdapter.evaluate(StatementAdapter.java:36)
	at com.carrotsearch.randomizedtesting.ThreadLeakControl$StatementRunner.run(ThreadLeakControl.java:368)
	at com.carrotsearch.randomizedtesting.ThreadLeakControl.forkTimeoutingTask(ThreadLeakControl.java:817)
	at com.carrotsearch.randomizedtesting.ThreadLeakControl$3.evaluate(ThreadLeakControl.java:468)
	at com.carrotsearch.randomizedtesting.RandomizedRunner.runSingleTest(RandomizedRunner.java:943)
	at com.carrotsearch.randomizedtesting.RandomizedRunner$5.evaluate(RandomizedRunner.java:829)
	at com.carrotsearch.randomizedtesting.RandomizedRunner$6.evaluate(RandomizedRunner.java:879)
	at com.carrotsearch.randomizedtesting.RandomizedRunner$7.evaluate(RandomizedRunner.java:890)
	at com.carrotsearch.randomizedtesting.rules.StatementAdapter.evaluate(StatementAdapter.java:36)
	at com.carrotsearch.randomizedtesting.rules.SystemPropertiesRestoreRule$1.evaluate(SystemPropertiesRestoreRule.java:57)
	at org.apache.lucene.util.AbstractBeforeAfterRule$1.evaluate(AbstractBeforeAfterRule.java:45)
	at com.carrotsearch.randomizedtesting.rules.StatementAdapter.evaluate(StatementAdapter.java:36)
	at org.apache.lucene.util.TestRuleStoreClassName$1.evaluate(TestRuleStoreClassName.java:41)
	at com.carrotsearch.randomizedtesting.rules.NoShadowingOrOverridesOnMethodsRule$1.evaluate(NoShadowingOrOverridesOnMethodsRule.java:40)
	at com.carrotsearch.randomizedtesting.rules.NoShadowingOrOverridesOnMethodsRule$1.evaluate(NoShadowingOrOverridesOnMethodsRule.java:40)
	at com.carrotsearch.randomizedtesting.rules.StatementAdapter.evaluate(StatementAdapter.java:36)
	at com.carrotsearch.randomizedtesting.rules.StatementAdapter.evaluate(StatementAdapter.java:36)
	at com.carrotsearch.randomizedtesting.rules.StatementAdapter.evaluate(StatementAdapter.java:36)
	at org.apache.lucene.util.TestRuleAssertionsRequired$1.evaluate(TestRuleAssertionsRequired.java:53)
	at org.apache.lucene.util.TestRuleMarkFailure$1.evaluate(TestRuleMarkFailure.java:47)
	at org.apache.lucene.util.TestRuleIgnoreAfterMaxFailures$1.evaluate(TestRuleIgnoreAfterMaxFailures.java:64)
	at org.apache.lucene.util.TestRuleIgnoreTestSuites$1.evaluate(TestRuleIgnoreTestSuites.java:54)
	at com.carrotsearch.randomizedtesting.rules.StatementAdapter.evaluate(StatementAdapter.java:36)
	at com.carrotsearch.randomizedtesting.ThreadLeakControl$StatementRunner.run(ThreadLeakControl.java:368)
	at java.lang.Thread.run(Thread.java:748)


FAILED:  org.apache.solr.cloud.LeaderTragicEventTest.test

Error Message:
Error from server at https://127.0.0.1:39051/solr: collection already exists: collection1

Stack Trace:
org.apache.solr.client.solrj.impl.HttpSolrClient$RemoteSolrException: Error from server at https://127.0.0.1:39051/solr: collection already exists: collection1
	at __randomizedtesting.SeedInfo.seed([6B7AB9A74EAE55C5:E32E867DE052383D]:0)
	at org.apache.solr.client.solrj.impl.HttpSolrClient.executeMethod(HttpSolrClient.java:643)
	at org.apache.solr.client.solrj.impl.HttpSolrClient.request(HttpSolrClient.java:255)
	at org.apache.solr.client.solrj.impl.HttpSolrClient.request(HttpSolrClient.java:244)
	at org.apache.solr.client.solrj.impl.LBHttpSolrClient.doRequest(LBHttpSolrClient.java:483)
	at org.apache.solr.client.solrj.impl.LBHttpSolrClient.request(LBHttpSolrClient.java:413)
	at org.apache.solr.client.solrj.impl.CloudSolrClient.sendRequest(CloudSolrClient.java:1106)
	at org.apache.solr.client.solrj.impl.CloudSolrClient.requestWithRetryOnStaleState(CloudSolrClient.java:886)
	at org.apache.solr.client.solrj.impl.CloudSolrClient.request(CloudSolrClient.java:819)
	at org.apache.solr.client.solrj.SolrRequest.process(SolrRequest.java:194)
	at org.apache.solr.client.solrj.SolrRequest.process(SolrRequest.java:211)
	at org.apache.solr.cloud.LeaderTragicEventTest.test(LeaderTragicEventTest.java:70)
	at sun.reflect.NativeMethodAccessorImpl.invoke0(Native Method)
	at sun.reflect.NativeMethodAccessorImpl.invoke(NativeMethodAccessorImpl.java:62)
	at sun.reflect.DelegatingMethodAccessorImpl.invoke(DelegatingMethodAccessorImpl.java:43)
	at java.lang.reflect.Method.invoke(Method.java:498)
	at com.carrotsearch.randomizedtesting.RandomizedRunner.invoke(RandomizedRunner.java:1737)
	at com.carrotsearch.randomizedtesting.RandomizedRunner$8.evaluate(RandomizedRunner.java:934)
	at com.carrotsearch.randomizedtesting.RandomizedRunner$9.evaluate(RandomizedRunner.java:970)
	at com.carrotsearch.randomizedtesting.RandomizedRunner$10.evaluate(RandomizedRunner.java:984)
	at com.carrotsearch.randomizedtesting.rules.SystemPropertiesRestoreRule$1.evaluate(SystemPropertiesRestoreRule.java:57)
	at org.apache.lucene.util.TestRuleSetupTeardownChained$1.evaluate(TestRuleSetupTeardownChained.java:49)
	at org.apache.lucene.util.AbstractBeforeAfterRule$1.evaluate(AbstractBeforeAfterRule.java:45)
	at org.apache.lucene.util.TestRuleThreadAndTestName$1.evaluate(TestRuleThreadAndTestName.java:48)
	at org.apache.lucene.util.TestRuleIgnoreAfterMaxFailures$1.evaluate(TestRuleIgnoreAfterMaxFailures.java:64)
	at org.apache.lucene.util.TestRuleMarkFailure$1.evaluate(TestRuleMarkFailure.java:47)
	at com.carrotsearch.randomizedtesting.rules.StatementAdapter.evaluate(StatementAdapter.java:36)
	at com.carrotsearch.randomizedtesting.ThreadLeakControl$StatementRunner.run(ThreadLeakControl.java:368)
	at com.carrotsearch.randomizedtesting.ThreadLeakControl.forkTimeoutingTask(ThreadLeakControl.java:817)
	at com.carrotsearch.randomizedtesting.ThreadLeakControl$3.evaluate(ThreadLeakControl.java:468)
	at com.carrotsearch.randomizedtesting.RandomizedRunner.runSingleTest(RandomizedRunner.java:943)
	at com.carrotsearch.randomizedtesting.RandomizedRunner$5.evaluate(RandomizedRunner.java:829)
	at com.carrotsearch.randomizedtesting.RandomizedRunner$6.evaluate(RandomizedRunner.java:879)
	at com.carrotsearch.randomizedtesting.RandomizedRunner$7.evaluate(RandomizedRunner.java:890)
	at com.carrotsearch.randomizedtesting.rules.StatementAdapter.evaluate(StatementAdapter.java:36)
	at com.carrotsearch.randomizedtesting.rules.SystemPropertiesRestoreRule$1.evaluate(SystemPropertiesRestoreRule.java:57)
	at org.apache.lucene.util.AbstractBeforeAfterRule$1.evaluate(AbstractBeforeAfterRule.java:45)
	at com.carrotsearch.randomizedtesting.rules.StatementAdapter.evaluate(StatementAdapter.java:36)
	at org.apache.lucene.util.TestRuleStoreClassName$1.evaluate(TestRuleStoreClassName.java:41)
	at com.carrotsearch.randomizedtesting.rules.NoShadowingOrOverridesOnMethodsRule$1.evaluate(NoShadowingOrOverridesOnMethodsRule.java:40)
	at com.carrotsearch.randomizedtesting.rules.NoShadowingOrOverridesOnMethodsRule$1.evaluate(NoShadowingOrOverridesOnMethodsRule.java:40)
	at com.carrotsearch.randomizedtesting.rules.StatementAdapter.evaluate(StatementAdapter.java:36)
	at com.carrotsearch.randomizedtesting.rules.StatementAdapter.evaluate(StatementAdapter.java:36)
	at com.carrotsearch.randomizedtesting.rules.StatementAdapter.evaluate(StatementAdapter.java:36)
	at org.apache.lucene.util.TestRuleAssertionsRequired$1.evaluate(TestRuleAssertionsRequired.java:53)
	at org.apache.lucene.util.TestRuleMarkFailure$1.evaluate(TestRuleMarkFailure.java:47)
	at org.apache.lucene.util.TestRuleIgnoreAfterMaxFailures$1.evaluate(TestRuleIgnoreAfterMaxFailures.java:64)
	at org.apache.lucene.util.TestRuleIgnoreTestSuites$1.evaluate(TestRuleIgnoreTestSuites.java:54)
	at com.carrotsearch.randomizedtesting.rules.StatementAdapter.evaluate(StatementAdapter.java:36)
	at com.carrotsearch.randomizedtesting.ThreadLeakControl$StatementRunner.run(ThreadLeakControl.java:368)
	at java.lang.Thread.run(Thread.java:748)




Build Log:
[...truncated 13353 lines...]
   [junit4] Suite: org.apache.solr.cloud.LeaderTragicEventTest
   [junit4]   2> 965655 INFO  (SUITE-LeaderTragicEventTest-seed#[6B7AB9A74EAE55C5]-worker) [    ] o.a.s.SolrTestCaseJ4 SecureRandom sanity checks: test.solr.allowed.securerandom=null & java.security.egd=file:/dev/./urandom
   [junit4]   2> Creating dataDir: /home/jenkins/workspace/Lucene-Solr-7.x-Linux/solr/build/solr-core/test/J1/temp/solr.cloud.LeaderTragicEventTest_6B7AB9A74EAE55C5-001/init-core-data-001
   [junit4]   2> 965655 INFO  (SUITE-LeaderTragicEventTest-seed#[6B7AB9A74EAE55C5]-worker) [    ] o.a.s.SolrTestCaseJ4 Using PointFields (NUMERIC_POINTS_SYSPROP=true) w/NUMERIC_DOCVALUES_SYSPROP=false
   [junit4]   2> 965655 INFO  (SUITE-LeaderTragicEventTest-seed#[6B7AB9A74EAE55C5]-worker) [    ] o.a.s.SolrTestCaseJ4 Randomized ssl (true) and clientAuth (true) via: @org.apache.solr.util.RandomizeSSL(reason=, ssl=NaN, value=NaN, clientAuth=NaN)
   [junit4]   2> 965656 INFO  (SUITE-LeaderTragicEventTest-seed#[6B7AB9A74EAE55C5]-worker) [    ] o.a.s.c.MiniSolrCloudCluster Starting cluster of 2 servers in /home/jenkins/workspace/Lucene-Solr-7.x-Linux/solr/build/solr-core/test/J1/temp/solr.cloud.LeaderTragicEventTest_6B7AB9A74EAE55C5-001/tempDir-001
   [junit4]   2> 965656 INFO  (SUITE-LeaderTragicEventTest-seed#[6B7AB9A74EAE55C5]-worker) [    ] o.a.s.c.ZkTestServer STARTING ZK TEST SERVER
   [junit4]   2> 965656 INFO  (Thread-2021) [    ] o.a.s.c.ZkTestServer client port:0.0.0.0/0.0.0.0:0
   [junit4]   2> 965656 INFO  (Thread-2021) [    ] o.a.s.c.ZkTestServer Starting server
   [junit4]   2> 965658 ERROR (Thread-2021) [    ] o.a.z.s.ZooKeeperServer ZKShutdownHandler is not registered, so ZooKeeper server won't take any action on ERROR or SHUTDOWN server state changes
   [junit4]   2> 965756 INFO  (SUITE-LeaderTragicEventTest-seed#[6B7AB9A74EAE55C5]-worker) [    ] o.a.s.c.ZkTestServer start zk server on port:44853
   [junit4]   2> 965759 INFO  (zkConnectionManagerCallback-1872-thread-1) [    ] o.a.s.c.c.ConnectionManager zkClient has connected
   [junit4]   2> 965764 INFO  (jetty-launcher-1869-thread-1) [    ] o.e.j.s.Server jetty-9.4.11.v20180605; built: 2018-06-05T18:24:03.829Z; git: d5fc0523cfa96bfebfbda19606cad384d772f04c; jvm 1.8.0_172-b11
   [junit4]   2> 965764 INFO  (jetty-launcher-1869-thread-2) [    ] o.e.j.s.Server jetty-9.4.11.v20180605; built: 2018-06-05T18:24:03.829Z; git: d5fc0523cfa96bfebfbda19606cad384d772f04c; jvm 1.8.0_172-b11
   [junit4]   2> 965773 INFO  (jetty-launcher-1869-thread-2) [    ] o.e.j.s.session DefaultSessionIdManager workerName=node0
   [junit4]   2> 965773 INFO  (jetty-launcher-1869-thread-2) [    ] o.e.j.s.session No SessionScavenger set, using defaults
   [junit4]   2> 965773 INFO  (jetty-launcher-1869-thread-2) [    ] o.e.j.s.session node0 Scavenging every 600000ms
   [junit4]   2> 965774 INFO  (jetty-launcher-1869-thread-1) [    ] o.e.j.s.session DefaultSessionIdManager workerName=node0
   [junit4]   2> 965774 INFO  (jetty-launcher-1869-thread-1) [    ] o.e.j.s.session No SessionScavenger set, using defaults
   [junit4]   2> 965774 INFO  (jetty-launcher-1869-thread-1) [    ] o.e.j.s.session node0 Scavenging every 660000ms
   [junit4]   2> 965775 INFO  (jetty-launcher-1869-thread-2) [    ] o.e.j.s.h.ContextHandler Started o.e.j.s.ServletContextHandler@7463c340{/solr,null,AVAILABLE}
   [junit4]   2> 965775 INFO  (jetty-launcher-1869-thread-1) [    ] o.e.j.s.h.ContextHandler Started o.e.j.s.ServletContextHandler@2784efe7{/solr,null,AVAILABLE}
   [junit4]   2> 965776 INFO  (jetty-launcher-1869-thread-2) [    ] o.e.j.s.AbstractConnector Started ServerConnector@94620a5{SSL,[ssl, http/1.1]}{127.0.0.1:39051}
   [junit4]   2> 965776 INFO  (jetty-launcher-1869-thread-2) [    ] o.e.j.s.Server Started @965803ms
   [junit4]   2> 965776 INFO  (jetty-launcher-1869-thread-2) [    ] o.a.s.c.s.e.JettySolrRunner Jetty properties: {hostContext=/solr, hostPort=39051}
   [junit4]   2> 965776 INFO  (jetty-launcher-1869-thread-1) [    ] o.e.j.s.AbstractConnector Started ServerConnector@2e791596{SSL,[ssl, http/1.1]}{127.0.0.1:33103}
   [junit4]   2> 965776 INFO  (jetty-launcher-1869-thread-1) [    ] o.e.j.s.Server Started @965803ms
   [junit4]   2> 965776 INFO  (jetty-launcher-1869-thread-1) [    ] o.a.s.c.s.e.JettySolrRunner Jetty properties: {hostContext=/solr, hostPort=33103}
   [junit4]   2> 965776 ERROR (jetty-launcher-1869-thread-2) [    ] o.a.s.u.StartupLoggingUtils Missing Java Option solr.log.dir. Logging may be missing or incomplete.
   [junit4]   2> 965776 INFO  (jetty-launcher-1869-thread-2) [    ] o.a.s.s.SolrDispatchFilter Using logger factory org.apache.logging.slf4j.Log4jLoggerFactory
   [junit4]   2> 965776 ERROR (jetty-launcher-1869-thread-1) [    ] o.a.s.u.StartupLoggingUtils Missing Java Option solr.log.dir. Logging may be missing or incomplete.
   [junit4]   2> 965776 INFO  (jetty-launcher-1869-thread-1) [    ] o.a.s.s.SolrDispatchFilter Using logger factory org.apache.logging.slf4j.Log4jLoggerFactory
   [junit4]   2> 965776 INFO  (jetty-launcher-1869-thread-2) [    ] o.a.s.s.SolrDispatchFilter  ___      _       Welcome to Apache Solr™ version 7.5.0
   [junit4]   2> 965776 INFO  (jetty-launcher-1869-thread-1) [    ] o.a.s.s.SolrDispatchFilter  ___      _       Welcome to Apache Solr™ version 7.5.0
   [junit4]   2> 965776 INFO  (jetty-launcher-1869-thread-2) [    ] o.a.s.s.SolrDispatchFilter / __| ___| |_ _   Starting in cloud mode on port null
   [junit4]   2> 965776 INFO  (jetty-launcher-1869-thread-1) [    ] o.a.s.s.SolrDispatchFilter / __| ___| |_ _   Starting in cloud mode on port null
   [junit4]   2> 965776 INFO  (jetty-launcher-1869-thread-2) [    ] o.a.s.s.SolrDispatchFilter \__ \/ _ \ | '_|  Install dir: null
   [junit4]   2> 965777 INFO  (jetty-launcher-1869-thread-1) [    ] o.a.s.s.SolrDispatchFilter \__ \/ _ \ | '_|  Install dir: null
   [junit4]   2> 965777 INFO  (jetty-launcher-1869-thread-2) [    ] o.a.s.s.SolrDispatchFilter |___/\___/_|_|    Start time: 2018-07-13T14:40:16.447Z
   [junit4]   2> 965777 INFO  (jetty-launcher-1869-thread-1) [    ] o.a.s.s.SolrDispatchFilter |___/\___/_|_|    Start time: 2018-07-13T14:40:16.447Z
   [junit4]   2> 965781 INFO  (zkConnectionManagerCallback-1875-thread-1) [    ] o.a.s.c.c.ConnectionManager zkClient has connected
   [junit4]   2> 965781 INFO  (zkConnectionManagerCallback-1876-thread-1) [    ] o.a.s.c.c.ConnectionManager zkClient has connected
   [junit4]   2> 965781 INFO  (jetty-launcher-1869-thread-2) [    ] o.a.s.s.SolrDispatchFilter solr.xml found in ZooKeeper. Loading...
   [junit4]   2> 965781 INFO  (jetty-launcher-1869-thread-1) [    ] o.a.s.s.SolrDispatchFilter solr.xml found in ZooKeeper. Loading...
   [junit4]   2> 965832 INFO  (jetty-launcher-1869-thread-2) [    ] o.a.s.c.ZkContainer Zookeeper client=127.0.0.1:44853/solr
   [junit4]   2> 965833 INFO  (zkConnectionManagerCallback-1880-thread-1) [    ] o.a.s.c.c.ConnectionManager zkClient has connected
   [junit4]   2> 965834 INFO  (zkConnectionManagerCallback-1882-thread-1) [    ] o.a.s.c.c.ConnectionManager zkClient has connected
   [junit4]   2> 965843 INFO  (jetty-launcher-1869-thread-1) [    ] o.a.s.c.ZkContainer Zookeeper client=127.0.0.1:44853/solr
   [junit4]   2> 965844 INFO  (zkConnectionManagerCallback-1888-thread-1) [    ] o.a.s.c.c.ConnectionManager zkClient has connected
   [junit4]   2> 965845 INFO  (zkConnectionManagerCallback-1890-thread-1) [    ] o.a.s.c.c.ConnectionManager zkClient has connected
   [junit4]   2> 965849 INFO  (jetty-launcher-1869-thread-1) [n:127.0.0.1:33103_solr    ] o.a.s.c.Overseer Overseer (id=null) closing
   [junit4]   2> 965850 INFO  (jetty-launcher-1869-thread-1) [n:127.0.0.1:33103_solr    ] o.a.s.c.OverseerElectionContext I am going to be the leader 127.0.0.1:33103_solr
   [junit4]   2> 965850 INFO  (jetty-launcher-1869-thread-1) [n:127.0.0.1:33103_solr    ] o.a.s.c.Overseer Overseer (id=72120639222185990-127.0.0.1:33103_solr-n_0000000000) starting
   [junit4]   2> 965856 INFO  (zkConnectionManagerCallback-1897-thread-1) [    ] o.a.s.c.c.ConnectionManager zkClient has connected
   [junit4]   2> 965857 INFO  (jetty-launcher-1869-thread-1) [n:127.0.0.1:33103_solr    ] o.a.s.c.s.i.ZkClientClusterStateProvider Cluster at 127.0.0.1:44853/solr ready
   [junit4]   2> 965858 INFO  (jetty-launcher-1869-thread-1) [n:127.0.0.1:33103_solr    ] o.a.s.c.ZkController Register node as live in ZooKeeper:/live_nodes/127.0.0.1:33103_solr
   [junit4]   2> 965861 INFO  (zkCallback-1896-thread-1) [    ] o.a.s.c.c.ZkStateReader Updated live nodes from ZooKeeper... (0) -> (1)
   [junit4]   2> 965861 INFO  (zkCallback-1889-thread-1) [    ] o.a.s.c.c.ZkStateReader Updated live nodes from ZooKeeper... (0) -> (1)
   [junit4]   2> 965868 INFO  (jetty-launcher-1869-thread-2) [n:127.0.0.1:39051_solr    ] o.a.s.c.c.ZkStateReader Updated live nodes from ZooKeeper... (0) -> (1)
   [junit4]   2> 965869 INFO  (jetty-launcher-1869-thread-2) [n:127.0.0.1:39051_solr    ] o.a.s.c.Overseer Overseer (id=null) closing
   [junit4]   2> 965870 INFO  (jetty-launcher-1869-thread-2) [n:127.0.0.1:39051_solr    ] o.a.s.c.TransientSolrCoreCacheDefault Allocating transient cache for 2147483647 transient cores
   [junit4]   2> 965870 INFO  (jetty-launcher-1869-thread-2) [n:127.0.0.1:39051_solr    ] o.a.s.c.ZkController Register node as live in ZooKeeper:/live_nodes/127.0.0.1:39051_solr
   [junit4]   2> 965870 INFO  (zkCallback-1896-thread-1) [    ] o.a.s.c.c.ZkStateReader Updated live nodes from ZooKeeper... (1) -> (2)
   [junit4]   2> 965870 INFO  (zkCallback-1889-thread-1) [    ] o.a.s.c.c.ZkStateReader Updated live nodes from ZooKeeper... (1) -> (2)
   [junit4]   2> 965872 INFO  (jetty-launcher-1869-thread-1) [n:127.0.0.1:33103_solr    ] o.a.s.h.a.MetricsHistoryHandler No .system collection, keeping metrics history in memory.
   [junit4]   2> 965873 INFO  (zkCallback-1881-thread-1) [    ] o.a.s.c.c.ZkStateReader Updated live nodes from ZooKeeper... (1) -> (2)
   [junit4]   2> 965884 INFO  (zkConnectionManagerCallback-1903-thread-1) [    ] o.a.s.c.c.ConnectionManager zkClient has connected
   [junit4]   2> 965885 INFO  (jetty-launcher-1869-thread-2) [n:127.0.0.1:39051_solr    ] o.a.s.c.c.ZkStateReader Updated live nodes from ZooKeeper... (0) -> (2)
   [junit4]   2> 965886 INFO  (jetty-launcher-1869-thread-2) [n:127.0.0.1:39051_solr    ] o.a.s.c.s.i.ZkClientClusterStateProvider Cluster at 127.0.0.1:44853/solr ready
   [junit4]   2> 965888 INFO  (jetty-launcher-1869-thread-1) [n:127.0.0.1:33103_solr    ] o.a.s.m.r.SolrJmxReporter JMX monitoring for 'solr_33103.solr.node' (registry 'solr.node') enabled at server: com.sun.jmx.mbeanserver.JmxMBeanServer@457a262d
   [junit4]   2> 965889 INFO  (jetty-launcher-1869-thread-2) [n:127.0.0.1:39051_solr    ] o.a.s.h.a.MetricsHistoryHandler No .system collection, keeping metrics history in memory.
   [junit4]   2> 965893 INFO  (jetty-launcher-1869-thread-1) [n:127.0.0.1:33103_solr    ] o.a.s.m.r.SolrJmxReporter JMX monitoring for 'solr_33103.solr.jvm' (registry 'solr.jvm') enabled at server: com.sun.jmx.mbeanserver.JmxMBeanServer@457a262d
   [junit4]   2> 965893 INFO  (jetty-launcher-1869-thread-1) [n:127.0.0.1:33103_solr    ] o.a.s.m.r.SolrJmxReporter JMX monitoring for 'solr_33103.solr.jetty' (registry 'solr.jetty') enabled at server: com.sun.jmx.mbeanserver.JmxMBeanServer@457a262d
   [junit4]   2> 965894 INFO  (jetty-launcher-1869-thread-1) [n:127.0.0.1:33103_solr    ] o.a.s.c.CorePropertiesLocator Found 0 core definitions underneath /home/jenkins/workspace/Lucene-Solr-7.x-Linux/solr/build/solr-core/test/J1/temp/solr.cloud.LeaderTragicEventTest_6B7AB9A74EAE55C5-001/tempDir-001/node1/.
   [junit4]   2> 965896 INFO  (jetty-launcher-1869-thread-2) [n:127.0.0.1:39051_solr    ] o.a.s.m.r.SolrJmxReporter JMX monitoring for 'solr_39051.solr.node' (registry 'solr.node') enabled at server: com.sun.jmx.mbeanserver.JmxMBeanServer@457a262d
   [junit4]   2> 965900 INFO  (jetty-launcher-1869-thread-2) [n:127.0.0.1:39051_solr    ] o.a.s.m.r.SolrJmxReporter JMX monitoring for 'solr_39051.solr.jvm' (registry 'solr.jvm') enabled at server: com.sun.jmx.mbeanserver.JmxMBeanServer@457a262d
   [junit4]   2> 965901 INFO  (jetty-launcher-1869-thread-2) [n:127.0.0.1:39051_solr    ] o.a.s.m.r.SolrJmxReporter JMX monitoring for 'solr_39051.solr.jetty' (registry 'solr.jetty') enabled at server: com.sun.jmx.mbeanserver.JmxMBeanServer@457a262d
   [junit4]   2> 965901 INFO  (jetty-launcher-1869-thread-2) [n:127.0.0.1:39051_solr    ] o.a.s.c.CorePropertiesLocator Found 0 core definitions underneath /home/jenkins/workspace/Lucene-Solr-7.x-Linux/solr/build/solr-core/test/J1/temp/solr.cloud.LeaderTragicEventTest_6B7AB9A74EAE55C5-001/tempDir-001/node2/.
   [junit4]   2> 965919 INFO  (zkConnectionManagerCallback-1906-thread-1) [    ] o.a.s.c.c.ConnectionManager zkClient has connected
   [junit4]   2> 965921 INFO  (zkConnectionManagerCallback-1911-thread-1) [    ] o.a.s.c.c.ConnectionManager zkClient has connected
   [junit4]   2> 965922 INFO  (SUITE-LeaderTragicEventTest-seed#[6B7AB9A74EAE55C5]-worker) [    ] o.a.s.c.c.ZkStateReader Updated live nodes from ZooKeeper... (0) -> (2)
   [junit4]   2> 965923 INFO  (SUITE-LeaderTragicEventTest-seed#[6B7AB9A74EAE55C5]-worker) [    ] o.a.s.c.s.i.ZkClientClusterStateProvider Cluster at 127.0.0.1:44853/solr ready
   [junit4]   2> 965944 INFO  (TEST-LeaderTragicEventTest.testOtherReplicasAreNotActive-seed#[6B7AB9A74EAE55C5]) [    ] o.a.s.SolrTestCaseJ4 ###Starting testOtherReplicasAreNotActive
   [junit4]   2> 965956 INFO  (qtp203607361-8896) [n:127.0.0.1:33103_solr    ] o.a.s.h.a.CollectionsHandler Invoked Collection Action :create with params collection.configName=config&name=collection1&nrtReplicas=2&action=CREATE&numShards=1&wt=javabin&version=2 and sendToOCPQueue=true
   [junit4]   2> 965957 INFO  (OverseerThreadFactory-3317-thread-1) [    ] o.a.s.c.a.c.CreateCollectionCmd Create collection collection1
   [junit4]   2> 966062 INFO  (OverseerStateUpdate-72120639222185990-127.0.0.1:33103_solr-n_0000000000) [    ] o.a.s.c.o.SliceMutator createReplica() {
   [junit4]   2>   "operation":"ADDREPLICA",
   [junit4]   2>   "collection":"collection1",
   [junit4]   2>   "shard":"shard1",
   [junit4]   2>   "core":"collection1_shard1_replica_n1",
   [junit4]   2>   "state":"down",
   [junit4]   2>   "base_url":"https://127.0.0.1:33103/solr",
   [junit4]   2>   "type":"NRT",
   [junit4]   2>   "waitForFinalState":"false"} 
   [junit4]   2> 966062 INFO  (OverseerStateUpdate-72120639222185990-127.0.0.1:33103_solr-n_0000000000) [    ] o.a.s.c.o.SliceMutator createReplica() {
   [junit4]   2>   "operation":"ADDREPLICA",
   [junit4]   2>   "collection":"collection1",
   [junit4]   2>   "shard":"shard1",
   [junit4]   2>   "core":"collection1_shard1_replica_n2",
   [junit4]   2>   "state":"down",
   [junit4]   2>   "base_url":"https://127.0.0.1:39051/solr",
   [junit4]   2>   "type":"NRT",
   [junit4]   2>   "waitForFinalState":"false"} 
   [junit4]   2> 966269 INFO  (qtp203607361-8887) [n:127.0.0.1:33103_solr    x:collection1_shard1_replica_n1] o.a.s.h.a.CoreAdminOperation core create command qt=/admin/cores&coreNodeName=core_node3&collection.configName=config&newCollection=true&name=collection1_shard1_replica_n1&action=CREATE&numShards=1&collection=collection1&shard=shard1&wt=javabin&version=2&replicaType=NRT
   [junit4]   2> 966269 INFO  (qtp203607361-8887) [n:127.0.0.1:33103_solr    x:collection1_shard1_replica_n1] o.a.s.c.TransientSolrCoreCacheDefault Allocating transient cache for 2147483647 transient cores
   [junit4]   2> 966281 INFO  (qtp1550165463-8897) [n:127.0.0.1:39051_solr    x:collection1_shard1_replica_n2] o.a.s.h.a.CoreAdminOperation core create command qt=/admin/cores&coreNodeName=core_node4&collection.configName=config&newCollection=true&name=collection1_shard1_replica_n2&action=CREATE&numShards=1&collection=collection1&shard=shard1&wt=javabin&version=2&replicaType=NRT
   [junit4]   2> 967278 INFO  (qtp203607361-8887) [n:127.0.0.1:33103_solr c:collection1 s:shard1 r:core_node3 x:collection1_shard1_replica_n1] o.a.s.c.SolrConfig Using Lucene MatchVersion: 7.5.0
   [junit4]   2> 967286 INFO  (qtp203607361-8887) [n:127.0.0.1:33103_solr c:collection1 s:shard1 r:core_node3 x:collection1_shard1_replica_n1] o.a.s.s.IndexSchema [collection1_shard1_replica_n1] Schema name=minimal
   [junit4]   2> 967288 INFO  (qtp203607361-8887) [n:127.0.0.1:33103_solr c:collection1 s:shard1 r:core_node3 x:collection1_shard1_replica_n1] o.a.s.s.IndexSchema Loaded schema minimal/1.1 with uniqueid field id
   [junit4]   2> 967288 INFO  (qtp203607361-8887) [n:127.0.0.1:33103_solr c:collection1 s:shard1 r:core_node3 x:collection1_shard1_replica_n1] o.a.s.c.CoreContainer Creating SolrCore 'collection1_shard1_replica_n1' using configuration from collection collection1, trusted=true
   [junit4]   2> 967289 INFO  (qtp203607361-8887) [n:127.0.0.1:33103_solr c:collection1 s:shard1 r:core_node3 x:collection1_shard1_replica_n1] o.a.s.m.r.SolrJmxReporter JMX monitoring for 'solr_33103.solr.core.collection1.shard1.replica_n1' (registry 'solr.core.collection1.shard1.replica_n1') enabled at server: com.sun.jmx.mbeanserver.JmxMBeanServer@457a262d
   [junit4]   2> 967289 INFO  (qtp203607361-8887) [n:127.0.0.1:33103_solr c:collection1 s:shard1 r:core_node3 x:collection1_shard1_replica_n1] o.a.s.c.SolrCore solr.RecoveryStrategy.Builder
   [junit4]   2> 967289 INFO  (qtp203607361-8887) [n:127.0.0.1:33103_solr c:collection1 s:shard1 r:core_node3 x:collection1_shard1_replica_n1] o.a.s.c.SolrCore [[collection1_shard1_replica_n1] ] Opening new SolrCore at [/home/jenkins/workspace/Lucene-Solr-7.x-Linux/solr/build/solr-core/test/J1/temp/solr.cloud.LeaderTragicEventTest_6B7AB9A74EAE55C5-001/tempDir-001/node1/collection1_shard1_replica_n1], dataDir=[/home/jenkins/workspace/Lucene-Solr-7.x-Linux/solr/build/solr-core/test/J1/temp/solr.cloud.LeaderTragicEventTest_6B7AB9A74EAE55C5-001/tempDir-001/node1/./collection1_shard1_replica_n1/data/]
   [junit4]   2> 967289 INFO  (qtp1550165463-8897) [n:127.0.0.1:39051_solr c:collection1 s:shard1 r:core_node4 x:collection1_shard1_replica_n2] o.a.s.c.SolrConfig Using Lucene MatchVersion: 7.5.0
   [junit4]   2> 967294 INFO  (qtp1550165463-8897) [n:127.0.0.1:39051_solr c:collection1 s:shard1 r:core_node4 x:collection1_shard1_replica_n2] o.a.s.s.IndexSchema [collection1_shard1_replica_n2] Schema name=minimal
   [junit4]   2> 967295 INFO  (qtp1550165463-8897) [n:127.0.0.1:39051_solr c:collection1 s:shard1 r:core_node4 x:collection1_shard1_replica_n2] o.a.s.s.IndexSchema Loaded schema minimal/1.1 with uniqueid field id
   [junit4]   2> 967295 INFO  (qtp1550165463-8897) [n:127.0.0.1:39051_solr c:collection1 s:shard1 r:core_node4 x:collection1_shard1_replica_n2] o.a.s.c.CoreContainer Creating SolrCore 'collection1_shard1_replica_n2' using configuration from collection collection1, trusted=true
   [junit4]   2> 967295 INFO  (qtp1550165463-8897) [n:127.0.0.1:39051_solr c:collection1 s:shard1 r:core_node4 x:collection1_shard1_replica_n2] o.a.s.m.r.SolrJmxReporter JMX monitoring for 'solr_39051.solr.core.collection1.shard1.replica_n2' (registry 'solr.core.collection1.shard1.replica_n2') enabled at server: com.sun.jmx.mbeanserver.JmxMBeanServer@457a262d
   [junit4]   2> 967295 INFO  (qtp1550165463-8897) [n:127.0.0.1:39051_solr c:collection1 s:shard1 r:core_node4 x:collection1_shard1_replica_n2] o.a.s.c.SolrCore solr.RecoveryStrategy.Builder
   [junit4]   2> 967295 INFO  (qtp1550165463-8897) [n:127.0.0.1:39051_solr c:collection1 s:shard1 r:core_node4 x:collection1_shard1_replica_n2] o.a.s.c.SolrCore [[collection1_shard1_replica_n2] ] Opening new SolrCore at [/home/jenkins/workspace/Lucene-Solr-7.x-Linux/solr/build/solr-core/test/J1/temp/solr.cloud.LeaderTragicEventTest_6B7AB9A74EAE55C5-001/tempDir-001/node2/collection1_shard1_replica_n2], dataDir=[/home/jenkins/workspace/Lucene-Solr-7.x-Linux/solr/build/solr-core/test/J1/temp/solr.cloud.LeaderTragicEventTest_6B7AB9A74EAE55C5-001/tempDir-001/node2/./collection1_shard1_replica_n2/data/]
   [junit4]   2> 967321 INFO  (qtp1550165463-8897) [n:127.0.0.1:39051_solr c:collection1 s:shard1 r:core_node4 x:collection1_shard1_replica_n2] o.a.s.u.UpdateHandler Using UpdateLog implementation: org.apache.solr.update.UpdateLog
   [junit4]   2> 967321 INFO  (qtp1550165463-8897) [n:127.0.0.1:39051_solr c:collection1 s:shard1 r:core_node4 x:collection1_shard1_replica_n2] o.a.s.u.UpdateLog Initializing UpdateLog: dataDir=null defaultSyncLevel=FLUSH numRecordsToKeep=100 maxNumLogsToKeep=10 numVersionBuckets=65536
   [junit4]   2> 967321 INFO  (qtp203607361-8887) [n:127.0.0.1:33103_solr c:collection1 s:shard1 r:core_node3 x:collection1_shard1_replica_n1] o.a.s.u.UpdateHandler Using UpdateLog implementation: org.apache.solr.update.UpdateLog
   [junit4]   2> 967321 INFO  (qtp203607361-8887) [n:127.0.0.1:33103_solr c:collection1 s:shard1 r:core_node3 x:collection1_shard1_replica_n1] o.a.s.u.UpdateLog Initializing UpdateLog: dataDir=null defaultSyncLevel=FLUSH numRecordsToKeep=100 maxNumLogsToKeep=10 numVersionBuckets=65536
   [junit4]   2> 967321 INFO  (qtp1550165463-8897) [n:127.0.0.1:39051_solr c:collection1 s:shard1 r:core_node4 x:collection1_shard1_replica_n2] o.a.s.u.CommitTracker Hard AutoCommit: disabled
   [junit4]   2> 967321 INFO  (qtp1550165463-8897) [n:127.0.0.1:39051_solr c:collection1 s:shard1 r:core_node4 x:collection1_shard1_replica_n2] o.a.s.u.CommitTracker Soft AutoCommit: disabled
   [junit4]   2> 967321 INFO  (qtp203607361-8887) [n:127.0.0.1:33103_solr c:collection1 s:shard1 r:core_node3 x:collection1_shard1_replica_n1] o.a.s.u.CommitTracker Hard AutoCommit: disabled
   [junit4]   2> 967321 INFO  (qtp203607361-8887) [n:127.0.0.1:33103_solr c:collection1 s:shard1 r:core_node3 x:collection1_shard1_replica_n1] o.a.s.u.CommitTracker Soft AutoCommit: disabled
   [junit4]   2> 967322 INFO  (qtp1550165463-8897) [n:127.0.0.1:39051_solr c:collection1 s:shard1 r:core_node4 x:collection1_shard1_replica_n2] o.a.s.s.SolrIndexSearcher Opening [Searcher@6643bc45[collection1_shard1_replica_n2] main]
   [junit4]   2> 967322 INFO  (qtp203607361-8887) [n:127.0.0.1:33103_solr c:collection1 s:shard1 r:core_node3 x:collection1_shard1_replica_n1] o.a.s.s.SolrIndexSearcher Opening [Searcher@1dfdcc1e[collection1_shard1_replica_n1] main]
   [junit4]   2> 967323 INFO  (qtp1550165463-8897) [n:127.0.0.1:39051_solr c:collection1 s:shard1 r:core_node4 x:collection1_shard1_replica_n2] o.a.s.r.ManagedResourceStorage Configured ZooKeeperStorageIO with znodeBase: /configs/config
   [junit4]   2> 967323 INFO  (qtp203607361-8887) [n:127.0.0.1:33103_solr c:collection1 s:shard1 r:core_node3 x:collection1_shard1_replica_n1] o.a.s.r.ManagedResourceStorage Configured ZooKeeperStorageIO with znodeBase: /configs/config
   [junit4]   2> 967323 INFO  (qtp1550165463-8897) [n:127.0.0.1:39051_solr c:collection1 s:shard1 r:core_node4 x:collection1_shard1_replica_n2] o.a.s.r.ManagedResourceStorage Loaded null at path _rest_managed.json using ZooKeeperStorageIO:path=/configs/config
   [junit4]   2> 967323 INFO  (qtp203607361-8887) [n:127.0.0.1:33103_solr c:collection1 s:shard1 r:core_node3 x:collection1_shard1_replica_n1] o.a.s.r.ManagedResourceStorage Loaded null at path _rest_managed.json using ZooKeeperStorageIO:path=/configs/config
   [junit4]   2> 967323 INFO  (qtp1550165463-8897) [n:127.0.0.1:39051_solr c:collection1 s:shard1 r:core_node4 x:collection1_shard1_replica_n2] o.a.s.h.ReplicationHandler Commits will be reserved for 10000ms.
   [junit4]   2> 967324 INFO  (qtp1550165463-8897) [n:127.0.0.1:39051_solr c:collection1 s:shard1 r:core_node4 x:collection1_shard1_replica_n2] o.a.s.u.UpdateLog Could not find max version in index or recent updates, using new clock 1605886613120876544
   [junit4]   2> 967324 INFO  (qtp203607361-8887) [n:127.0.0.1:33103_solr c:collection1 s:shard1 r:core_node3 x:collection1_shard1_replica_n1] o.a.s.h.ReplicationHandler Commits will be reserved for 10000ms.
   [junit4]   2> 967324 INFO  (searcherExecutor-3327-thread-1-processing-n:127.0.0.1:39051_solr x:collection1_shard1_replica_n2 c:collection1 s:shard1 r:core_node4) [n:127.0.0.1:39051_solr c:collection1 s:shard1 r:core_node4 x:collection1_shard1_replica_n2] o.a.s.c.SolrCore [collection1_shard1_replica_n2] Registered new searcher Searcher@6643bc45[collection1_shard1_replica_n2] main{ExitableDirectoryReader(UninvertingDirectoryReader())}
   [junit4]   2> 967324 INFO  (searcherExecutor-3326-thread-1-processing-n:127.0.0.1:33103_solr x:collection1_shard1_replica_n1 c:collection1 s:shard1 r:core_node3) [n:127.0.0.1:33103_solr c:collection1 s:shard1 r:core_node3 x:collection1_shard1_replica_n1] o.a.s.c.SolrCore [collection1_shard1_replica_n1] Registered new searcher Searcher@1dfdcc1e[collection1_shard1_replica_n1] main{ExitableDirectoryReader(UninvertingDirectoryReader())}
   [junit4]   2> 967324 INFO  (qtp203607361-8887) [n:127.0.0.1:33103_solr c:collection1 s:shard1 r:core_node3 x:collection1_shard1_replica_n1] o.a.s.u.UpdateLog Could not find max version in index or recent updates, using new clock 1605886613120876544
   [junit4]   2> 967329 INFO  (qtp1550165463-8897) [n:127.0.0.1:39051_solr c:collection1 s:shard1 r:core_node4 x:collection1_shard1_replica_n2] o.a.s.c.ZkShardTerms Successful update of terms at /collections/collection1/terms/shard1 to Terms{values={core_node4=0}, version=0}
   [junit4]   2> 967329 INFO  (qtp203607361-8887) [n:127.0.0.1:33103_solr c:collection1 s:shard1 r:core_node3 x:collection1_shard1_replica_n1] o.a.s.c.ZkShardTerms Failed to save terms, version is not a match, retrying
   [junit4]   2> 967329 INFO  (qtp203607361-8887) [n:127.0.0.1:33103_solr c:collection1 s:shard1 r:core_node3 x:collection1_shard1_replica_n1] o.a.s.c.ZkShardTerms Successful update of terms at /collections/collection1/terms/shard1 to Terms{values={core_node3=0, core_node4=0}, version=1}
   [junit4]   2> 967331 INFO  (qtp1550165463-8897) [n:127.0.0.1:39051_solr c:collection1 s:shard1 r:core_node4 x:collection1_shard1_replica_n2] o.a.s.c.ShardLeaderElectionContext Enough replicas found to continue.
   [junit4]   2> 967331 INFO  (qtp1550165463-8897) [n:127.0.0.1:39051_solr c:collection1 s:shard1 r:core_node4 x:collection1_shard1_replica_n2] o.a.s.c.ShardLeaderElectionContext I may be the new leader - try and sync
   [junit4]   2> 967331 INFO  (qtp1550165463-8897) [n:127.0.0.1:39051_solr c:collection1 s:shard1 r:core_node4 x:collection1_shard1_replica_n2] o.a.s.c.SyncStrategy Sync replicas to https://127.0.0.1:39051/solr/collection1_shard1_replica_n2/
   [junit4]   2> 967331 INFO  (qtp1550165463-8897) [n:127.0.0.1:39051_solr c:collection1 s:shard1 r:core_node4 x:collection1_shard1_replica_n2] o.a.s.u.PeerSync PeerSync: core=collection1_shard1_replica_n2 url=https://127.0.0.1:39051/solr START replicas=[https://127.0.0.1:33103/solr/collection1_shard1_replica_n1/] nUpdates=100
   [junit4]   2> 967331 INFO  (qtp1550165463-8897) [n:127.0.0.1:39051_solr c:collection1 s:shard1 r:core_node4 x:collection1_shard1_replica_n2] o.a.s.u.PeerSync PeerSync: core=collection1_shard1_replica_n2 url=https://127.0.0.1:39051/solr DONE.  We have no versions.  sync failed.
   [junit4]   2> 967338 INFO  (qtp203607361-8902) [n:127.0.0.1:33103_solr c:collection1 s:shard1 r:core_node3 x:collection1_shard1_replica_n1] o.a.s.c.S.Request [collection1_shard1_replica_n1]  webapp=/solr path=/get params={distrib=false&qt=/get&fingerprint=false&getVersions=100&wt=javabin&version=2} status=0 QTime=0
   [junit4]   2> 967338 INFO  (qtp1550165463-8897) [n:127.0.0.1:39051_solr c:collection1 s:shard1 r:core_node4 x:collection1_shard1_replica_n2] o.a.s.c.SyncStrategy Leader's attempt to sync with shard failed, moving to the next candidate
   [junit4]   2> 967338 INFO  (qtp1550165463-8897) [n:127.0.0.1:39051_solr c:collection1 s:shard1 r:core_node4 x:collection1_shard1_replica_n2] o.a.s.c.ShardLeaderElectionContext We failed sync, but we have no versions - we can't sync in that case - we were active before, so become leader anyway
   [junit4]   2> 967338 INFO  (qtp1550165463-8897) [n:127.0.0.1:39051_solr c:collection1 s:shard1 r:core_node4 x:collection1_shard1_replica_n2] o.a.s.c.ShardLeaderElectionContext Found all replicas participating in election, clear LIR
   [junit4]   2> 967340 INFO  (qtp1550165463-8897) [n:127.0.0.1:39051_solr c:collection1 s:shard1 r:core_node4 x:collection1_shard1_replica_n2] o.a.s.c.ShardLeaderElectionContext I am the new leader: https://127.0.0.1:39051/solr/collection1_shard1_replica_n2/ shard1
   [junit4]   2> 967491 INFO  (qtp1550165463-8897) [n:127.0.0.1:39051_solr c:collection1 s:shard1 r:core_node4 x:collection1_shard1_replica_n2] o.a.s.c.ZkController I am the leader, no recovery necessary
   [junit4]   2> 967519 INFO  (qtp1550165463-8897) [n:127.0.0.1:39051_solr c:collection1 s:shard1 r:core_node4 x:collection1_shard1_replica_n2] o.a.s.s.HttpSolrCall [admin] webapp=null path=/admin/cores params={qt=/admin/cores&coreNodeName=core_node4&collection.configName=config&newCollection=true&name=collection1_shard1_replica_n2&action=CREATE&numShards=1&collection=collection1&shard=shard1&wt=javabin&version=2&replicaType=NRT} status=0 QTime=1238
   [junit4]   2> 967593 INFO  (zkCallback-1881-thread-1) [    ] o.a.s.c.c.ZkStateReader A cluster state change: [WatchedEvent state:SyncConnected type:NodeDataChanged path:/collections/collection1/state.json] for collection [collection1] has occurred - updating... (live nodes size: [2])
   [junit4]   2> 968367 INFO  (qtp203607361-8887) [n:127.0.0.1:33103_solr c:collection1 s:shard1 r:core_node3 x:collection1_shard1_replica_n1] o.a.s.s.HttpSolrCall [admin] webapp=null path=/admin/cores params={qt=/admin/cores&coreNodeName=core_node3&collection.configName=config&newCollection=true&name=collection1_shard1_replica_n1&action=CREATE&numShards=1&collection=collection1&shard=shard1&wt=javabin&version=2&replicaType=NRT} status=0 QTime=2098
   [junit4]   2> 968369 INFO  (qtp203607361-8896) [n:127.0.0.1:33103_solr    ] o.a.s.h.a.CollectionsHandler Wait for new collection to be active for at most 30 seconds. Check all shard replicas
   [junit4]   2> 968433 INFO  (zkCallback-1889-thread-1) [    ] o.a.s.c.c.ZkStateReader A cluster state change: [WatchedEvent state:SyncConnected type:NodeDataChanged path:/collections/collection1/state.json] for collection [collection1] has occurred - updating... (live nodes size: [2])
   [junit4]   2> 968433 INFO  (zkCallback-1881-thread-1) [    ] o.a.s.c.c.ZkStateReader A cluster state change: [WatchedEvent state:SyncConnected type:NodeDataChanged path:/collections/collection1/state.json] for collection [collection1] has occurred - updating... (live nodes size: [2])
   [junit4]   2> 969369 INFO  (qtp203607361-8896) [n:127.0.0.1:33103_solr    ] o.a.s.s.HttpSolrCall [admin] webapp=null path=/admin/collections params={collection.configName=config&name=collection1&nrtReplicas=2&action=CREATE&numShards=1&wt=javabin&version=2} status=0 QTime=3413
   [junit4]   2> 969372 INFO  (TEST-LeaderTragicEventTest.testOtherReplicasAreNotActive-seed#[6B7AB9A74EAE55C5]) [    ] o.e.j.s.AbstractConnector Stopped ServerConnector@2e791596{SSL,[ssl, http/1.1]}{127.0.0.1:0}
   [junit4]   2> 969372 INFO  (TEST-LeaderTragicEventTest.testOtherReplicasAreNotActive-seed#[6B7AB9A74EAE55C5]) [    ] o.a.s.c.CoreContainer Shutting down CoreContainer instance=1600610129
   [junit4]   2> 969372 INFO  (TEST-LeaderTragicEventTest.testOtherReplicasAreNotActive-seed#[6B7AB9A74EAE55C5]) [    ] o.a.s.m.SolrMetricManager Closing metric reporters for registry=solr.node, tag=null
   [junit4]   2> 969373 INFO  (TEST-LeaderTragicEventTest.testOtherReplicasAreNotActive-seed#[6B7AB9A74EAE55C5]) [    ] o.a.s.m.r.SolrJmxReporter Closing reporter [org.apache.solr.metrics.reporters.SolrJmxReporter@175c55b: rootName = solr_33103, domain = solr.node, service url = null, agent id = null] for registry solr.node / com.codahale.metrics.MetricRegistry@337500b3
   [junit4]   2> 969379 INFO  (TEST-LeaderTragicEventTest.testOtherReplicasAreNotActive-seed#[6B7AB9A74EAE55C5]) [    ] o.a.s.m.SolrMetricManager Closing metric reporters for registry=solr.jvm, tag=null
   [junit4]   2> 969379 INFO  (TEST-LeaderTragicEventTest.testOtherReplicasAreNotActive-seed#[6B7AB9A74EAE55C5]) [    ] o.a.s.m.r.SolrJmxReporter Closing reporter [org.apache.solr.metrics.reporters.SolrJmxReporter@2e1b45f9: rootName = solr_33103, domain = solr.jvm, service url = null, agent id = null] for registry solr.jvm / com.codahale.metrics.MetricRegistry@189629f2
   [junit4]   2> 969382 INFO  (TEST-LeaderTragicEventTest.testOtherReplicasAreNotActive-seed#[6B7AB9A74EAE55C5]) [    ] o.a.s.m.SolrMetricManager Closing metric reporters for registry=solr.jetty, tag=null
   [junit4]   2> 969382 INFO  (TEST-LeaderTragicEventTest.testOtherReplicasAreNotActive-seed#[6B7AB9A74EAE55C5]) [    ] o.a.s.m.r.SolrJmxReporter Closing reporter [org.apache.solr.metrics.reporters.SolrJmxReporter@28d3e454: rootName = solr_33103, domain = solr.jetty, service url = null, agent id = null] for registry solr.jetty / com.codahale.metrics.MetricRegistry@636bc8d
   [junit4]   2> 969383 INFO  (TEST-LeaderTragicEventTest.testOtherReplicasAreNotActive-seed#[6B7AB9A74EAE55C5]) [    ] o.a.s.c.ZkController Remove node as live in ZooKeeper:/live_nodes/127.0.0.1:33103_solr
   [junit4]   2> 969383 INFO  (TEST-LeaderTragicEventTest.testOtherReplicasAreNotActive-seed#[6B7AB9A74EAE55C5]) [    ] o.a.s.m.SolrMetricManager Closing metric reporters for registry=solr.cluster, tag=null
   [junit4]   2> 969384 INFO  (zkCallback-1902-thread-1) [    ] o.a.s.c.c.ZkStateReader Updated live nodes from ZooKeeper... (2) -> (1)
   [junit4]   2> 969384 INFO  (zkCallback-1896-thread-1) [    ] o.a.s.c.c.ZkStateReader Updated live nodes from ZooKeeper... (2) -> (1)
   [junit4]   2> 969384 INFO  (zkCallback-1910-thread-1) [    ] o.a.s.c.c.ZkStateReader Updated live nodes from ZooKeeper... (2) -> (1)
   [junit4]   2> 969384 INFO  (zkCallback-1889-thread-2) [    ] o.a.s.c.c.ZkStateReader Updated live nodes from ZooKeeper... (2) -> (1)
   [junit4]   2> 969384 INFO  (zkCallback-1881-thread-1) [    ] o.a.s.c.c.ZkStateReader Updated live nodes from ZooKeeper... (2) -> (1)
   [junit4]   2> 969384 INFO  (coreCloseExecutor-3336-thread-1) [n:127.0.0.1:33103_solr c:collection1 s:shard1 r:core_node3 x:collection1_shard1_replica_n1] o.a.s.c.SolrCore [collection1_shard1_replica_n1]  CLOSING SolrCore org.apache.solr.core.SolrCore@3f7d10ae
   [junit4]   2> 969384 INFO  (coreCloseExecutor-3336-thread-1) [n:127.0.0.1:33103_solr c:collection1 s:shard1 r:core_node3 x:collection1_shard1_replica_n1] o.a.s.m.SolrMetricManager Closing metric reporters for registry=solr.core.collection1.shard1.replica_n1, tag=3f7d10ae
   [junit4]   2> 969384 INFO  (coreCloseExecutor-3336-thread-1) [n:127.0.0.1:33103_solr c:collection1 s:shard1 r:core_node3 x:collection1_shard1_replica_n1] o.a.s.m.r.SolrJmxReporter Closing reporter [org.apache.solr.metrics.reporters.SolrJmxReporter@6c1cde3f: rootName = solr_33103, domain = solr.core.collection1.shard1.replica_n1, service url = null, agent id = null] for registry solr.core.collection1.shard1.replica_n1 / com.codahale.metrics.MetricRegistry@74848ed0
   [junit4]   2> 969389 INFO  (coreCloseExecutor-3336-thread-1) [n:127.0.0.1:33103_solr c:collection1 s:shard1 r:core_node3 x:collection1_shard1_replica_n1] o.a.s.m.SolrMetricManager Closing metric reporters for registry=solr.collection.collection1.shard1.leader, tag=3f7d10ae
   [junit4]   2> 969391 INFO  (TEST-LeaderTragicEventTest.testOtherReplicasAreNotActive-seed#[6B7AB9A74EAE55C5]) [    ] o.a.s.c.Overseer Overseer (id=72120639222185990-127.0.0.1:33103_solr-n_0000000000) closing
   [junit4]   2> 969391 INFO  (OverseerStateUpdate-72120639222185990-127.0.0.1:33103_solr-n_0000000000) [    ] o.a.s.c.Overseer Overseer Loop exiting : 127.0.0.1:33103_solr
   [junit4]   2> 969391 WARN  (OverseerAutoScalingTriggerThread-72120639222185990-127.0.0.1:33103_solr-n_0000000000) [    ] o.a.s.c.a.OverseerTriggerThread OverseerTriggerThread woken up but we are closed, exiting.
   [junit4]   2> 969393 INFO  (zkCallback-1881-thread-1) [    ] o.a.s.c.OverseerElectionContext I am going to be the leader 127.0.0.1:39051_solr
   [junit4]   2> 969393 INFO  (TEST-LeaderTragicEventTest.testOtherReplicasAreNotActive-seed#[6B7AB9A74EAE55C5]) [    ] o.e.j.s.h.ContextHandler Stopped o.e.j.s.ServletContextHandler@2784efe7{/solr,null,UNAVAILABLE}
   [junit4]   2> 969394 INFO  (TEST-LeaderTragicEventTest.testOtherReplicasAreNotActive-seed#[6B7AB9A74EAE55C5]) [    ] o.e.j.s.session node0 Stopped scavenging
   [junit4]   2> 969394 INFO  (zkCallback-1881-thread-1) [    ] o.a.s.c.Overseer Overseer (id=72120639222185988-127.0.0.1:39051_solr-n_0000000001) starting
   [junit4]   2> 969397 INFO  (zkCallback-1910-thread-1) [    ] o.a.s.c.c.ZkStateReader A cluster state change: [WatchedEvent state:SyncConnected type:NodeDataChanged path:/collections/collection1/state.json] for collection [collection1] has occurred - updating... (live nodes size: [1])
   [junit4]   2> 969401 INFO  (zkCallback-1881-thread-2) [    ] o.a.s.c.c.ZkStateReader A cluster state change: [WatchedEvent state:SyncConnected type:NodeDataChanged path:/collections/collection1/state.json] for collection [collection1] has occurred - updating... (live nodes size: [1])
   [junit4]   2> 969401 INFO  (TEST-LeaderTragicEventTest.testOtherReplicasAreNotActive-seed#[6B7AB9A74EAE55C5]) [    ] o.a.s.SolrTestCaseJ4 ###Ending testOtherReplicasAreNotActive
   [junit4]   2> NOTE: reproduce with: ant test  -Dtestcase=LeaderTragicEventTest -Dtests.method=testOtherReplicasAreNotActive -Dtests.seed=6B7AB9A74EAE55C5 -Dtests.multiplier=3 -Dtests.slow=true -Dtests.locale=es-CL -Dtests.timezone=UCT -Dtests.asserts=true -Dtests.file.encoding=UTF-8
   [junit4] ERROR   3.48s J1 | LeaderTragicEventTest.testOtherReplicasAreNotActive <<<
   [junit4]    > Throwable #1: java.lang.IllegalStateException: Jetty Connector is not open: -2
   [junit4]    > 	at __randomizedtesting.SeedInfo.seed([6B7AB9A74EAE55C5:EECE95D07251EC5D]:0)
   [junit4]    > 	at org.apache.solr.client.solrj.embedded.JettySolrRunner.getBaseUrl(JettySolrRunner.java:499)
   [junit4]    > 	at org.apache.solr.cloud.MiniSolrCloudCluster.getReplicaJetty(MiniSolrCloudCluster.java:539)
   [junit4]    > 	at org.apache.solr.cloud.LeaderTragicEventTest.corruptLeader(LeaderTragicEventTest.java:100)
   [junit4]    > 	at org.apache.solr.cloud.LeaderTragicEventTest.testOtherReplicasAreNotActive(LeaderTragicEventTest.java:150)
   [junit4]    > 	at java.lang.Thread.run(Thread.java:748)
   [junit4]   2> 969421 INFO  (TEST-LeaderTragicEventTest.test-seed#[6B7AB9A74EAE55C5]) [    ] o.a.s.SolrTestCaseJ4 ###Starting test
   [junit4]   2> 969424 INFO  (qtp1550165463-8898) [n:127.0.0.1:39051_solr    ] o.a.s.h.a.CollectionsHandler Invoked Collection Action :create with params collection.configName=config&name=collection1&nrtReplicas=2&action=CREATE&numShards=1&wt=javabin&version=2 and sendToOCPQueue=true
   [junit4]   2> 969426 INFO  (OverseerThreadFactory-3341-thread-1) [    ] o.a.s.c.a.c.CreateCollectionCmd Create collection collection1
   [junit4]   2> 969426 ERROR (OverseerThreadFactory-3341-thread-1) [    ] o.a.s.c.a.c.OverseerCollectionMessageHandler Collection: collection1 operation: create failed:org.apache.solr.common.SolrException: collection already exists: collection1
   [junit4]   2> 	at org.apache.solr.cloud.api.collections.CreateCollectionCmd.call(CreateCollectionCmd.java:106)
   [junit4]   2> 	at org.apache.solr.cloud.api.collections.OverseerCollectionMessageHandler.processMessage(OverseerCollectionMessageHandler.java:255)
   [junit4]   2> 	at org.apache.solr.cloud.OverseerTaskProcessor$Runner.run(OverseerTaskProcessor.java:469)
   [junit4]   2> 	at org.apache.solr.common.util.ExecutorUtil$MDCAwareThreadPoolExecutor.lambda$execute$0(ExecutorUtil.java:209)
   [junit4]   2> 	at java.util.concurrent.ThreadPoolExecutor.runWorker(ThreadPoolExecutor.java:1149)
   [junit4]   2> 	at java.util.concurrent.ThreadPoolExecutor$Worker.run(ThreadPoolExecutor.java:624)
   [junit4]   2> 	at java.lang.Thread.run(Thread.java:748)
   [junit4]   2> 
   [junit4]   2> 969428 INFO  (qtp1550165463-8898) [n:127.0.0.1:39051_solr    ] o.a.s.s.HttpSolrCall [admin] webapp=null path=/admin/collections params={collection.configName=config&name=collection1&nrtReplicas=2&action=CREATE&numShards=1&wt=javabin&version=2} status=400 QTime=3
   [junit4]   2> 969429 INFO  (TEST-LeaderTragicEventTest.test-seed#[6B7AB9A74EAE55C5]) [    ] o.a.s.SolrTestCaseJ4 ###Ending test
   [junit4]   2> NOTE: reproduce with: ant test  -Dtestcase=LeaderTragicEventTest -Dtests.method=test -Dtests.seed=6B7AB9A74EAE55C5 -Dtests.multiplier=3 -Dtests.slow=true -Dtests.locale=es-CL -Dtests.timezone=UCT -Dtests.asserts=true -Dtests.file.encoding=UTF-8
   [junit4] ERROR   0.03s J1 | LeaderTragicEventTest.test <<<
   [junit4]    > Throwable #1: org.apache.solr.client.solrj.impl.HttpSolrClient$RemoteSolrException: Error from server at https://127.0.0.1:39051/solr: collection already exists: collection1
   [junit4]    > 	at __randomizedtesting.SeedInfo.seed([6B7AB9A74EAE55C5:E32E867DE052383D]:0)
   [junit4]    > 	at org.apache.solr.client.solrj.impl.HttpSolrClient.executeMethod(HttpSolrClient.java:643)
   [junit4]    > 	at org.apache.solr.client.solrj.impl.HttpSolrClient.request(HttpSolrClient.java:255)
   [junit4]    > 	at org.apache.solr.client.solrj.impl.HttpSolrClient.request(HttpSolrClient.java:244)
   [junit4]    > 	at org.apache.solr.client.solrj.impl.LBHttpSolrClient.doRequest(LBHttpSolrClient.java:483)
   [junit4]    > 	at org.apache.solr.client.solrj.impl.LBHttpSolrClient.request(LBHttpSolrClient.java:413)
   [junit4]    > 	at org.apache.solr.client.solrj.impl.CloudSolrClient.sendRequest(CloudSolrClient.java:1106)
   [junit4]    > 	at org.apache.solr.client.solrj.impl.CloudSolrClient.requestWithRetryOnStaleState(CloudSolrClient.java:886)
   [junit4]    > 	at org.apache.solr.client.solrj.impl.CloudSolrClient.request(CloudSolrClient.java:819)
   [junit4]    > 	at org.apache.solr.client.solrj.SolrRequest.process(SolrRequest.java:194)
   [junit4]    > 	at org.apache.solr.client.solrj.SolrRequest.process(SolrRequest.java:211)
   [junit4]    > 	at org.apache.solr.cloud.LeaderTragicEventTest.test(LeaderTragicEventTest.java:70)
   [junit4]    > 	at java.lang.Thread.run(Thread.java:748)
   [junit4]   2> 969432 INFO  (jetty-closer-1870-thread-2) [    ] o.e.j.s.AbstractConnector Stopped ServerConnector@94620a5{SSL,[ssl, http/1.1]}{127.0.0.1:0}
   [junit4]   2> 969433 INFO  (jetty-closer-1870-thread-2) [    ] o.a.s.c.CoreContainer Shutting down CoreContainer instance=611187082
   [junit4]   2> 969433 INFO  (jetty-closer-1870-thread-2) [    ] o.a.s.m.SolrMetricManager Closing metric reporters for registry=solr.node, tag=null
   [junit4]   2> 969433 INFO  (jetty-closer-1870-thread-2) [    ] o.a.s.m.r.SolrJmxReporter Closing reporter [org.apache.solr.metrics.reporters.SolrJmxReporter@14554254: rootName = solr_39051, domain = solr.node, service url = null, agent id = null] for registry solr.node / com.codahale.metrics.MetricRegistry@7d861ed3
   [junit4]   2> 969437 INFO  (jetty-closer-1870-thread-2) [    ] o.a.s.m.SolrMetricManager Closing metric reporters for registry=solr.jvm, tag=null
   [junit4]   2> 969437 INFO  (jetty-closer-1870-thread-2) [    ] o.a.s.m.r.SolrJmxReporter Closing reporter [org.apache.solr.metrics.reporters.SolrJmxReporter@7a75feec: rootName = solr_39051, domain = solr.jvm, service url = null, agent id = null] for registry solr.jvm / com.codahale.metrics.MetricRegistry@189629f2
   [junit4]   2> 969440 INFO  (jetty-closer-1870-thread-2) [    ] o.a.s.m.SolrMetricManager Closing metric reporters for registry=solr.jetty, tag=null
   [junit4]   2> 969440 INFO  (jetty-closer-1870-thread-2) [    ] o.a.s.m.r.SolrJmxReporter Closing reporter [org.apache.solr.metrics.reporters.SolrJmxReporter@2c412f62: rootName = solr_39051, domain = solr.jetty, service url = null, agent id = null] for registry solr.jetty / com.codahale.metrics.MetricRegistry@636bc8d
   [junit4]   2> 969441 INFO  (jetty-closer-1870-thread-2) [    ] o.a.s.c.ZkController Remove node as live in ZooKeeper:/live_nodes/127.0.0.1:39051_solr
   [junit4]   2> 969441 INFO  (jetty-closer-1870-thread-2) [    ] o.a.s.m.SolrMetricManager Closing metric reporters for registry=solr.cluster, tag=null
   [junit4]   2> 969441 INFO  (zkCallback-1881-thread-2) [    ] o.a.s.c.c.ZkStateReader Updated live nodes from ZooKeeper... (1) -> (0)
   [junit4]   2> 969441 INFO  (zkCallback-1902-thread-1) [    ] o.a.s.c.c.ZkStateReader Updated live nodes from ZooKeeper... (1) -> (0)
   [junit4]   2> 969442 INFO  (coreCloseExecutor-3342-thread-1) [n:127.0.0.1:39051_solr c:collection1 s:shard1 r:core_node4 x:collection1_shard1_replica_n2] o.a.s.c.SolrCore [collection1_shard1_replica_n2]  CLOSING SolrCore org.apache.solr.core.SolrCore@5b6f484b
   [junit4]   2> 969442 INFO  (coreCloseExecutor-3342-thread-1) [n:127.0.0.1:39051_solr c:collection1 s:shard1 r:core_node4 x:collection1_shard1_replica_n2] o.a.s.m.SolrMetricManager Closing metric reporters for registry=solr.core.collection1.shard1.replica_n2, tag=5b6f484b
   [junit4]   2> 969442 INFO  (coreCloseExecutor-3342-thread-1) [n:127.0.0.1:39051_solr c:collection1 s:shard1 r:core_node4 x:collection1_shard1_replica_n2] o.a.s.m.r.SolrJmxReporter Closing reporter [org.apache.solr.metrics.reporters.SolrJmxReporter@57677168: rootName = solr_39051, domain = solr.core.collection1.shard1.replica_n2, service url = null, agent id = null] for registry solr.core.collection1.shard1.replica_n2 / com.codahale.metrics.MetricRegistry@103ddcd7
   [junit4]   2> 969449 INFO  (coreCloseExecutor-3342-thread-1) [n:127.0.0.1:39051_solr c:collection1 s:shard1 r:core_node4 x:collection1_shard1_replica_n2] o.a.s.m.SolrMetricManager Closing metric reporters for registry=solr.collection.collection1.shard1.leader, tag=5b6f484b
   [junit4]   2> 969451 INFO  (jetty-closer-1870-thread-2) [    ] o.a.s.c.Overseer Overseer (id=72120639222185988-127.0.0.1:39051_solr-n_0000000001) closing
   [junit4]   2> 969451 INFO  (OverseerStateUpdate-72120639222185988-127.0.0.1:39051_solr-n_0000000001) [    ] o.a.s.c.Overseer Overseer Loop exiting : 127.0.0.1:39051_solr
   [junit4]   2> 969452 WARN  (OverseerAutoScalingTriggerThread-72120639222185988-127.0.0.1:39051_solr-n_0000000001) [    ] o.a.s.c.a.OverseerTriggerThread OverseerTriggerThread woken up but we are closed, exiting.
   [junit4]   2> 969457 INFO  (jetty-closer-1870-thread-2) [    ] o.e.j.s.h.ContextHandler Stopped o.e.j.s.ServletContextHandler@7463c340{/solr,null,UNAVAILABLE}
   [junit4]   2> 969457 INFO  (jetty-closer-1870-thread-2) [    ] o.e.j.s.session node0 Stopped scavenging
   [junit4]   2> 969458 ERROR (SUITE-LeaderTragicEventTest-seed#[6B7AB9A74EAE55C5]-worker) [    ] o.a.z.s.ZooKeeperServer ZKShutdownHandler is not registered, so ZooKeeper server won't take any action on ERROR or SHUTDOWN server state changes
   [junit4]   2> 969458 INFO  (SUITE-LeaderTragicEventTest-seed#[6B7AB9A74EAE55C5]-worker) [    ] o.a.s.c.ZkTestServer connecting to 127.0.0.1:44853 44853
   [junit4]   2> 970119 INFO  (Thread-2021) [    ] o.a.s.c.ZkTestServer connecting to 127.0.0.1:44853 44853
   [junit4]   2> 970120 WARN  (Thread-2021) [    ] o.a.s.c.ZkTestServer Watch limit violations: 
   [junit4]   2> Maximum concurrent create/delete watches above limit:
   [junit4]   2> 
   [junit4]   2> 	6	/solr/collections/collection1/terms/shard1
   [junit4]   2> 	5	/solr/aliases.json
   [junit4]   2> 	2	/solr/security.json
   [junit4]   2> 	2	/solr/configs/config
   [junit4]   2> 
   [junit4]   2> Maximum concurrent data watches above limit:
   [junit4]   2> 
   [junit4]   2> 	5	/solr/clusterstate.json
   [junit4]   2> 	5	/solr/clusterprops.json
   [junit4]   2> 	3	/solr/collections/collection1/state.json
   [junit4]   2> 	2	/solr/autoscaling.json
   [junit4]   2> 
   [junit4]   2> Maximum concurrent children watches above limit:
   [junit4]   2> 
   [junit4]   2> 	5	/solr/live_nodes
   [junit4]   2> 	5	/solr/collections
   [junit4]   2> 	2	/solr/overseer/queue
   [junit4]   2> 	2	/solr/autoscaling/events/.scheduled_maintenance
   [junit4]   2> 	2	/solr/autoscaling/events/.auto_add_replicas
   [junit4]   2> 	2	/solr/overseer/queue-work
   [junit4]   2> 	2	/solr/overseer/collection-queue-work
   [junit4]   2> 
   [junit4]   2> NOTE: leaving temporary files on disk at: /home/jenkins/workspace/Lucene-Solr-7.x-Linux/solr/build/solr-core/test/J1/temp/solr.cloud.LeaderTragicEventTest_6B7AB9A74EAE55C5-001
   [junit4]   2> NOTE: test params are: codec=Asserting(Lucene70): {}, docValues:{}, maxPointsInLeafNode=728, maxMBSortInHeap=5.735384506037827, sim=RandomSimilarity(queryNorm=true): {}, locale=es-CL, timezone=UCT
   [junit4]   2> NOTE: Linux 4.15.0-24-generic amd64/Oracle Corporation 1.8.0_172 (64-bit)/cpus=8,threads=1,free=141748808,total=518979584
   [junit4]   2> NOTE: All tests run in this JVM: [TestExportWriter, TestSimDistributedQueue, TestCoreAdminApis, TestSolr4Spatial2, CoreAdminOperationTest, TermVectorComponentDistributedTest, IndexSchemaTest, TestBinaryResponseWriter, TestManagedResourceStorage, TestPartialUpdateDeduplication, TestJavabinTupleStreamParser, NumberUtilsTest, BasicDistributedZkTest, ActionThrottleTest, DistribJoinFromCollectionTest, ReplaceNodeNoTargetTest, HighlighterTest, TestRecovery, TestCopyFieldCollectionResource, SearchHandlerTest, TestDistributedSearch, OverseerModifyCollectionTest, TestImplicitCoreProperties, HttpPartitionOnCommitTest, DeleteStatusTest, TestDocBasedVersionConstraints, JsonLoaderTest, MetricsHistoryIntegrationTest, TestSlowCompositeReaderWrapper, ImplicitSnitchTest, TestCloudInspectUtil, TestFreeTextSuggestions, HdfsRecoverLeaseTest, TestRawResponseWriter, TestSurroundQueryParser, TestInPlaceUpdatesDistrib, HdfsAutoAddReplicasIntegrationTest, CachingDirectoryFactoryTest, TestPseudoReturnFields, TestLRUCache, AddBlockUpdateTest, TriLevelCompositeIdRoutingTest, CustomCollectionTest, TestRandomFaceting, TestTestInjection, FieldMutatingUpdateProcessorTest, TestFieldCacheReopen, TestSubQueryTransformerCrossCore, TestOverriddenPrefixQueryForCustomFieldType, TestFieldCollectionResource, DirectoryFactoryTest, TestHighlightDedupGrouping, TestNodeAddedTrigger, UtilsToolTest, TestDirectoryFactory, TestImpersonationWithHadoopAuth, TestClusterStateProvider, SolrIndexMetricsTest, SharedFSAutoReplicaFailoverTest, TestLegacyFieldReuse, TestJmxIntegration, TestConfigSetProperties, TestUnInvertedFieldException, TestLeaderElectionWithEmptyReplica, TestMacros, TestSolrCloudSnapshots, AutoscalingHistoryHandlerTest, TestComponentsName, EnumFieldTest, SynonymTokenizerTest, MetricsConfigTest, ScriptEngineTest, MultiSolrCloudTestCaseTest, ConfigSetsAPITest, TestConfig, DistributedQueryElevationComponentTest, MetricTriggerIntegrationTest, TestCloudSearcherWarming, RecoveryAfterSoftCommitTest, TestSortByMinMaxFunction, TestClusterStateMutator, SpellPossibilityIteratorTest, ClassificationUpdateProcessorF

[...truncated too long message...]

.solr.client.solrj.impl.CloudSolrClient.requestWithRetryOnStaleState(CloudSolrClient.java:886)
   [junit4]    > 	at org.apache.solr.client.solrj.impl.CloudSolrClient.request(CloudSolrClient.java:819)
   [junit4]    > 	at org.apache.solr.client.solrj.SolrRequest.process(SolrRequest.java:194)
   [junit4]    > 	at org.apache.solr.client.solrj.SolrRequest.process(SolrRequest.java:211)
   [junit4]    > 	at org.apache.solr.cloud.LeaderTragicEventTest.test(LeaderTragicEventTest.java:70)
   [junit4]    > 	at java.lang.Thread.run(Thread.java:748)
   [junit4]   2> 106102 INFO  (jetty-closer-126-thread-2) [    ] o.e.j.s.AbstractConnector Stopped ServerConnector@975f091{SSL,[ssl, http/1.1]}{127.0.0.1:0}
   [junit4]   2> 106103 INFO  (jetty-closer-126-thread-2) [    ] o.a.s.c.CoreContainer Shutting down CoreContainer instance=477891547
   [junit4]   2> 106103 INFO  (jetty-closer-126-thread-2) [    ] o.a.s.m.SolrMetricManager Closing metric reporters for registry=solr.node, tag=null
   [junit4]   2> 106103 INFO  (jetty-closer-126-thread-2) [    ] o.a.s.m.r.SolrJmxReporter Closing reporter [org.apache.solr.metrics.reporters.SolrJmxReporter@657a9f65: rootName = solr_34397, domain = solr.node, service url = null, agent id = null] for registry solr.node / com.codahale.metrics.MetricRegistry@4856b1bd
   [junit4]   2> 106107 INFO  (jetty-closer-126-thread-2) [    ] o.a.s.m.SolrMetricManager Closing metric reporters for registry=solr.jvm, tag=null
   [junit4]   2> 106107 INFO  (jetty-closer-126-thread-2) [    ] o.a.s.m.r.SolrJmxReporter Closing reporter [org.apache.solr.metrics.reporters.SolrJmxReporter@7c48cd8e: rootName = solr_34397, domain = solr.jvm, service url = null, agent id = null] for registry solr.jvm / com.codahale.metrics.MetricRegistry@3a90ffa2
   [junit4]   2> 106109 INFO  (jetty-closer-126-thread-2) [    ] o.a.s.m.SolrMetricManager Closing metric reporters for registry=solr.jetty, tag=null
   [junit4]   2> 106109 INFO  (jetty-closer-126-thread-2) [    ] o.a.s.m.r.SolrJmxReporter Closing reporter [org.apache.solr.metrics.reporters.SolrJmxReporter@78060098: rootName = solr_34397, domain = solr.jetty, service url = null, agent id = null] for registry solr.jetty / com.codahale.metrics.MetricRegistry@62d8fb55
   [junit4]   2> 106110 INFO  (jetty-closer-126-thread-2) [    ] o.a.s.c.ZkController Remove node as live in ZooKeeper:/live_nodes/127.0.0.1:34397_solr
   [junit4]   2> 106110 INFO  (zkCallback-137-thread-2) [    ] o.a.s.c.c.ZkStateReader Updated live nodes from ZooKeeper... (1) -> (0)
   [junit4]   2> 106110 INFO  (zkCallback-152-thread-1) [    ] o.a.s.c.c.ZkStateReader Updated live nodes from ZooKeeper... (1) -> (0)
   [junit4]   2> 106110 INFO  (jetty-closer-126-thread-2) [    ] o.a.s.m.SolrMetricManager Closing metric reporters for registry=solr.cluster, tag=null
   [junit4]   2> 106111 INFO  (coreCloseExecutor-171-thread-1) [n:127.0.0.1:34397_solr c:collection1 s:shard1 r:core_node4 x:collection1_shard1_replica_n2] o.a.s.c.SolrCore [collection1_shard1_replica_n2]  CLOSING SolrCore org.apache.solr.core.SolrCore@1ff7b0f6
   [junit4]   2> 106111 INFO  (coreCloseExecutor-171-thread-1) [n:127.0.0.1:34397_solr c:collection1 s:shard1 r:core_node4 x:collection1_shard1_replica_n2] o.a.s.m.SolrMetricManager Closing metric reporters for registry=solr.core.collection1.shard1.replica_n2, tag=1ff7b0f6
   [junit4]   2> 106111 INFO  (coreCloseExecutor-171-thread-1) [n:127.0.0.1:34397_solr c:collection1 s:shard1 r:core_node4 x:collection1_shard1_replica_n2] o.a.s.m.r.SolrJmxReporter Closing reporter [org.apache.solr.metrics.reporters.SolrJmxReporter@26a1dd65: rootName = solr_34397, domain = solr.core.collection1.shard1.replica_n2, service url = null, agent id = null] for registry solr.core.collection1.shard1.replica_n2 / com.codahale.metrics.MetricRegistry@53740b7b
   [junit4]   2> 106116 INFO  (coreCloseExecutor-171-thread-1) [n:127.0.0.1:34397_solr c:collection1 s:shard1 r:core_node4 x:collection1_shard1_replica_n2] o.a.s.m.SolrMetricManager Closing metric reporters for registry=solr.collection.collection1.shard1.leader, tag=1ff7b0f6
   [junit4]   2> 106119 INFO  (jetty-closer-126-thread-2) [    ] o.a.s.c.Overseer Overseer (id=72121150107090948-127.0.0.1:34397_solr-n_0000000000) closing
   [junit4]   2> 106119 INFO  (OverseerStateUpdate-72121150107090948-127.0.0.1:34397_solr-n_0000000000) [    ] o.a.s.c.Overseer Overseer Loop exiting : 127.0.0.1:34397_solr
   [junit4]   2> 106120 WARN  (OverseerAutoScalingTriggerThread-72121150107090948-127.0.0.1:34397_solr-n_0000000000) [    ] o.a.s.c.a.OverseerTriggerThread OverseerTriggerThread woken up but we are closed, exiting.
   [junit4]   2> 106121 INFO  (jetty-closer-126-thread-2) [    ] o.e.j.s.h.ContextHandler Stopped o.e.j.s.ServletContextHandler@198cae04{/solr,null,UNAVAILABLE}
   [junit4]   2> 106121 INFO  (jetty-closer-126-thread-2) [    ] o.e.j.s.session node0 Stopped scavenging
   [junit4]   2> 106122 ERROR (SUITE-LeaderTragicEventTest-seed#[6B7AB9A74EAE55C5]-worker) [    ] o.a.z.s.ZooKeeperServer ZKShutdownHandler is not registered, so ZooKeeper server won't take any action on ERROR or SHUTDOWN server state changes
   [junit4]   2> 106122 INFO  (SUITE-LeaderTragicEventTest-seed#[6B7AB9A74EAE55C5]-worker) [    ] o.a.s.c.ZkTestServer connecting to 127.0.0.1:36181 36181
   [junit4]   2> 106152 INFO  (Thread-89) [    ] o.a.s.c.ZkTestServer connecting to 127.0.0.1:36181 36181
   [junit4]   2> 106153 WARN  (Thread-89) [    ] o.a.s.c.ZkTestServer Watch limit violations: 
   [junit4]   2> Maximum concurrent create/delete watches above limit:
   [junit4]   2> 
   [junit4]   2> 	5	/solr/aliases.json
   [junit4]   2> 	5	/solr/collections/collection1/terms/shard1
   [junit4]   2> 	2	/solr/security.json
   [junit4]   2> 	2	/solr/configs/config
   [junit4]   2> 
   [junit4]   2> Maximum concurrent data watches above limit:
   [junit4]   2> 
   [junit4]   2> 	5	/solr/clusterstate.json
   [junit4]   2> 	5	/solr/clusterprops.json
   [junit4]   2> 	3	/solr/collections/collection1/state.json
   [junit4]   2> 
   [junit4]   2> Maximum concurrent children watches above limit:
   [junit4]   2> 
   [junit4]   2> 	5	/solr/live_nodes
   [junit4]   2> 	5	/solr/collections
   [junit4]   2> 
   [junit4]   2> NOTE: leaving temporary files on disk at: /home/jenkins/workspace/Lucene-Solr-7.x-Linux/solr/build/solr-core/test/J2/temp/solr.cloud.LeaderTragicEventTest_6B7AB9A74EAE55C5-001
   [junit4]   2> Jul 13, 2018 4:50:15 PM com.carrotsearch.randomizedtesting.ThreadLeakControl checkThreadLeaks
   [junit4]   2> WARNING: Will linger awaiting termination of 4 leaked thread(s).
   [junit4]   2> NOTE: test params are: codec=Asserting(Lucene70): {}, docValues:{}, maxPointsInLeafNode=728, maxMBSortInHeap=5.735384506037827, sim=RandomSimilarity(queryNorm=true): {}, locale=es-CL, timezone=UCT
   [junit4]   2> NOTE: Linux 4.15.0-24-generic amd64/Oracle Corporation 1.8.0_172 (64-bit)/cpus=8,threads=1,free=430274464,total=518979584
   [junit4]   2> NOTE: All tests run in this JVM: [LeaderTragicEventTest, LeaderTragicEventTest, LeaderTragicEventTest]
   [junit4] Completed [10/10 (3!)] on J2 in 4.51s, 2 tests, 2 errors <<< FAILURES!
   [junit4] 
   [junit4] 
   [junit4] Tests with failures [seed: 6B7AB9A74EAE55C5]:
   [junit4]   - org.apache.solr.cloud.LeaderTragicEventTest.testOtherReplicasAreNotActive
   [junit4]   - org.apache.solr.cloud.LeaderTragicEventTest.test
   [junit4]   - org.apache.solr.cloud.LeaderTragicEventTest.testOtherReplicasAreNotActive
   [junit4]   - org.apache.solr.cloud.LeaderTragicEventTest.test
   [junit4]   - org.apache.solr.cloud.LeaderTragicEventTest.testOtherReplicasAreNotActive
   [junit4]   - org.apache.solr.cloud.LeaderTragicEventTest.test
   [junit4] 
   [junit4] 
   [junit4] JVM J0:     0.45 ..    65.14 =    64.69s
   [junit4] JVM J1:     0.65 ..    73.30 =    72.66s
   [junit4] JVM J2:     0.68 ..   106.89 =   106.21s
   [junit4] Execution time total: 1 minute 47 seconds
   [junit4] Tests summary: 10 suites, 15 tests, 6 errors

BUILD FAILED
/home/jenkins/workspace/Lucene-Solr-7.x-Linux/lucene/common-build.xml:1568: The following error occurred while executing this line:
/home/jenkins/workspace/Lucene-Solr-7.x-Linux/lucene/common-build.xml:1092: There were test failures: 10 suites, 15 tests, 6 errors [seed: 6B7AB9A74EAE55C5]

Total time: 1 minute 48 seconds

[repro] Setting last failure code to 256

[repro] Failures:
[repro]   0/5 failed: org.apache.solr.handler.TestHdfsBackupRestoreCore
[repro]   3/5 failed: org.apache.solr.cloud.LeaderTragicEventTest
[repro] Exiting with code 256
+ mv lucene/build lucene/build.repro
+ mv solr/build solr/build.repro
+ mv lucene/build.orig lucene/build
+ mv solr/build.orig solr/build
Archiving artifacts
Setting ANT_1_8_2_HOME=/var/lib/jenkins/tools/hudson.tasks.Ant_AntInstallation/ANT_1.8.2
[WARNINGS] Parsing warnings in console log with parser Java Compiler (javac)
Setting ANT_1_8_2_HOME=/var/lib/jenkins/tools/hudson.tasks.Ant_AntInstallation/ANT_1.8.2
Setting ANT_1_8_2_HOME=/var/lib/jenkins/tools/hudson.tasks.Ant_AntInstallation/ANT_1.8.2
<Git Blamer> Using GitBlamer to create author and commit information for all warnings.
<Git Blamer> GIT_COMMIT=1c11dcf8fbf2b3acbda22a27df65138e3ebbeccb, workspace=/var/lib/jenkins/workspace/Lucene-Solr-7.x-Linux
[WARNINGS] Computing warning deltas based on reference build #2315
Recording test results
Setting ANT_1_8_2_HOME=/var/lib/jenkins/tools/hudson.tasks.Ant_AntInstallation/ANT_1.8.2
Build step 'Publish JUnit test result report' changed build result to UNSTABLE
Email was triggered for: Unstable (Test Failures)
Sending email for trigger: Unstable (Test Failures)
Setting ANT_1_8_2_HOME=/var/lib/jenkins/tools/hudson.tasks.Ant_AntInstallation/ANT_1.8.2
Setting ANT_1_8_2_HOME=/var/lib/jenkins/tools/hudson.tasks.Ant_AntInstallation/ANT_1.8.2
Setting ANT_1_8_2_HOME=/var/lib/jenkins/tools/hudson.tasks.Ant_AntInstallation/ANT_1.8.2
Setting ANT_1_8_2_HOME=/var/lib/jenkins/tools/hudson.tasks.Ant_AntInstallation/ANT_1.8.2

Mime
View raw message