lucene-dev mailing list archives

Site index · List index
Message view « Date » · « Thread »
Top « Date » · « Thread »
From Policeman Jenkins Server <jenk...@thetaphi.de>
Subject [JENKINS] Lucene-Solr-master-Solaris (64bit/jdk1.8.0) - Build # 1942 - Unstable!
Date Sat, 30 Jun 2018 08:40:45 GMT
Build: https://jenkins.thetaphi.de/job/Lucene-Solr-master-Solaris/1942/
Java: 64bit/jdk1.8.0 -XX:+UseCompressedOops -XX:+UseSerialGC

3 tests failed.
FAILED:  org.apache.solr.cloud.MoveReplicaHDFSTest.testFailedMove

Error Message:
No live SolrServers available to handle this request:[http://127.0.0.1:33105/solr/MoveReplicaHDFSTest_failed_coll_true, http://127.0.0.1:37572/solr/MoveReplicaHDFSTest_failed_coll_true]

Stack Trace:
org.apache.solr.client.solrj.SolrServerException: No live SolrServers available to handle this request:[http://127.0.0.1:33105/solr/MoveReplicaHDFSTest_failed_coll_true, http://127.0.0.1:37572/solr/MoveReplicaHDFSTest_failed_coll_true]
	at __randomizedtesting.SeedInfo.seed([94C3A3495C87837D:3E0E70BBEB5456AD]:0)
	at org.apache.solr.client.solrj.impl.LBHttpSolrClient.request(LBHttpSolrClient.java:462)
	at org.apache.solr.client.solrj.impl.CloudSolrClient.sendRequest(CloudSolrClient.java:1106)
	at org.apache.solr.client.solrj.impl.CloudSolrClient.requestWithRetryOnStaleState(CloudSolrClient.java:886)
	at org.apache.solr.client.solrj.impl.CloudSolrClient.requestWithRetryOnStaleState(CloudSolrClient.java:993)
	at org.apache.solr.client.solrj.impl.CloudSolrClient.request(CloudSolrClient.java:819)
	at org.apache.solr.client.solrj.SolrRequest.process(SolrRequest.java:194)
	at org.apache.solr.client.solrj.SolrClient.query(SolrClient.java:942)
	at org.apache.solr.cloud.MoveReplicaTest.testFailedMove(MoveReplicaTest.java:290)
	at sun.reflect.NativeMethodAccessorImpl.invoke0(Native Method)
	at sun.reflect.NativeMethodAccessorImpl.invoke(NativeMethodAccessorImpl.java:62)
	at sun.reflect.DelegatingMethodAccessorImpl.invoke(DelegatingMethodAccessorImpl.java:43)
	at java.lang.reflect.Method.invoke(Method.java:498)
	at com.carrotsearch.randomizedtesting.RandomizedRunner.invoke(RandomizedRunner.java:1737)
	at com.carrotsearch.randomizedtesting.RandomizedRunner$8.evaluate(RandomizedRunner.java:934)
	at com.carrotsearch.randomizedtesting.RandomizedRunner$9.evaluate(RandomizedRunner.java:970)
	at com.carrotsearch.randomizedtesting.RandomizedRunner$10.evaluate(RandomizedRunner.java:984)
	at com.carrotsearch.randomizedtesting.rules.SystemPropertiesRestoreRule$1.evaluate(SystemPropertiesRestoreRule.java:57)
	at org.apache.lucene.util.TestRuleSetupTeardownChained$1.evaluate(TestRuleSetupTeardownChained.java:49)
	at org.apache.lucene.util.AbstractBeforeAfterRule$1.evaluate(AbstractBeforeAfterRule.java:45)
	at org.apache.lucene.util.TestRuleThreadAndTestName$1.evaluate(TestRuleThreadAndTestName.java:48)
	at org.apache.lucene.util.TestRuleIgnoreAfterMaxFailures$1.evaluate(TestRuleIgnoreAfterMaxFailures.java:64)
	at org.apache.lucene.util.TestRuleMarkFailure$1.evaluate(TestRuleMarkFailure.java:47)
	at com.carrotsearch.randomizedtesting.rules.StatementAdapter.evaluate(StatementAdapter.java:36)
	at com.carrotsearch.randomizedtesting.ThreadLeakControl$StatementRunner.run(ThreadLeakControl.java:368)
	at com.carrotsearch.randomizedtesting.ThreadLeakControl.forkTimeoutingTask(ThreadLeakControl.java:817)
	at com.carrotsearch.randomizedtesting.ThreadLeakControl$3.evaluate(ThreadLeakControl.java:468)
	at com.carrotsearch.randomizedtesting.RandomizedRunner.runSingleTest(RandomizedRunner.java:943)
	at com.carrotsearch.randomizedtesting.RandomizedRunner$5.evaluate(RandomizedRunner.java:829)
	at com.carrotsearch.randomizedtesting.RandomizedRunner$6.evaluate(RandomizedRunner.java:879)
	at com.carrotsearch.randomizedtesting.RandomizedRunner$7.evaluate(RandomizedRunner.java:890)
	at com.carrotsearch.randomizedtesting.rules.StatementAdapter.evaluate(StatementAdapter.java:36)
	at com.carrotsearch.randomizedtesting.rules.SystemPropertiesRestoreRule$1.evaluate(SystemPropertiesRestoreRule.java:57)
	at org.apache.lucene.util.AbstractBeforeAfterRule$1.evaluate(AbstractBeforeAfterRule.java:45)
	at com.carrotsearch.randomizedtesting.rules.StatementAdapter.evaluate(StatementAdapter.java:36)
	at org.apache.lucene.util.TestRuleStoreClassName$1.evaluate(TestRuleStoreClassName.java:41)
	at com.carrotsearch.randomizedtesting.rules.NoShadowingOrOverridesOnMethodsRule$1.evaluate(NoShadowingOrOverridesOnMethodsRule.java:40)
	at com.carrotsearch.randomizedtesting.rules.NoShadowingOrOverridesOnMethodsRule$1.evaluate(NoShadowingOrOverridesOnMethodsRule.java:40)
	at com.carrotsearch.randomizedtesting.rules.StatementAdapter.evaluate(StatementAdapter.java:36)
	at com.carrotsearch.randomizedtesting.rules.StatementAdapter.evaluate(StatementAdapter.java:36)
	at com.carrotsearch.randomizedtesting.rules.StatementAdapter.evaluate(StatementAdapter.java:36)
	at org.apache.lucene.util.TestRuleAssertionsRequired$1.evaluate(TestRuleAssertionsRequired.java:53)
	at org.apache.lucene.util.TestRuleMarkFailure$1.evaluate(TestRuleMarkFailure.java:47)
	at org.apache.lucene.util.TestRuleIgnoreAfterMaxFailures$1.evaluate(TestRuleIgnoreAfterMaxFailures.java:64)
	at org.apache.lucene.util.TestRuleIgnoreTestSuites$1.evaluate(TestRuleIgnoreTestSuites.java:54)
	at com.carrotsearch.randomizedtesting.rules.StatementAdapter.evaluate(StatementAdapter.java:36)
	at com.carrotsearch.randomizedtesting.ThreadLeakControl$StatementRunner.run(ThreadLeakControl.java:368)
	at java.lang.Thread.run(Thread.java:748)
Caused by: org.apache.solr.client.solrj.impl.HttpSolrClient$RemoteSolrException: Error from server at http://127.0.0.1:33105/solr/MoveReplicaHDFSTest_failed_coll_true: no servers hosting shard: shard1
	at org.apache.solr.client.solrj.impl.HttpSolrClient.executeMethod(HttpSolrClient.java:643)
	at org.apache.solr.client.solrj.impl.HttpSolrClient.request(HttpSolrClient.java:255)
	at org.apache.solr.client.solrj.impl.HttpSolrClient.request(HttpSolrClient.java:244)
	at org.apache.solr.client.solrj.impl.LBHttpSolrClient.doRequest(LBHttpSolrClient.java:483)
	at org.apache.solr.client.solrj.impl.LBHttpSolrClient.request(LBHttpSolrClient.java:436)
	... 46 more


FAILED:  org.apache.solr.search.TestRecovery.testExistOldBufferLog

Error Message:
Test abandoned because suite timeout was reached.

Stack Trace:
java.lang.Exception: Test abandoned because suite timeout was reached.
	at __randomizedtesting.SeedInfo.seed([94C3A3495C87837D]:0)


FAILED:  junit.framework.TestSuite.org.apache.solr.search.TestRecovery

Error Message:
Suite timeout exceeded (>= 7200000 msec).

Stack Trace:
java.lang.Exception: Suite timeout exceeded (>= 7200000 msec).
	at __randomizedtesting.SeedInfo.seed([94C3A3495C87837D]:0)




Build Log:
[...truncated 13926 lines...]
   [junit4] Suite: org.apache.solr.cloud.MoveReplicaHDFSTest
   [junit4]   2> Creating dataDir: /export/home/jenkins/workspace/Lucene-Solr-master-Solaris/solr/build/solr-core/test/J1/temp/solr.cloud.MoveReplicaHDFSTest_94C3A3495C87837D-001/init-core-data-001
   [junit4]   2> 2317844 WARN  (SUITE-MoveReplicaHDFSTest-seed#[94C3A3495C87837D]-worker) [    ] o.a.s.SolrTestCaseJ4 startTrackingSearchers: numOpens=16 numCloses=16
   [junit4]   2> 2317845 INFO  (SUITE-MoveReplicaHDFSTest-seed#[94C3A3495C87837D]-worker) [    ] o.a.s.SolrTestCaseJ4 Using PointFields (NUMERIC_POINTS_SYSPROP=true) w/NUMERIC_DOCVALUES_SYSPROP=false
   [junit4]   2> 2317846 INFO  (SUITE-MoveReplicaHDFSTest-seed#[94C3A3495C87837D]-worker) [    ] o.a.s.SolrTestCaseJ4 Randomized ssl (false) and clientAuth (false) via: @org.apache.solr.util.RandomizeSSL(reason=, value=NaN, ssl=NaN, clientAuth=NaN)
   [junit4]   2> 2317846 INFO  (SUITE-MoveReplicaHDFSTest-seed#[94C3A3495C87837D]-worker) [    ] o.a.s.SolrTestCaseJ4 SecureRandom sanity checks: test.solr.allowed.securerandom=null & java.security.egd=file:/dev/./urandom
   [junit4]   2> 2317846 INFO  (SUITE-MoveReplicaHDFSTest-seed#[94C3A3495C87837D]-worker) [    ] o.a.s.c.MiniSolrCloudCluster Starting cluster of 4 servers in /export/home/jenkins/workspace/Lucene-Solr-master-Solaris/solr/build/solr-core/test/J1/temp/solr.cloud.MoveReplicaHDFSTest_94C3A3495C87837D-001/tempDir-001
   [junit4]   2> 2317847 INFO  (SUITE-MoveReplicaHDFSTest-seed#[94C3A3495C87837D]-worker) [    ] o.a.s.c.ZkTestServer STARTING ZK TEST SERVER
   [junit4]   2> 2317847 INFO  (Thread-4086) [    ] o.a.s.c.ZkTestServer client port:0.0.0.0/0.0.0.0:0
   [junit4]   2> 2317847 INFO  (Thread-4086) [    ] o.a.s.c.ZkTestServer Starting server
   [junit4]   2> 2317851 ERROR (Thread-4086) [    ] o.a.z.s.ZooKeeperServer ZKShutdownHandler is not registered, so ZooKeeper server won't take any action on ERROR or SHUTDOWN server state changes
   [junit4]   2> 2317947 INFO  (SUITE-MoveReplicaHDFSTest-seed#[94C3A3495C87837D]-worker) [    ] o.a.s.c.ZkTestServer start zk server on port:43303
   [junit4]   2> 2317955 INFO  (zkConnectionManagerCallback-5964-thread-1) [    ] o.a.s.c.c.ConnectionManager zkClient has connected
   [junit4]   2> 2317968 INFO  (jetty-launcher-5961-thread-2) [    ] o.e.j.s.Server jetty-9.4.11.v20180605; built: 2018-06-05T18:24:03.829Z; git: d5fc0523cfa96bfebfbda19606cad384d772f04c; jvm 1.8.0_172-b11
   [junit4]   2> 2317968 INFO  (jetty-launcher-5961-thread-1) [    ] o.e.j.s.Server jetty-9.4.11.v20180605; built: 2018-06-05T18:24:03.829Z; git: d5fc0523cfa96bfebfbda19606cad384d772f04c; jvm 1.8.0_172-b11
   [junit4]   2> 2317968 INFO  (jetty-launcher-5961-thread-4) [    ] o.e.j.s.Server jetty-9.4.11.v20180605; built: 2018-06-05T18:24:03.829Z; git: d5fc0523cfa96bfebfbda19606cad384d772f04c; jvm 1.8.0_172-b11
   [junit4]   2> 2317969 INFO  (jetty-launcher-5961-thread-3) [    ] o.e.j.s.Server jetty-9.4.11.v20180605; built: 2018-06-05T18:24:03.829Z; git: d5fc0523cfa96bfebfbda19606cad384d772f04c; jvm 1.8.0_172-b11
   [junit4]   2> 2317969 INFO  (jetty-launcher-5961-thread-2) [    ] o.e.j.s.session DefaultSessionIdManager workerName=node0
   [junit4]   2> 2317969 INFO  (jetty-launcher-5961-thread-2) [    ] o.e.j.s.session No SessionScavenger set, using defaults
   [junit4]   2> 2317969 INFO  (jetty-launcher-5961-thread-2) [    ] o.e.j.s.session node0 Scavenging every 660000ms
   [junit4]   2> 2317970 INFO  (jetty-launcher-5961-thread-2) [    ] o.e.j.s.h.ContextHandler Started o.e.j.s.ServletContextHandler@624ae3a6{/solr,null,AVAILABLE}
   [junit4]   2> 2317970 INFO  (jetty-launcher-5961-thread-4) [    ] o.e.j.s.session DefaultSessionIdManager workerName=node0
   [junit4]   2> 2317970 INFO  (jetty-launcher-5961-thread-4) [    ] o.e.j.s.session No SessionScavenger set, using defaults
   [junit4]   2> 2317970 INFO  (jetty-launcher-5961-thread-4) [    ] o.e.j.s.session node0 Scavenging every 600000ms
   [junit4]   2> 2317971 INFO  (jetty-launcher-5961-thread-1) [    ] o.e.j.s.session DefaultSessionIdManager workerName=node0
   [junit4]   2> 2317971 INFO  (jetty-launcher-5961-thread-1) [    ] o.e.j.s.session No SessionScavenger set, using defaults
   [junit4]   2> 2317971 INFO  (jetty-launcher-5961-thread-1) [    ] o.e.j.s.session node0 Scavenging every 660000ms
   [junit4]   2> 2317971 INFO  (jetty-launcher-5961-thread-1) [    ] o.e.j.s.h.ContextHandler Started o.e.j.s.ServletContextHandler@3c38d2b7{/solr,null,AVAILABLE}
   [junit4]   2> 2317972 INFO  (jetty-launcher-5961-thread-2) [    ] o.e.j.s.AbstractConnector Started ServerConnector@7c2b4639{HTTP/1.1,[http/1.1]}{127.0.0.1:33105}
   [junit4]   2> 2317973 INFO  (jetty-launcher-5961-thread-2) [    ] o.e.j.s.Server Started @2319218ms
   [junit4]   2> 2317973 INFO  (jetty-launcher-5961-thread-2) [    ] o.a.s.c.s.e.JettySolrRunner Jetty properties: {hostContext=/solr, hostPort=33105}
   [junit4]   2> 2317973 INFO  (jetty-launcher-5961-thread-1) [    ] o.e.j.s.AbstractConnector Started ServerConnector@5168ee6c{HTTP/1.1,[http/1.1]}{127.0.0.1:37572}
   [junit4]   2> 2317973 INFO  (jetty-launcher-5961-thread-1) [    ] o.e.j.s.Server Started @2319219ms
   [junit4]   2> 2317973 INFO  (jetty-launcher-5961-thread-1) [    ] o.a.s.c.s.e.JettySolrRunner Jetty properties: {hostContext=/solr, hostPort=37572}
   [junit4]   2> 2317973 ERROR (jetty-launcher-5961-thread-2) [    ] o.a.s.u.StartupLoggingUtils Missing Java Option solr.log.dir. Logging may be missing or incomplete.
   [junit4]   2> 2317973 INFO  (jetty-launcher-5961-thread-2) [    ] o.a.s.s.SolrDispatchFilter Using logger factory org.apache.logging.slf4j.Log4jLoggerFactory
   [junit4]   2> 2317973 ERROR (jetty-launcher-5961-thread-1) [    ] o.a.s.u.StartupLoggingUtils Missing Java Option solr.log.dir. Logging may be missing or incomplete.
   [junit4]   2> 2317973 INFO  (jetty-launcher-5961-thread-1) [    ] o.a.s.s.SolrDispatchFilter Using logger factory org.apache.logging.slf4j.Log4jLoggerFactory
   [junit4]   2> 2317973 INFO  (jetty-launcher-5961-thread-2) [    ] o.a.s.s.SolrDispatchFilter  ___      _       Welcome to Apache Solr™ version 8.0.0
   [junit4]   2> 2317973 INFO  (jetty-launcher-5961-thread-2) [    ] o.a.s.s.SolrDispatchFilter / __| ___| |_ _   Starting in cloud mode on port null
   [junit4]   2> 2317973 INFO  (jetty-launcher-5961-thread-1) [    ] o.a.s.s.SolrDispatchFilter  ___      _       Welcome to Apache Solr™ version 8.0.0
   [junit4]   2> 2317973 INFO  (jetty-launcher-5961-thread-2) [    ] o.a.s.s.SolrDispatchFilter \__ \/ _ \ | '_|  Install dir: null
   [junit4]   2> 2317973 INFO  (jetty-launcher-5961-thread-1) [    ] o.a.s.s.SolrDispatchFilter / __| ___| |_ _   Starting in cloud mode on port null
   [junit4]   2> 2317973 INFO  (jetty-launcher-5961-thread-2) [    ] o.a.s.s.SolrDispatchFilter |___/\___/_|_|    Start time: 2018-06-30T05:49:38.400Z
   [junit4]   2> 2317973 INFO  (jetty-launcher-5961-thread-1) [    ] o.a.s.s.SolrDispatchFilter \__ \/ _ \ | '_|  Install dir: null
   [junit4]   2> 2317973 INFO  (jetty-launcher-5961-thread-1) [    ] o.a.s.s.SolrDispatchFilter |___/\___/_|_|    Start time: 2018-06-30T05:49:38.400Z
   [junit4]   2> 2317975 INFO  (jetty-launcher-5961-thread-3) [    ] o.e.j.s.session DefaultSessionIdManager workerName=node0
   [junit4]   2> 2317975 INFO  (jetty-launcher-5961-thread-3) [    ] o.e.j.s.session No SessionScavenger set, using defaults
   [junit4]   2> 2317975 INFO  (jetty-launcher-5961-thread-3) [    ] o.e.j.s.session node0 Scavenging every 660000ms
   [junit4]   2> 2317975 INFO  (jetty-launcher-5961-thread-3) [    ] o.e.j.s.h.ContextHandler Started o.e.j.s.ServletContextHandler@2bf50572{/solr,null,AVAILABLE}
   [junit4]   2> 2317975 INFO  (jetty-launcher-5961-thread-3) [    ] o.e.j.s.AbstractConnector Started ServerConnector@45244040{HTTP/1.1,[http/1.1]}{127.0.0.1:62581}
   [junit4]   2> 2317976 INFO  (jetty-launcher-5961-thread-3) [    ] o.e.j.s.Server Started @2319221ms
   [junit4]   2> 2317976 INFO  (jetty-launcher-5961-thread-3) [    ] o.a.s.c.s.e.JettySolrRunner Jetty properties: {hostContext=/solr, hostPort=62581}
   [junit4]   2> 2317976 ERROR (jetty-launcher-5961-thread-3) [    ] o.a.s.u.StartupLoggingUtils Missing Java Option solr.log.dir. Logging may be missing or incomplete.
   [junit4]   2> 2317976 INFO  (jetty-launcher-5961-thread-3) [    ] o.a.s.s.SolrDispatchFilter Using logger factory org.apache.logging.slf4j.Log4jLoggerFactory
   [junit4]   2> 2317976 INFO  (jetty-launcher-5961-thread-3) [    ] o.a.s.s.SolrDispatchFilter  ___      _       Welcome to Apache Solr™ version 8.0.0
   [junit4]   2> 2317976 INFO  (jetty-launcher-5961-thread-3) [    ] o.a.s.s.SolrDispatchFilter / __| ___| |_ _   Starting in cloud mode on port null
   [junit4]   2> 2317976 INFO  (jetty-launcher-5961-thread-3) [    ] o.a.s.s.SolrDispatchFilter \__ \/ _ \ | '_|  Install dir: null
   [junit4]   2> 2317976 INFO  (jetty-launcher-5961-thread-3) [    ] o.a.s.s.SolrDispatchFilter |___/\___/_|_|    Start time: 2018-06-30T05:49:38.403Z
   [junit4]   2> 2317977 INFO  (jetty-launcher-5961-thread-4) [    ] o.e.j.s.h.ContextHandler Started o.e.j.s.ServletContextHandler@78da2d39{/solr,null,AVAILABLE}
   [junit4]   2> 2317977 INFO  (zkConnectionManagerCallback-5967-thread-1) [    ] o.a.s.c.c.ConnectionManager zkClient has connected
   [junit4]   2> 2317978 INFO  (jetty-launcher-5961-thread-4) [    ] o.e.j.s.AbstractConnector Started ServerConnector@62ddb370{HTTP/1.1,[http/1.1]}{127.0.0.1:34831}
   [junit4]   2> 2317978 INFO  (jetty-launcher-5961-thread-4) [    ] o.e.j.s.Server Started @2319224ms
   [junit4]   2> 2317978 INFO  (jetty-launcher-5961-thread-4) [    ] o.a.s.c.s.e.JettySolrRunner Jetty properties: {hostContext=/solr, hostPort=34831}
   [junit4]   2> 2317978 ERROR (jetty-launcher-5961-thread-4) [    ] o.a.s.u.StartupLoggingUtils Missing Java Option solr.log.dir. Logging may be missing or incomplete.
   [junit4]   2> 2317978 INFO  (jetty-launcher-5961-thread-4) [    ] o.a.s.s.SolrDispatchFilter Using logger factory org.apache.logging.slf4j.Log4jLoggerFactory
   [junit4]   2> 2317978 INFO  (jetty-launcher-5961-thread-4) [    ] o.a.s.s.SolrDispatchFilter  ___      _       Welcome to Apache Solr™ version 8.0.0
   [junit4]   2> 2317978 INFO  (jetty-launcher-5961-thread-4) [    ] o.a.s.s.SolrDispatchFilter / __| ___| |_ _   Starting in cloud mode on port null
   [junit4]   2> 2317978 INFO  (jetty-launcher-5961-thread-4) [    ] o.a.s.s.SolrDispatchFilter \__ \/ _ \ | '_|  Install dir: null
   [junit4]   2> 2317978 INFO  (jetty-launcher-5961-thread-4) [    ] o.a.s.s.SolrDispatchFilter |___/\___/_|_|    Start time: 2018-06-30T05:49:38.405Z
   [junit4]   2> 2317978 INFO  (zkConnectionManagerCallback-5968-thread-1) [    ] o.a.s.c.c.ConnectionManager zkClient has connected
   [junit4]   2> 2317979 INFO  (jetty-launcher-5961-thread-2) [    ] o.a.s.s.SolrDispatchFilter solr.xml found in ZooKeeper. Loading...
   [junit4]   2> 2317980 INFO  (jetty-launcher-5961-thread-1) [    ] o.a.s.s.SolrDispatchFilter solr.xml found in ZooKeeper. Loading...
   [junit4]   2> 2317980 INFO  (zkConnectionManagerCallback-5970-thread-1) [    ] o.a.s.c.c.ConnectionManager zkClient has connected
   [junit4]   2> 2317981 INFO  (jetty-launcher-5961-thread-3) [    ] o.a.s.s.SolrDispatchFilter solr.xml found in ZooKeeper. Loading...
   [junit4]   2> 2318008 INFO  (zkConnectionManagerCallback-5972-thread-1) [    ] o.a.s.c.c.ConnectionManager zkClient has connected
   [junit4]   2> 2318010 INFO  (jetty-launcher-5961-thread-4) [    ] o.a.s.s.SolrDispatchFilter solr.xml found in ZooKeeper. Loading...
   [junit4]   2> 2319275 INFO  (jetty-launcher-5961-thread-2) [    ] o.a.s.c.ZkContainer Zookeeper client=127.0.0.1:43303/solr
   [junit4]   2> 2319310 INFO  (zkConnectionManagerCallback-5976-thread-1) [    ] o.a.s.c.c.ConnectionManager zkClient has connected
   [junit4]   2> 2319371 DEBUG (jetty-launcher-5961-thread-2) [n:127.0.0.1:33105_solr    ] o.a.s.c.ZkController Added new OnReconnect listener org.apache.solr.cloud.ZkController$$Lambda$48/354273539@582d124d
   [junit4]   2> 2319372 INFO  (zkConnectionManagerCallback-5978-thread-1) [    ] o.a.s.c.c.ConnectionManager zkClient has connected
   [junit4]   2> 2319440 INFO  (jetty-launcher-5961-thread-3) [    ] o.a.s.c.ZkContainer Zookeeper client=127.0.0.1:43303/solr
   [junit4]   2> 2319448 INFO  (zkConnectionManagerCallback-5984-thread-1) [    ] o.a.s.c.c.ConnectionManager zkClient has connected
   [junit4]   2> 2319454 DEBUG (jetty-launcher-5961-thread-3) [n:127.0.0.1:62581_solr    ] o.a.s.c.ZkController Added new OnReconnect listener org.apache.solr.cloud.ZkController$$Lambda$48/354273539@4a6d80ae
   [junit4]   2> 2319461 INFO  (zkConnectionManagerCallback-5986-thread-1) [    ] o.a.s.c.c.ConnectionManager zkClient has connected
   [junit4]   2> 2319475 DEBUG (SyncThread:0) [    ] o.a.s.c.ZkTestServer Watch added: create/delete: /solr/clusterprops.json
   [junit4]   2> 2319475 DEBUG (SyncThread:0) [    ] o.a.s.c.ZkTestServer Watch added: children: /solr/live_nodes
   [junit4]   2> 2319476 DEBUG (SyncThread:0) [    ] o.a.s.c.ZkTestServer Watch added: data: /solr/clusterstate.json
   [junit4]   2> 2319477 DEBUG (SyncThread:0) [    ] o.a.s.c.ZkTestServer Watch added: children: /solr/collections
   [junit4]   2> 2319477 DEBUG (SyncThread:0) [    ] o.a.s.c.ZkTestServer Watch added: create/delete: /solr/aliases.json
   [junit4]   2> 2319478 DEBUG (SyncThread:0) [    ] o.a.s.c.ZkTestServer Watch added: create/delete: /solr/security.json
   [junit4]   2> 2319483 INFO  (jetty-launcher-5961-thread-3) [n:127.0.0.1:62581_solr    ] o.a.s.c.Overseer Overseer (id=null) closing
   [junit4]   2> 2319484 DEBUG (jetty-launcher-5961-thread-3) [n:127.0.0.1:62581_solr    ] o.a.s.c.LeaderElector Joined leadership election with path: /overseer_elect/election/72425004739002376-127.0.0.1:62581_solr-n_0000000000
   [junit4]   2> 2319485 DEBUG (SyncThread:0) [    ] o.a.s.c.ZkTestServer Watch added: create/delete: /solr/clusterprops.json
   [junit4]   2> 2319485 INFO  (jetty-launcher-5961-thread-3) [n:127.0.0.1:62581_solr    ] o.a.s.c.OverseerElectionContext I am going to be the leader 127.0.0.1:62581_solr
   [junit4]   2> 2319485 DEBUG (SyncThread:0) [    ] o.a.s.c.ZkTestServer Watch added: children: /solr/live_nodes
   [junit4]   2> 2319485 DEBUG (SyncThread:0) [    ] o.a.s.c.ZkTestServer Watch added: data: /solr/clusterstate.json
   [junit4]   2> 2319486 DEBUG (SyncThread:0) [    ] o.a.s.c.ZkTestServer Watch added: children: /solr/collections
   [junit4]   2> 2319486 DEBUG (SyncThread:0) [    ] o.a.s.c.ZkTestServer Watch added: create/delete: /solr/aliases.json
   [junit4]   2> 2319487 DEBUG (SyncThread:0) [    ] o.a.s.c.ZkTestServer Watch added: create/delete: /solr/security.json
   [junit4]   2> 2319487 INFO  (jetty-launcher-5961-thread-3) [n:127.0.0.1:62581_solr    ] o.a.s.c.Overseer Overseer (id=72425004739002376-127.0.0.1:62581_solr-n_0000000000) starting
   [junit4]   2> 2319488 INFO  (jetty-launcher-5961-thread-2) [n:127.0.0.1:33105_solr    ] o.a.s.c.Overseer Overseer (id=null) closing
   [junit4]   2> 2319489 DEBUG (jetty-launcher-5961-thread-2) [n:127.0.0.1:33105_solr    ] o.a.s.c.LeaderElector Joined leadership election with path: /overseer_elect/election/72425004739002374-127.0.0.1:33105_solr-n_0000000001
   [junit4]   2> 2319489 DEBUG (SyncThread:0) [    ] o.a.s.c.ZkTestServer Watch added: data: /solr/overseer_elect/election/72425004739002376-127.0.0.1:62581_solr-n_0000000000
   [junit4]   2> 2319489 DEBUG (jetty-launcher-5961-thread-2) [n:127.0.0.1:33105_solr    ] o.a.s.c.LeaderElector Watching path /overseer_elect/election/72425004739002376-127.0.0.1:62581_solr-n_0000000000 to know if I could be the leader
   [junit4]   2> 2319490 INFO  (jetty-launcher-5961-thread-2) [n:127.0.0.1:33105_solr    ] o.a.s.c.ZkController Register node as live in ZooKeeper:/live_nodes/127.0.0.1:33105_solr
   [junit4]   2> 2319490 DEBUG (SyncThread:0) [    ] o.a.s.c.ZkTestServer Watch fired: children: /solr/live_nodes
   [junit4]   2> 2319490 DEBUG (SyncThread:0) [    ] o.a.s.c.ZkTestServer Watch fired: children: /solr/live_nodes
   [junit4]   2> 2319491 DEBUG (SyncThread:0) [    ] o.a.s.c.ZkTestServer Watch added: children: /solr/live_nodes
   [junit4]   2> 2319491 INFO  (zkCallback-5977-thread-1) [    ] o.a.s.c.c.ZkStateReader Updated live nodes from ZooKeeper... (0) -> (1)
   [junit4]   2> 2319515 INFO  (zkConnectionManagerCallback-5993-thread-1) [    ] o.a.s.c.c.ConnectionManager zkClient has connected
   [junit4]   2> 2319515 DEBUG (SyncThread:0) [    ] o.a.s.c.ZkTestServer Watch added: children: /solr/live_nodes
   [junit4]   2> 2319516 DEBUG (SyncThread:0) [    ] o.a.s.c.ZkTestServer Watch added: create/delete: /solr/clusterprops.json
   [junit4]   2> 2319516 INFO  (zkCallback-5985-thread-1) [    ] o.a.s.c.c.ZkStateReader Updated live nodes from ZooKeeper... (0) -> (1)
   [junit4]   2> 2319516 DEBUG (SyncThread:0) [    ] o.a.s.c.ZkTestServer Watch added: children: /solr/live_nodes
   [junit4]   2> 2319516 INFO  (jetty-launcher-5961-thread-2) [n:127.0.0.1:33105_solr    ] o.a.s.c.c.ZkStateReader Updated live nodes from ZooKeeper... (0) -> (1)
   [junit4]   2> 2319516 DEBUG (SyncThread:0) [    ] o.a.s.c.ZkTestServer Watch added: data: /solr/clusterstate.json
   [junit4]   2> 2319516 DEBUG (SyncThread:0) [    ] o.a.s.c.ZkTestServer Watch added: children: /solr/collections
   [junit4]   2> 2319517 DEBUG (SyncThread:0) [    ] o.a.s.c.ZkTestServer Watch added: create/delete: /solr/aliases.json
   [junit4]   2> 2319517 INFO  (jetty-launcher-5961-thread-2) [n:127.0.0.1:33105_solr    ] o.a.s.c.s.i.ZkClientClusterStateProvider Cluster at 127.0.0.1:43303/solr ready
   [junit4]   2> 2319518 INFO  (jetty-launcher-5961-thread-2) [n:127.0.0.1:33105_solr    ] o.a.s.h.a.MetricsHistoryHandler No .system collection, keeping metrics history in memory.
   [junit4]   2> 2319525 INFO  (zkConnectionManagerCallback-6000-thread-1) [    ] o.a.s.c.c.ConnectionManager zkClient has connected
   [junit4]   2> 2319526 INFO  (jetty-launcher-5961-thread-4) [    ] o.a.s.c.ZkContainer Zookeeper client=127.0.0.1:43303/solr
   [junit4]   2> 2319526 DEBUG (SyncThread:0) [    ] o.a.s.c.ZkTestServer Watch added: create/delete: /solr/clusterprops.json
   [junit4]   2> 2319527 DEBUG (SyncThread:0) [    ] o.a.s.c.ZkTestServer Watch added: children: /solr/live_nodes
   [junit4]   2> 2319527 INFO  (jetty-launcher-5961-thread-3) [n:127.0.0.1:62581_solr    ] o.a.s.c.c.ZkStateReader Updated live nodes from ZooKeeper... (0) -> (1)
   [junit4]   2> 2319527 DEBUG (SyncThread:0) [    ] o.a.s.c.ZkTestServer Watch added: data: /solr/clusterstate.json
   [junit4]   2> 2319527 DEBUG (SyncThread:0) [    ] o.a.s.c.ZkTestServer Watch added: children: /solr/collections
   [junit4]   2> 2319528 DEBUG (SyncThread:0) [    ] o.a.s.c.ZkTestServer Watch added: create/delete: /solr/aliases.json
   [junit4]   2> 2319528 INFO  (jetty-launcher-5961-thread-3) [n:127.0.0.1:62581_solr    ] o.a.s.c.s.i.ZkClientClusterStateProvider Cluster at 127.0.0.1:43303/solr ready
   [junit4]   2> 2319529 DEBUG (OverseerCollectionConfigSetProcessor-72425004739002376-127.0.0.1:62581_solr-n_0000000000) [    ] o.a.s.c.OverseerTaskProcessor Process current queue of overseer operations
   [junit4]   2> 2319530 DEBUG (OverseerAutoScalingTriggerThread-72425004739002376-127.0.0.1:62581_solr-n_0000000000) [    ] o.a.s.c.a.OverseerTriggerThread Adding .auto_add_replicas and .scheduled_maintenance triggers
   [junit4]   2> 2319531 DEBUG (SyncThread:0) [    ] o.a.s.c.ZkTestServer Watch added: data: /solr/autoscaling.json
   [junit4]   2> 2319531 DEBUG (OverseerAutoScalingTriggerThread-72425004739002376-127.0.0.1:62581_solr-n_0000000000) [    ] o.a.s.c.a.OverseerTriggerThread Refreshing /autoscaling.json with znode version 1
   [junit4]   2> 2319531 DEBUG (OverseerAutoScalingTriggerThread-72425004739002376-127.0.0.1:62581_solr-n_0000000000) [    ] o.a.s.c.a.OverseerTriggerThread Current znodeVersion 1, lastZnodeVersion -1
   [junit4]   2> 2319531 DEBUG (OverseerAutoScalingTriggerThread-72425004739002376-127.0.0.1:62581_solr-n_0000000000) [    ] o.a.s.c.a.OverseerTriggerThread Processed trigger updates upto znodeVersion 1
   [junit4]   2> 2319533 DEBUG (jetty-launcher-5961-thread-3) [n:127.0.0.1:62581_solr    ] o.a.s.c.ZkController Publish node=127.0.0.1:62581_solr as DOWN
   [junit4]   2> 2319534 DEBUG (OverseerCollectionConfigSetProcessor-72425004739002376-127.0.0.1:62581_solr-n_0000000000) [    ] o.a.s.c.OverseerTaskProcessor Cleaning up work-queue. #Running tasks: 0
   [junit4]   2> 2319534 DEBUG (OverseerCollectionConfigSetProcessor-72425004739002376-127.0.0.1:62581_solr-n_0000000000) [    ] o.a.s.c.OverseerTaskProcessor RunningTasks: []
   [junit4]   2> 2319535 DEBUG (OverseerCollectionConfigSetProcessor-72425004739002376-127.0.0.1:62581_solr-n_0000000000) [    ] o.a.s.c.OverseerTaskProcessor BlockedTasks: []
   [junit4]   2> 2319535 DEBUG (OverseerCollectionConfigSetProcessor-72425004739002376-127.0.0.1:62581_solr-n_0000000000) [    ] o.a.s.c.OverseerTaskProcessor CompletedTasks: []
   [junit4]   2> 2319535 DEBUG (OverseerCollectionConfigSetProcessor-72425004739002376-127.0.0.1:62581_solr-n_0000000000) [    ] o.a.s.c.OverseerTaskProcessor RunningZKTasks: []
   [junit4]   2> 2319535 DEBUG (OverseerCollectionConfigSetProcessor-72425004739002376-127.0.0.1:62581_solr-n_0000000000) [    ] o.a.s.c.OverseerTaskQueue Peeking for top 100 elements. ExcludeSet: []
   [junit4]   2> 2319535 DEBUG (SyncThread:0) [    ] o.a.s.c.ZkTestServer Watch added: children: /solr/overseer/queue-work
   [junit4]   2> 2319535 DEBUG (SyncThread:0) [    ] o.a.s.c.ZkTestServer Watch added: children: /solr/overseer/collection-queue-work
   [junit4]   2> 2319536 DEBUG (SyncThread:0) [    ] o.a.s.c.ZkTestServer Watch added: children: /solr/overseer/queue
   [junit4]   2> 2319537 DEBUG (SyncThread:0) [    ] o.a.s.c.ZkTestServer Watch fired: children: /solr/overseer/queue
   [junit4]   2> 2319537 INFO  (jetty-launcher-5961-thread-3) [n:127.0.0.1:62581_solr    ] o.a.s.c.TransientSolrCoreCacheDefault Allocating transient cache for 2147483647 transient cores
   [junit4]   2> 2319537 INFO  (jetty-launcher-5961-thread-3) [n:127.0.0.1:62581_solr    ] o.a.s.c.ZkController Register node as live in ZooKeeper:/live_nodes/127.0.0.1:62581_solr
   [junit4]   2> 2319537 DEBUG (SyncThread:0) [    ] o.a.s.c.ZkTestServer Watch fired: children: /solr/live_nodes
   [junit4]   2> 2319538 DEBUG (SyncThread:0) [    ] o.a.s.c.ZkTestServer Watch fired: children: /solr/live_nodes
   [junit4]   2> 2319538 DEBUG (SyncThread:0) [    ] o.a.s.c.ZkTestServer Watch fired: children: /solr/live_nodes
   [junit4]   2> 2319538 DEBUG (SyncThread:0) [    ] o.a.s.c.ZkTestServer Watch fired: children: /solr/live_nodes
   [junit4]   2> 2319538 DEBUG (SyncThread:0) [    ] o.a.s.c.ZkTestServer Watch added: children: /solr/live_nodes
   [junit4]   2> 2319538 INFO  (zkCallback-5977-thread-1) [    ] o.a.s.c.c.ZkStateReader Updated live nodes from ZooKeeper... (1) -> (2)
   [junit4]   2> 2319538 DEBUG (SyncThread:0) [    ] o.a.s.c.ZkTestServer Watch added: children: /solr/live_nodes
   [junit4]   2> 2319538 DEBUG (SyncThread:0) [    ] o.a.s.c.ZkTestServer Watch added: children: /solr/live_nodes
   [junit4]   2> 2319538 INFO  (zkCallback-5992-thread-1) [    ] o.a.s.c.c.ZkStateReader Updated live nodes from ZooKeeper... (1) -> (2)
   [junit4]   2> 2319538 INFO  (zkCallback-5999-thread-1) [    ] o.a.s.c.c.ZkStateReader Updated live nodes from ZooKeeper... (1) -> (2)
   [junit4]   2> 2319546 INFO  (jetty-launcher-5961-thread-2) [n:127.0.0.1:33105_solr    ] o.a.s.m.r.SolrJmxReporter JMX monitoring for 'solr_33105.solr.node' (registry 'solr.node') enabled at server: com.sun.jmx.mbeanserver.JmxMBeanServer@4e66dc6b
   [junit4]   2> 2319551 INFO  (jetty-launcher-5961-thread-2) [n:127.0.0.1:33105_solr    ] o.a.s.m.r.SolrJmxReporter JMX monitoring for 'solr_33105.solr.jvm' (registry 'solr.jvm') enabled at server: com.sun.jmx.mbeanserver.JmxMBeanServer@4e66dc6b
   [junit4]   2> 2319551 INFO  (jetty-launcher-5961-thread-2) [n:127.0.0.1:33105_solr    ] o.a.s.m.r.SolrJmxReporter JMX monitoring for 'solr_33105.solr.jetty' (registry 'solr.jetty') enabled at server: com.sun.jmx.mbeanserver.JmxMBeanServer@4e66dc6b
   [junit4]   2> 2319552 INFO  (jetty-launcher-5961-thread-2) [n:127.0.0.1:33105_solr    ] o.a.s.c.CorePropertiesLocator Found 0 core definitions underneath /export/home/jenkins/workspace/Lucene-Solr-master-Solaris/solr/build/solr-core/test/J1/temp/solr.cloud.MoveReplicaHDFSTest_94C3A3495C87837D-001/tempDir-001/node2/.
   [junit4]   2> 2319561 DEBUG (SyncThread:0) [    ] o.a.s.c.ZkTestServer Watch added: children: /solr/autoscaling/events/.scheduled_maintenance
   [junit4]   2> 2319562 DEBUG (SyncThread:0) [    ] o.a.s.c.ZkTestServer Watch added: children: /solr/live_nodes
   [junit4]   2> 2319562 INFO  (zkCallback-5985-thread-2) [    ] o.a.s.c.c.ZkStateReader Updated live nodes from ZooKeeper... (1) -> (2)
   [junit4]   2> 2319562 INFO  (jetty-launcher-5961-thread-3) [n:127.0.0.1:62581_solr    ] o.a.s.h.a.MetricsHistoryHandler No .system collection, keeping metrics history in memory.
   [junit4]   2> 2319571 DEBUG (SyncThread:0) [    ] o.a.s.c.ZkTestServer Watch added: children: /solr/overseer/queue
   [junit4]   2> 2319572 INFO  (zkConnectionManagerCallback-6003-thread-1) [    ] o.a.s.c.c.ConnectionManager zkClient has connected
   [junit4]   2> 2319573 DEBUG (OverseerAutoScalingTriggerThread-72425004739002376-127.0.0.1:62581_solr-n_0000000000) [    ] o.a.s.c.a.NodeLostTrigger NodeLostTrigger .auto_add_replicas - Initial livenodes: [127.0.0.1:62581_solr, 127.0.0.1:33105_solr]
   [junit4]   2> 2319574 DEBUG (OverseerAutoScalingTriggerThread-72425004739002376-127.0.0.1:62581_solr-n_0000000000) [    ] o.a.s.c.a.OverseerTriggerThread -- clean old nodeAdded markers
   [junit4]   2> 2319574 DEBUG (SyncThread:0) [    ] o.a.s.c.ZkTestServer Watch added: children: /solr/autoscaling/events/.auto_add_replicas
   [junit4]   2> 2319574 DEBUG (OverseerAutoScalingTriggerThread-72425004739002376-127.0.0.1:62581_solr-n_0000000000) [    ] o.a.s.c.a.OverseerTriggerThread Current znodeVersion 1, lastZnodeVersion 1
   [junit4]   2> 2319575 DEBUG (ScheduledTrigger-9388-thread-1) [    ] o.a.s.c.a.NodeLostTrigger Running NodeLostTrigger: .auto_add_replicas with currently live nodes: 2
   [junit4]   2> 2319576 DEBUG (jetty-launcher-5961-thread-4) [n:127.0.0.1:34831_solr    ] o.a.s.c.ZkController Added new OnReconnect listener org.apache.solr.cloud.ZkController$$Lambda$48/354273539@495d4543
   [junit4]   2> 2319577 INFO  (zkConnectionManagerCallback-6006-thread-1) [    ] o.a.s.c.c.ConnectionManager zkClient has connected
   [junit4]   2> 2319581 INFO  (jetty-launcher-5961-thread-3) [n:127.0.0.1:62581_solr    ] o.a.s.m.r.SolrJmxReporter JMX monitoring for 'solr_62581.solr.node' (registry 'solr.node') enabled at server: com.sun.jmx.mbeanserver.JmxMBeanServer@4e66dc6b
   [junit4]   2> 2319585 DEBUG (SyncThread:0) [    ] o.a.s.c.ZkTestServer Watch added: create/delete: /solr/clusterprops.json
   [junit4]   2> 2319585 DEBUG (SyncThread:0) [    ] o.a.s.c.ZkTestServer Watch added: children: /solr/live_nodes
   [junit4]   2> 2319586 INFO  (jetty-launcher-5961-thread-4) [n:127.0.0.1:34831_solr    ] o.a.s.c.c.ZkStateReader Updated live nodes from ZooKeeper... (0) -> (2)
   [junit4]   2> 2319586 DEBUG (SyncThread:0) [    ] o.a.s.c.ZkTestServer Watch added: data: /solr/clusterstate.json
   [junit4]   2> 2319586 DEBUG (SyncThread:0) [    ] o.a.s.c.ZkTestServer Watch added: children: /solr/collections
   [junit4]   2> 2319586 DEBUG (SyncThread:0) [    ] o.a.s.c.ZkTestServer Watch added: create/delete: /solr/aliases.json
   [junit4]   2> 2319587 DEBUG (SyncThread:0) [    ] o.a.s.c.ZkTestServer Watch added: create/delete: /solr/security.json
   [junit4]   2> 2319588 INFO  (jetty-launcher-5961-thread-4) [n:127.0.0.1:34831_solr    ] o.a.s.c.Overseer Overseer (id=null) closing
   [junit4]   2> 2319589 DEBUG (jetty-launcher-5961-thread-4) [n:127.0.0.1:34831_solr    ] o.a.s.c.LeaderElector Joined leadership election with path: /overseer_elect/election/72425004739002380-127.0.0.1:34831_solr-n_0000000002
   [junit4]   2> 2319589 INFO  (jetty-launcher-5961-thread-3) [n:127.0.0.1:62581_solr    ] o.a.s.m.r.SolrJmxReporter JMX monitoring for 'solr_62581.solr.jvm' (registry 'solr.jvm') enabled at server: com.sun.jmx.mbeanserver.JmxMBeanServer@4e66dc6b
   [junit4]   2> 2319589 INFO  (jetty-launcher-5961-thread-3) [n:127.0.0.1:62581_solr    ] o.a.s.m.r.SolrJmxReporter JMX monitoring for 'solr_62581.solr.jetty' (registry 'solr.jetty') enabled at server: com.sun.jmx.mbeanserver.JmxMBeanServer@4e66dc6b
   [junit4]   2> 2319589 DEBUG (SyncThread:0) [    ] o.a.s.c.ZkTestServer Watch added: data: /solr/overseer_elect/election/72425004739002374-127.0.0.1:33105_solr-n_0000000001
   [junit4]   2> 2319589 DEBUG (jetty-launcher-5961-thread-4) [n:127.0.0.1:34831_solr    ] o.a.s.c.LeaderElector Watching path /overseer_elect/election/72425004739002374-127.0.0.1:33105_solr-n_0000000001 to know if I could be the leader
   [junit4]   2> 2319590 DEBUG (jetty-launcher-5961-thread-4) [n:127.0.0.1:34831_solr    ] o.a.s.c.ZkController Publish node=127.0.0.1:34831_solr as DOWN
   [junit4]   2> 2319590 INFO  (jetty-launcher-5961-thread-3) [n:127.0.0.1:62581_solr    ] o.a.s.c.CorePropertiesLocator Found 0 core definitions underneath /export/home/jenkins/workspace/Lucene-Solr-master-Solaris/solr/build/solr-core/test/J1/temp/solr.cloud.MoveReplicaHDFSTest_94C3A3495C87837D-001/tempDir-001/node4/.
   [junit4]   2> 2319591 DEBUG (SyncThread:0) [    ] o.a.s.c.ZkTestServer Watch fired: children: /solr/overseer/queue
   [junit4]   2> 2319591 DEBUG (SyncThread:0) [    ] o.a.s.c.ZkTestServer Watch added: children: /solr/overseer/queue
   [junit4]   2> 2319592 INFO  (jetty-launcher-5961-thread-4) [n:127.0.0.1:34831_solr    ] o.a.s.c.TransientSolrCoreCacheDefault Allocating transient cache for 2147483647 transient cores
   [junit4]   2> 2319592 INFO  (jetty-launcher-5961-thread-4) [n:127.0.0.1:34831_solr    ] o.a.s.c.ZkController Register node as live in ZooKeeper:/live_nodes/127.0.0.1:34831_solr
   [junit4]   2> 2319593 DEBUG (SyncThread:0) [    ] o.a.s.c.ZkTestServer Watch fired: children: /solr/live_nodes
   [junit4]   2> 2319593 DEBUG (SyncThread:0) [    ] o.a.s.c.ZkTestServer Watch fired: children: /solr/live_nodes
   [junit4]   2> 2319593 DEBUG (SyncThread:0) [    ] o.a.s.c.ZkTestServer Watch fired: children: /solr/live_nodes
   [junit4]   2> 2319593 DEBUG (SyncThread:0) [    ] o.a.s.c.ZkTestServer Watch fired: children: /solr/live_nodes
   [junit4]   2> 2319593 DEBUG (SyncThread:0) [    ] o.a.s.c.ZkTestServer Watch fired: children: /solr/live_nodes
   [junit4]   2> 2319593 DEBUG (SyncThread:0) [    ] o.a.s.c.ZkTestServer Watch added: children: /solr/live_nodes
   [junit4]   2> 2319593 DEBUG (SyncThread:0) [    ] o.a.s.c.ZkTestServer Watch added: children: /solr/live_nodes
   [junit4]   2> 2319593 DEBUG (SyncThread:0) [    ] o.a.s.c.ZkTestServer Watch added: children: /solr/live_nodes
   [junit4]   2> 2319593 DEBUG (SyncThread:0) [    ] o.a.s.c.ZkTestServer Watch added: children: /solr/live_nodes
   [junit4]   2> 2319593 INFO  (zkCallback-5977-thread-1) [    ] o.a.s.c.c.ZkStateReader Updated live nodes from ZooKeeper... (2) -> (3)
   [junit4]   2> 2319593 INFO  (zkCallback-5999-thread-1) [    ] o.a.s.c.c.ZkStateReader Updated live nodes from ZooKeeper... (2) -> (3)
   [junit4]   2> 2319593 INFO  (zkCallback-5992-thread-1) [    ] o.a.s.c.c.ZkStateReader Updated live nodes from ZooKeeper... (2) -> (3)
   [junit4]   2> 2319594 INFO  (zkCallback-5985-thread-1) [    ] o.a.s.c.c.ZkStateReader Updated live nodes from ZooKeeper... (2) -> (3)
   [junit4]   2> 2319614 DEBUG (SyncThread:0) [    ] o.a.s.c.ZkTestServer Watch added: children: /solr/live_nodes
   [junit4]   2> 2319614 INFO  (zkCallback-6005-thread-1) [    ] o.a.s.c.c.ZkStateReader Updated live nodes from ZooKeeper... (2) -> (3)
   [junit4]   2> 2319619 INFO  (zkConnectionManagerCallback-6013-thread-1) [    ] o.a.s.c.c.ConnectionManager zkClient has connected
   [junit4]   2> 2319620 DEBUG (SyncThread:0) [    ] o.a.s.c.ZkTestServer Watch added: create/delete: /solr/clusterprops.json
   [junit4]   2> 2319621 DEBUG (SyncThread:0) [    ] o.a.s.c.ZkTestServer Watch added: children: /solr/live_nodes
   [junit4]   2> 2319621 INFO  (jetty-launcher-5961-thread-4) [n:127.0.0.1:34831_solr    ] o.a.s.c.c.ZkStateReader Updated live nodes from ZooKeeper... (0) -> (3)
   [junit4]   2> 2319621 DEBUG (SyncThread:0) [    ] o.a.s.c.ZkTestServer Watch added: data: /solr/clusterstate.json
   [junit4]   2> 2319622 DEBUG (SyncThread:0) [    ] o.a.s.c.ZkTestServer Watch added: children: /solr/collections
   [junit4]   2> 2319622 DEBUG (SyncThread:0) [    ] o.a.s.c.ZkTestServer Watch added: create/delete: /solr/aliases.json
   [junit4]   2> 2319623 INFO  (jetty-launcher-5961-thread-4) [n:127.0.0.1:34831_solr    ] o.a.s.c.s.i.ZkClientClusterStateProvider Cluster at 127.0.0.1:43303/solr ready
   [junit4]   2> 2319624 INFO  (jetty-launcher-5961-thread-4) [n:127.0.0.1:34831_solr    ] o.a.s.h.a.MetricsHistoryHandler No .system collection, keeping metrics history in memory.
   [junit4]   2> 2319645 INFO  (jetty-launcher-5961-thread-4) [n:127.0.0.1:34831_solr    ] o.a.s.m.r.SolrJmxReporter JMX monitoring for 'solr_34831.solr.node' (registry 'solr.node') enabled at server: com.sun.jmx.mbeanserver.JmxMBeanServer@4e66dc6b
   [junit4]   2> 2319651 INFO  (jetty-launcher-5961-thread-4) [n:127.0.0.1:34831_solr    ] o.a.s.m.r.SolrJmxReporter JMX monitoring for 'solr_34831.solr.jvm' (registry 'solr.jvm') enabled at server: com.sun.jmx.mbeanserver.JmxMBeanServer@4e66dc6b
   [junit4]   2> 2319651 INFO  (jetty-launcher-5961-thread-4) [n:127.0.0.1:34831_solr    ] o.a.s.m.r.SolrJmxReporter JMX monitoring for 'solr_34831.solr.jetty' (registry 'solr.jetty') enabled at server: com.sun.jmx.mbeanserver.JmxMBeanServer@4e66dc6b
   [junit4]   2> 2319651 INFO  (jetty-launcher-5961-thread-4) [n:127.0.0.1:34831_solr    ] o.a.s.c.CorePropertiesLocator Found 0 core definitions underneath /export/home/jenkins/workspace/Lucene-Solr-master-Solaris/solr/build/solr-core/test/J1/temp/solr.cloud.MoveReplicaHDFSTest_94C3A3495C87837D-001/tempDir-001/node3/.
   [junit4]   2> 2319693 DEBUG (SyncThread:0) [    ] o.a.s.c.ZkTestServer Watch fired: children: /solr/overseer/queue
   [junit4]   2> 2319694 DEBUG (SyncThread:0) [    ] o.a.s.c.ZkTestServer Watch added: children: /solr/overseer/queue
   [junit4]   2> 2319702 INFO  (jetty-launcher-5961-thread-1) [    ] o.a.s.c.ZkContainer Zookeeper client=127.0.0.1:43303/solr
   [junit4]   2> 2319704 INFO  (zkConnectionManagerCallback-6018-thread-1) [    ] o.a.s.c.c.ConnectionManager zkClient has connected
   [junit4]   2> 2319706 DEBUG (jetty-launcher-5961-thread-1) [n:127.0.0.1:37572_solr    ] o.a.s.c.ZkController Added new OnReconnect listener org.apache.solr.cloud.ZkController$$Lambda$48/354273539@138895db
   [junit4]   2> 2319707 INFO  (zkConnectionManagerCallback-6020-thread-1) [    ] o.a.s.c.c.ConnectionManager zkClient has connected
   [junit4]   2> 2319722 DEBUG (SyncThread:0) [    ] o.a.s.c.ZkTestServer Watch added: create/delete: /solr/clusterprops.json
   [junit4]   2> 2319722 DEBUG (SyncThread:0) [    ] o.a.s.c.ZkTestServer Watch added: children: /solr/live_nodes
   [junit4]   2> 2319722 INFO  (jetty-launcher-5961-thread-1) [n:127.0.0.1:37572_solr    ] o.a.s.c.c.ZkStateReader Updated live nodes from ZooKeeper... (0) -> (3)
   [junit4]   2> 2319723 DEBUG (SyncThread:0) [    ] o.a.s.c.ZkTestServer Watch added: data: /solr/clusterstate.json
   [junit4]   2> 2319723 DEBUG (SyncThread:0) [    ] o.a.s.c.ZkTestServer Watch added: children: /solr/collections
   [junit4]   2> 2319723 DEBUG (SyncThread:0) [    ] o.a.s.c.ZkTestServer Watch added: create/delete: /solr/aliases.json
   [junit4]   2> 2319724 DEBUG (SyncThread:0) [    ] o.a.s.c.ZkTestServer Watch added: create/delete: /solr/security.json
   [junit4]   2> 2319726 INFO  (jetty-launcher-5961-thread-1) [n:127.0.0.1:37572_solr    ] o.a.s.c.Overseer Overseer (id=null) closing
   [junit4]   2> 2319726 DEBUG (jetty-launcher-5961-thread-1) [n:127.0.0.1:37572_solr    ] o.a.s.c.LeaderElector Joined leadership election with path: /overseer_elect/election/72425004739002383-127.0.0.1:37572_solr-n_0000000003
   [junit4]   2> 2319727 DEBUG (SyncThread:0) [    ] o.a.s.c.ZkTestServer Watch added: data: /solr/overseer_elect/election/72425004739002380-127.0.0.1:34831_solr-n_0000000002
   [junit4]   2> 2319727 DEBUG (jetty-launcher-5961-thread-1) [n:127.0.0.1:37572_solr    ] o.a.s.c.LeaderElector Watching path /overseer_elect/election/72425004739002380-127.0.0.1:34831_solr-n_0000000002 to know if I could be the leader
   [junit4]   2> 2319728 DEBUG (jetty-launcher-5961-thread-1) [n:127.0.0.1:37572_solr    ] o.a.s.c.ZkController Publish node=127.0.0.1:37572_solr as DOWN
   [junit4]   2> 2319729 DEBUG (SyncThread:0) [    ] o.a.s.c.ZkTestServer Watch fired: children: /solr/overseer/queue
   [junit4]   2> 2319729 INFO  (jetty-launcher-5961-thread-1) [n:127.0.0.1:37572_solr    ] o.a.s.c.TransientSolrCoreCacheDefault Allocating transient cache for 2147483647 transient cores
   [junit4]   2> 2319729 INFO  (jetty-launcher-5961-thread-1) [n:127.0.0.1:37572_solr    ] o.a.s.c.ZkController Register node as live in ZooKeeper:/live_nodes/127.0.0.1:37572_solr
   [junit4]   2> 2319730 DEBUG (SyncThread:0) [    ] o.a.s.c.ZkTestServer Watch added: children: /solr/overseer/queue
   [junit4]   2> 2319731 DEBUG (SyncThread:0) [    ] o.a.s.c.ZkTestServer Watch fired: children: /solr/live_nodes
   [junit4]   2> 2319731 DEBUG (SyncThread:0) [    ] o.a.s.c.ZkTestServer Watch fired: children: /solr/live_nodes
   [junit4]   2> 2319731 DEBUG (SyncThread:0) [    ] o.a.s.c.ZkTestServer Watch fired: children: /solr/live_nodes
   [junit4]   2> 2319731 DEBUG (SyncThread:0) [    ] o.a.s.c.ZkTestServer Watch fired: children: /solr/live_nodes
   [junit4]   2> 2319731 DEBUG (SyncThread:0) [    ] o.a.s.c.ZkTestServer Watch fired: children: /solr/live_nodes
   [junit4]   2> 2319731 DEBUG (SyncThread:0) [    ] o.a.s.c.ZkTestServer Watch fired: children: /solr/live_nodes
   [junit4]   2> 2319731 DEBUG (SyncThread:0) [    ] o.a.s.c.ZkTestServer Watch fired: children: /solr/live_nodes
   [junit4]   2> 2319731 DEBUG (SyncThread:0) [    ] o.a.s.c.ZkTestServer Watch added: children: /solr/live_nodes
   [junit4]   2> 2319732 DEBUG (SyncThread:0) [    ] o.a.s.c.ZkTestServer Watch added: children: /solr/live_nodes
   [junit4]   2> 2319732 INFO  (zkCallback-5977-thread-1) [    ] o.a.s.c.c.ZkStateReader Updated live nodes from ZooKeeper... (3) -> (4)
   [junit4]   2> 2319732 INFO  (zkCallback-5985-thread-1) [    ] o.a.s.c.c.ZkStateReader Updated live nodes from ZooKeeper... (3) -> (4)
   [junit4]   2> 2319732 DEBUG (SyncThread:0) [    ] o.a.s.c.ZkTestServer Watch added: children: /solr/live_nodes
   [junit4]   2> 2319732 DEBUG (SyncThread:0) [    ] o.a.s.c.ZkTestServer Watch added: children: /solr/live_nodes
   [junit4]   2> 2319732 INFO  (zkCallback-6012-thread-1) [    ] o.a.s.c.c.ZkStateReader Updated live nodes from ZooKeeper... (3) -> (4)
   [junit4]   2> 2319732 INFO  (zkCallback-5992-thread-1) [    ] o.a.s.c.c.ZkStateReader Updated live nodes from ZooKeeper... (3) -> (4)
   [junit4]   2> 2319733 DEBUG (SyncThread:0) [    ] o.a.s.c.ZkTestServer Watch added: children: /solr/live_nodes
   [junit4]   2> 2319733 INFO  (zkCallback-5999-thread-1) [    ] o.a.s.c.c.ZkStateReader Updated live nodes from ZooKeeper... (3) -> (4)
   [junit4]   2> 2319733 DEBUG (SyncThread:0) [    ] o.a.s.c.ZkTestServer Watch added: children: /solr/live_nodes
   [junit4]   2> 2319733 INFO  (zkCallback-6019-thread-1) [    ] o.a.s.c.c.ZkStateReader Updated live nodes from ZooKeeper... (3) -> (4)
   [junit4]   2> 2319734 DEBUG (SyncThread:0) [    ] o.a.s.c.ZkTestServer Watch added: children: /solr/live_nodes
   [junit4]   2> 2319734 INFO  (zkCallback-6005-thread-1) [    ] o.a.s.c.c.ZkStateReader Updated live nodes from ZooKeeper... (3) -> (4)
   [junit4]   2> 2319786 INFO  (zkConnectionManagerCallback-6027-thread-1) [    ] o.a.s.c.c.ConnectionManager zkClient has connected
   [junit4]   2> 2319787 DEBUG (SyncThread:0) [    ] o.a.s.c.ZkTestServer Watch added: create/delete: /solr/clusterprops.json
   [junit4]   2> 2319788 DEBUG (SyncThread:0) [    ] o.a.s.c.ZkTestServer Watch added: children: /solr/live_nodes
   [junit4]   2> 2319788 INFO  (jetty-launcher-5961-thread-1) [n:127.0.0.1:37572_solr    ] o.a.s.c.c.ZkStateReader Updated live nodes from ZooKeeper... (0) -> (4)
   [junit4]   2> 2319788 DEBUG (SyncThread:0) [    ] o.a.s.c.ZkTestServer Watch added: data: /solr/clusterstate.json
   [junit4]   2> 2319789 DEBUG (SyncThread:0) [    ] o.a.s.c.ZkTestServer Watch added: children: /solr/collections
   [junit4]   2> 2319789 DEBUG (SyncThread:0) [    ] o.a.s.c.ZkTestServer Watch added: create/delete: /solr/aliases.json
   [junit4]   2> 2319798 INFO  (jetty-launcher-5961-thread-1) [n:127.0.0.1:37572_solr    ] o.a.s.c.s.i.ZkClientClusterStateProvider Cluster at 127.0.0.1:43303/solr ready
   [junit4]   2> 2319807 INFO  (jetty-launcher-5961-thread-1) [n:127.0.0.1:37572_solr    ] o.a.s.h.a.MetricsHistoryHandler No .system collection, keeping metrics history in memory.
   [junit4]   2> 2319826 INFO  (jetty-launcher-5961-thread-1) [n:127.0.0.1:37572_solr    ] o.a.s.m.r.SolrJmxReporter JMX monitoring for 'solr_37572.solr.node' (registry 'solr.node') enabled at server: com.sun.jmx.mbeanserver.JmxMBeanServer@4e66dc6b
   [junit4]   2> 2319841 DEBUG (SyncThread:0) [    ] o.a.s.c.ZkTestServer Watch fired: children: /solr/overseer/queue
   [junit4]   2> 2319842 DEBUG (SyncThread:0) [    ] o.a.s.c.ZkTestServer Watch added: children: /solr/overseer/queue
   [junit4]   2> 2319847 INFO  (jetty-launcher-5961-thread-1) [n:127.0.0.1:37572_solr    ] o.a.s.m.r.SolrJmxReporter JMX monitoring for 'solr_37572.solr.jvm' (registry 'solr.jvm') enabled at server: com.sun.jmx.mbeanserver.JmxMBeanServer@4e66dc6b
   [junit4]   2> 2319847 INFO  (jetty-launcher-5961-thread-1) [n:127.0.0.1:37572_solr    ] o.a.s.m.r.SolrJmxReporter JMX monitoring for 'solr_37572.solr.jetty' (registry 'solr.jetty') enabled at server: com.sun.jmx.mbeanserver.JmxMBeanServer@4e66dc6b
   [junit4]   2> 2319848 INFO  (jetty-launcher-5961-thread-1) [n:127.0.0.1:37572_solr    ] o.a.s.c.CorePropertiesLocator Found 0 core definitions underneath /export/home/jenkins/workspace/Lucene-Solr-master-Solaris/solr/build/solr-core/test/J1/temp/solr.cloud.MoveReplicaHDFSTest_94C3A3495C87837D-001/tempDir-001/node1/.
   [junit4]   2> 2319901 INFO  (zkConnectionManagerCallback-6030-thread-1) [    ] o.a.s.c.c.ConnectionManager zkClient has connected
   [junit4]   2> 2319903 WARN  (NIOServerCxn.Factory:0.0.0.0/0.0.0.0:0) [    ] o.a.z.s.NIOServerCnxn Unable to read additional data from client sessionid 0x1014e2878530011, likely client has closed socket
   [junit4]   2> 2319905 INFO  (zkConnectionManagerCallback-6035-thread-1) [    ] o.a.s.c.c.ConnectionManager zkClient has connected
   [junit4]   2> 2319908 DEBUG (SyncThread:0) [    ] o.a.s.c.ZkTestServer Watch added: create/delete: /solr/clusterprops.json
   [junit4]   2> 2319909 DEBUG (SyncThread:0) [    ] o.a.s.c.ZkTestServer Watch added: children: /solr/live_nodes
   [junit4]   2> 2319909 INFO  (SUITE-MoveReplicaHDFSTest-seed#[94C3A3495C87837D]-worker) [    ] o.a.s.c.c.ZkStateReader Updated live nodes from ZooKeeper... (0) -> (4)
   [junit4]   2> 2319909 DEBUG (SyncThread:0) [    ] o.a.s.c.ZkTestServer Watch added: data: /solr/clusterstate.json
   [junit4]   2> 2319910 DEBUG (SyncThread:0) [    ] o.a.s.c.ZkTestServer Watch added: children: /solr/collections
   [junit4]   2> 2319910 DEBUG (SyncThread:0) [    ] o.a.s.c.ZkTestServer Watch added: create/delete: /solr/aliases.json
   [junit4]   2> 2319910 INFO  (SUITE-MoveReplicaHDFSTest-seed#[94C3A3495C87837D]-worker) [    ] o.a.s.c.s.i.ZkClientClusterStateProvider Cluster at 127.0.0.1:43303/solr ready
   [junit4]   2> 2319919 INFO  (qtp2077640694-21956) [n:127.0.0.1:62581_solr    ] o.a.s.h.a.CollectionsHandler Invoked Collection Action :overseerstatus with params action=OVERSEERSTATUS&wt=javabin&version=2 and sendToOCPQueue=true
   [junit4]   2> 2319919 DEBUG (SyncThread:0) [    ] o.a.s.c.ZkTestServer Watch fired: children: /solr/overseer/collection-queue-work
   [junit4]   2> 2319920 DEBUG (SyncThread:0) [    ] o.a.s.c.ZkTestServer Watch added: create/delete: /solr/overseer/collection-queue-work/qnr-0000000000
   [junit4]   2> 2319920 DEBUG (SyncThread:0) [    ] o.a.s.c.ZkTestServer Watch added: children: /solr/overseer/collection-queue-work
   [junit4]   2> 2319921 DEBUG (SyncThread:0) [    ] o.a.s.c.ZkTestServer Watch fired: children: /solr/overseer/collection-queue-work
   [junit4]   2> 2319921 DEBUG (OverseerCollectionConfigSetProcessor-72425004739002376-127.0.0.1:62581_solr-n_0000000000) [    ] o.a.s.c.ZkDistributedQueue Found child node with improper name: qnr-0000000000
   [junit4]   2> 2319921 DEBUG (SyncThread:0) [    ] o.a.s.c.ZkTestServer Watch added: children: /solr/overseer/collection-queue-work
   [junit4]   2> 2319922 DEBUG (OverseerCollectionConfigSetProcessor-72425004739002376-127.0.0.1:62581_solr-n_0000000000) [    ] o.a.s.c.ZkDistributedQueue Found child node with improper name: qnr-0000000000
   [junit4]   2> 2319923 DEBUG (OverseerCollectionConfigSetProcessor-72425004739002376-127.0.0.1:62581_solr-n_0000000000) [    ] o.a.s.c.OverseerTaskQueue Returning topN elements: [/overseer/collection-queue-work/qn-0000000000, ]
   [junit4]   2> 2319923 DEBUG (OverseerCollectionConfigSetProcessor-72425004739002376-127.0.0.1:62581_solr-n_0000000000) [    ] o.a.s.c.OverseerTaskProcessor Got 1 tasks from work-queue : [[org.apache.solr.cloud.OverseerTaskQueue$QueueEvent@2e684ecf]]
   [junit4]   2> 2319923 DEBUG (OverseerCollectionConfigSetProcessor-72425004739002376-127.0.0.1:62581_solr-n_0000000000) [    ] o.a.s.c.OverseerTaskProcessor Marked task [/overseer/collection-queue-work/qn-0000000000] as running
   [junit4]   2> 2319923 DEBUG (OverseerCollectionConfigSetProcessor-72425004739002376-127.0.0.1:62581_solr-n_0000000000) [    ] o.a.s.c.OverseerTaskProcessor Overseer Collection Message Handler: Get the message id:/overseer/collection-queue-work/qn-0000000000 message:{"operation":"overseerstatus"}
   [junit4]   2> 2319924 DEBUG (OverseerCollectionConfigSetProcessor-72425004739002376-127.0.0.1:62581_solr-n_0000000000) [    ] o.a.s.c.OverseerTaskProcessor Cleaning up work-queue. #Running tasks: 1
   [junit4]   2> 2319924 DEBUG (OverseerCollectionConfigSetProcessor-72425004739002376-127.0.0.1:62581_solr-n_0000000000) [    ] o.a.s.c.OverseerTaskProcessor RunningTasks: [/overseer/collection-queue-work/qn-0000000000]
   [junit4]   2> 2319924 DEBUG (OverseerCollectionConfigSetProcessor-72425004739002376-127.0.0.1:62581_solr-n_0000000000) [    ] o.a.s.c.OverseerTaskProcessor BlockedTasks: []
   [junit4]   2> 2319924 DEBUG (OverseerCollectionConfigSetProcessor-72425004739002376-127.0.0.1:62581_solr-n_0000000000) [    ] o.a.s.c.OverseerTaskProcessor CompletedTasks: []
   [junit4]   2> 2319924 DEBUG (OverseerCollectionConfigSetProcessor-72425004739002376-127.0.0.1:62581_solr-n_0000000000) [    ] o.a.s.c.OverseerTaskProcessor RunningZKTasks: [/overseer/collection-queue-work/qn-0000000000]
   [junit4]   2> 2319924 DEBUG (OverseerCollectionConfigSetProcessor-72425004739002376-127.0.0.1:62581_solr-n_0000000000) [    ] o.a.s.c.OverseerTaskQueue Peeking for top 99 elements. ExcludeSet: [/overseer/collection-queue-work/qn-0000000000],[]
   [junit4]   2> 2319924 DEBUG (OverseerThreadFactory-9390-thread-1) [    ] o.a.s.c.OverseerTaskProcessor Runner processing /overseer/collection-queue-work/qn-0000000000
   [junit4]   2> 2319924 DEBUG (OverseerThreadFactory-9390-thread-1) [    ] o.a.s.c.a.c.OverseerCollectionMessageHandler OverseerCollectionMessageHandler.processMessage : overseerstatus , {"operation":"overseerstatus"}
   [junit4]   2> 2319932 DEBUG (OverseerThreadFactory-9390-thread-1) [    ] o.a.s.c.OverseerTaskProcessor Completed task:[/overseer/collection-queue-work/qn-0000000000]
   [junit4]   2> 2319933 DEBUG (SyncThread:0) [    ] o.a.s.c.ZkTestServer Watch fired: data: /solr/overseer/collection-queue-work/qnr-0000000000
   [junit4]   2> 2319933 DEBUG (SyncThread:0) [    ] o.a.s.c.ZkTestServer Watch fired: children: /solr/overseer/collection-queue-work
   [junit4]   2> 2319933 DEBUG (OverseerThreadFactory-9390-thread-1) [    ] o.a.s.c.OverseerTaskProcessor Marked task [/overseer/collection-queue-work/qn-0000000000] as completed.
   [junit4]   2> 2319933 DEBUG (OverseerThreadFactory-9390-thread-1) [    ] o.a.s.c.OverseerTaskProcessor RunningTasks: []
   [junit4]   2> 2319933 DEBUG (OverseerThreadFactory-9390-thread-1) [    ] o.a.s.c.OverseerTaskProcessor BlockedTasks: []
   [junit4]   2> 2319933 DEBUG (OverseerThreadFactory-9390-thread-1) [    ] o.a.s.c.OverseerTaskProcessor CompletedTasks: [/overseer/collection-queue-work/qn-0000000000]
   [junit4]   2> 2319933 DEBUG (OverseerThreadFactory-9390-thread-1) [    ] o.a.s.c.OverseerTaskProcessor RunningZKTasks: [/overseer/collection-queue-work/qn-0000000000]
   [junit4]   2> 2319933 DEBUG (OverseerThreadFactory-9390-thread-1) [    ] o.a.s.c.OverseerTaskProcessor Overseer Collection Message Handler: Message id:/overseer/collection-queue-work/qn-0000000000 complete, response:{leader=127.0.0.1:62581_solr,overseer_queue_size=0,overseer_work_queue_size=0,overseer_collection_queue_size=2,overseer_operations={am_i_leader={requests=4,errors=0,avgRequestsPerSecond=9.981577601116276,5minRateRequestsPerSecond=0.0,15minRateRequestsPerSecond=0.0,avgTimePerRequest=1.0995137947971905,medianRequestTime=0.359416,75thPcRequestTime=0.732963,95thPcRequestTime=3.02146,99thPcRequestTime=3.02146,999thPcRequestTime=3.02146},downnode={requests=3,errors=0,avgRequestsPerSecond=8.426610267851014,5minRateRequestsPerSecond=0.0,15minRateRequestsPerSecond=0.0,avgTimePerRequest=0.009532333333333332,medianRequestTime=0.009781,75thPcRequestTime=0.010291,95thPcRequestTime=0.010291,99thPcRequestTime=0.010291,999thPcRequestTime=0.010291}},collection_operations={am_i_leader={requests=3,errors=0,avgRequestsPerSecond=7.498548712135881,5minRateRequestsPerSecond=0.0,15minRateRequestsPerSecond=0.0,avgTimePerRequest=1.3275950991978687,medianRequestTime=0.759621,75thPcRequestTime=2.896284,95thPcRequestTime=2.896284,99thPcRequestTime=2.896284,999thPcRequestTime=2.896284},overseerstatus={requests=0,errors=0,avgRequestsPerSecond=0.0,5minRateRequestsPerSecond=0.0,15minRateRequestsPerSecond=0.0,avgTimePerRequest=0.0,medianRequestTime=0.0,75thPcRequestTime=0.0,95thPcRequestTime=0.0,99thPcRequestTime=0.0,999thPcRequestTime=0.0}},overseer_queue={},overseer_internal_queue={peek={avgRequestsPerSecond=2.535628875681795,5minRateRequestsPerSecond=0.0,15minRateRequestsPerSecond=0.0,avgTimePerRequest=0.559887,medianRequestTime=0.559887,75thPcRequestTime=0.559887,95thPcRequestTime=0.559887,99thPcRequestTime=0.559887,999thPcRequestTime=0.559887}},collection_queue={peektopn_wait2000={avgRequestsPerSecond=2.5355110364329865,5minRateRequestsPerSecond=0.0,15minRateRequestsPerSecond=0.0,avgTimePerRequest=388.194069,medianRequestTime=388.194069,75thPcRequestTime=388.194069,95thPcRequestTime=388.194069,99thPcRequestTime=388.194069,999thPcRequestTime=388.194069}}}
   [junit4]   2> 2319934 DEBUG (SyncThread:0) [    ] o.a.s.c.ZkTestServer Watch added: children: /solr/overseer/collection-queue-work
   [junit4]   2> 2319934 DEBUG (OverseerCollectionConfigSetProcessor-72425004739002376-127.0.0.1:62581_solr-n_0000000000) [    ] o.a.s.c.ZkDistributedQueue Found child node with improper name: qnr-0000000000
   [junit4]   2> 2319934 DEBUG (zkCallback-5985-thread-1) [    ] o.a.s.c.OverseerTaskQueue NodeDataChanged fired on path /overseer/collection-queue-work/qnr-0000000000 state SyncConnected latchEventType null
   [junit4]   2> 2319935 DEBUG (SyncThread:0) [    ] o.a.s.c.ZkTestServer Watch fired: children: /solr/overseer/collection-queue-work
   [junit4]   2> 2319936 DEBUG (SyncThread:0) [    ] o.a.s.c.ZkTestServer Watch added: children: /solr/overseer/collection-queue-work
   [junit4]   2> 2319937 INFO  (qtp2077640694-21956) [n:127.0.0.1:62581_solr    ] o.a.s.s.HttpSolrCall [admin] webapp=null path=/admin/collections params={action=OVERSEERSTATUS&wt=javabin&version=2} status=0 QTime=18
   [junit4]   1> Formatting using clusterid: testClusterID
   [junit4]   2> 2320137 WARN  (SUITE-MoveReplicaHDFSTest-seed#[94C3A3495C87837D]-worker) [    ] o.a.h.m.i.MetricsConfig Cannot locate configuration: tried hadoop-metrics2-namenode.properties,hadoop-metrics2.properties
   [junit4]   2> 2320143 WARN  (SUITE-MoveReplicaHDFSTest-seed#[94C3A3495C87837D]-worker) [    ] o.a.h.h.HttpRequestLog Jetty request log can only be enabled using Log4j
   [junit4]   2> 2320143 INFO  (SUITE-MoveReplicaHDFSTest-seed#[94C3A3495C87837D]-worker) [    ] o.m.log jetty-6.1.26
   [junit4]   2> 2320165 INFO  (SUITE-MoveReplicaHDFSTest-seed#[94C3A3495C87837D]-worker) [    ] o.m.log Extract jar:file:/export/home/jenkins/.ivy2/cache/org.apache.hadoop/hadoop-hdfs/tests/hadoop-hdfs-2.7.4-tests.jar!/webapps/hdfs to ./temp/Jetty_serv1.vm3_40689_hdfs____.8pavwk/webapp
   [junit4]   2> 2320575 DEBUG (ScheduledTrigger-9388-thread-1) [    ] o.a.s.c.a.NodeLostTrigger Running NodeLostTrigger: .auto_add_replicas with currently live nodes: 4
   [junit4]   2> 2320675 INFO  (SUITE-MoveReplicaHDFSTest-seed#[94C3A3495C87837D]-worker) [    ] o.m.log Started HttpServer2$SelectChannelConnectorWithSafeStartup@serv1-vm3:40689
   [junit4]   2> 2320890 WARN  (SUITE-MoveReplicaHDFSTest-seed#[94C3A3495C87837D]-worker) [    ] o.a.h.h.HttpRequestLog Jetty request log can only be enabled using Log4j
   [junit4]   2> 2320891 INFO  (SUITE-MoveReplicaHDFSTest-seed#[94C3A3495C87837D]-worker) [    ] o.m.log jetty-6.1.26
   [junit4]   2> 2320908 INFO  (SUITE-MoveReplicaHDFSTest-seed#[94C3A3495C87837D]-worker) [    ] o.m.log Extract jar:file:/export/home/jenkins/.ivy2/cache/org.apache.hadoop/hadoop-hdfs/tests/hadoop-hdfs-2.7.4-tests.jar!/webapps/datanode to ./temp/Jetty_localhost_60228_datanode____.iszml7/webapp
   [junit4]   2> 2321444 INFO  (SUITE-MoveReplicaHDFSTest-seed#[94C3A3495C87837D]-worker) [    ] o.m.log Started HttpServer2$SelectChannelConnectorWithSafeStartup@localhost:60228
   [junit4]   2> 2321601 DEBUG (ScheduledTrigger-9388-thread-2) [    ] o.a.s.c.a.NodeLostTrigger Running NodeLostTrigger: .auto_add_replicas with currently live nodes: 4
   [junit4]   2> 2321671 WARN  (SUITE-MoveReplicaHDFSTest-seed#[94C3A3495C87837D]-worker) [    ] o.a.h.h.HttpRequestLog Jetty request log can only be enabled using Log4j
   [junit4]   2> 2321672 INFO  (SUITE-MoveReplicaHDFSTest-seed#[94C3A3495C87837D]-worker) [    ] o.m.log jetty-6.1.26
   [junit4]   2> 2321720 INFO  (SUITE-MoveReplicaHDFSTest-seed#[94C3A3495C87837D]-worker) [    ] o.m.log Extract jar:file:/export/home/jenkins/.ivy2/cache/org.apache.hadoop/hadoop-hdfs/tests/hadoop-hdfs-2.7.4-tests.jar!/webapps/datanode to ./temp/Jetty_localhost_45704_datanode____.g0tuwv/webapp
   [junit4]   2> 2321930 DEBUG (OverseerCollectionConfigSetProcessor-72425004739002376-127.0.0.1:62581_solr-n_0000000000) [    ] o.a.s.c.OverseerTaskProcessor Got 0 tasks from work-queue : [[]]
   [junit4]   2> 2321931 DEBUG (OverseerCollectionConfigSetProcessor-72425004739002376-127.0.0.1:62581_solr-n_0000000000) [    ] o.a.s.c.OverseerTaskProcessor Cleaning up work-queue. #Running tasks: 0
   [junit4]   2> 2321931 INFO  (OverseerCollectionConfigSetProcessor-72425004739002376-127.0.0.1:62581_solr-n_0000000000) [    ] o.a.s.c.OverseerTaskQueue Response ZK path: /overseer/collection-queue-work/qnr-0000000000 doesn't exist.  Requestor may have disconnected from ZooKeeper
   [junit4]   2> 2321932 DEBUG (OverseerCollectionConfigSetProcessor-72425004739002376-127.0.0.1:62581_solr-n_0000000000) [    ] o.a.s.c.OverseerTaskProcessor RunningTasks: []
   [junit4]   2> 2321932 DEBUG (OverseerCollectionConfigSetProcessor-72425004739002376-127.0.0.1:62581_solr-n_0000000000) [    ] o.a.s.c.OverseerTaskProcessor BlockedTasks: []
   [junit4]   2> 2321932 DEBUG (OverseerCollectionConfigSetProcessor-72425004739002376-127.0.0.1:62581_solr-n_0000000000) [    ] o.a.s.c.OverseerTaskProcessor CompletedTasks: []
   [junit4]   2> 2321932 DEBUG (OverseerCollectionConfigSetProcessor-72425004739002376-127.0.0.1:62581_solr-n_0000000000) [    ] o.a.s.c.OverseerTaskProcessor RunningZKTasks: []
   [junit4]   2> 2321932 DEBUG (OverseerCollectionConfigSetProcessor-72425004739002376-127.0.0.1:62581_solr-n_0000000000) [    ] o.a.s.c.OverseerTaskQueue Peeking for top 100 elements. ExcludeSet: []
   [junit4]   2> 2322000 ERROR (DataNode: [[[DISK]file:/export/home/jenkins/workspace/Lucene-Solr-master-Solaris/solr/build/solr-core/test/J1/temp/solr.cloud.MoveReplicaHDFSTest_94C3A3495C87837D-001/tempDir-002/hdfsBaseDir/data/data1/, [DISK]file:/export/home/jenkins/workspace/Lucene-Solr-master-Solaris/solr/build/solr-core/test/J1/temp/solr.cloud.MoveReplicaHDFSTest_94C3A3495C87837D-001/tempDir-002/hdfsBaseDir/data/data2/]]  heartbeating to serv1-vm3/127.0.0.1:56521) [    ] o.a.h.h.s.d.DirectoryScanner dfs.datanode.directoryscan.throttle.limit.ms.per.sec set to value below 1 ms/sec. Assuming default value of 1000
   [junit4]   2> 2322052 INFO  (Block report processor) [    ] BlockStateChange BLOCK* processReport 0x13eada00591339: from storage DS-e545c726-cd04-41e5-8674-a5a6c2bc4c9d node DatanodeRegistration(127.0.0.1:51295, datanodeUuid=9eeeb802-8b28-479d-b091-935cd668fc60, infoPort=39049, infoSecurePort=0, ipcPort=40167, storageInfo=lv=-56;cid=testClusterID;nsid=1018367913;c=0), blocks: 0, hasStaleStorage: true, processing time: 0 msecs
   [junit4]   2> 2322052 INFO  (Block report processor) [    ] BlockStateChange BLOCK* processReport 0x13eada00591339: from storage DS-570c5e5d-11c6-4111-980a-e670071a06e2 node DatanodeRegistration(127.0.0.1:51295, datanodeUuid=9eeeb802-8b28-479d-b091-935cd668fc60, infoPort=39049, infoSecurePort=0, ipcPort=40167, storageInfo=lv=-56;cid=testClusterID;nsid=1018367913;c=0), blocks: 0, hasStaleStorage: false, processing time: 0 msecs
   [junit4]   2> 2322511 INFO  (SUITE-MoveReplicaHDFSTest-seed#[94C3A3495C87837D]-worker) [    ] o.m.log Started HttpServer2$SelectChannelConnectorWithSafeStartup@localhost:45704
   [junit4]   2> 2322601 DEBUG (ScheduledTrigger-9388-thread-2) [    ] o.a.s.c.a.NodeLostTrigger Running NodeLostTrigger: .auto_add_replicas with currently live nodes: 4
   [junit4]   2> 2322778 ERROR (DataNode: [[[DISK]file:/export/home/jenkins/workspace/Lucene-Solr-master-Solaris/solr/build/solr-core/test/J1/temp/solr.cloud.MoveReplicaHDFSTest_94C3A3495C87837D-001/tempDir-002/hdfsBaseDir/data/data3/, [DISK]file:/export/home/jenkins/workspace/Lucene-Solr-master-Solaris/solr/build/solr-core/test/J1/temp/solr.cloud.MoveReplicaHDFSTest_94C3A3495C87837D-001/tempDir-002/hdfsBaseDir/data/data4/]]  heartbeating to serv1-vm3/127.0.0.1:56521) [    ] o.a.h.h.s.d.DirectoryScanner dfs.datanode.directoryscan.throttle.limit.ms.per.sec set to value below 1 ms/sec. Assuming default value of 1000
   [junit4]   2> 2322802 INFO  (Block report processor) [    ] BlockStateChange BLOCK* processReport 0x13eada2d5b1c5a: from storage DS-c885fc16-dbd3-46f1-8801-91fe0c2a5071 node DatanodeRegistration(127.0.0.1:63253, datanodeUuid=deb87bd7-2968-4b78-8422-ca2e527971bd, infoPort=39844, infoSecurePort=0, ipcPort=62541, storageInfo=lv=-56;cid=testClusterID;nsid=1018367913;c=0), blocks: 0, hasStaleStorage: true, processing time: 0 msecs
   [junit4]   2> 2322802 INFO  (Block report processor) [    ] BlockStateChange BLOCK* processReport 0x13eada2d5b1c5a: from storage DS-2c46ecfd-c619-4228-b6e8-57def7a1bcab node DatanodeRegistration(127.0.0.1:63253, datanodeUuid=deb87bd7-2968-4b78-8422-ca2e527971bd, infoPort=39844, infoSecurePort=0, ipcPort=62541, storageInfo=lv=-56;cid=testClusterID;nsid=1018367913;c=0), blocks: 0, hasStaleStorage: false, processing time: 0 msecs
   [junit4]   2> 2323606 DEBUG (ScheduledTrigger-9388-thread-3) [    ] o.a.s.c.a.NodeLostTrigger Running NodeLostTrigger: .auto_add_replicas with currently live nodes: 4
   [junit4]   2> 2323778 INFO  (TEST-MoveReplicaHDFSTest.testNormalFailedMove-seed#[94C3A3495C87837D]) [    ] o.a.s.SolrTestCaseJ4 ###Starting testNormalFailedMove
   [junit4]   2> 2323779 DEBUG (SyncThread:0) [    ] o.a.s.c.ZkTestServer Watch added: create/delete: /solr/clusterprops.json
   [junit4]   2> 2323780 DEBUG (SyncThread:0) [    ] o.a.s.c.ZkTestServer Watch added: children: /solr/live_nodes
   [junit4]   2> 2323780 INFO  (TEST-MoveReplicaHDFSTest.testNormalFailedMove-seed#[94C3A3495C87837D]) [    ] o.a.s.c.c.ZkStateReader Updated live nodes from ZooKeeper... (0) -> (4)
   [junit4]   2> 2323780 DEBUG (SyncThread:0) [    ] o.a.s.c.ZkTestServer Watch added: data: /solr/clusterstate.json
   [junit4]   2> 2323781 DEBUG (SyncThread:0) [    ] o.a.s.c.ZkTestServer Watch added: children: /solr/collections
   [junit4]   2> 2323781 DEBUG (SyncThread:0) [    ] o.a.s.c.ZkTestServer Watch added: create/delete: /solr/aliases.json
   [junit4]   2> 2323782 DEBUG (SyncThread:0) [    ] o.a.s.c.ZkTestServer Watch fired: data: /solr/aliases.json
   [junit4]   2> 2323782 DEBUG (SyncThread:0) [    ] o.a.s.c.ZkTestServer Watch fired: data: /solr/aliases.json
   [junit4]   2> 2323782 DEBUG (SyncThread:0) [    ] o.a.s.c.ZkTestServer Watch fired: data: /solr/aliases.json
   [junit4]   2> 2323782 DEBUG (SyncThread:0) [    ] o.a.s.c.ZkTestServer Watch fired: data: /solr/aliases.json
   [junit4]   2> 2323782 DEBUG (SyncThread:0) [    ] o.a.s.c.ZkTestServer Watch fired: data: /solr/aliases.json
   [junit4]   2> 2323782 DEBUG (SyncThread:0) [    ] o.a.s.c.ZkTestServer Watch fired: data: /solr/aliases.json
   [junit4]   2> 2323782 DEBUG (SyncThread:0) [    ] o.a.s.c.ZkTestServer Watch fired: data: /solr/aliases.json
   [junit4]   2> 2323782 DEBUG (SyncThread:0) [    ] o.a.s.c.ZkTestServer Watch fired: data: /solr/aliases.json
   [junit4]   2> 2323782 DEBUG (SyncThread:0) [    ] o.a.s.c.ZkTestServer Watch fired: data: /solr/aliases.json
   [junit4]   2> 2323783 DEBUG (SyncThread:0) [    ] o.a.s.c.ZkTestServer Watch added: data: /solr/aliases.json
   [junit4]   2> 2323783 INFO  (TEST-MoveReplicaHDFSTest.testNormalFailedMove-seed#[94C3A3495C87837D]) [    ] o.e.j.s.Server jetty-9.4.11.v20180605; built: 2018-06-05T18:24:03.829Z; git: d5fc0523cfa96bfebfbda19606cad384d772f04c; jvm 1.8.0_172-b11
   [junit4]   2> 2323783 DEBUG (SyncThread:0) [    ] o.a.s.c.ZkTestServer Watch added: data: /solr/aliases.json
   [junit4]   2> 2323783 DEBUG (SyncThread:0) [    ] o.a.s.c.ZkTestServer Watch added: data: /solr/aliases.json
   [junit4]   2> 2323784 DEBUG (SyncThread:0) [    ] o.a.s.c.ZkTestServer Watch added: data: /solr/aliases.json
   [junit4]   2> 2323784 DEBUG (SyncThread:0) [    ] o.a.s.c.ZkTestServer Watch added: data: /solr/aliases.json
   [junit4]   2> 2323784 DEBUG (SyncThread:0) [    ] o.a.s.c.ZkTestServer Watch added: data: /solr/aliases.json
   [junit4]   2> 2323784 DEBUG (SyncThread:0) [    ] o.a.s.c.ZkTestServer Watch added: data: /solr/aliases.json
   [junit4]   2> 2323784 DEBUG (SyncThread:0) [    ] o.a.s.c.ZkTestServer Watch added: data: /solr/aliases.json
   [junit4]   2> 2323784 DEBUG (SyncThread:0) [    ] o.a.s.c.ZkTestServer Watch added: data: /solr/aliases.json
   [junit4]   2> 2323785 DEBUG (SyncThread:0) [    ] o.a.s.c.ZkTestServer Watch added: data: /solr/aliases.json
   [junit4]   2> 2323785 INFO  (TEST-MoveReplicaHDFSTest.testNormalFailedMove-seed#[94C3A3495C87837D]) [    ] o.e.j.s.session DefaultSessionIdManager workerName=node0
   [junit4]   2> 2323785 INFO  (TEST-MoveReplicaHDFSTest.testNormalFailedMove-seed#[94C3A3495C87837D]) [    ] o.e.j.s.session No SessionScavenger set, using defaults
   [junit4]   2> 2323785 INFO  (TEST-MoveReplicaHDFSTest.testNormalFailedMove-seed#[94C3A3495C87837D]) [    ] o.e.j.s.session node0 Scavenging every 660000ms
   [junit4]   2> 2323786 INFO  (TEST-MoveReplicaHDFSTest.testNormalFailedMove-seed#[94C3A3495C87837D]) [    ] o.e.j.s.h.ContextHandler Started o.e.j.s.ServletContextHandler@1587b908{/solr,null,AVAILABLE}
   [junit4]   2> 2323786 INFO  (TEST-MoveReplicaHDFSTest.testNormalFailedMove-seed#[94C3A3495C87837D]) [    ] o.e.j.s.AbstractConnector Started ServerConnector@7b4b362e{HTTP/1.1,[http/1.1]}{127.0.0.1:59782}
   [junit4]   2> 2323786 INFO  (TEST-MoveReplicaHDFSTest.testNormalFailedMove-seed#[94C3A3495C87837D]) [    ] o.e.j.s.Server Started @2325035ms
   [junit4]   2> 2323786 INFO  (TEST-MoveReplicaHDFSTest.testNormalFailedMove-seed#[94C3A3495C87837D]) [    ] o.a.s.c.s.e.JettySolrRunner Jetty properties: {hostContext=/solr, hostPort=59782}
   [junit4]   2> 2323786 ERROR (TEST-MoveReplicaHDFSTest.testNormalFailedMove-seed#[94C3A3495C87837D]) [    ] o.a.s.u.StartupLoggingUtils Missing Java Option solr.log.dir. Logging may be missing or incomplete.
   [junit4]   2> 2323786 INFO  (TEST-MoveReplicaHDFSTest.testNormalFailedMove-seed#[94C3A3495C87837D]) [    ] o.a.s.s.SolrDispatchFilter Using logger factory org.apache.logging.slf4j.Log4jLoggerFactory
   [junit4]   2> 2323786 INFO  (TEST-MoveReplicaHDFSTest.testNormalFailedMove-seed#[94C3A3495C87837D]) [    ] o.a.s.s.SolrDispatchFilter  ___      _       Welcome to Apache Solr™ version 8.0.0
   [junit4]   2> 2323786 INFO  (TEST-MoveReplicaHDFSTest.testNormalFailedMove-seed#[94C3A3495C87837D]) [    ] o.a.s.s.SolrDispatchFilter / __| ___| |_ _   Starting in cloud mode on port null
   [junit4]   2> 2323786 INFO  (TEST-MoveReplicaHDFSTest.testNormalFailedMove-seed#[94C3A3495C87837D]) [    ] o.a.s.s.SolrDispatchFilter \__ \/ _ \ | '_|  Install dir: null
   [junit4]   2> 2323786 INFO  (TEST-MoveReplicaHDFSTest.testNormalFailedMove-seed#[94C3A3495C87837D]) [    ] o.a.s.s.SolrDispatchFilter |___/\___/_|_|    Start time: 2018-06-30T05:49:44.213Z
   [junit4]   2> 2323788 INFO  (zkConnectionManagerCallback-6039-thread-1) [    ] o.a.s.c.c.ConnectionManager zkClient has connected
   [junit4]   2> 2323789 INFO  (TEST-MoveReplicaHDFSTest.testNormalFailedMove-seed#[94C3A3495C87837D]) [    ] o.a.s.s.SolrDispatchFilter solr.xml found in ZooKeeper. Loading...
   [junit4]   2> 2323932 DEBUG (OverseerCollectionConfigSetProcessor-72425004739002376-127.0.0.1:62581_solr-n_0000000000) [    ] o.a.s.c.OverseerTaskProcessor Got 0 tasks from work-queue : [[]]
   [junit4]   2> 2323933 DEBUG (OverseerCollectionConfigSetProcessor-72425004739002376-127.0.0.1:62581_solr-n_0000000000) [    ] o.a.s.c.OverseerTaskProcessor Cleaning up work-queue. #Running tasks: 0
   [junit4]   2> 2323933 DEBUG (OverseerCollectionConfigSetProcessor-72425004739002376-127.0.0.1:62581_solr-n_0000000000) [    ] o.a.s.c.OverseerTaskProcessor RunningTasks: []
   [junit4]   2> 2323933 DEBUG (OverseerCollectionConfigSetProcessor-72425004739002376-127.0.0.1:62581_solr-n_0000000000) [    ] o.a.s.c.OverseerTaskProcessor BlockedTasks: []
   [junit4]   2> 2323933 DEBUG (OverseerCollectionConfigSetProcessor-72425004739002376-127.0.0.1:62581_solr-n_0000000000) [    ] o.a.s.c.OverseerTaskProcessor CompletedTasks: []
   [junit4]   2> 2323933 DEBUG (OverseerCollectionConfigSetProcessor-72425004739002376-127.0.0.1:62581_solr-n_0000000000) [    ] o.a.s.c.OverseerTaskProcessor RunningZKTasks: []
   [junit4]   2> 2323933 DEBUG (OverseerCollectionConfigSetProcessor-72425004739002376-127.0.0.1:62581_solr-n_0000000000) [    ] o.a.s.c.OverseerTaskQueue Peeking for top 100 elements. ExcludeSet: []
   [junit4]   2> 2324247 INFO  (TEST-MoveReplicaHDFSTest.testNormalFailedMove-seed#[94C3A3495C87837D]) [    ] o.a.s.c.ZkContainer Zookeeper client=127.0.0.1:43303/solr
   [junit4]   2> 2324250 INFO  (zkConnectionManagerCallback-6043-thread-1) [    ] o.a.s.c.c.ConnectionManager zkClient has connected
   [junit4]   2> 2324252 DEBUG (TEST-MoveReplicaHDFSTest.testNormalFailedMove-seed#[94C3A3495C87837D]) [n:127.0.0.1:59782_solr    ] o.a.s.c.ZkController Added new OnReconnect listener org.apache.solr.cloud.ZkController$$Lambda$48/354273539@17de5704
   [junit4]   2> 2324254 INFO  (zkConnectionManagerCallback-6045-thread-1) [    ] o.a.s.c.c.ConnectionManager zkClient has connected
   [junit4]   2> 2324274 DEBUG (SyncThread:0) [    ] o.a.s.c.ZkTestServer Watch added: create/delete: /solr/clusterprops.json
   [junit4]   2> 2324274 DEBUG (SyncThread:0) [    ] o.a.s.c.ZkTestServer Watch added: children: /solr/live_nodes
   [junit4]   2> 2324274 INFO  (TEST-MoveReplicaHDFSTest.testNormalFailedMove-seed#[94C3A3495C87837D]) [n:127.0.0.1:59782_solr    ] o.a.s.c.c.ZkStateReader Updated live nodes from ZooKeeper... (0) -> (4)
   [junit4]   2> 2324275 DEBUG (SyncThread:0) [    ] o.a.s.c.ZkTestServer Watch added: data: /solr/clusterstate.json
   [junit4]   2> 2324276 DEBUG (SyncThread:0) [    ] o.a.s.c.ZkTestServer Watch added: children: /solr/collections
   [junit4]   2> 2324277 DEBUG (SyncThread:0) [    ] o.a.s.c.ZkTestServer Watch added: create/delete: /solr/aliases.json
   [junit4]   2> 2324278 DEBUG (SyncThread:0) [    ] o.a.s.c.ZkTestServer Watch added: create/delete: /solr/security.json
   [junit4]   2> 2324280 INFO  (TEST-MoveReplicaHDFSTest.testNormalFailedMove-seed#[94C3A3495C87837D]) [n:127.0.0.1:59782_solr    ] o.a.s.c.Overseer Overseer (id=null) closing
   [junit4]   2> 2324281 DEBUG (TEST-MoveReplicaHDFSTest.testNormalFailedMove-seed#[94C3A3495C87837D]) [n:127.0.0.1:59782_solr    ] o.a.s.c.LeaderElector Joined leadership election with path: /overseer_elect/election/72425004739002389-127.0.0.1:59782_solr-n_0000000004
   [junit4]   2> 2324282 DEBUG (SyncThread:0) [    ] o.a.s.c.ZkTestServer Watch added: data: /solr/overseer_elect/election/72425004739002383-127.0.0.1:37572_solr-n_0000000003
   [junit4]   2> 2324282 DEBUG (TEST-MoveReplicaHDFSTest.testNormalFailedMove-seed#[94C3A3495C87837D]) [n:127.0.0.1:59782_solr    ] o.a.s.c.LeaderElector Watching path /overseer_elect/election/72425004739002383-127.0.0.1:37572_solr-n_0000000003 to know if I could be the leader
   [junit4]   2> 2324283 DEBUG (TEST-MoveReplicaHDFSTest.testNormalFailedMove-seed#[94C3A3495C87837D]) [n:127.0.0.1:59782_solr    ] o.a.s.c.ZkController Publish node=127.0.0.1:59782_solr as DOWN
   [junit4]   2> 2324284 DEBUG (SyncThread:0) [    ] o.a.s.c.ZkTestServer Watch fired: children: /solr/overseer/queue
   [junit4]   2> 2324284 INFO  (TEST-MoveReplicaHDFSTest.testNormalFailedMove-seed#[94C3A3495C87837D]) [n:127.0.0.1:59782_solr    ] o.a.s.c.TransientSolrCoreCacheDefault Allocating transient cache for 2147483647 transient cores
   [junit4]   2> 2324284 INFO  (TEST-MoveReplicaHDFSTest.testNormalFailedMove-seed#[94C3A3495C87837D]) [n:127.0.0.1:59782_solr    ] o.a.s.c.ZkController Register node as live in ZooKeeper:/live_nodes/127.0.0.1:59782_solr
   [junit4]   2> 2324285 DEBUG (SyncThread:0) [    ] o.a.s.c.ZkTestServer Watch added: children: /solr/overseer/queue
   [junit4]   2> 2324285 DEBUG (SyncThread:0) [    ] o.a.s.c.ZkTestServer Watch fired: children: /solr/live_nodes
   [junit4]   2> 2324285 DEBUG (SyncThread:0) [    ] o.a.s.c.ZkTestServer Watch fired: children: /solr/live_nodes
   [junit4]   2> 2324285 DEBUG (SyncThread:0) [    ] o.a.s.c.ZkTestServer Watch fired: children: /solr/live_nodes
   [junit4]   2> 2324285 DEBUG (SyncThread:0) [    ] o.a.s.c.ZkTestServer Watch fired: children: /solr/live_nodes
   [junit4]   2> 2324285 DEBUG (SyncThread:0) [    ] o.a.s.c.ZkTestServer Watch fired: children: /solr/live_nodes
   [junit4]   2> 2324285 DEBUG (SyncThread:0) [    ] o.a.s.c.ZkTestServer Watch fired: children: /solr/live_nodes
   [junit4]   2> 2324285 DEBUG (SyncThread:0) [    ] o.a.s.c.ZkTestServer Watch fired: children: /solr/live_nodes
   [junit4]   2> 2324285 DEBUG (SyncThread:0) [    ] o.a.s.c.ZkTestServer Watch fired: children: /solr/live_nodes
   [junit4]   2> 2324285 DEBUG (SyncThread:0) [    ] o.a.s.c.ZkTestServer Watch fired: children: /solr/live_nodes
   [junit4]   2> 2324285 DEBUG (SyncThread:0) [    ] o.a.s.c.ZkTestServer Watch fired: children: /solr/live_nodes
   [junit4]   2> 2324286 DEBUG (SyncThread:0) [    ] o.a.s.c.ZkTestServer Watch added: children: /solr/live_nodes
   [junit4]   2> 2324286 INFO  (zkCallback-6034-thread-2) [    ] o.a.s.c.c.ZkStateReader Updated live nodes from ZooKeeper... (4) -> (5)
   [junit4]   2> 2324286 DEBUG (SyncThread:0) [    ] o.a.s.c.ZkTestServer Watch added: children: /solr/live_nodes
   [junit4]   2> 2324286 INFO  (zkCallback-5985-thread-1) [    ] o.a.s.c.c.ZkStateReader Updated live nodes from ZooKeeper... (4) -> (5)
   [junit4]   2> 2324286 DEBUG (SyncThread:0) [    ] o.a.s.c.ZkTestServer Watch added: children: /solr/live_nodes
   [junit4]   2> 2324286 INFO  (zkCallback-6012-thread-1) [    ] o.a.s.c.c.ZkStateReader Updated live nodes from ZooKeeper... (4) -> (5)
   [junit4]   2> 2324287 DEBUG (SyncThread:0) [    ] o.a.s.c.ZkTestServer Watch added: children: /solr/live_nodes
   [junit4]   2> 2324287 DEBUG (SyncThread:0) [    ] o.a.s.c.ZkTestServer Watch added: children: /solr/live_nodes
   [junit4]   2> 2324287 INFO  (zkCallback-5977-thread-1) [    ] o.a.s.c.c.ZkStateReader Updated live nodes from ZooKeeper... (4) -> (5)
   [junit4]   2> 2324287 DEBUG (SyncThread:0) [    ] o.a.s.c.ZkTestServer Watch added: children: /solr/live_nodes
   [junit4]   2> 2324287 INFO  (zkCallback-5992-thread-1) [    ] o.a.s.c.c.ZkStateReader Updated live nodes from ZooKeeper... (4) -> (5)
   [junit4]   2> 2324287 INFO  (zkCallback-6019-thread-1) [    ] o.a.s.c.c.ZkStateReader Updated live nodes from ZooKeeper... (4) -> (5)
   [junit4]   2> 2324288 DEBUG (SyncThread:0) [    ] o.a.s.c.ZkTestServer Watch added: children: /solr/live_nodes
   [junit4]   2> 2324288 DEBUG (SyncThread:0) [    ] o.a.s.c.ZkTestServer Watch added: children: /solr/live_nodes
   [junit4]   2> 2324288 INFO  (zkCallback-6005-thread-1) [    ] o.a.s.c.c.ZkStateReader Updated live nodes from ZooKeeper... (4) -> (5)
   [junit4]   2> 2324288 INFO  (zkCallback-5999-thread-1) [    ] o.a.s.c.c.ZkStateReader Updated live nodes from ZooKeeper... (4) -> (5)
   [junit4]   2> 2324289 DEBUG (SyncThread:0) [    ] o.a.s.c.ZkTestServer Watch added: children: /solr/live_nodes
   [junit4]   2> 2324289 DEBUG (SyncThread:0) [    ] o.a.s.c.ZkTestServer Watch added: children: /solr/live_nodes
   [junit4]   2> 2324289 INFO  (zkCallback-6034-thread-1) [    ] o.a.s.c.c.ZkStateReader Updated live nodes from ZooKeeper... (4) -> (5)
   [junit4]   2> 2324289 INFO  (zkCallback-6026-thread-1) [    ] o.a.s.c.c.ZkStateReader Updated live nodes from ZooKeeper... (4) -> (5)
   [junit4]   2> 2324289 DEBUG (SyncThread:0) [    ] o.a.s.c.ZkTestServer Watch added: children: /solr/live_nodes
   [junit4]   2> 2324289 INFO  (zkCallback-6044-thread-1) [    ] o.a.s.c.c.ZkStateReader Updated live nodes from ZooKeeper... (4) -> (5)
   [junit4]   2> 2324316 INFO  (zkConnectionManagerCallback-6052-thread-1) [    ] o.a.s.c.c.ConnectionManager zkClient has connected
   [junit4]   2> 2324317 DEBUG (SyncThread:0) [    ] o.a.s.c.ZkTestServer Watch added: create/delete: /solr/clusterprops.json
   [junit4]   2> 2324317 DEBUG (SyncThread:0) [    ] o.a.s.c.ZkTestServer Watch added: children: /solr/live_nodes
   [junit4]   2> 2324318 INFO  (TEST-MoveReplicaHDFSTest.testNormalFailedMove-seed#[94C3A3495C87837D]) [n:127.0.0.1:59782_solr    ] o.a.s.c.c.ZkStateReader Updated live nodes from ZooKeeper... (0) -> (5)
   [junit4]   2> 2324318 DEBUG (SyncThread:0) [    ] o.a.s.c.ZkTestServer Watch added: data: /solr/clusterstate.json
   [junit4]   2> 2324318 DEBUG (SyncThread:0) [    ] o.a.s.c.ZkTestServer Watch added: children: /solr/collections
   [junit4]   2> 2324319 DEBUG (SyncThread:0) [    ] o.a.s.c.ZkTestServer Watch added: create/delete: /solr/aliases.json
   [junit4]   2> 2324319 INFO  (TEST-MoveReplicaHDFSTest.testNormalFailedMove-seed#[94C3A3495C87837D]) [n:127.0.0.1:59782_solr    ] o.a.s.c.s.i.ZkClientClusterStateProvider Cluster at 127.0.0.1:43303/solr ready
   [junit4]   2> 2324320 INFO  (TEST-MoveReplicaHDFSTest.testNormalFailedMove-seed#[94C3A3495C87837D]) [n:127.0.0.1:59782_solr    ] o.a.s.h.a.MetricsHistoryHandler No .system collection, keeping metrics history in memory.
   [junit4]   2> 2324334 INFO  (TEST-MoveReplicaHDFSTest.testNormalFailedMove-seed#[94C3A3495C87837D]) [n:127.0.0.1:59782_solr    ] o.a.s.m.r.SolrJmxReporter JMX monitoring for 'solr_59782.solr.node' (registry 'solr.node') enabled at server: com.sun.jmx.mbeanserver.JmxMBeanServer@4e66dc6b
   [junit4]   2> 2324340 INFO  (TEST-MoveReplicaHDFSTest.testNormalFailedMove-seed#[94C3A3495C87837D]) [n:127.0.0.1:59782_solr    ] o.a.s.m.r.SolrJmxReporter JMX monitoring for 'solr_59782.solr.jvm' (registry 'solr.jvm') enabled at server: com.sun.jmx.mbeanserver.JmxMBeanServer@4e66dc6b
   [junit4]   2> 2324340 INFO  (TEST-MoveReplicaHDFSTest.testNormalFailedMove-seed#[94C3A3495C87837D]) [n:127.0.0.1:59782_solr    ] o.a.s.m.r.SolrJmxReporter JMX monitoring for 'solr_59782.solr.jetty' (registry 'solr.jetty') enabled at server: com.sun.jmx.mbeanserver.JmxMBeanServer@4e66dc6b
   [junit4]   2> 2324341 INFO  (TEST-MoveReplicaHDFSTest.testNormalFailedMove-seed#[94C3A3495C87837D]) [n:127.0.0.1:59782_solr    ] o.a.s.c.CorePropertiesLocator Found 0 core definitions underneath /export/home/jenkins/workspace/Lucene-Solr-master-Solaris/solr/build/solr-core/test/J1/temp/solr.cloud.MoveReplicaHDFSTest_94C3A3495C87837D-001/tempDir-001/node5/.
   [junit4]   2> 2324391 DEBUG (SyncThread:0) [    ] o.a.s.c.ZkTestServer Watch fired: children: /solr/overseer/queue
   [junit4]   2> 2324392 DEBUG (SyncThread:0) [    ] o.a.s.c.ZkTestServer Watch added: children: /solr/overseer/queue
   [junit4]   2> 2324417 INFO  (zkConnectionManagerCallback-6055-thread-1) [    ] o.a.s.c.c.ConnectionManager zkClient has connected
   [junit4]   2> 2324420 INFO  (qtp1128722055-21929) [n:127.0.0.1:33105_solr    ] o.a.s.h.a.CollectionsHandler Invoked Collection Action :create with params collection.configName=conf1&autoAddReplicas=false&name=MoveReplicaHDFSTest_failed_coll_false&nrtReplicas=2&action=CREATE&numShards=2&wt=javabin&version=2 and sendToOCPQueue=true
   [junit4]   2> 2324422 DEBUG (SyncThread:0) [    ] o.a.s.c.ZkTestServer Watch fired: children: /solr/overseer/collection-queue-work
   [junit4]   2> 2324422 DEBUG (SyncThread:0) [    ] o.a.s.c.ZkTestServer Watch added: create/delete: /solr/overseer/collection-queue-work/qnr-0000000002
   [junit4]   2> 2324422 DEBUG (SyncThread:0) [    ] o.a.s.c.ZkTestServer Watch added: children: /solr/overseer/collection-queue-work
   [junit4]   2> 2324423 DEBUG (OverseerCollectionConfigSetProcessor-72425004739002376-127.0.0.1:62581_solr-n_0000000000) [    ] o.a.s.c.ZkDistributedQueue Found child node with improper name: qnr-0000000002
   [junit4]   2> 2324423 DEBUG (SyncThread:0) [    ] o.a.s.c.ZkTestServer Watch fired: children: /solr/overseer/collection-queue-work
   [junit4]   2> 2324424 DEBUG (SyncThread:0) [    ] o.a.s.c.ZkTestServer Watch added: children: /solr/overseer/collection-queue-work
   [junit4]   2> 2324424 DEBUG (OverseerCollectionConfigSetProcessor-72425004739002376-127.0.0.1:62581_solr-n_0000000000) [    ] o.a.s.c.ZkDistributedQueue Found child node with improper name: qnr-0000000002
   [junit4]   2> 2324424 DEBUG (OverseerCollectionConfigSetProcessor-72425004739002376-127.0.0.1:62581_solr-n_0000000000) [    ] o.a.s.c.OverseerTaskQueue Returning topN elements: [/overseer/collection-queue-work/qn-0000000002, ]
   [junit4]   2> 2324424 DEBUG (OverseerCollectionConfigSetProcessor-72425004739002376-127.0.0.1:62581_solr-n_0000000000) [    ] o.a.s.c.OverseerTaskProcessor Got 1 tasks from work-queue : [[org.apache.solr.cloud.OverseerTaskQueue$QueueEvent@2e684ed1]]
   [junit4]   2> 2324424 DEBUG (OverseerCollectionConfigSetProcessor-72425004739002376-127.0.0.1:62581_solr-n_0000000000) [    ] o.a.s.c.OverseerTaskProcessor Marked task [/overseer/collection-queue-work/qn-0000000002] as running
   [junit4]   2> 2324424 DEBUG (OverseerCollectionConfigSetProcessor-72425004739002376-127.0.0.1:62581_solr-n_0000000000) [    ] o.a.s.c.OverseerTaskProcessor Overseer Collection Message Handler: Get the message id:/overseer/collection-queue-work/qn-0000000002 message:{
   [junit4]   2>   "name":"MoveReplicaHDFSTest_failed_coll_false",
   [junit4]   2>   "fromApi":"true",
   [junit4]   2>   "collection.configName":"conf1",
   [junit4]   2>   "numShards":"2",
   [junit4]   2>   "autoAddReplicas":"false",
   [junit4]   2>   "nrtReplicas":"2",
   [junit4]   2>   "stateFormat":"2",
   [junit4]   2>   "replicationFactor":"2",
   [junit4]   2>   "operation":"create"}
   [junit4]   2> 2324425 DEBUG (OverseerThreadFactory-9390-thread-2) [    ] o.a.s.c.OverseerTaskProcessor Runner processing /overseer/collection-queue-work/qn-0000000002
   [junit4]   2> 2324425 DEBUG (OverseerCollectionConfigSetProcessor-72425004739002376-127.0.0.1:62581_solr-n_0000000000) [    ] o.a.s.c.OverseerTaskProcessor Cleaning up work-queue. #Running tasks: 1
   [junit4]   2> 2324425 DEBUG (OverseerThreadFactory-9390-thread-2) [    ] o.a.s.c.a.c.OverseerCollectionMessageHandler OverseerCollectionMessageHandler.processMessage : create , {
   [junit4]   2>   "name":"MoveReplicaHDFSTest_failed_coll_false",
   [junit4]   2>   "fromApi":"true",
   [junit4]   2>   "collection.configName":"conf1",
   [junit4]   2>   "numShards":"2",
   [junit4]   2>   "autoAddReplicas":"false",
   [junit4]   2>   "nrtReplicas":"2",
   [junit4]   2>   "stateFormat":"2",
   [junit4]   2>   "replicationFactor":"2",
   [junit4]   2>   "operation":"create"}
   [junit4]   2> 2324425 INFO  (OverseerThreadFactory-9390-thread-2) [    ] o.a.s.c.a.c.CreateCollectionCmd Create collection MoveReplicaHDFSTest_failed_coll_false
   [junit4]   2> 2324425 DEBUG (OverseerCollectionConfigSetProcessor-72425004739002376-127.0.0.1:62581_solr-n_0000000000) [    ] o.a.s.c.OverseerTaskProcessor RunningTasks: [/overseer/collection-queue-work/qn-0000000002]
   [junit4]   2> 2324425 DEBUG (OverseerCollectionConfigSetProcessor-72425004739002376-127.0.0.1:62581_solr-n_0000000000) [    ] o.a.s.c.OverseerTaskProcessor BlockedTasks: []
   [junit4]   2> 2324425 DEBUG (OverseerCollectionConfigSetProcessor-72425004739002376-127.0.0.1:62581_solr-n_0000000000) [    ] o.a.s.c.OverseerTaskProcessor CompletedTasks: []
   [junit4]   2> 2324425 DEBUG (OverseerCollectionConfigSetProcessor-72425004739002376-127.0.0.1:62581_solr-n_0000000000) [    ] o.a.s.c.OverseerTaskProcessor RunningZKTasks: [/overseer/collection-queue-work/qn-0000000002]
   [junit4]   2> 2324425 DEBUG (OverseerCollectionConfigSetProcessor-72425004739002376-127.0.0.1:62581_solr-n_0000000000) [    ] o.a.s.c.OverseerTaskQueue Peeking for top 99 elements. ExcludeSet: [/overseer/collection-queue-work/qn-0000000002],[]
   [junit4]   2> 2324427 DEBUG (OverseerThreadFactory-9390-thread-2) [    ] o.a.s.c.a.c.Assign Identify nodes using default
   [junit4]   2> 2324427 DEBUG (OverseerThreadFactory-9390-thread-2) [    ] o.a.s.c.a.c.OverseerCollectionMessageHandler creating collections conf node /collections/MoveReplicaHDFSTest_failed_coll_false 
   [junit4]   2> 2324428 DEBUG (SyncThread:0) [    ] o.a.s.c.ZkTestServer Watch fired: children: /solr/collections
   [junit4]   2> 2324428 DEBUG (SyncThread:0) [    ] o.a.s.c.ZkTestServer Watch fired: children: /solr/collections
   [junit4]   2> 2324428 DEBUG (SyncThread:0) [    ] o.a.s.c.ZkTestServer Watch fired: children:

[...truncated too long message...]

 | TestRecovery.testBufferedMultipleCalls
   [junit4] OK      4.49s J0 | TestRecovery.testLogReplayWithInPlaceUpdatesAndDeletes
   [junit4] OK      1.31s J0 | TestRecovery.testLogReplayWithReorderedDBQInsertingChildnodes
   [junit4] OK      1.75s J0 | TestRecovery.testLogReplayWithReorderedDBQByIdAndChildDocs
   [junit4] OK      2.40s J0 | TestRecovery.testRecoveryMultipleLogs
   [junit4] Completed [5/10] on J0 in 45.15s, 20 tests
   [junit4] 
   [junit4] Suite: org.apache.solr.cloud.MoveReplicaHDFSTest
   [junit4] OK      13.4s J1 | MoveReplicaHDFSTest.testNormalFailedMove
   [junit4] OK      25.2s J1 | MoveReplicaHDFSTest.testNormalMove
   [junit4] OK      35.5s J1 | MoveReplicaHDFSTest.testFailedMove
   [junit4] OK      25.0s J1 | MoveReplicaHDFSTest.test
   [junit4] Completed [6/10] on J1 in 117.25s, 4 tests
   [junit4] 
   [junit4] Duplicate suite name used with XML reports: org.apache.solr.cloud.MoveReplicaHDFSTest. This may confuse tools that process XML reports. Set 'ignoreDuplicateSuites' to true to skip this message.
   [junit4] Suite: org.apache.solr.search.TestRecovery
   [junit4] OK      4.59s J1 | TestRecovery.testRemoveOldLogs
   [junit4] OK      2.31s J1 | TestRecovery.testCleanShutdown
   [junit4] OK      1.99s J1 | TestRecovery.testCorruptLog
   [junit4] OK      6.37s J1 | TestRecovery.stressLogReplay
   [junit4] OK      1.57s J1 | TestRecovery.testDropBuffered
   [junit4] OK      0.48s J1 | TestRecovery.testReload
   [junit4] OK      4.91s J1 | TestRecovery.testExistOldBufferLog
   [junit4] OK      2.41s J1 | TestRecovery.testLogReplayWithReorderedDBQUpdateWithDifferentChildCount
   [junit4] OK      2.08s J1 | TestRecovery.testNewDBQAndDocMatchingOldDBQDuringLogReplay
   [junit4] OK      2.17s J1 | TestRecovery.testBuffering
   [junit4] OK      2.37s J1 | TestRecovery.testLogReplayWithReorderedDBQ
   [junit4] OK      1.47s J1 | TestRecovery.testTruncatedLog
   [junit4] OK      0.98s J1 | TestRecovery.testVersionsOnRestart
   [junit4] OK      4.18s J1 | TestRecovery.testLogReplay
   [junit4] OK      2.48s J1 | TestRecovery.testLogReplayWithReorderedDBQByAsterixAndChildDocs
   [junit4] OK      1.24s J1 | TestRecovery.testBufferedMultipleCalls
   [junit4] OK      5.31s J1 | TestRecovery.testLogReplayWithInPlaceUpdatesAndDeletes
   [junit4] OK      1.32s J1 | TestRecovery.testLogReplayWithReorderedDBQInsertingChildnodes
   [junit4] OK      2.63s J1 | TestRecovery.testLogReplayWithReorderedDBQByIdAndChildDocs
   [junit4] OK      2.41s J1 | TestRecovery.testRecoveryMultipleLogs
   [junit4] Completed [7/10] on J1 in 54.41s, 20 tests
   [junit4] 
   [junit4] Suite: org.apache.solr.cloud.MoveReplicaHDFSTest
   [junit4] OK      15.5s J0 | MoveReplicaHDFSTest.testNormalFailedMove
   [junit4] OK      26.6s J0 | MoveReplicaHDFSTest.testNormalMove
   [junit4] OK      16.0s J0 | MoveReplicaHDFSTest.testFailedMove
   [junit4] OK      22.7s J0 | MoveReplicaHDFSTest.test
   [junit4] Completed [8/10] on J0 in 101.97s, 4 tests
   [junit4] 
   [junit4] Suite: org.apache.solr.cloud.MoveReplicaHDFSTest
   [junit4] OK      13.2s J1 | MoveReplicaHDFSTest.testNormalFailedMove
   [junit4] OK      19.4s J1 | MoveReplicaHDFSTest.testNormalMove
   [junit4] OK      15.0s J1 | MoveReplicaHDFSTest.testFailedMove
   [junit4] OK      24.3s J1 | MoveReplicaHDFSTest.test
   [junit4] Completed [9/10] on J1 in 87.96s, 4 tests
   [junit4] 
   [junit4] Suite: org.apache.solr.cloud.MoveReplicaHDFSTest
   [junit4] OK      13.0s J0 | MoveReplicaHDFSTest.testNormalFailedMove
   [junit4] OK      21.2s J0 | MoveReplicaHDFSTest.testNormalMove
   [junit4] OK      34.9s J0 | MoveReplicaHDFSTest.testFailedMove
   [junit4] OK      22.8s J0 | MoveReplicaHDFSTest.test
   [junit4] Completed [10/10] on J0 in 105.97s, 4 tests
   [junit4] 
   [junit4] JVM J0:     0.75 ..   438.49 =   437.74s
   [junit4] JVM J1:     0.74 ..   378.07 =   377.33s
   [junit4] Execution time total: 7 minutes 18 seconds
   [junit4] Tests summary: 10 suites, 120 tests
   [junit4] Could not remove temporary path: /export/home/jenkins/workspace/Lucene-Solr-master-Solaris/solr/build/solr-core/test/J1 (java.nio.file.DirectoryNotEmptyException: Remaining files: [/export/home/jenkins/workspace/Lucene-Solr-master-Solaris/solr/build/solr-core/test/J1/temp])
   [junit4] Could not remove temporary path: /export/home/jenkins/workspace/Lucene-Solr-master-Solaris/solr/build/solr-core/test/J0 (java.nio.file.DirectoryNotEmptyException: Remaining files: [/export/home/jenkins/workspace/Lucene-Solr-master-Solaris/solr/build/solr-core/test/J0/temp])
     [echo] 5 slowest tests:
[junit4:tophints] 1260.96s | org.apache.solr.search.TestRecovery
[junit4:tophints] 131.81s | org.apache.solr.cloud.TestTlogReplica
[junit4:tophints] 117.88s | org.apache.solr.update.SoftAutoCommitTest
[junit4:tophints] 113.02s | org.apache.solr.cloud.ZkFailoverTest
[junit4:tophints] 106.74s | org.apache.solr.cloud.MoveReplicaHDFSTest

-check-totals:

test-nocompile:

BUILD SUCCESSFUL
Total time: 7 minutes 21 seconds
[repro] Failures:
[repro]   0/5 failed: org.apache.solr.cloud.MoveReplicaHDFSTest
[repro]   0/5 failed: org.apache.solr.search.TestRecovery
[repro] Exiting with code 0
+ mv lucene/build lucene/build.repro
+ mv solr/build solr/build.repro
+ mv lucene/build.orig lucene/build
+ mv solr/build.orig solr/build
Archiving artifacts
Setting ANT_1_8_2_HOME=/export/home/jenkins/tools/hudson.tasks.Ant_AntInstallation/ANT_1.8.2
java.lang.InterruptedException: no matches found within 10000
	at hudson.FilePath$ValidateAntFileMask.hasMatch(FilePath.java:2843)
	at hudson.FilePath$ValidateAntFileMask.invoke(FilePath.java:2722)
	at hudson.FilePath$ValidateAntFileMask.invoke(FilePath.java:2703)
	at hudson.FilePath$FileCallableWrapper.call(FilePath.java:3082)
Also:   hudson.remoting.Channel$CallSiteStackTrace: Remote call to Solaris VBOX
		at hudson.remoting.Channel.attachCallSiteStackTrace(Channel.java:1741)
		at hudson.remoting.UserRequest$ExceptionResponse.retrieve(UserRequest.java:357)
		at hudson.remoting.Channel.call(Channel.java:955)
		at hudson.FilePath.act(FilePath.java:1089)
		at hudson.FilePath.act(FilePath.java:1078)
		at hudson.FilePath.validateAntFileMask(FilePath.java:2701)
		at hudson.tasks.ArtifactArchiver.perform(ArtifactArchiver.java:243)
		at hudson.tasks.BuildStepCompatibilityLayer.perform(BuildStepCompatibilityLayer.java:81)
		at hudson.tasks.BuildStepMonitor$1.perform(BuildStepMonitor.java:20)
		at hudson.model.AbstractBuild$AbstractBuildExecution.perform(AbstractBuild.java:744)
		at hudson.model.AbstractBuild$AbstractBuildExecution.performAllBuildSteps(AbstractBuild.java:690)
		at hudson.model.Build$BuildExecution.post2(Build.java:186)
		at hudson.model.AbstractBuild$AbstractBuildExecution.post(AbstractBuild.java:635)
		at hudson.model.Run.execute(Run.java:1840)
		at hudson.model.FreeStyleBuild.run(FreeStyleBuild.java:43)
		at hudson.model.ResourceController.execute(ResourceController.java:97)
		at hudson.model.Executor.run(Executor.java:429)
Caused: hudson.FilePath$TunneledInterruptedException
	at hudson.FilePath$FileCallableWrapper.call(FilePath.java:3084)
	at hudson.remoting.UserRequest.perform(UserRequest.java:212)
	at hudson.remoting.UserRequest.perform(UserRequest.java:54)
	at hudson.remoting.Request$2.run(Request.java:369)
	at hudson.remoting.InterceptingExecutorService$1.call(InterceptingExecutorService.java:72)
	at java.util.concurrent.FutureTask.run(FutureTask.java:266)
	at java.util.concurrent.ThreadPoolExecutor.runWorker(ThreadPoolExecutor.java:1149)
	at java.util.concurrent.ThreadPoolExecutor$Worker.run(ThreadPoolExecutor.java:624)
	at java.lang.Thread.run(Thread.java:748)
Caused: java.lang.InterruptedException: java.lang.InterruptedException: no matches found within 10000
	at hudson.FilePath.act(FilePath.java:1091)
	at hudson.FilePath.act(FilePath.java:1078)
	at hudson.FilePath.validateAntFileMask(FilePath.java:2701)
	at hudson.tasks.ArtifactArchiver.perform(ArtifactArchiver.java:243)
	at hudson.tasks.BuildStepCompatibilityLayer.perform(BuildStepCompatibilityLayer.java:81)
	at hudson.tasks.BuildStepMonitor$1.perform(BuildStepMonitor.java:20)
	at hudson.model.AbstractBuild$AbstractBuildExecution.perform(AbstractBuild.java:744)
	at hudson.model.AbstractBuild$AbstractBuildExecution.performAllBuildSteps(AbstractBuild.java:690)
	at hudson.model.Build$BuildExecution.post2(Build.java:186)
	at hudson.model.AbstractBuild$AbstractBuildExecution.post(AbstractBuild.java:635)
	at hudson.model.Run.execute(Run.java:1840)
	at hudson.model.FreeStyleBuild.run(FreeStyleBuild.java:43)
	at hudson.model.ResourceController.execute(ResourceController.java:97)
	at hudson.model.Executor.run(Executor.java:429)
No artifacts found that match the file pattern "**/*.events,heapdumps/**,**/*_pid*.log". Configuration error?
[WARNINGS] Parsing warnings in console log with parser Java Compiler (javac)
Setting ANT_1_8_2_HOME=/export/home/jenkins/tools/hudson.tasks.Ant_AntInstallation/ANT_1.8.2
Setting ANT_1_8_2_HOME=/export/home/jenkins/tools/hudson.tasks.Ant_AntInstallation/ANT_1.8.2
<Git Blamer> Using GitBlamer to create author and commit information for all warnings.
<Git Blamer> GIT_COMMIT=ad727bac4332d5fba45dc4d6d43292e2263e7e52, workspace=/export/home/jenkins/workspace/Lucene-Solr-master-Solaris
[WARNINGS] Computing warning deltas based on reference build #1941
Recording test results
Setting ANT_1_8_2_HOME=/export/home/jenkins/tools/hudson.tasks.Ant_AntInstallation/ANT_1.8.2
Build step 'Publish JUnit test result report' changed build result to UNSTABLE
Email was triggered for: Unstable (Test Failures)
Sending email for trigger: Unstable (Test Failures)
Setting ANT_1_8_2_HOME=/export/home/jenkins/tools/hudson.tasks.Ant_AntInstallation/ANT_1.8.2
Setting ANT_1_8_2_HOME=/export/home/jenkins/tools/hudson.tasks.Ant_AntInstallation/ANT_1.8.2
Setting ANT_1_8_2_HOME=/export/home/jenkins/tools/hudson.tasks.Ant_AntInstallation/ANT_1.8.2
Setting ANT_1_8_2_HOME=/export/home/jenkins/tools/hudson.tasks.Ant_AntInstallation/ANT_1.8.2

Mime
View raw message