lucene-dev mailing list archives

Site index · List index
Message view « Date » · « Thread »
Top « Date » · « Thread »
From Policeman Jenkins Server <jenk...@thetaphi.de>
Subject [JENKINS] Lucene-Solr-master-Windows (64bit/jdk-9.0.4) - Build # 7383 - Still Unstable!
Date Wed, 27 Jun 2018 06:53:48 GMT
Build: https://jenkins.thetaphi.de/job/Lucene-Solr-master-Windows/7383/
Java: 64bit/jdk-9.0.4 -XX:-UseCompressedOops -XX:+UseG1GC

4 tests failed.
FAILED:  org.apache.solr.cloud.autoscaling.ScheduledTriggerTest.testTrigger

Error Message:
expected:<3> but was:<2>

Stack Trace:
java.lang.AssertionError: expected:<3> but was:<2>
	at __randomizedtesting.SeedInfo.seed([E484AD6D9171F191:874F9BEF08BE82BC]:0)
	at org.junit.Assert.fail(Assert.java:93)
	at org.junit.Assert.failNotEquals(Assert.java:647)
	at org.junit.Assert.assertEquals(Assert.java:128)
	at org.junit.Assert.assertEquals(Assert.java:472)
	at org.junit.Assert.assertEquals(Assert.java:456)
	at org.apache.solr.cloud.autoscaling.ScheduledTriggerTest.scheduledTriggerTest(ScheduledTriggerTest.java:112)
	at org.apache.solr.cloud.autoscaling.ScheduledTriggerTest.testTrigger(ScheduledTriggerTest.java:65)
	at java.base/jdk.internal.reflect.NativeMethodAccessorImpl.invoke0(Native Method)
	at java.base/jdk.internal.reflect.NativeMethodAccessorImpl.invoke(NativeMethodAccessorImpl.java:62)
	at java.base/jdk.internal.reflect.DelegatingMethodAccessorImpl.invoke(DelegatingMethodAccessorImpl.java:43)
	at java.base/java.lang.reflect.Method.invoke(Method.java:564)
	at com.carrotsearch.randomizedtesting.RandomizedRunner.invoke(RandomizedRunner.java:1737)
	at com.carrotsearch.randomizedtesting.RandomizedRunner$8.evaluate(RandomizedRunner.java:934)
	at com.carrotsearch.randomizedtesting.RandomizedRunner$9.evaluate(RandomizedRunner.java:970)
	at com.carrotsearch.randomizedtesting.RandomizedRunner$10.evaluate(RandomizedRunner.java:984)
	at com.carrotsearch.randomizedtesting.rules.SystemPropertiesRestoreRule$1.evaluate(SystemPropertiesRestoreRule.java:57)
	at org.apache.lucene.util.TestRuleSetupTeardownChained$1.evaluate(TestRuleSetupTeardownChained.java:49)
	at org.apache.lucene.util.AbstractBeforeAfterRule$1.evaluate(AbstractBeforeAfterRule.java:45)
	at org.apache.lucene.util.TestRuleThreadAndTestName$1.evaluate(TestRuleThreadAndTestName.java:48)
	at org.apache.lucene.util.TestRuleIgnoreAfterMaxFailures$1.evaluate(TestRuleIgnoreAfterMaxFailures.java:64)
	at org.apache.lucene.util.TestRuleMarkFailure$1.evaluate(TestRuleMarkFailure.java:47)
	at com.carrotsearch.randomizedtesting.rules.StatementAdapter.evaluate(StatementAdapter.java:36)
	at com.carrotsearch.randomizedtesting.ThreadLeakControl$StatementRunner.run(ThreadLeakControl.java:368)
	at com.carrotsearch.randomizedtesting.ThreadLeakControl.forkTimeoutingTask(ThreadLeakControl.java:817)
	at com.carrotsearch.randomizedtesting.ThreadLeakControl$3.evaluate(ThreadLeakControl.java:468)
	at com.carrotsearch.randomizedtesting.RandomizedRunner.runSingleTest(RandomizedRunner.java:943)
	at com.carrotsearch.randomizedtesting.RandomizedRunner$5.evaluate(RandomizedRunner.java:829)
	at com.carrotsearch.randomizedtesting.RandomizedRunner$6.evaluate(RandomizedRunner.java:879)
	at com.carrotsearch.randomizedtesting.RandomizedRunner$7.evaluate(RandomizedRunner.java:890)
	at com.carrotsearch.randomizedtesting.rules.StatementAdapter.evaluate(StatementAdapter.java:36)
	at com.carrotsearch.randomizedtesting.rules.SystemPropertiesRestoreRule$1.evaluate(SystemPropertiesRestoreRule.java:57)
	at org.apache.lucene.util.AbstractBeforeAfterRule$1.evaluate(AbstractBeforeAfterRule.java:45)
	at com.carrotsearch.randomizedtesting.rules.StatementAdapter.evaluate(StatementAdapter.java:36)
	at org.apache.lucene.util.TestRuleStoreClassName$1.evaluate(TestRuleStoreClassName.java:41)
	at com.carrotsearch.randomizedtesting.rules.NoShadowingOrOverridesOnMethodsRule$1.evaluate(NoShadowingOrOverridesOnMethodsRule.java:40)
	at com.carrotsearch.randomizedtesting.rules.NoShadowingOrOverridesOnMethodsRule$1.evaluate(NoShadowingOrOverridesOnMethodsRule.java:40)
	at com.carrotsearch.randomizedtesting.rules.StatementAdapter.evaluate(StatementAdapter.java:36)
	at com.carrotsearch.randomizedtesting.rules.StatementAdapter.evaluate(StatementAdapter.java:36)
	at org.apache.lucene.util.TestRuleAssertionsRequired$1.evaluate(TestRuleAssertionsRequired.java:53)
	at org.apache.lucene.util.TestRuleMarkFailure$1.evaluate(TestRuleMarkFailure.java:47)
	at org.apache.lucene.util.TestRuleIgnoreAfterMaxFailures$1.evaluate(TestRuleIgnoreAfterMaxFailures.java:64)
	at org.apache.lucene.util.TestRuleIgnoreTestSuites$1.evaluate(TestRuleIgnoreTestSuites.java:54)
	at com.carrotsearch.randomizedtesting.rules.StatementAdapter.evaluate(StatementAdapter.java:36)
	at com.carrotsearch.randomizedtesting.ThreadLeakControl$StatementRunner.run(ThreadLeakControl.java:368)
	at java.base/java.lang.Thread.run(Thread.java:844)


FAILED:  org.apache.solr.common.util.TestTimeSource.testEpochTime

Error Message:
SimTimeSource:50.0 time diff=22730000

Stack Trace:
java.lang.AssertionError: SimTimeSource:50.0 time diff=22730000
	at __randomizedtesting.SeedInfo.seed([A182DE01A0880114:99EEAD243458A352]:0)
	at org.junit.Assert.fail(Assert.java:93)
	at org.junit.Assert.assertTrue(Assert.java:43)
	at org.apache.solr.common.util.TestTimeSource.doTestEpochTime(TestTimeSource.java:52)
	at org.apache.solr.common.util.TestTimeSource.testEpochTime(TestTimeSource.java:32)
	at java.base/jdk.internal.reflect.NativeMethodAccessorImpl.invoke0(Native Method)
	at java.base/jdk.internal.reflect.NativeMethodAccessorImpl.invoke(NativeMethodAccessorImpl.java:62)
	at java.base/jdk.internal.reflect.DelegatingMethodAccessorImpl.invoke(DelegatingMethodAccessorImpl.java:43)
	at java.base/java.lang.reflect.Method.invoke(Method.java:564)
	at com.carrotsearch.randomizedtesting.RandomizedRunner.invoke(RandomizedRunner.java:1737)
	at com.carrotsearch.randomizedtesting.RandomizedRunner$8.evaluate(RandomizedRunner.java:934)
	at com.carrotsearch.randomizedtesting.RandomizedRunner$9.evaluate(RandomizedRunner.java:970)
	at com.carrotsearch.randomizedtesting.RandomizedRunner$10.evaluate(RandomizedRunner.java:984)
	at com.carrotsearch.randomizedtesting.rules.SystemPropertiesRestoreRule$1.evaluate(SystemPropertiesRestoreRule.java:57)
	at org.apache.lucene.util.TestRuleSetupTeardownChained$1.evaluate(TestRuleSetupTeardownChained.java:49)
	at org.apache.lucene.util.AbstractBeforeAfterRule$1.evaluate(AbstractBeforeAfterRule.java:45)
	at org.apache.lucene.util.TestRuleThreadAndTestName$1.evaluate(TestRuleThreadAndTestName.java:48)
	at org.apache.lucene.util.TestRuleIgnoreAfterMaxFailures$1.evaluate(TestRuleIgnoreAfterMaxFailures.java:64)
	at org.apache.lucene.util.TestRuleMarkFailure$1.evaluate(TestRuleMarkFailure.java:47)
	at com.carrotsearch.randomizedtesting.rules.StatementAdapter.evaluate(StatementAdapter.java:36)
	at com.carrotsearch.randomizedtesting.ThreadLeakControl$StatementRunner.run(ThreadLeakControl.java:368)
	at com.carrotsearch.randomizedtesting.ThreadLeakControl.forkTimeoutingTask(ThreadLeakControl.java:817)
	at com.carrotsearch.randomizedtesting.ThreadLeakControl$3.evaluate(ThreadLeakControl.java:468)
	at com.carrotsearch.randomizedtesting.RandomizedRunner.runSingleTest(RandomizedRunner.java:943)
	at com.carrotsearch.randomizedtesting.RandomizedRunner$5.evaluate(RandomizedRunner.java:829)
	at com.carrotsearch.randomizedtesting.RandomizedRunner$6.evaluate(RandomizedRunner.java:879)
	at com.carrotsearch.randomizedtesting.RandomizedRunner$7.evaluate(RandomizedRunner.java:890)
	at com.carrotsearch.randomizedtesting.rules.StatementAdapter.evaluate(StatementAdapter.java:36)
	at com.carrotsearch.randomizedtesting.rules.SystemPropertiesRestoreRule$1.evaluate(SystemPropertiesRestoreRule.java:57)
	at org.apache.lucene.util.AbstractBeforeAfterRule$1.evaluate(AbstractBeforeAfterRule.java:45)
	at com.carrotsearch.randomizedtesting.rules.StatementAdapter.evaluate(StatementAdapter.java:36)
	at org.apache.lucene.util.TestRuleStoreClassName$1.evaluate(TestRuleStoreClassName.java:41)
	at com.carrotsearch.randomizedtesting.rules.NoShadowingOrOverridesOnMethodsRule$1.evaluate(NoShadowingOrOverridesOnMethodsRule.java:40)
	at com.carrotsearch.randomizedtesting.rules.NoShadowingOrOverridesOnMethodsRule$1.evaluate(NoShadowingOrOverridesOnMethodsRule.java:40)
	at com.carrotsearch.randomizedtesting.rules.StatementAdapter.evaluate(StatementAdapter.java:36)
	at com.carrotsearch.randomizedtesting.rules.StatementAdapter.evaluate(StatementAdapter.java:36)
	at org.apache.lucene.util.TestRuleAssertionsRequired$1.evaluate(TestRuleAssertionsRequired.java:53)
	at org.apache.lucene.util.TestRuleMarkFailure$1.evaluate(TestRuleMarkFailure.java:47)
	at org.apache.lucene.util.TestRuleIgnoreAfterMaxFailures$1.evaluate(TestRuleIgnoreAfterMaxFailures.java:64)
	at org.apache.lucene.util.TestRuleIgnoreTestSuites$1.evaluate(TestRuleIgnoreTestSuites.java:54)
	at com.carrotsearch.randomizedtesting.rules.StatementAdapter.evaluate(StatementAdapter.java:36)
	at com.carrotsearch.randomizedtesting.ThreadLeakControl$StatementRunner.run(ThreadLeakControl.java:368)
	at java.base/java.lang.Thread.run(Thread.java:844)


FAILED:  org.apache.solr.common.util.TestTimeSource.testEpochTime

Error Message:
SimTimeSource:50.0 time diff=13855000

Stack Trace:
java.lang.AssertionError: SimTimeSource:50.0 time diff=13855000
	at __randomizedtesting.SeedInfo.seed([A182DE01A0880114:99EEAD243458A352]:0)
	at org.junit.Assert.fail(Assert.java:93)
	at org.junit.Assert.assertTrue(Assert.java:43)
	at org.apache.solr.common.util.TestTimeSource.doTestEpochTime(TestTimeSource.java:52)
	at org.apache.solr.common.util.TestTimeSource.testEpochTime(TestTimeSource.java:32)
	at java.base/jdk.internal.reflect.NativeMethodAccessorImpl.invoke0(Native Method)
	at java.base/jdk.internal.reflect.NativeMethodAccessorImpl.invoke(NativeMethodAccessorImpl.java:62)
	at java.base/jdk.internal.reflect.DelegatingMethodAccessorImpl.invoke(DelegatingMethodAccessorImpl.java:43)
	at java.base/java.lang.reflect.Method.invoke(Method.java:564)
	at com.carrotsearch.randomizedtesting.RandomizedRunner.invoke(RandomizedRunner.java:1737)
	at com.carrotsearch.randomizedtesting.RandomizedRunner$8.evaluate(RandomizedRunner.java:934)
	at com.carrotsearch.randomizedtesting.RandomizedRunner$9.evaluate(RandomizedRunner.java:970)
	at com.carrotsearch.randomizedtesting.RandomizedRunner$10.evaluate(RandomizedRunner.java:984)
	at com.carrotsearch.randomizedtesting.rules.SystemPropertiesRestoreRule$1.evaluate(SystemPropertiesRestoreRule.java:57)
	at org.apache.lucene.util.TestRuleSetupTeardownChained$1.evaluate(TestRuleSetupTeardownChained.java:49)
	at org.apache.lucene.util.AbstractBeforeAfterRule$1.evaluate(AbstractBeforeAfterRule.java:45)
	at org.apache.lucene.util.TestRuleThreadAndTestName$1.evaluate(TestRuleThreadAndTestName.java:48)
	at org.apache.lucene.util.TestRuleIgnoreAfterMaxFailures$1.evaluate(TestRuleIgnoreAfterMaxFailures.java:64)
	at org.apache.lucene.util.TestRuleMarkFailure$1.evaluate(TestRuleMarkFailure.java:47)
	at com.carrotsearch.randomizedtesting.rules.StatementAdapter.evaluate(StatementAdapter.java:36)
	at com.carrotsearch.randomizedtesting.ThreadLeakControl$StatementRunner.run(ThreadLeakControl.java:368)
	at com.carrotsearch.randomizedtesting.ThreadLeakControl.forkTimeoutingTask(ThreadLeakControl.java:817)
	at com.carrotsearch.randomizedtesting.ThreadLeakControl$3.evaluate(ThreadLeakControl.java:468)
	at com.carrotsearch.randomizedtesting.RandomizedRunner.runSingleTest(RandomizedRunner.java:943)
	at com.carrotsearch.randomizedtesting.RandomizedRunner$5.evaluate(RandomizedRunner.java:829)
	at com.carrotsearch.randomizedtesting.RandomizedRunner$6.evaluate(RandomizedRunner.java:879)
	at com.carrotsearch.randomizedtesting.RandomizedRunner$7.evaluate(RandomizedRunner.java:890)
	at com.carrotsearch.randomizedtesting.rules.StatementAdapter.evaluate(StatementAdapter.java:36)
	at com.carrotsearch.randomizedtesting.rules.SystemPropertiesRestoreRule$1.evaluate(SystemPropertiesRestoreRule.java:57)
	at org.apache.lucene.util.AbstractBeforeAfterRule$1.evaluate(AbstractBeforeAfterRule.java:45)
	at com.carrotsearch.randomizedtesting.rules.StatementAdapter.evaluate(StatementAdapter.java:36)
	at org.apache.lucene.util.TestRuleStoreClassName$1.evaluate(TestRuleStoreClassName.java:41)
	at com.carrotsearch.randomizedtesting.rules.NoShadowingOrOverridesOnMethodsRule$1.evaluate(NoShadowingOrOverridesOnMethodsRule.java:40)
	at com.carrotsearch.randomizedtesting.rules.NoShadowingOrOverridesOnMethodsRule$1.evaluate(NoShadowingOrOverridesOnMethodsRule.java:40)
	at com.carrotsearch.randomizedtesting.rules.StatementAdapter.evaluate(StatementAdapter.java:36)
	at com.carrotsearch.randomizedtesting.rules.StatementAdapter.evaluate(StatementAdapter.java:36)
	at org.apache.lucene.util.TestRuleAssertionsRequired$1.evaluate(TestRuleAssertionsRequired.java:53)
	at org.apache.lucene.util.TestRuleMarkFailure$1.evaluate(TestRuleMarkFailure.java:47)
	at org.apache.lucene.util.TestRuleIgnoreAfterMaxFailures$1.evaluate(TestRuleIgnoreAfterMaxFailures.java:64)
	at org.apache.lucene.util.TestRuleIgnoreTestSuites$1.evaluate(TestRuleIgnoreTestSuites.java:54)
	at com.carrotsearch.randomizedtesting.rules.StatementAdapter.evaluate(StatementAdapter.java:36)
	at com.carrotsearch.randomizedtesting.ThreadLeakControl$StatementRunner.run(ThreadLeakControl.java:368)
	at java.base/java.lang.Thread.run(Thread.java:844)


FAILED:  org.apache.solr.common.util.TestTimeSource.testEpochTime

Error Message:
SimTimeSource:50.0 time diff=27730000

Stack Trace:
java.lang.AssertionError: SimTimeSource:50.0 time diff=27730000
	at __randomizedtesting.SeedInfo.seed([A182DE01A0880114:99EEAD243458A352]:0)
	at org.junit.Assert.fail(Assert.java:93)
	at org.junit.Assert.assertTrue(Assert.java:43)
	at org.apache.solr.common.util.TestTimeSource.doTestEpochTime(TestTimeSource.java:52)
	at org.apache.solr.common.util.TestTimeSource.testEpochTime(TestTimeSource.java:32)
	at java.base/jdk.internal.reflect.NativeMethodAccessorImpl.invoke0(Native Method)
	at java.base/jdk.internal.reflect.NativeMethodAccessorImpl.invoke(NativeMethodAccessorImpl.java:62)
	at java.base/jdk.internal.reflect.DelegatingMethodAccessorImpl.invoke(DelegatingMethodAccessorImpl.java:43)
	at java.base/java.lang.reflect.Method.invoke(Method.java:564)
	at com.carrotsearch.randomizedtesting.RandomizedRunner.invoke(RandomizedRunner.java:1737)
	at com.carrotsearch.randomizedtesting.RandomizedRunner$8.evaluate(RandomizedRunner.java:934)
	at com.carrotsearch.randomizedtesting.RandomizedRunner$9.evaluate(RandomizedRunner.java:970)
	at com.carrotsearch.randomizedtesting.RandomizedRunner$10.evaluate(RandomizedRunner.java:984)
	at com.carrotsearch.randomizedtesting.rules.SystemPropertiesRestoreRule$1.evaluate(SystemPropertiesRestoreRule.java:57)
	at org.apache.lucene.util.TestRuleSetupTeardownChained$1.evaluate(TestRuleSetupTeardownChained.java:49)
	at org.apache.lucene.util.AbstractBeforeAfterRule$1.evaluate(AbstractBeforeAfterRule.java:45)
	at org.apache.lucene.util.TestRuleThreadAndTestName$1.evaluate(TestRuleThreadAndTestName.java:48)
	at org.apache.lucene.util.TestRuleIgnoreAfterMaxFailures$1.evaluate(TestRuleIgnoreAfterMaxFailures.java:64)
	at org.apache.lucene.util.TestRuleMarkFailure$1.evaluate(TestRuleMarkFailure.java:47)
	at com.carrotsearch.randomizedtesting.rules.StatementAdapter.evaluate(StatementAdapter.java:36)
	at com.carrotsearch.randomizedtesting.ThreadLeakControl$StatementRunner.run(ThreadLeakControl.java:368)
	at com.carrotsearch.randomizedtesting.ThreadLeakControl.forkTimeoutingTask(ThreadLeakControl.java:817)
	at com.carrotsearch.randomizedtesting.ThreadLeakControl$3.evaluate(ThreadLeakControl.java:468)
	at com.carrotsearch.randomizedtesting.RandomizedRunner.runSingleTest(RandomizedRunner.java:943)
	at com.carrotsearch.randomizedtesting.RandomizedRunner$5.evaluate(RandomizedRunner.java:829)
	at com.carrotsearch.randomizedtesting.RandomizedRunner$6.evaluate(RandomizedRunner.java:879)
	at com.carrotsearch.randomizedtesting.RandomizedRunner$7.evaluate(RandomizedRunner.java:890)
	at com.carrotsearch.randomizedtesting.rules.StatementAdapter.evaluate(StatementAdapter.java:36)
	at com.carrotsearch.randomizedtesting.rules.SystemPropertiesRestoreRule$1.evaluate(SystemPropertiesRestoreRule.java:57)
	at org.apache.lucene.util.AbstractBeforeAfterRule$1.evaluate(AbstractBeforeAfterRule.java:45)
	at com.carrotsearch.randomizedtesting.rules.StatementAdapter.evaluate(StatementAdapter.java:36)
	at org.apache.lucene.util.TestRuleStoreClassName$1.evaluate(TestRuleStoreClassName.java:41)
	at com.carrotsearch.randomizedtesting.rules.NoShadowingOrOverridesOnMethodsRule$1.evaluate(NoShadowingOrOverridesOnMethodsRule.java:40)
	at com.carrotsearch.randomizedtesting.rules.NoShadowingOrOverridesOnMethodsRule$1.evaluate(NoShadowingOrOverridesOnMethodsRule.java:40)
	at com.carrotsearch.randomizedtesting.rules.StatementAdapter.evaluate(StatementAdapter.java:36)
	at com.carrotsearch.randomizedtesting.rules.StatementAdapter.evaluate(StatementAdapter.java:36)
	at org.apache.lucene.util.TestRuleAssertionsRequired$1.evaluate(TestRuleAssertionsRequired.java:53)
	at org.apache.lucene.util.TestRuleMarkFailure$1.evaluate(TestRuleMarkFailure.java:47)
	at org.apache.lucene.util.TestRuleIgnoreAfterMaxFailures$1.evaluate(TestRuleIgnoreAfterMaxFailures.java:64)
	at org.apache.lucene.util.TestRuleIgnoreTestSuites$1.evaluate(TestRuleIgnoreTestSuites.java:54)
	at com.carrotsearch.randomizedtesting.rules.StatementAdapter.evaluate(StatementAdapter.java:36)
	at com.carrotsearch.randomizedtesting.ThreadLeakControl$StatementRunner.run(ThreadLeakControl.java:368)
	at java.base/java.lang.Thread.run(Thread.java:844)




Build Log:
[...truncated 12473 lines...]
   [junit4] Suite: org.apache.solr.cloud.autoscaling.ScheduledTriggerTest
   [junit4]   2> Creating dataDir: C:\Users\jenkins\workspace\Lucene-Solr-master-Windows\solr\build\solr-core\test\J1\temp\solr.cloud.autoscaling.ScheduledTriggerTest_E484AD6D9171F191-001\init-core-data-001
   [junit4]   2> 111308 WARN  (SUITE-ScheduledTriggerTest-seed#[E484AD6D9171F191]-worker) [    ] o.a.s.SolrTestCaseJ4 startTrackingSearchers: numOpens=1 numCloses=1
   [junit4]   2> 111308 INFO  (SUITE-ScheduledTriggerTest-seed#[E484AD6D9171F191]-worker) [    ] o.a.s.SolrTestCaseJ4 Using PointFields (NUMERIC_POINTS_SYSPROP=true) w/NUMERIC_DOCVALUES_SYSPROP=true
   [junit4]   2> 111309 INFO  (SUITE-ScheduledTriggerTest-seed#[E484AD6D9171F191]-worker) [    ] o.a.s.SolrTestCaseJ4 Randomized ssl (false) and clientAuth (true) via: @org.apache.solr.util.RandomizeSSL(reason="", value=0.0/0.0, ssl=0.0/0.0, clientAuth=0.0/0.0)
   [junit4]   2> 111310 INFO  (SUITE-ScheduledTriggerTest-seed#[E484AD6D9171F191]-worker) [    ] o.a.s.SolrTestCaseJ4 SecureRandom sanity checks: test.solr.allowed.securerandom=null & java.security.egd=file:/dev/./urandom
   [junit4]   2> 111310 INFO  (SUITE-ScheduledTriggerTest-seed#[E484AD6D9171F191]-worker) [    ] o.a.s.c.MiniSolrCloudCluster Starting cluster of 1 servers in C:\Users\jenkins\workspace\Lucene-Solr-master-Windows\solr\build\solr-core\test\J1\temp\solr.cloud.autoscaling.ScheduledTriggerTest_E484AD6D9171F191-001\tempDir-001
   [junit4]   2> 111310 INFO  (SUITE-ScheduledTriggerTest-seed#[E484AD6D9171F191]-worker) [    ] o.a.s.c.ZkTestServer STARTING ZK TEST SERVER
   [junit4]   2> 111311 INFO  (Thread-188) [    ] o.a.s.c.ZkTestServer client port:0.0.0.0/0.0.0.0:0
   [junit4]   2> 111311 INFO  (Thread-188) [    ] o.a.s.c.ZkTestServer Starting server
   [junit4]   2> 111317 ERROR (Thread-188) [    ] o.a.z.s.ZooKeeperServer ZKShutdownHandler is not registered, so ZooKeeper server won't take any action on ERROR or SHUTDOWN server state changes
   [junit4]   2> 111412 INFO  (SUITE-ScheduledTriggerTest-seed#[E484AD6D9171F191]-worker) [    ] o.a.s.c.ZkTestServer start zk server on port:50890
   [junit4]   2> 111417 INFO  (zkConnectionManagerCallback-333-thread-1) [    ] o.a.s.c.c.ConnectionManager zkClient has connected
   [junit4]   2> 111422 INFO  (jetty-launcher-330-thread-1) [    ] o.e.j.s.Server jetty-9.4.11.v20180605; built: 2018-06-05T18:24:03.829Z; git: d5fc0523cfa96bfebfbda19606cad384d772f04c; jvm 9.0.4+11
   [junit4]   2> 111422 INFO  (jetty-launcher-330-thread-1) [    ] o.e.j.s.session DefaultSessionIdManager workerName=node0
   [junit4]   2> 111422 INFO  (jetty-launcher-330-thread-1) [    ] o.e.j.s.session No SessionScavenger set, using defaults
   [junit4]   2> 111422 INFO  (jetty-launcher-330-thread-1) [    ] o.e.j.s.session node0 Scavenging every 600000ms
   [junit4]   2> 111423 INFO  (jetty-launcher-330-thread-1) [    ] o.e.j.s.h.ContextHandler Started o.e.j.s.ServletContextHandler@66b2728c{/solr,null,AVAILABLE}
   [junit4]   2> 111424 INFO  (jetty-launcher-330-thread-1) [    ] o.e.j.s.AbstractConnector Started ServerConnector@7ff00df4{HTTP/1.1,[http/1.1]}{127.0.0.1:50894}
   [junit4]   2> 111424 INFO  (jetty-launcher-330-thread-1) [    ] o.e.j.s.Server Started @111516ms
   [junit4]   2> 111425 INFO  (jetty-launcher-330-thread-1) [    ] o.a.s.c.s.e.JettySolrRunner Jetty properties: {hostContext=/solr, hostPort=50894}
   [junit4]   2> 111425 ERROR (jetty-launcher-330-thread-1) [    ] o.a.s.u.StartupLoggingUtils Missing Java Option solr.log.dir. Logging may be missing or incomplete.
   [junit4]   2> 111425 INFO  (jetty-launcher-330-thread-1) [    ] o.a.s.s.SolrDispatchFilter Using logger factory org.apache.logging.slf4j.Log4jLoggerFactory
   [junit4]   2> 111425 INFO  (jetty-launcher-330-thread-1) [    ] o.a.s.s.SolrDispatchFilter  ___      _       Welcome to Apache Solr? version 8.0.0
   [junit4]   2> 111425 INFO  (jetty-launcher-330-thread-1) [    ] o.a.s.s.SolrDispatchFilter / __| ___| |_ _   Starting in cloud mode on port null
   [junit4]   2> 111425 INFO  (jetty-launcher-330-thread-1) [    ] o.a.s.s.SolrDispatchFilter \__ \/ _ \ | '_|  Install dir: null
   [junit4]   2> 111425 INFO  (jetty-launcher-330-thread-1) [    ] o.a.s.s.SolrDispatchFilter |___/\___/_|_|    Start time: 2018-06-27T05:34:30.502734700Z
   [junit4]   2> 111429 INFO  (zkConnectionManagerCallback-335-thread-1) [    ] o.a.s.c.c.ConnectionManager zkClient has connected
   [junit4]   2> 111430 INFO  (jetty-launcher-330-thread-1) [    ] o.a.s.s.SolrDispatchFilter solr.xml found in ZooKeeper. Loading...
   [junit4]   2> 111536 INFO  (jetty-launcher-330-thread-1) [    ] o.a.s.c.ZkContainer Zookeeper client=127.0.0.1:50890/solr
   [junit4]   2> 111539 INFO  (zkConnectionManagerCallback-339-thread-1) [    ] o.a.s.c.c.ConnectionManager zkClient has connected
   [junit4]   2> 111540 WARN  (NIOServerCxn.Factory:0.0.0.0/0.0.0.0:0) [    ] o.a.z.s.NIOServerCnxn Unable to read additional data from client sessionid 0x1004580f5ff0002, likely client has closed socket
   [junit4]   2> 111543 INFO  (zkConnectionManagerCallback-341-thread-1) [    ] o.a.s.c.c.ConnectionManager zkClient has connected
   [junit4]   2> 111657 INFO  (jetty-launcher-330-thread-1) [n:127.0.0.1:50894_solr    ] o.a.s.c.Overseer Overseer (id=null) closing
   [junit4]   2> 111657 INFO  (jetty-launcher-330-thread-1) [n:127.0.0.1:50894_solr    ] o.a.s.c.OverseerElectionContext I am going to be the leader 127.0.0.1:50894_solr
   [junit4]   2> 111658 INFO  (jetty-launcher-330-thread-1) [n:127.0.0.1:50894_solr    ] o.a.s.c.Overseer Overseer (id=72134014223187971-127.0.0.1:50894_solr-n_0000000000) starting
   [junit4]   2> 111666 INFO  (zkConnectionManagerCallback-348-thread-1) [    ] o.a.s.c.c.ConnectionManager zkClient has connected
   [junit4]   2> 111668 INFO  (jetty-launcher-330-thread-1) [n:127.0.0.1:50894_solr    ] o.a.s.c.s.i.ZkClientClusterStateProvider Cluster at 127.0.0.1:50890/solr ready
   [junit4]   2> 111669 INFO  (jetty-launcher-330-thread-1) [n:127.0.0.1:50894_solr    ] o.a.s.c.ZkController Register node as live in ZooKeeper:/live_nodes/127.0.0.1:50894_solr
   [junit4]   2> 111671 DEBUG (OverseerAutoScalingTriggerThread-72134014223187971-127.0.0.1:50894_solr-n_0000000000) [    ] o.a.s.c.a.OverseerTriggerThread Adding .auto_add_replicas and .scheduled_maintenance triggers
   [junit4]   2> 111673 INFO  (OverseerStateUpdate-72134014223187971-127.0.0.1:50894_solr-n_0000000000) [    ] o.a.s.c.c.ZkStateReader Updated live nodes from ZooKeeper... (0) -> (1)
   [junit4]   2> 111674 DEBUG (OverseerAutoScalingTriggerThread-72134014223187971-127.0.0.1:50894_solr-n_0000000000) [    ] o.a.s.c.a.OverseerTriggerThread Refreshing /autoscaling.json with znode version 1
   [junit4]   2> 111674 DEBUG (OverseerAutoScalingTriggerThread-72134014223187971-127.0.0.1:50894_solr-n_0000000000) [    ] o.a.s.c.a.OverseerTriggerThread Current znodeVersion 1, lastZnodeVersion -1
   [junit4]   2> 111674 DEBUG (OverseerAutoScalingTriggerThread-72134014223187971-127.0.0.1:50894_solr-n_0000000000) [    ] o.a.s.c.a.OverseerTriggerThread Processed trigger updates upto znodeVersion 1
   [junit4]   2> 111679 DEBUG (OverseerAutoScalingTriggerThread-72134014223187971-127.0.0.1:50894_solr-n_0000000000) [    ] o.a.s.c.a.NodeLostTrigger NodeLostTrigger .auto_add_replicas - Initial livenodes: []
   [junit4]   2> 111679 DEBUG (OverseerAutoScalingTriggerThread-72134014223187971-127.0.0.1:50894_solr-n_0000000000) [    ] o.a.s.c.a.OverseerTriggerThread -- clean old nodeAdded markers
   [junit4]   2> 111679 DEBUG (OverseerAutoScalingTriggerThread-72134014223187971-127.0.0.1:50894_solr-n_0000000000) [    ] o.a.s.c.a.OverseerTriggerThread Current znodeVersion 1, lastZnodeVersion 1
   [junit4]   2> 111685 INFO  (zkCallback-347-thread-1) [    ] o.a.s.c.c.ZkStateReader Updated live nodes from ZooKeeper... (0) -> (1)
   [junit4]   2> 111687 DEBUG (ScheduledTrigger-438-thread-1) [    ] o.a.s.c.a.NodeLostTrigger Running NodeLostTrigger: .auto_add_replicas with currently live nodes: 1
   [junit4]   2> 111693 INFO  (jetty-launcher-330-thread-1) [n:127.0.0.1:50894_solr    ] o.a.s.h.a.MetricsHistoryHandler No .system collection, keeping metrics history in memory.
   [junit4]   2> 111725 INFO  (jetty-launcher-330-thread-1) [n:127.0.0.1:50894_solr    ] o.a.s.m.r.SolrJmxReporter JMX monitoring for 'solr_50894.solr.node' (registry 'solr.node') enabled at server: com.sun.jmx.mbeanserver.JmxMBeanServer@606fe5c3
   [junit4]   2> 111730 INFO  (jetty-launcher-330-thread-1) [n:127.0.0.1:50894_solr    ] o.a.s.m.r.SolrJmxReporter JMX monitoring for 'solr_50894.solr.jvm' (registry 'solr.jvm') enabled at server: com.sun.jmx.mbeanserver.JmxMBeanServer@606fe5c3
   [junit4]   2> 111730 INFO  (jetty-launcher-330-thread-1) [n:127.0.0.1:50894_solr    ] o.a.s.m.r.SolrJmxReporter JMX monitoring for 'solr_50894.solr.jetty' (registry 'solr.jetty') enabled at server: com.sun.jmx.mbeanserver.JmxMBeanServer@606fe5c3
   [junit4]   2> 111731 INFO  (jetty-launcher-330-thread-1) [n:127.0.0.1:50894_solr    ] o.a.s.c.CorePropertiesLocator Found 0 core definitions underneath C:\Users\jenkins\workspace\Lucene-Solr-master-Windows\solr\build\solr-core\test\J1\temp\solr.cloud.autoscaling.ScheduledTriggerTest_E484AD6D9171F191-001\tempDir-001\node1\.
   [junit4]   2> 111755 INFO  (zkConnectionManagerCallback-351-thread-1) [    ] o.a.s.c.c.ConnectionManager zkClient has connected
   [junit4]   2> 111773 INFO  (zkConnectionManagerCallback-356-thread-1) [    ] o.a.s.c.c.ConnectionManager zkClient has connected
   [junit4]   2> 111776 INFO  (SUITE-ScheduledTriggerTest-seed#[E484AD6D9171F191]-worker) [    ] o.a.s.c.c.ZkStateReader Updated live nodes from ZooKeeper... (0) -> (1)
   [junit4]   2> 111777 INFO  (SUITE-ScheduledTriggerTest-seed#[E484AD6D9171F191]-worker) [    ] o.a.s.c.s.i.ZkClientClusterStateProvider Cluster at 127.0.0.1:50890/solr ready
   [junit4]   2> 111791 INFO  (TEST-ScheduledTriggerTest.testIgnoredEvent-seed#[E484AD6D9171F191]) [    ] o.a.s.SolrTestCaseJ4 ###Starting testIgnoredEvent
   [junit4]   2> 111806 WARN  (TEST-ScheduledTriggerTest.testIgnoredEvent-seed#[E484AD6D9171F191]) [    ] o.a.s.c.a.ScheduledTrigger ScheduledTrigger was not able to run event at scheduled time: 2018-06-26T05:34:30.869Z. Now: 2018-06-27T05:34:30.881Z
   [junit4]   2> 111808 INFO  (TEST-ScheduledTriggerTest.testIgnoredEvent-seed#[E484AD6D9171F191]) [    ] o.a.s.SolrTestCaseJ4 ###Ending testIgnoredEvent
   [junit4]   2> 111817 INFO  (TEST-ScheduledTriggerTest.testTrigger-seed#[E484AD6D9171F191]) [    ] o.a.s.SolrTestCaseJ4 ###Starting testTrigger
   [junit4]   2> 112690 DEBUG (ScheduledTrigger-438-thread-1) [    ] o.a.s.c.a.NodeLostTrigger Running NodeLostTrigger: .auto_add_replicas with currently live nodes: 1
   [junit4]   2> 113691 DEBUG (ScheduledTrigger-438-thread-1) [    ] o.a.s.c.a.NodeLostTrigger Running NodeLostTrigger: .auto_add_replicas with currently live nodes: 1
   [junit4]   2> 114693 DEBUG (ScheduledTrigger-438-thread-2) [    ] o.a.s.c.a.NodeLostTrigger Running NodeLostTrigger: .auto_add_replicas with currently live nodes: 1
   [junit4]   2> 115693 DEBUG (ScheduledTrigger-438-thread-4) [    ] o.a.s.c.a.NodeLostTrigger Running NodeLostTrigger: .auto_add_replicas with currently live nodes: 1
   [junit4]   2> 116694 DEBUG (ScheduledTrigger-438-thread-1) [    ] o.a.s.c.a.NodeLostTrigger Running NodeLostTrigger: .auto_add_replicas with currently live nodes: 1
   [junit4]   2> 117694 DEBUG (ScheduledTrigger-438-thread-2) [    ] o.a.s.c.a.NodeLostTrigger Running NodeLostTrigger: .auto_add_replicas with currently live nodes: 1
   [junit4]   2> 117819 WARN  (TEST-ScheduledTriggerTest.testTrigger-seed#[E484AD6D9171F191]) [    ] o.a.s.c.a.ScheduledTrigger ScheduledTrigger was not able to run event at scheduled time: 2018-06-27T05:34:33.894Z. Now: 2018-06-27T05:34:36.893Z
   [junit4]   2> 118695 DEBUG (ScheduledTrigger-438-thread-1) [    ] o.a.s.c.a.NodeLostTrigger Running NodeLostTrigger: .auto_add_replicas with currently live nodes: 1
   [junit4]   2> 119697 DEBUG (ScheduledTrigger-438-thread-1) [    ] o.a.s.c.a.NodeLostTrigger Running NodeLostTrigger: .auto_add_replicas with currently live nodes: 1
   [junit4]   2> 120698 DEBUG (ScheduledTrigger-438-thread-4) [    ] o.a.s.c.a.NodeLostTrigger Running NodeLostTrigger: .auto_add_replicas with currently live nodes: 1
   [junit4]   2> 120820 WARN  (TEST-ScheduledTriggerTest.testTrigger-seed#[E484AD6D9171F191]) [    ] o.a.s.c.a.ScheduledTrigger ScheduledTrigger was not able to run event at scheduled time: 2018-06-27T05:34:36.894Z. Now: 2018-06-27T05:34:39.894Z
   [junit4]   2> 120821 INFO  (TEST-ScheduledTriggerTest.testTrigger-seed#[E484AD6D9171F191]) [    ] o.a.s.SolrTestCaseJ4 ###Ending testTrigger
   [junit4]   2> NOTE: reproduce with: ant test  -Dtestcase=ScheduledTriggerTest -Dtests.method=testTrigger -Dtests.seed=E484AD6D9171F191 -Dtests.slow=true -Dtests.locale=en-SZ -Dtests.timezone=Europe/Berlin -Dtests.asserts=true -Dtests.file.encoding=ISO-8859-1
   [junit4] FAILURE 9.01s J1 | ScheduledTriggerTest.testTrigger <<<
   [junit4]    > Throwable #1: java.lang.AssertionError: expected:<3> but was:<2>
   [junit4]    > 	at __randomizedtesting.SeedInfo.seed([E484AD6D9171F191:874F9BEF08BE82BC]:0)
   [junit4]    > 	at org.apache.solr.cloud.autoscaling.ScheduledTriggerTest.scheduledTriggerTest(ScheduledTriggerTest.java:112)
   [junit4]    > 	at org.apache.solr.cloud.autoscaling.ScheduledTriggerTest.testTrigger(ScheduledTriggerTest.java:65)
   [junit4]    > 	at java.base/jdk.internal.reflect.NativeMethodAccessorImpl.invoke0(Native Method)
   [junit4]    > 	at java.base/jdk.internal.reflect.NativeMethodAccessorImpl.invoke(NativeMethodAccessorImpl.java:62)
   [junit4]    > 	at java.base/jdk.internal.reflect.DelegatingMethodAccessorImpl.invoke(DelegatingMethodAccessorImpl.java:43)
   [junit4]    > 	at java.base/java.lang.reflect.Method.invoke(Method.java:564)
   [junit4]    > 	at java.base/java.lang.Thread.run(Thread.java:844)
   [junit4]   2> 120824 INFO  (jetty-closer-331-thread-1) [    ] o.e.j.s.AbstractConnector Stopped ServerConnector@7ff00df4{HTTP/1.1,[http/1.1]}{127.0.0.1:0}
   [junit4]   2> 120825 INFO  (jetty-closer-331-thread-1) [    ] o.a.s.c.CoreContainer Shutting down CoreContainer instance=1832306947
   [junit4]   2> 120825 INFO  (jetty-closer-331-thread-1) [    ] o.a.s.m.SolrMetricManager Closing metric reporters for registry=solr.node, tag=null
   [junit4]   2> 120826 INFO  (jetty-closer-331-thread-1) [    ] o.a.s.m.r.SolrJmxReporter Closing reporter [org.apache.solr.metrics.reporters.SolrJmxReporter@acf9551: rootName = solr_50894, domain = solr.node, service url = null, agent id = null] for registry solr.node / com.codahale.metrics.MetricRegistry@37efa095
   [junit4]   2> 120831 INFO  (jetty-closer-331-thread-1) [    ] o.a.s.m.SolrMetricManager Closing metric reporters for registry=solr.jvm, tag=null
   [junit4]   2> 120831 INFO  (jetty-closer-331-thread-1) [    ] o.a.s.m.r.SolrJmxReporter Closing reporter [org.apache.solr.metrics.reporters.SolrJmxReporter@1a12de10: rootName = solr_50894, domain = solr.jvm, service url = null, agent id = null] for registry solr.jvm / com.codahale.metrics.MetricRegistry@5ef98313
   [junit4]   2> 120833 INFO  (jetty-closer-331-thread-1) [    ] o.a.s.m.SolrMetricManager Closing metric reporters for registry=solr.jetty, tag=null
   [junit4]   2> 120833 INFO  (jetty-closer-331-thread-1) [    ] o.a.s.m.r.SolrJmxReporter Closing reporter [org.apache.solr.metrics.reporters.SolrJmxReporter@c064fd1: rootName = solr_50894, domain = solr.jetty, service url = null, agent id = null] for registry solr.jetty / com.codahale.metrics.MetricRegistry@64d0264f
   [junit4]   2> 120834 INFO  (jetty-closer-331-thread-1) [    ] o.a.s.c.ZkController Remove node as live in ZooKeeper:/live_nodes/127.0.0.1:50894_solr
   [junit4]   2> 120835 INFO  (jetty-closer-331-thread-1) [    ] o.a.s.m.SolrMetricManager Closing metric reporters for registry=solr.cluster, tag=null
   [junit4]   2> 120837 INFO  (jetty-closer-331-thread-1) [    ] o.a.s.c.TransientSolrCoreCacheDefault Allocating transient cache for 2147483647 transient cores
   [junit4]   2> 120837 INFO  (zkCallback-340-thread-1) [    ] o.a.s.c.c.ZkStateReader Updated live nodes from ZooKeeper... (1) -> (0)
   [junit4]   2> 120837 INFO  (zkCallback-347-thread-1) [    ] o.a.s.c.c.ZkStateReader Updated live nodes from ZooKeeper... (1) -> (0)
   [junit4]   2> 120837 INFO  (jetty-closer-331-thread-1) [    ] o.a.s.c.Overseer Overseer (id=72134014223187971-127.0.0.1:50894_solr-n_0000000000) closing
   [junit4]   2> 120838 WARN  (OverseerAutoScalingTriggerThread-72134014223187971-127.0.0.1:50894_solr-n_0000000000) [    ] o.a.s.c.a.OverseerTriggerThread OverseerTriggerThread woken up but we are closed, exiting.
   [junit4]   2> 120838 INFO  (OverseerStateUpdate-72134014223187971-127.0.0.1:50894_solr-n_0000000000) [    ] o.a.s.c.Overseer Overseer Loop exiting : 127.0.0.1:50894_solr
   [junit4]   2> 120838 DEBUG (jetty-closer-331-thread-1) [    ] o.a.s.c.a.ScheduledTriggers Shutting down scheduled thread pool executor now
   [junit4]   2> 120838 DEBUG (jetty-closer-331-thread-1) [    ] o.a.s.c.a.ScheduledTriggers Shutting down action executor now
   [junit4]   2> 120838 DEBUG (jetty-closer-331-thread-1) [    ] o.a.s.c.a.ScheduledTriggers Awaiting termination for action executor
   [junit4]   2> 120838 DEBUG (jetty-closer-331-thread-1) [    ] o.a.s.c.a.ScheduledTriggers Awaiting termination for scheduled thread pool executor
   [junit4]   2> 120838 DEBUG (jetty-closer-331-thread-1) [    ] o.a.s.c.a.ScheduledTriggers ScheduledTriggers closed completely
   [junit4]   2> 120838 DEBUG (jetty-closer-331-thread-1) [    ] o.a.s.c.a.OverseerTriggerThread OverseerTriggerThread has been closed explicitly
   [junit4]   2> 120841 INFO  (jetty-closer-331-thread-1) [    ] o.e.j.s.h.ContextHandler Stopped o.e.j.s.ServletContextHandler@66b2728c{/solr,null,UNAVAILABLE}
   [junit4]   2> 120841 INFO  (jetty-closer-331-thread-1) [    ] o.e.j.s.session node0 Stopped scavenging
   [junit4]   2> 120842 ERROR (SUITE-ScheduledTriggerTest-seed#[E484AD6D9171F191]-worker) [    ] o.a.z.s.ZooKeeperServer ZKShutdownHandler is not registered, so ZooKeeper server won't take any action on ERROR or SHUTDOWN server state changes
   [junit4]   2> 120842 INFO  (SUITE-ScheduledTriggerTest-seed#[E484AD6D9171F191]-worker) [    ] o.a.s.c.ZkTestServer connecting to 127.0.0.1:50890 50890
   [junit4]   2> 120843 INFO  (Thread-188) [    ] o.a.s.c.ZkTestServer connecting to 127.0.0.1:50890 50890
   [junit4]   2> 120844 WARN  (Thread-188) [    ] o.a.s.c.ZkTestServer Watch limit violations: 
   [junit4]   2> Maximum concurrent create/delete watches above limit:
   [junit4]   2> 
   [junit4]   2> 	3	/solr/aliases.json
   [junit4]   2> 	3	/solr/clusterprops.json
   [junit4]   2> 
   [junit4]   2> Maximum concurrent data watches above limit:
   [junit4]   2> 
   [junit4]   2> 	3	/solr/clusterstate.json
   [junit4]   2> 
   [junit4]   2> Maximum concurrent children watches above limit:
   [junit4]   2> 
   [junit4]   2> 	3	/solr/live_nodes
   [junit4]   2> 	3	/solr/collections
   [junit4]   2> 
   [junit4]   2> NOTE: leaving temporary files on disk at: C:\Users\jenkins\workspace\Lucene-Solr-master-Windows\solr\build\solr-core\test\J1\temp\solr.cloud.autoscaling.ScheduledTriggerTest_E484AD6D9171F191-001
   [junit4]   2> Jun 27, 2018 5:34:39 AM com.carrotsearch.randomizedtesting.ThreadLeakControl checkThreadLeaks
   [junit4]   2> WARNING: Will linger awaiting termination of 4 leaked thread(s).
   [junit4]   2> NOTE: test params are: codec=Asserting(Lucene70): {}, docValues:{}, maxPointsInLeafNode=1027, maxMBSortInHeap=7.470676207204846, sim=Asserting(org.apache.lucene.search.similarities.AssertingSimilarity@60eed99d), locale=en-SZ, timezone=Europe/Berlin
   [junit4]   2> NOTE: Windows 10 10.0 amd64/Oracle Corporation 9.0.4 (64-bit)/cpus=3,threads=1,free=56492488,total=202375168
   [junit4]   2> NOTE: All tests run in this JVM: [BJQParserTest, HdfsRestartWhileUpdatingTest, DataDrivenBlockJoinTest, BlockCacheTest, ConfigSetsAPITest, TestFieldCacheReopen, PreAnalyzedFieldTest, TestCloudRecovery, MultiTermTest, BlobRepositoryCloudTest, MissingSegmentRecoveryTest, DeleteInactiveReplicaTest, UniqFieldsUpdateProcessorFactoryTest, TestSchemaVersionResource, ScheduledTriggerTest]
   [junit4] Completed [29/820 (1!)] on J1 in 10.56s, 2 tests, 1 failure <<< FAILURES!

[...truncated 3500 lines...]
   [junit4] Suite: org.apache.solr.common.util.TestTimeSource
   [junit4]   2> 57582 INFO  (SUITE-TestTimeSource-seed#[A182DE01A0880114]-worker) [    ] o.a.s.SolrTestCaseJ4 SecureRandom sanity checks: test.solr.allowed.securerandom=null & java.security.egd=file:/dev/./urandom
   [junit4]   2> Creating dataDir: C:\Users\jenkins\workspace\Lucene-Solr-master-Windows\solr\build\solr-solrj\test\J0\temp\solr.common.util.TestTimeSource_A182DE01A0880114-001\init-core-data-001
   [junit4]   2> 57583 WARN  (SUITE-TestTimeSource-seed#[A182DE01A0880114]-worker) [    ] o.a.s.SolrTestCaseJ4 startTrackingSearchers: numOpens=19 numCloses=19
   [junit4]   2> 57583 INFO  (SUITE-TestTimeSource-seed#[A182DE01A0880114]-worker) [    ] o.a.s.SolrTestCaseJ4 Using PointFields (NUMERIC_POINTS_SYSPROP=true) w/NUMERIC_DOCVALUES_SYSPROP=false
   [junit4]   2> 57586 INFO  (SUITE-TestTimeSource-seed#[A182DE01A0880114]-worker) [    ] o.a.s.SolrTestCaseJ4 Randomized ssl (false) and clientAuth (false) via: @org.apache.solr.util.RandomizeSSL(reason="", ssl=0.0/0.0, value=0.0/0.0, clientAuth=0.0/0.0)
   [junit4]   2> 57587 INFO  (TEST-TestTimeSource.testEpochTime-seed#[A182DE01A0880114]) [    ] o.a.s.SolrTestCaseJ4 ###Starting testEpochTime
   [junit4]   2> 67768 INFO  (TEST-TestTimeSource.testEpochTime-seed#[A182DE01A0880114]) [    ] o.a.s.SolrTestCaseJ4 ###Ending testEpochTime
   [junit4]   2> NOTE: reproduce with: ant test  -Dtestcase=TestTimeSource -Dtests.method=testEpochTime -Dtests.seed=A182DE01A0880114 -Dtests.slow=true -Dtests.locale=nnh-CM -Dtests.timezone=America/Lima -Dtests.asserts=true -Dtests.file.encoding=UTF-8
   [junit4] FAILURE 10.2s J0 | TestTimeSource.testEpochTime <<<
   [junit4]    > Throwable #1: java.lang.AssertionError: SimTimeSource:50.0 time diff=27730000
   [junit4]    > 	at __randomizedtesting.SeedInfo.seed([A182DE01A0880114:99EEAD243458A352]:0)
   [junit4]    > 	at org.apache.solr.common.util.TestTimeSource.doTestEpochTime(TestTimeSource.java:52)
   [junit4]    > 	at org.apache.solr.common.util.TestTimeSource.testEpochTime(TestTimeSource.java:32)
   [junit4]    > 	at java.base/jdk.internal.reflect.NativeMethodAccessorImpl.invoke0(Native Method)
   [junit4]    > 	at java.base/jdk.internal.reflect.NativeMethodAccessorImpl.invoke(NativeMethodAccessorImpl.java:62)
   [junit4]    > 	at java.base/jdk.internal.reflect.DelegatingMethodAccessorImpl.invoke(DelegatingMethodAccessorImpl.java:43)
   [junit4]    > 	at java.base/java.lang.reflect.Method.invoke(Method.java:564)
   [junit4]    > 	at java.base/java.lang.Thread.run(Thread.java:844)
   [junit4]   2> NOTE: leaving temporary files on disk at: C:\Users\jenkins\workspace\Lucene-Solr-master-Windows\solr\build\solr-solrj\test\J0\temp\solr.common.util.TestTimeSource_A182DE01A0880114-001
   [junit4]   2> NOTE: test params are: codec=Asserting(Lucene70): {}, docValues:{}, maxPointsInLeafNode=755, maxMBSortInHeap=5.630264039233152, sim=Asserting(org.apache.lucene.search.similarities.AssertingSimilarity@63389ac6), locale=nnh-CM, timezone=America/Lima
   [junit4]   2> NOTE: Windows 10 10.0 amd64/Oracle Corporation 9.0.4 (64-bit)/cpus=3,threads=1,free=130850880,total=225443840
   [junit4]   2> NOTE: All tests run in this JVM: [TestPolicy, SolrExampleXMLTest, AndEvaluatorTest, FieldValueEvaluatorTest, ContentStreamTest, JdbcDriverTest, NormalizeEvaluatorTest, TestEmbeddedSolrServer, LessThanEqualToEvaluatorTest, FieldAnalysisResponseTest, TestToleratedUpdateError, ConcurrentUpdateSolrClientTest, TestDelegationTokenRequest, JDBCStreamTest, CommonParamsTest, QueryResponseTest, ArcTangentEvaluatorTest, HyperbolicCosineEvaluatorTest, TestTimeSource]
   [junit4] Completed [51/154 (1!)] on J0 in 10.22s, 1 test, 1 failure <<< FAILURES!

[...truncated 43160 lines...]
[repro] Jenkins log URL: https://jenkins.thetaphi.de/job/Lucene-Solr-master-Windows/7383/consoleText

[repro] Revision: a929003f5b2792dedef6563203a86b99ac54e5df

[repro] Ant options: "-Dargs=-XX:-UseCompressedOops -XX:+UseG1GC"

[repro] ant clean

[...truncated 6 lines...]
[repro] Test suites by module:
[repro]    solr\solrj
[repro]       TestTimeSource
[repro]    solr\core
[repro]       ScheduledTriggerTest
[repro] ant compile-test

[...truncated 2476 lines...]
[repro] ant test-nocompile -Dtests.dups=5 -Dtests.maxfailures=5 -Dtests.class="*.TestTimeSource" -Dtests.showOutput=onerror "-Dargs=-XX:-UseCompressedOops -XX:+UseG1GC" -Dtests.seed=A182DE01A0880114 -Dtests.slow=true -Dtests.locale=nnh-CM -Dtests.timezone=America/Lima -Dtests.asserts=true -Dtests.file.encoding=UTF-8

[...truncated 32 lines...]
   [junit4] Suite: org.apache.solr.common.util.TestTimeSource
   [junit4]   2> SLF4J: Class path contains multiple SLF4J bindings.
   [junit4]   2> SLF4J: Found binding in [jar:file:/C:/Users/jenkins/workspace/Lucene-Solr-master-Windows/solr/solrj/test-lib/log4j-slf4j-impl-2.11.0.jar!/org/slf4j/impl/StaticLoggerBinder.class]
   [junit4]   2> SLF4J: Found binding in [jar:file:/C:/Users/jenkins/workspace/Lucene-Solr-master-Windows/solr/core/lib/log4j-slf4j-impl-2.11.0.jar!/org/slf4j/impl/StaticLoggerBinder.class]
   [junit4]   2> SLF4J: See http://www.slf4j.org/codes.html#multiple_bindings for an explanation.
   [junit4]   2> SLF4J: Actual binding is of type [org.apache.logging.slf4j.Log4jLoggerFactory]
   [junit4]   2> 10549 INFO  (SUITE-TestTimeSource-seed#[A182DE01A0880114]-worker) [    ] o.a.s.SolrTestCaseJ4 SecureRandom sanity checks: test.solr.allowed.securerandom=null & java.security.egd=file:/dev/./urandom
   [junit4]   2> Creating dataDir: C:\Users\jenkins\workspace\Lucene-Solr-master-Windows\solr\build\solr-solrj\test\J0\temp\solr.common.util.TestTimeSource_A182DE01A0880114-001\init-core-data-001
   [junit4]   2> 10645 INFO  (SUITE-TestTimeSource-seed#[A182DE01A0880114]-worker) [    ] o.a.s.SolrTestCaseJ4 Using PointFields (NUMERIC_POINTS_SYSPROP=true) w/NUMERIC_DOCVALUES_SYSPROP=false
   [junit4]   2> 10686 INFO  (SUITE-TestTimeSource-seed#[A182DE01A0880114]-worker) [    ] o.e.j.u.log Logging initialized @10725ms to org.eclipse.jetty.util.log.Slf4jLog
   [junit4]   2> 10694 INFO  (SUITE-TestTimeSource-seed#[A182DE01A0880114]-worker) [    ] o.a.s.SolrTestCaseJ4 Randomized ssl (false) and clientAuth (false) via: @org.apache.solr.util.RandomizeSSL(reason="", value=0.0/0.0, ssl=0.0/0.0, clientAuth=0.0/0.0)
   [junit4]   2> 10707 INFO  (TEST-TestTimeSource.testEpochTime-seed#[A182DE01A0880114]) [    ] o.a.s.SolrTestCaseJ4 ###Starting testEpochTime
   [junit4]   2> 20733 INFO  (TEST-TestTimeSource.testEpochTime-seed#[A182DE01A0880114]) [    ] o.a.s.SolrTestCaseJ4 ###Ending testEpochTime
   [junit4]   2> NOTE: reproduce with: ant test  -Dtestcase=TestTimeSource -Dtests.method=testEpochTime -Dtests.seed=A182DE01A0880114 -Dtests.slow=true -Dtests.badapples=true -Dtests.locale=nnh-CM -Dtests.timezone=America/Lima -Dtests.asserts=true -Dtests.file.encoding=UTF-8
   [junit4] FAILURE 10.0s J0 | TestTimeSource.testEpochTime <<<
   [junit4]    > Throwable #1: java.lang.AssertionError: SimTimeSource:50.0 time diff=13855000
   [junit4]    > 	at __randomizedtesting.SeedInfo.seed([A182DE01A0880114:99EEAD243458A352]:0)
   [junit4]    > 	at org.apache.solr.common.util.TestTimeSource.doTestEpochTime(TestTimeSource.java:52)
   [junit4]    > 	at org.apache.solr.common.util.TestTimeSource.testEpochTime(TestTimeSource.java:32)
   [junit4]    > 	at java.base/jdk.internal.reflect.NativeMethodAccessorImpl.invoke0(Native Method)
   [junit4]    > 	at java.base/jdk.internal.reflect.NativeMethodAccessorImpl.invoke(NativeMethodAccessorImpl.java:62)
   [junit4]    > 	at java.base/jdk.internal.reflect.DelegatingMethodAccessorImpl.invoke(DelegatingMethodAccessorImpl.java:43)
   [junit4]    > 	at java.base/java.lang.reflect.Method.invoke(Method.java:564)
   [junit4]    > 	at java.base/java.lang.Thread.run(Thread.java:844)
   [junit4]   2> NOTE: leaving temporary files on disk at: C:\Users\jenkins\workspace\Lucene-Solr-master-Windows\solr\build\solr-solrj\test\J0\temp\solr.common.util.TestTimeSource_A182DE01A0880114-001
   [junit4]   2> NOTE: test params are: codec=Asserting(Lucene70): {}, docValues:{}, maxPointsInLeafNode=755, maxMBSortInHeap=5.630264039233152, sim=Asserting(org.apache.lucene.search.similarities.AssertingSimilarity@47dc495b), locale=nnh-CM, timezone=America/Lima
   [junit4]   2> NOTE: Windows 10 10.0 amd64/Oracle Corporation 9.0.4 (64-bit)/cpus=3,threads=1,free=36071424,total=100663296
   [junit4]   2> NOTE: All tests run in this JVM: [TestTimeSource]
   [junit4] Completed [1/5 (1!)] on J0 in 20.12s, 1 test, 1 failure <<< FAILURES!

[...truncated 1 lines...]
   [junit4] Suite: org.apache.solr.common.util.TestTimeSource
   [junit4]   2> SLF4J: Class path contains multiple SLF4J bindings.
   [junit4]   2> SLF4J: Found binding in [jar:file:/C:/Users/jenkins/workspace/Lucene-Solr-master-Windows/solr/solrj/test-lib/log4j-slf4j-impl-2.11.0.jar!/org/slf4j/impl/StaticLoggerBinder.class]
   [junit4]   2> SLF4J: Found binding in [jar:file:/C:/Users/jenkins/workspace/Lucene-Solr-master-Windows/solr/core/lib/log4j-slf4j-impl-2.11.0.jar!/org/slf4j/impl/StaticLoggerBinder.class]
   [junit4]   2> SLF4J: See http://www.slf4j.org/codes.html#multiple_bindings for an explanation.
   [junit4]   2> SLF4J: Actual binding is of type [org.apache.logging.slf4j.Log4jLoggerFactory]
   [junit4]   2> 10525 INFO  (SUITE-TestTimeSource-seed#[A182DE01A0880114]-worker) [    ] o.a.s.SolrTestCaseJ4 SecureRandom sanity checks: test.solr.allowed.securerandom=null & java.security.egd=file:/dev/./urandom
   [junit4]   2> Creating dataDir: C:\Users\jenkins\workspace\Lucene-Solr-master-Windows\solr\build\solr-solrj\test\J1\temp\solr.common.util.TestTimeSource_A182DE01A0880114-001\init-core-data-001
   [junit4]   2> 10624 INFO  (SUITE-TestTimeSource-seed#[A182DE01A0880114]-worker) [    ] o.a.s.SolrTestCaseJ4 Using PointFields (NUMERIC_POINTS_SYSPROP=true) w/NUMERIC_DOCVALUES_SYSPROP=false
   [junit4]   2> 10660 INFO  (SUITE-TestTimeSource-seed#[A182DE01A0880114]-worker) [    ] o.e.j.u.log Logging initialized @11315ms to org.eclipse.jetty.util.log.Slf4jLog
   [junit4]   2> 10669 INFO  (SUITE-TestTimeSource-seed#[A182DE01A0880114]-worker) [    ] o.a.s.SolrTestCaseJ4 Randomized ssl (false) and clientAuth (false) via: @org.apache.solr.util.RandomizeSSL(reason="", value=0.0/0.0, ssl=0.0/0.0, clientAuth=0.0/0.0)
   [junit4]   2> 10691 INFO  (TEST-TestTimeSource.testEpochTime-seed#[A182DE01A0880114]) [    ] o.a.s.SolrTestCaseJ4 ###Starting testEpochTime
   [junit4]   2> 20726 INFO  (TEST-TestTimeSource.testEpochTime-seed#[A182DE01A0880114]) [    ] o.a.s.SolrTestCaseJ4 ###Ending testEpochTime
   [junit4]   2> NOTE: reproduce with: ant test  -Dtestcase=TestTimeSource -Dtests.method=testEpochTime -Dtests.seed=A182DE01A0880114 -Dtests.slow=true -Dtests.badapples=true -Dtests.locale=nnh-CM -Dtests.timezone=America/Lima -Dtests.asserts=true -Dtests.file.encoding=UTF-8
   [junit4] FAILURE 10.1s J1 | TestTimeSource.testEpochTime <<<
   [junit4]    > Throwable #1: java.lang.AssertionError: SimTimeSource:50.0 time diff=22730000
   [junit4]    > 	at __randomizedtesting.SeedInfo.seed([A182DE01A0880114:99EEAD243458A352]:0)
   [junit4]    > 	at org.apache.solr.common.util.TestTimeSource.doTestEpochTime(TestTimeSource.java:52)
   [junit4]    > 	at org.apache.solr.common.util.TestTimeSource.testEpochTime(TestTimeSource.java:32)
   [junit4]    > 	at java.base/jdk.internal.reflect.NativeMethodAccessorImpl.invoke0(Native Method)
   [junit4]    > 	at java.base/jdk.internal.reflect.NativeMethodAccessorImpl.invoke(NativeMethodAccessorImpl.java:62)
   [junit4]    > 	at java.base/jdk.internal.reflect.DelegatingMethodAccessorImpl.invoke(DelegatingMethodAccessorImpl.java:43)
   [junit4]    > 	at java.base/java.lang.reflect.Method.invoke(Method.java:564)
   [junit4]    > 	at java.base/java.lang.Thread.run(Thread.java:844)
   [junit4]   2> NOTE: leaving temporary files on disk at: C:\Users\jenkins\workspace\Lucene-Solr-master-Windows\solr\build\solr-solrj\test\J1\temp\solr.common.util.TestTimeSource_A182DE01A0880114-001
   [junit4]   2> NOTE: test params are: codec=Asserting(Lucene70): {}, docValues:{}, maxPointsInLeafNode=755, maxMBSortInHeap=5.630264039233152, sim=Asserting(org.apache.lucene.search.similarities.AssertingSimilarity@152a4a70), locale=nnh-CM, timezone=America/Lima
   [junit4]   2> NOTE: Windows 10 10.0 amd64/Oracle Corporation 9.0.4 (64-bit)/cpus=3,threads=1,free=35387488,total=100663296
   [junit4]   2> NOTE: All tests run in this JVM: [TestTimeSource]
   [junit4] Completed [2/5 (2!)] on J1 in 19.40s, 1 test, 1 failure <<< FAILURES!

[...truncated 24 lines...]
BUILD FAILED
C:\Users\jenkins\workspace\Lucene-Solr-master-Windows\lucene\common-build.xml:1568: The following error occurred while executing this line:
C:\Users\jenkins\workspace\Lucene-Solr-master-Windows\lucene\common-build.xml:1092: There were test failures: 5 suites, 5 tests, 2 failures [seed: A182DE01A0880114]

Total time: 43 seconds

[repro] Setting last failure code to 1

[repro] ant compile-test
Buildfile: C:\Users\jenkins\workspace\Lucene-Solr-master-Windows\solr\core\build.xml

check-analyzers-icu-uptodate:

jar-analyzers-icu:

-mrjar-classes-uptodate:

ivy-availability-check:
[loadresource] Do not set property disallowed.ivy.jars.list as its length is 0.

-ivy-fail-disallowed-ivy-version:

ivy-fail:

ivy-configure:
[ivy:configure] :: Apache Ivy 2.4.0 - 20141213170938 :: http://ant.apache.org/ivy/ ::
[ivy:configure] :: loading settings :: file = C:\Users\jenkins\workspace\Lucene-Solr-master-Windows\lucene\top-level-ivy-settings.xml

resolve-groovy:
[ivy:cachepath] :: resolving dependencies :: org.codehaus.groovy#groovy-all-caller;working
[ivy:cachepath] 	confs: [default]
[ivy:cachepath] 	found org.codehaus.groovy#groovy-all;2.4.15 in public
[ivy:cachepath] :: resolution report :: resolve 148ms :: artifacts dl 2ms
	---------------------------------------------------------------------
	|                  |            modules            ||   artifacts   |
	|       conf       | number| search|dwnlded|evicted|| number|dwnlded|
	---------------------------------------------------------------------
	|      default     |   1   |   0   |   0   |   0   ||   1   |   0   |
	---------------------------------------------------------------------

check-analyzers-common-uptodate:

jar-analyzers-common:

-check-git-state:

-git-cleanroot:

-copy-git-state:

git-autoclean:

resolve:

common.init:

compile-lucene-core:

-check-git-state:

-git-cleanroot:

-copy-git-state:

git-autoclean:

ivy-availability-check:
[loadresource] Do not set property disallowed.ivy.jars.list as its length is 0.

-ivy-fail-disallowed-ivy-version:

ivy-fail:

ivy-configure:
[ivy:configure] :: loading settings :: file = C:\Users\jenkins\workspace\Lucene-Solr-master-Windows\lucene\top-level-ivy-settings.xml

resolve:

init:

-clover.disable:

-clover.load:

-clover.classpath:

-clover.setup:

clover:

compile-core:

init:

-clover.disable:

-clover.load:

-clover.classpath:

-clover.setup:

clover:

common.compile-core:
    [mkdir] Created dir: C:\Users\jenkins\workspace\Lucene-Solr-master-Windows\lucene\build\analysis\icu\classes\java
    [javac] Compiling 25 source files to C:\Users\jenkins\workspace\Lucene-Solr-master-Windows\lucene\build\analysis\icu\classes\java
    [javac] Note: C:\Users\jenkins\workspace\Lucene-Solr-master-Windows\lucene\analysis\icu\src\java\org\apache\lucene\analysis\icu\ICUTransformFilter.java uses or overrides a deprecated API.
    [javac] Note: Recompile with -Xlint:deprecation for details.
    [javac] Creating empty C:\Users\jenkins\workspace\Lucene-Solr-master-Windows\lucene\build\analysis\icu\classes\java\org\apache\lucene\analysis\icu\package-info.class
    [javac] Creating empty C:\Users\jenkins\workspace\Lucene-Solr-master-Windows\lucene\build\analysis\icu\classes\java\org\apache\lucene\analysis\icu\tokenattributes\package-info.class
    [javac] Creating empty C:\Users\jenkins\workspace\Lucene-Solr-master-Windows\lucene\build\analysis\icu\classes\java\org\apache\lucene\analysis\icu\segmentation\package-info.class
     [copy] Copying 6 files to C:\Users\jenkins\workspace\Lucene-Solr-master-Windows\lucene\build\analysis\icu\classes\java

compile-core:

patch-mrjar-classes:
WARNING: An illegal reflective access operation has occurred
WARNING: Illegal reflective access by org.codehaus.groovy.reflection.CachedClass (file:/C:/Users/jenkins/.ivy2/cache/org.codehaus.groovy/groovy-all/jars/groovy-all-2.4.15.jar) to method java.lang.Object.finalize()
WARNING: Please consider reporting this to the maintainers of org.codehaus.groovy.reflection.CachedClass
WARNING: Use --illegal-access=warn to enable warnings of further illegal reflective access operations
WARNING: All illegal access operations will be denied in a future release
[patch-cls] Remapped 0 class files for Java 9 to: C:\Users\jenkins\workspace\Lucene-Solr-master-Windows\lucene\build\analysis\icu\classes\java9
    [touch] Creating C:\Users\jenkins\workspace\Lucene-Solr-master-Windows\lucene\build\analysis\icu\patch-mrjar.stamp

-mrjar-check:

-mrjar-core:

-jar-core:
     [exec] Execute failed: java.io.IOException: Cannot run program "git" (in directory "C:\Users\jenkins\workspace\Lucene-Solr-master-Windows\lucene\analysis\icu"): CreateProcess error=2, The system cannot find the file specified
      [jar] Building jar: C:\Users\jenkins\workspace\Lucene-Solr-master-Windows\lucene\build\analysis\icu\lucene-analyzers-icu-8.0.0-SNAPSHOT.jar

jar-core:

-compile-test-lucene-queryparser:

-check-git-state:

-git-cleanroot:

-copy-git-state:

git-autoclean:

ivy-availability-check:
[loadresource] Do not set property disallowed.ivy.jars.list as its length is 0.

-ivy-fail-disallowed-ivy-version:

ivy-fail:

ivy-configure:
[ivy:configure] :: loading settings :: file = C:\Users\jenkins\workspace\Lucene-Solr-master-Windows\lucene\top-level-ivy-settings.xml

resolve:

common.init:

compile-lucene-core:

-check-git-state:

-git-cleanroot:

-copy-git-state:

git-autoclean:

ivy-availability-check:
[loadresource] Do not set property disallowed.ivy.jars.list as its length is 0.

-ivy-fail-disallowed-ivy-version:

ivy-fail:

ivy-configure:
[ivy:configure] :: loading settings :: file = C:\Users\jenkins\workspace\Lucene-Solr-master-Windows\lucene\top-level-ivy-settings.xml

resolve:

init:

-clover.disable:

-clover.load:

-clover.classpath:

-clover.setup:

clover:

compile-core:

init:

compile-test:

check-queries-uptodate:

jar-queries:

check-sandbox-uptodate:

jar-sandbox:

-check-git-state:

-git-cleanroot:

-copy-git-state:

git-autoclean:

ivy-availability-check:

ivy-configure:
[ivy:configure] :: loading settings :: file = C:\Users\jenkins\workspace\Lucene-Solr-master-Windows\lucene\top-level-ivy-settings.xml

resolve:

common.init:

compile-lucene-core:

init:

-clover.disable:

-clover.load:

-clover.classpath:

-clover.setup:

clover:

common.compile-core:

compile-core:

compile-test-framework:

-check-git-state:

-git-cleanroot:

-copy-git-state:

git-autoclean:

ivy-availability-check:
[loadresource] Do not set property disallowed.ivy.jars.list as its length is 0.

-ivy-fail-disallowed-ivy-version:

ivy-fail:

ivy-configure:
[ivy:configure] :: loading settings :: file = C:\Users\jenkins\workspace\Lucene-Solr-master-Windows\lucene\top-level-ivy-settings.xml

resolve:

init:

compile-lucene-core:

compile-codecs:

-check-git-state:

-git-cleanroot:

-copy-git-state:

git-autoclean:

ivy-availability-check:
[loadresource] Do not set property disallowed.ivy.jars.list as its length is 0.

-ivy-fail-disallowed-ivy-version:

ivy-fail:

ivy-configure:
[ivy:configure] :: loading settings :: file = C:\Users\jenkins\workspace\Lucene-Solr-master-Windows\lucene\top-level-ivy-settings.xml

resolve:

common.init:

compile-lucene-core:

init:

-clover.disable:

-clover.load:

-clover.classpath:

-clover.setup:

clover:

compile-core:

-clover.disable:

-clover.load:

-clover.classpath:

-clover.setup:

clover:

common.compile-core:

compile-core:

common.compile-test:
    [mkdir] Created dir: C:\Users\jenkins\workspace\Lucene-Solr-master-Windows\lucene\build\queryparser\classes\test
    [javac] Compiling 41 source files to C:\Users\jenkins\workspace\Lucene-Solr-master-Windows\lucene\build\queryparser\classes\test
     [copy] Copying 25 files to C:\Users\jenkins\workspace\Lucene-Solr-master-Windows\lucene\build\queryparser\classes\test

-compile-test-lucene-backward-codecs:

-check-git-state:

-git-cleanroot:

-copy-git-state:

git-autoclean:

ivy-availability-check:
[loadresource] Do not set property disallowed.ivy.jars.list as its length is 0.

-ivy-fail-disallowed-ivy-version:

ivy-fail:

ivy-configure:
[ivy:configure] :: loading settings :: file = C:\Users\jenkins\workspace\Lucene-Solr-master-Windows\lucene\top-level-ivy-settings.xml

resolve:

common.init:

compile-lucene-core:

-check-git-state:

-git-cleanroot:

-copy-git-state:

git-autoclean:

ivy-availability-check:
[loadresource] Do not set property disallowed.ivy.jars.list as its length is 0.

-ivy-fail-disallowed-ivy-version:

ivy-fail:

ivy-configure:
[ivy:configure] :: loading settings :: file = C:\Users\jenkins\workspace\Lucene-Solr-master-Windows\lucene\top-level-ivy-settings.xml

resolve:

init:

-clover.disable:

-clover.load:

-clover.classpath:

-clover.setup:

clover:

compile-core:

init:

compile-test:

-check-git-state:

-git-cleanroot:

-copy-git-state:

git-autoclean:

ivy-availability-check:

ivy-configure:
[ivy:configure] :: loading settings :: file = C:\Users\jenkins\workspace\Lucene-Solr-master-Windows\lucene\top-level-ivy-settings.xml

resolve:

common.init:

compile-lucene-core:

init:

-clover.disable:

-clover.load:

-clover.classpath:

-clover.setup:

clover:

compile-core:

compile-test-framework:

-check-git-state:

-git-cleanroot:

-copy-git-state:

git-autoclean:

ivy-availability-check:
[loadresource] Do not set property disallowed.ivy.jars.list as its length is 0.

-ivy-fail-disallowed-ivy-version:

ivy-fail:

ivy-configure:
[ivy:configure] :: loading settings :: file = C:\Users\jenkins\workspace\Lucene-Solr-master-Windows\lucene\top-level-ivy-settings.xml

resolve:

init:

compile-lucene-core:

compile-codecs:

-check-git-state:

-git-cleanroot:

-copy-git-state:

git-autoclean:

ivy-availability-check:
[loadresource] Do not set property disallowed.ivy.jars.list as its length is 0.

-ivy-fail-disallowed-ivy-version:

ivy-fail:

ivy-configure:
[ivy:configure] :: loading settings :: file = C:\Users\jenkins\workspace\Lucene-Solr-master-Windows\lucene\top-level-ivy-settings.xml

resolve:

common.init:

compile-lucene-core:

init:

-clover.disable:

-clover.load:

-clover.classpath:

-clover.setup:

clover:

compile-core:

-clover.disable:

-clover.load:

-clover.classpath:

-clover.setup:

clover:

common.compile-core:

compile-core:

common.compile-test:
    [mkdir] Created dir: C:\Users\jenkins\workspace\Lucene-Solr-master-Windows\lucene\build\backward-codecs\classes\test
    [javac] Compiling 3 source files to C:\Users\jenkins\workspace\Lucene-Solr-master-Windows\lucene\build\backward-codecs\classes\test
     [copy] Copying 191 files to C:\Users\jenkins\workspace\Lucene-Solr-master-Windows\lucene\build\backward-codecs\classes\test

-compile-analysis-extras:

check-analyzers-icu-uptodate:

jar-analyzers-icu:

check-analyzers-opennlp-uptodate:

jar-analyzers-opennlp:

-mrjar-classes-uptodate:

ivy-availability-check:
[loadresource] Do not set property disallowed.ivy.jars.list as its length is 0.

-ivy-fail-disallowed-ivy-version:

ivy-fail:

ivy-configure:
[ivy:configure] :: loading settings :: file = C:\Users\jenkins\workspace\Lucene-Solr-master-Windows\lucene\top-level-ivy-settings.xml

resolve-groovy:
[ivy:cachepath] :: resolving dependencies :: org.codehaus.groovy#groovy-all-caller;working
[ivy:cachepath] 	confs: [default]
[ivy:cachepath] 	found org.codehaus.groovy#groovy-all;2.4.15 in public
[ivy:cachepath] :: resolution report :: resolve 19ms :: artifacts dl 1ms
	---------------------------------------------------------------------
	|                  |            modules            ||   artifacts   |
	|       conf       | number| search|dwnlded|evicted|| number|dwnlded|
	---------------------------------------------------------------------
	|      default     |   1   |   0   |   0   |   0   ||   1   |   0   |
	---------------------------------------------------------------------

check-analyzers-common-uptodate:

jar-analyzers-common:

-check-git-state:

-git-cleanroot:

-copy-git-state:

git-autoclean:

resolve:

common.init:

compile-lucene-core:

-check-git-state:

-git-cleanroot:

-copy-git-state:

git-autoclean:

ivy-availability-check:
[loadresource] Do not set property disallowed.ivy.jars.list as its length is 0.

-ivy-fail-disallowed-ivy-version:

ivy-fail:

ivy-configure:
[ivy:configure] :: loading settings :: file = C:\Users\jenkins\workspace\Lucene-Solr-master-Windows\lucene\top-level-ivy-settings.xml

resolve:

init:

-clover.disable:

-clover.load:

-clover.classpath:

-clover.setup:

clover:

compile-core:

init:

-clover.disable:

-clover.load:

-clover.classpath:

-clover.setup:

clover:

common.compile-core:
    [mkdir] Created dir: C:\Users\jenkins\workspace\Lucene-Solr-master-Windows\lucene\build\analysis\opennlp\classes\java
    [javac] Compiling 18 source files to C:\Users\jenkins\workspace\Lucene-Solr-master-Windows\lucene\build\analysis\opennlp\classes\java
    [javac] Creating empty C:\Users\jenkins\workspace\Lucene-Solr-master-Windows\lucene\build\analysis\opennlp\classes\java\org\apache\lucene\analysis\opennlp\tools\package-info.class
    [javac] Creating empty C:\Users\jenkins\workspace\Lucene-Solr-master-Windows\lucene\build\analysis\opennlp\classes\java\org\apache\lucene\analysis\opennlp\package-info.class
     [copy] Copying 2 files to C:\Users\jenkins\workspace\Lucene-Solr-master-Windows\lucene\build\analysis\opennlp\classes\java

compile-core:

patch-mrjar-classes:
[patch-cls] Remapped 0 class files for Java 9 to: C:\Users\jenkins\workspace\Lucene-Solr-master-Windows\lucene\build\analysis\opennlp\classes\java9
    [touch] Creating C:\Users\jenkins\workspace\Lucene-Solr-master-Windows\lucene\build\analysis\opennlp\patch-mrjar.stamp

-mrjar-check:

-mrjar-core:

-jar-core:
     [exec] Execute failed: java.io.IOException: Cannot run program "git" (in directory "C:\Users\jenkins\workspace\Lucene-Solr-master-Windows\lucene\analysis\opennlp"): CreateProcess error=2, The system cannot find the file specified
      [jar] Building jar: C:\Users\jenkins\workspace\Lucene-Solr-master-Windows\lucene\build\analysis\opennlp\lucene-analyzers-opennlp-8.0.0-SNAPSHOT.jar

jar-core:

compile-solr-core:

compile-solrj:

ivy-availability-check:
[loadresource] Do not set property disallowed.ivy.jars.list as its length is 0.

-ivy-fail-disallowed-ivy-version:

ivy-fail:

ivy-configure:
[ivy:configure] :: loading settings :: file = C:\Users\jenkins\workspace\Lucene-Solr-master-Windows\lucene\top-level-ivy-settings.xml

resolve-groovy:
[ivy:cachepath] :: resolving dependencies :: org.codehaus.groovy#groovy-all-caller;working
[ivy:cachepath] 	confs: [default]
[ivy:cachepath] 	found org.codehaus.groovy#groovy-all;2.4.15 in public
[ivy:cachepath] :: resolution report :: resolve 20ms :: artifacts dl 0ms
	---------------------------------------------------------------------
	|                  |            modules            ||   artifacts   |
	|       conf       | number| search|dwnlded|evicted|| number|dwnlded|
	---------------------------------------------------------------------
	|      default     |   1   |   0   |   0   |   0   ||   1   |   0   |
	---------------------------------------------------------------------

check-lucene-core-uptodate:

jar-lucene-core:

check-backward-codecs-uptodate:

jar-backward-codecs:

check-analyzers-phonetic-uptodate:

jar-analyzers-phonetic:

check-analyzers-kuromoji-uptodate:

jar-analyzers-kuromoji:

check-codecs-uptodate:

jar-codecs:

check-expressions-uptodate:

jar-expressions:

check-suggest-uptodate:

jar-suggest:

check-highlighter-uptodate:

jar-highlighter:

check-memory-uptodate:

jar-memory:

check-misc-uptodate:

jar-misc:

check-spatial-extras-uptodate:

jar-spatial-extras:

check-spatial3d-uptodate:

jar-spatial3d:

check-grouping-uptodate:

jar-grouping:

check-queries-uptodate:

jar-queries:

check-queryparser-uptodate:

jar-queryparser:

check-join-uptodate:

jar-join:

check-sandbox-uptodate:

jar-sandbox:

check-classification-uptodate:

jar-classification:

prep-lucene-jars:

resolve-example:

ivy-availability-check:
[loadresource] Do not set property disallowed.ivy.jars.list as its length is 0.

-ivy-fail-disallowed-ivy-version:

ivy-fail:

ivy-configure:
[ivy:configure] :: loading settings :: file = C:\Users\jenkins\workspace\Lucene-Solr-master-Windows\lucene\top-level-ivy-settings.xml

resolve:

resolve-server:

ivy-availability-check:
[loadresource] Do not set property disallowed.ivy.jars.list as its length is 0.

-ivy-fail-disallowed-ivy-version:

ivy-fail:

ivy-fail:

ivy-configure:
[ivy:configure] :: loading settings :: file = C:\Users\jenkins\workspace\Lucene-Solr-master-Windows\lucene\top-level-ivy-settings.xml

resolve:

-check-git-state:

-git-cleanroot:

-copy-git-state:

git-autoclean:

ivy-fail:

resolve:

common.init:

compile-lucene-core:

-check-git-state:

-git-cleanroot:

-copy-git-state:

git-autoclean:

ivy-availability-check:
[loadresource] Do not set property disallowed.ivy.jars.list as its length is 0.

-ivy-fail-disallowed-ivy-version:

ivy-fail:

ivy-configure:
[ivy:configure] :: loading settings :: file = C:\Users\jenkins\workspace\Lucene-Solr-master-Windows\lucene\top-level-ivy-settings.xml

resolve:

init:

-clover.disable:

-clover.load:

-clover.classpath:

-clover.setup:

clover:

compile-core:

init:

-clover.disable:

-clover.load:

-clover.classpath:

-clover.setup:

clover:

common.compile-core:

compile-core:

ivy-availability-check:
[loadresource] Do not set property disallowed.ivy.jars.list as its length is 0.

-ivy-fail-disallowed-ivy-version:

ivy-fail:

ivy-configure:
[ivy:configure] :: loading settings :: file = C:\Users\jenkins\workspace\Lucene-Solr-master-Windows\lucene\top-level-ivy-settings.xml

resolve-groovy:
[ivy:cachepath] :: resolving dependencies :: org.codehaus.groovy#groovy-all-caller;working
[ivy:cachepath] 	confs: [default]
[ivy:cachepath] 	found org.codehaus.groovy#groovy-all;2.4.15 in public
[ivy:cachepath] :: resolution report :: resolve 14ms :: artifacts dl 1ms
	---------------------------------------------------------------------
	|                  |            modules            ||   artifacts   |
	|       conf       | number| search|dwnlded|evicted|| number|dwnlded|
	---------------------------------------------------------------------
	|      default     |   1   |   0   |   0   |   0   ||   1   |   0   |
	---------------------------------------------------------------------

check-lucene-core-uptodate:

jar-lucene-core:

check-backward-codecs-uptodate:

jar-backward-codecs:

check-analyzers-phonetic-uptodate:

jar-analyzers-phonetic:

check-analyzers-kuromoji-uptodate:

jar-analyzers-kuromoji:

check-codecs-uptodate:

jar-codecs:

check-expressions-uptodate:

jar-expressions:

check-suggest-uptodate:

jar-suggest:

check-highlighter-uptodate:

jar-highlighter:

check-memory-uptodate:

jar-memory:

check-misc-uptodate:

jar-misc:

check-spatial-extras-uptodate:

jar-spatial-extras:

check-spatial3d-uptodate:

jar-spatial3d:

check-grouping-uptodate:

jar-grouping:

check-queries-uptodate:

jar-queries:

check-queryparser-uptodate:

jar-queryparser:

check-join-uptodate:

jar-join:

check-sandbox-uptodate:

jar-sandbox:

check-classification-uptodate:

jar-classification:

prep-lucene-jars:

resolve-example:

ivy-availability-check:
[loadresource] Do not set property disallowed.ivy.jars.list as its length is 0.

-ivy-fail-disallowed-ivy-version:

ivy-fail:

ivy-configure:
[ivy:configure] :: loading settings :: file = C:\Users\jenkins\workspace\Lucene-Solr-master-Windows\lucene\top-level-ivy-settings.xml

resolve:

resolve-server:

ivy-availability-check:
[loadresource] Do not set property disallowed.ivy.jars.list as its length is 0.

-ivy-fail-disallowed-ivy-version:

ivy-fail:

ivy-fail:

ivy-configure:
[ivy:configure] :: loading settings :: file = C:\Users\jenkins\workspace\Lucene-Solr-master-Windows\lucene\top-level-ivy-settings.xml

resolve:

-check-git-state:

-git-cleanroot:

-copy-git-state:

git-autoclean:

ivy-fail:

resolve:

common.init:

compile-lucene-core:

-check-git-state:

-git-cleanroot:

-copy-git-state:

git-autoclean:

ivy-availability-check:
[loadresource] Do not set property disallowed.ivy.jars.list as its length is 0.

-ivy-fail-disallowed-ivy-version:

ivy-fail:

ivy-configure:
[ivy:configure] :: loading settings :: file = C:\Users\jenkins\workspace\Lucene-Solr-master-Windows\lucene\top-level-ivy-settings.xml

resolve:

init:

-clover.disable:

-clover.load:

-clover.classpath:

-clover.setup:

clover:

compile-core:

init:

-clover.disable:

-clover.load:

-clover.classpath:

-clover.setup:

clover:

common.compile-core:

common-solr.compile-core:

compile-core:

compile-solrj:

ivy-availability-check:
[loadresource] Do not set property disallowed.ivy.jars.list as its length is 0.

-ivy-fail-disallowed-ivy-version:

ivy-fail:

ivy-configure:
[ivy:configure] :: loading settings :: file = C:\Users\jenkins\workspace\Lucene-Solr-master-Windows\lucene\top-level-ivy-settings.xml

resolve-groovy:
[ivy:cachepath] :: resolving dependencies :: org.codehaus.groovy#groovy-all-caller;working
[ivy:cachepath] 	confs: [default]
[ivy:cachepath] 	found org.codehaus.groovy#groovy-all;2.4.15 in public
[ivy:cachepath] :: resolution report :: resolve 15ms :: artifacts dl 1ms
	---------------------------------------------------------------------
	|                  |            modules            ||   artifacts   |
	|       conf       | number| search|dwnlded|evicted|| number|dwnlded|
	---------------------------------------------------------------------
	|      default     |   1   |   0   |   0   |   0   ||   1   |   0   |
	---------------------------------------------------------------------

check-lucene-core-uptodate:

jar-lucene-core:

check-backward-codecs-uptodate:

jar-backward-codecs:

check-analyzers-phonetic-uptodate:

jar-analyzers-phonetic:

check-analyzers-kuromoji-uptodate:

jar-analyzers-kuromoji:

check-codecs-uptodate:

jar-codecs:

check-expressions-uptodate:

jar-expressions:

check-suggest-uptodate:

jar-suggest:

check-highlighter-uptodate:

jar-highlighter:

check-memory-uptodate:

jar-memory:

check-misc-uptodate:

jar-misc:

check-spatial-extras-uptodate:

jar-spatial-extras:

check-spatial3d-uptodate:

jar-spatial3d:

check-grouping-uptodate:

jar-grouping:

check-queries-uptodate:

jar-queries:

check-queryparser-uptodate:

jar-queryparser:

check-join-uptodate:

jar-join:

check-sandbox-uptodate:

jar-sandbox:

check-classification-uptodate:

jar-classification:

prep-lucene-jars:

resolve-example:

ivy-availability-check:
[loadresource] Do not set property disallowed.ivy.jars.list as its length is 0.

-ivy-fail-disallowed-ivy-version:

ivy-fail:

ivy-configure:
[ivy:configure] :: loading settings :: file = C:\Users\jenkins\workspace\Lucene-Solr-master-Windows\lucene\top-level-ivy-settings.xml

resolve:

resolve-server:

ivy-availability-check:
[loadresource] Do not set property disallowed.ivy.jars.list as its length is 0.

-ivy-fail-disallowed-ivy-version:

ivy-fail:

ivy-fail:

ivy-configure:
[ivy:configure] :: loading settings :: file = C:\Users\jenkins\workspace\Lucene-Solr-master-Windows\lucene\top-level-ivy-settings.xml

resolve:

-check-git-state:

-git-cleanroot:

-copy-git-state:

git-autoclean:

ivy-fail:

resolve:

common.init:

compile-lucene-core:

-check-git-state:

-git-cleanroot:

-copy-git-state:

git-autoclean:

ivy-availability-check:
[loadresource] Do not set property disallowed.ivy.jars.list as its length is 0.

-ivy-fail-disallowed-ivy-version:

ivy-fail:

ivy-configure:
[ivy:configure] :: loading settings :: file = C:\Users\jenkins\workspace\Lucene-Solr-master-Windows\lucene\top-level-ivy-settings.xml

resolve:

init:

-clover.disable:

-clover.load:

-clover.classpath:

-clover.setup:

clover:

compile-core:

init:

-clover.disable:

-clover.load:

-clover.classpath:

-clover.setup:

clover:

common.compile-core:

compile-core:

ivy-availability-check:
[loadresource] Do not set property disallowed.ivy.jars.list as its length is 0.

-ivy-fail-disallowed-ivy-version:

ivy-fail:

ivy-configure:
[ivy:configure] :: loading settings :: file = C:\Users\jenkins\workspace\Lucene-Solr-master-Windows\lucene\top-level-ivy-settings.xml

resolve-groovy:
[ivy:cachepath] :: resolving dependencies :: org.codehaus.groovy#groovy-all-caller;working
[ivy:cachepath] 	confs: [default]
[ivy:cachepath] 	found org.codehaus.groovy#groovy-all;2.4.15 in public
[ivy:cachepath] :: resolution report :: resolve 13ms :: artifacts dl 1ms
	---------------------------------------------------------------------
	|                  |            modules            ||   artifacts   |
	|       conf       | number| search|dwnlded|evicted|| number|dwnlded|
	---------------------------------------------------------------------
	|      default     |   1   |   0   |   0   |   0   ||   1   |   0   |
	---------------------------------------------------------------------

check-lucene-core-uptodate:

jar-lucene-core:

check-backward-codecs-uptodate:

jar-backward-codecs:

check-analyzers-phonetic-uptodate:

jar-analyzers-phonetic:

check-analyzers-kuromoji-uptodate:

jar-analyzers-kuromoji:

check-codecs-uptodate:

jar-codecs:

check-expressions-uptodate:

jar-expressions:

check-suggest-uptodate:

jar-suggest:

check-highlighter-uptodate:

jar-highlighter:

check-memory-uptodate:

jar-memory:

check-misc-uptodate:

jar-misc:

check-spatial-extras-uptodate:

jar-spatial-extras:

check-spatial3d-uptodate:

jar-spatial3d:

check-grouping-uptodate:

jar-grouping:

check-queries-uptodate:

jar-queries:

check-queryparser-uptodate:

jar-queryparser:

check-join-uptodate:

jar-join:

check-sandbox-uptodate:

jar-sandbox:

check-classification-uptodate:

jar-classification:

prep-lucene-jars:

resolve-example:

ivy-availability-check:
[loadresource] Do not set property disallowed.ivy.jars.list as its length is 0.

-ivy-fail-disallowed-ivy-version:

ivy-fail:

ivy-configure:
[ivy:configure] :: loading settings :: file = C:\Users\jenkins\workspace\Lucene-Solr-master-Windows\lucene\top-level-ivy-settings.xml

resolve:

resolve-server:

ivy-availability-check:
[loadresource] Do not set property disallowed.ivy.jars.list as its length is 0.

-ivy-fail-disallowed-ivy-version:

ivy-fail:

ivy-fail:

ivy-configure:
[ivy:configure] :: loading settings :: file = C:\Users\jenkins\workspace\Lucene-Solr-master-Windows\lucene\top-level-ivy-settings.xml

resolve:

-check-git-state:

-git-cleanroot:

-copy-git-state:

git-autoclean:

ivy-fail:

resolve:

common.init:

compile-lucene-core:

-check-git-state:

-git-cleanroot:

-copy-git-state:

git-autoclean:

ivy-availability-check:
[loadresource] Do not set property disallowed.ivy.jars.list as its length is 0.

-ivy-fail-disallowed-ivy-version:

ivy-fail:

ivy-configure:
[ivy:configure] :: loading settings :: file = C:\Users\jenkins\workspace\Lucene-Solr-master-Windows\lucene\top-level-ivy-settings.xml

resolve:

init:

-clover.disable:

-clover.load:

-clover.classpath:

-clover.setup:

clover:

compile-core:

init:

-clover.disable:

-clover.load:

-clover.classpath:

-clover.setup:

clover:

common.compile-core:
    [mkdir] Created dir: C:\Users\jenkins\workspace\Lucene-Solr-master-Windows\solr\build\contrib\solr-analysis-extras\classes\java
    [javac] Compiling 2 source files to C:\Users\jenkins\workspace\Lucene-Solr-master-Windows\solr\build\contrib\solr-analysis-extras\classes\java
    [javac] Note: C:\Users\jenkins\workspace\Lucene-Solr-master-Windows\solr\contrib\analysis-extras\src\java\org\apache\solr\schema\ICUCollationField.java uses or overrides a deprecated API.
    [javac] Note: Recompile with -Xlint:deprecation for details.

common-solr.compile-core:

solr-contrib-build.compile-core:

compile-core:

compile:

compile-solr-test-framework:

ivy-availability-check:
[loadresource] Do not set property disallowed.ivy.jars.list as its length is 0.

-ivy-fail-disallowed-ivy-version:

ivy-fail:

ivy-configure:
[ivy:configure] :: loading settings :: file = C:\Users\jenkins\workspace\Lucene-Solr-master-Windows\lucene\top-level-ivy-settings.xml

resolve:

-clover.disable:

-clover.load:

-clover.classpath:

-clover.setup:

clover:

compile-solr-core:

compile-solrj:

ivy-availability-check:
[loadresource] Do not set property disallowed.ivy.jars.list as its length is 0.

-ivy-fail-disallowed-ivy-version:

ivy-fail:

ivy-configure:
[ivy:configure] :: loading settings :: file = C:\Users\jenkins\workspace\Lucene-Solr-master-Windows\lucene\top-level-ivy-settings.xml

resolve-groovy:
[ivy:cachepath] :: resolving dependencies :: org.codehaus.groovy#groovy-all-caller;working
[ivy:cachepath] 	confs: [default]
[ivy:cachepath] 	found org.codehaus.groovy#groovy-all;2.4.15 in public
[ivy:cachepath] :: resolution report :: resolve 13ms :: artifacts dl 0ms
	---------------------------------------------------------------------
	|                  |            modules            ||   artifacts   |
	|       conf       | number| search|dwnlded|evicted|| number|dwnlded|
	---------------------------------------------------------------------
	|      default     |   1   |   0   |   0   |   0   ||   1   |   0   |
	---------------------------------------------------------------------

check-lucene-core-uptodate:

jar-lucene-core:

check-backward-codecs-uptodate:

jar-backward-codecs:

check-analyzers-phonetic-uptodate:

jar-analyzers-phonetic:

check-analyzers-kuromoji-uptodate:

jar-analyzers-kuromoji:

check-codecs-uptodate:

jar-codecs:

check-expressions-uptodate:

jar-expressions:

check-suggest-uptodate:

jar-suggest:

check-highlighter-uptodate:

jar-highlighter:

check-memory-uptodate:

jar-memory:

check-misc-uptodate:

jar-misc:

check-spatial-extras-uptodate:

jar-spatial-extras:

check-spatial3d-uptodate:

jar-spatial3d:

check-grouping-uptodate:

jar-grouping:

check-queries-uptodate:

jar-queries:

check-queryparser-uptodate:

jar-queryparser:

check-join-uptodate:

jar-join:

check-sandbox-uptodate:

jar-sandbox:

check-classification-uptodate:

jar-classification:

prep-lucene-jars:

resolve-example:

ivy-availability-check:
[loadresource] Do not set property disallowed.ivy.jars.list as its length is 0.

-ivy-fail-disallowed-ivy-version:

ivy-fail:

ivy-configure:
[ivy:configure] :: loading settings :: file = C:\Users\jenkins\workspace\Lucene-Solr-master-Windows\lucene\top-level-ivy-settings.xml

resolve:

resolve-server:

ivy-availability-check:
[loadresource] Do not set property disallowed.ivy.jars.list as its length is 0.

-ivy-fail-disallowed-ivy-version:

ivy-fail:

ivy-fail:

ivy-configure:
[ivy:configure] :: loading settings :: file = C:\Users\jenkins\workspace\Lucene-Solr-master-Windows\lucene\top-level-ivy-settings.xml

resolve:

-check-git-state:

-git-cleanroot:

-copy-git-state:

git-autoclean:

ivy-fail:

resolve:

common.init:

compile-lucene-core:

-check-git-state:

-git-cleanroot:

-copy-git-state:

git-autoclean:

ivy-availability-check:
[loadresource] Do not set property disallowed.ivy.jars.list as its length is 0.

-ivy-fail-disallowed-ivy-version:

ivy-fail:

ivy-configure:
[ivy:configure] :: loading settings :: file = C:\Users\jenkins\workspace\Lucene-Solr-master-Windows\lucene\top-level-ivy-settings.xml

resolve:

init:

-clover.disable:

-clover.load:

-clover.classpath:

-clover.setup:

clover:

compile-core:

init:

-clover.disable:

-clover.load:

-clover.classpath:

-clover.setup:

clover:

common.compile-core:

compile-core:

ivy-availability-check:
[loadresource] Do not set property disallowed.ivy.jars.list as its length is 0.

-ivy-fail-disallowed-ivy-version:

ivy-fail:

ivy-configure:
[ivy:configure] :: loading settings :: file = C:\Users\jenkins\workspace\Lucene-Solr-master-Windows\lucene\top-level-ivy-settings.xml

resolve-groovy:
[ivy:cachepath] :: resolving dependencies :: org.codehaus.groovy#groovy-all-caller;working
[ivy:cachepath] 	confs: [default]
[ivy:cachepath] 	found org.codehaus.groovy#groovy-all;2.4.15 in public
[ivy:cachepath] :: resolution report :: resolve 7ms :: artifacts dl 0ms
	---------------------------------------------------------------------
	|                  |            modules            ||   artifacts   |
	|       conf       | number| search|dwnlded|evicted|| number|dwnlded|
	---------------------------------------------------------------------
	|      default     |   1   |   0   |   0   |   0   ||   1   |   0   |
	---------------------------------------------------------------------

check-lucene-core-uptodate:

jar-lucene-core:

check-backward-codecs-uptodate:

jar-backward-codecs:

check-analyzers-phonetic-uptodate:

jar-analyzers-phonetic:

check-analyzers-kuromoji-uptodate:

jar-analyzers-kuromoji:

check-codecs-uptodate:

jar-codecs:

check-expressions-uptodate:

jar-expressions:

check-suggest-uptodate:

jar-suggest:

check-highlighter-uptodate:

jar-highlighter:

check-memory-uptodate:

jar-memory:

check-misc-uptodate:

jar-misc:

check-spatial-extras-uptodate:

jar-spatial-extras:

check-spatial3d-uptodate:

jar-spatial3d:

check-grouping-uptodate:

jar-grouping:

check-queries-uptodate:

jar-queries:

check-queryparser-uptodate:

jar-queryparser:

check-join-uptodate:

jar-join:

check-sandbox-uptodate:

jar-sandbox:

check-classification-uptodate:

jar-classification:

prep-lucene-jars:

resolve-example:

ivy-availability-check:
[loadresource] Do not set property disallowed.ivy.jars.list as its length is 0.

-ivy-fail-disallowed-ivy-version:

ivy-fail:

ivy-configure:
[ivy:configure] :: loading settings :: file = C:\Users\jenkins\workspace\Lucene-Solr-master-Windows\lucene\top-level-ivy-settings.xml

resolve:

resolve-server:

ivy-availability-check:
[loadresource] Do not set property disallowed.ivy.jars.list as its length is 0.

-ivy-fail-disallowed-ivy-version:

ivy-fail:

ivy-fail:

ivy-configure:
[ivy:configure] :: loading settings :: file = C:\Users\jenkins\workspace\Lucene-Solr-master-Windows\lucene\top-level-ivy-settings.xml

resolve:

-check-git-state:

-git-cleanroot:

-copy-git-state:

git-autoclean:

ivy-fail:

resolve:

common.init:

compile-lucene-core:

-check-git-state:

-git-cleanroot:

-copy-git-state:

git-autoclean:

ivy-availability-check:
[loadresource] Do not set property disallowed.ivy.jars.list as its length is 0.

-ivy-fail-disallowed-ivy-version:

ivy-fail:

ivy-configure:
[ivy:configure] :: loading settings :: file = C:\Users\jenkins\workspace\Lucene-Solr-master-Windows\lucene\top-level-ivy-settings.xml

resolve:

init:

-clover.disable:

-clover.load:

-clover.classpath:

-clover.setup:

clover:

compile-core:

init:

-clover.disable:

-clover.load:

-clover.classpath:

-clover.setup:

clover:

common.compile-core:

common-solr.compile-core:

compile-core:

compile-test-framework:

compile-test-framework:

-check-git-state:

-git-cleanroot:

-copy-git-state:

git-autoclean:

ivy-availability-check:
[loadresource] Do not set property disallowed.ivy.jars.list as its length is 0.

-ivy-fail-disallowed-ivy-version:

ivy-fail:

ivy-configure:
[ivy:configure] :: loading settings :: file = C:\Users\jenkins\workspace\Lucene-Solr-master-Windows\lucene\top-level-ivy-settings.xml

resolve:

init:

compile-lucene-core:

-check-git-state:

-git-cleanroot:

-copy-git-state:

git-autoclean:

ivy-availability-check:
[loadresource] Do not set property disallowed.ivy.jars.list as its length is 0.

-ivy-fail-disallowed-ivy-version:

ivy-fail:

ivy-configure:
[ivy:configure] :: loading settings :: file = C:\Users\jenkins\workspace\Lucene-Solr-master-Windows\lucene\top-level-ivy-settings.xml

resolve:

init:

-clover.disable:

-clover.load:

-clover.classpath:

-clover.setup:

clover:

compile-core:

compile-codecs:

-check-git-state:

-git-cleanroot:

-copy-git-state:

git-autoclean:

ivy-availability-check:
[loadresource] Do not set property disallowed.ivy.jars.list as its length is 0.

-ivy-fail-disallowed-ivy-version:

ivy-fail:

ivy-configure:
[ivy:configure] :: loading settings :: file = C:\Users\jenkins\workspace\Lucene-Solr-master-Windows\lucene\top-level-ivy-settings.xml

resolve:

common.init:

compile-lucene-core:

init:

-clover.disable:

-clover.load:

-clover.classpath:

-clover.setup:

clover:

compile-core:

-clover.disable:

-clover.load:

-clover.classpath:

-clover.setup:

clover:

common.compile-core:

compile-core:

compile-core:

compile-solrj:

ivy-availability-check:
[loadresource] Do not set property disallowed.ivy.jars.list as its length is 0.

-ivy-fail-disallowed-ivy-version:

ivy-fail:

ivy-configure:
[ivy:configure] :: loading settings :: file = C:\Users\jenkins\workspace\Lucene-Solr-master-Windows\lucene\top-level-ivy-settings.xml

resolve-groovy:
[ivy:cachepath] :: resolving dependencies :: org.codehaus.groovy#groovy-all-caller;working
[ivy:cachepath] 	confs: [default]
[ivy:cachepath] 	found org.codehaus.groovy#groovy-all;2.4.15 in public
[ivy:cachepath] :: resolution report :: resolve 12ms :: artifacts dl 1ms
	---------------------------------------------------------------------
	|                  |            modules            ||   artifacts   |
	|       conf       | number| search|dwnlded|evicted|| number|dwnlded|
	---------------------------------------------------------------------
	

[...truncated too long message...]



-clover.classpath:

-clover.setup:

clover:

common.compile-core:

common-solr.compile-core:

compile-core:

compile-test-framework:

-check-git-state:

-git-cleanroot:

-copy-git-state:

git-autoclean:

ivy-availability-check:
[loadresource] Do not set property disallowed.ivy.jars.list as its length is 0.

-ivy-fail-disallowed-ivy-version:

ivy-fail:

ivy-configure:
[ivy:configure] :: loading settings :: file = C:\Users\jenkins\workspace\Lucene-Solr-master-Windows\lucene\top-level-ivy-settings.xml

resolve:

init:

compile-lucene-core:

compile-codecs:

-check-git-state:

-git-cleanroot:

-copy-git-state:

git-autoclean:

ivy-availability-check:
[loadresource] Do not set property disallowed.ivy.jars.list as its length is 0.

-ivy-fail-disallowed-ivy-version:

ivy-fail:

ivy-configure:
[ivy:configure] :: loading settings :: file = C:\Users\jenkins\workspace\Lucene-Solr-master-Windows\lucene\top-level-ivy-settings.xml

resolve:

common.init:

compile-lucene-core:

init:

-clover.disable:

-clover.load:

-clover.classpath:

-clover.setup:

clover:

compile-core:

-clover.disable:

-clover.load:

-clover.classpath:

-clover.setup:

clover:

common.compile-core:

compile-core:

common.compile-test:
    [mkdir] Created dir: C:\Users\jenkins\workspace\Lucene-Solr-master-Windows\solr\build\solr-core\classes\test
    [javac] Compiling 918 source files to C:\Users\jenkins\workspace\Lucene-Solr-master-Windows\solr\build\solr-core\classes\test
    [javac] Note: Some input files use or override a deprecated API.
    [javac] Note: Recompile with -Xlint:deprecation for details.
    [javac] Note: Some input files use unchecked or unsafe operations.
    [javac] Note: Recompile with -Xlint:unchecked for details.
    [javac] Creating empty C:\Users\jenkins\workspace\Lucene-Solr-master-Windows\solr\build\solr-core\classes\test\org\apache\solr\cloud\autoscaling\sim\package-info.class
     [copy] Copying 1 file to C:\Users\jenkins\workspace\Lucene-Solr-master-Windows\solr\build\solr-core\classes\test

common-solr.compile-test:

compile-test:

BUILD SUCCESSFUL
Total time: 1 minute 7 seconds
[repro] ant test-nocompile -Dtests.dups=5 -Dtests.maxfailures=5 -Dtests.class="*.ScheduledTriggerTest" -Dtests.showOutput=onerror "-Dargs=-XX:-UseCompressedOops -XX:+UseG1GC" -Dtests.seed=E484AD6D9171F191 -Dtests.slow=true -Dtests.locale=en-SZ -Dtests.timezone=Europe/Berlin -Dtests.asserts=true -Dtests.file.encoding=ISO-8859-1
Buildfile: C:\Users\jenkins\workspace\Lucene-Solr-master-Windows\solr\core\build.xml

-clover.disable:

ivy-configure:
[ivy:configure] :: Apache Ivy 2.4.0 - 20141213170938 :: http://ant.apache.org/ivy/ ::
[ivy:configure] :: loading settings :: file = C:\Users\jenkins\workspace\Lucene-Solr-master-Windows\lucene\top-level-ivy-settings.xml

install-junit4-taskdef:

ivy-availability-check:
[loadresource] Do not set property disallowed.ivy.jars.list as its length is 0.

-ivy-fail-disallowed-ivy-version:

ivy-fail:

resolve-groovy:
[ivy:cachepath] :: resolving dependencies :: org.codehaus.groovy#groovy-all-caller;working
[ivy:cachepath] 	confs: [default]
[ivy:cachepath] 	found org.codehaus.groovy#groovy-all;2.4.15 in public
[ivy:cachepath] :: resolution report :: resolve 31ms :: artifacts dl 11ms
	---------------------------------------------------------------------
	|                  |            modules            ||   artifacts   |
	|       conf       | number| search|dwnlded|evicted|| number|dwnlded|
	---------------------------------------------------------------------
	|      default     |   1   |   0   |   0   |   0   ||   1   |   0   |
	---------------------------------------------------------------------

-init-totals:

-test:
    [mkdir] Created dir: C:\Users\jenkins\workspace\Lucene-Solr-master-Windows\solr\build\solr-core\test
[junit4:pickseed] Seed property 'tests.seed' already defined: E484AD6D9171F191
    [mkdir] Created dir: C:\Users\jenkins\workspace\Lucene-Solr-master-Windows\solr\build\solr-core\test\temp
   [junit4] <JUnit4> says ??????! Master seed: E484AD6D9171F191
   [junit4] Your default console's encoding may not display certain unicode glyphs: windows-1252
   [junit4] Executing 5 suites with 2 JVMs.
   [junit4] 
   [junit4] Started J1 PID(34296@serv1-vm1).
   [junit4] Started J0 PID(17004@serv1-vm1).
   [junit4] Suite: org.apache.solr.cloud.autoscaling.ScheduledTriggerTest
   [junit4] OK      0.11s J0 | ScheduledTriggerTest.testIgnoredEvent
   [junit4] OK      18.0s J0 | ScheduledTriggerTest.testTrigger
   [junit4] Completed [1/5] on J0 in 38.38s, 2 tests
   [junit4] 
   [junit4] Suite: org.apache.solr.cloud.autoscaling.ScheduledTriggerTest
   [junit4] OK      0.11s J1 | ScheduledTriggerTest.testIgnoredEvent
   [junit4] OK      18.1s J1 | ScheduledTriggerTest.testTrigger
   [junit4] Completed [2/5] on J1 in 39.57s, 2 tests
   [junit4] 
   [junit4] Duplicate suite name used with XML reports: org.apache.solr.cloud.autoscaling.ScheduledTriggerTest. This may confuse tools that process XML reports. Set 'ignoreDuplicateSuites' to true to skip this message.
   [junit4] Suite: org.apache.solr.cloud.autoscaling.ScheduledTriggerTest
   [junit4] OK      0.07s J0 | ScheduledTriggerTest.testIgnoredEvent
   [junit4] OK      18.0s J0 | ScheduledTriggerTest.testTrigger
   [junit4] Completed [3/5] on J0 in 21.13s, 2 tests
   [junit4] 
   [junit4] Suite: org.apache.solr.cloud.autoscaling.ScheduledTriggerTest
   [junit4] OK      0.01s J1 | ScheduledTriggerTest.testIgnoredEvent
   [junit4] OK      18.0s J1 | ScheduledTriggerTest.testTrigger
   [junit4] Completed [4/5] on J1 in 20.67s, 2 tests
   [junit4] 
   [junit4] Suite: org.apache.solr.cloud.autoscaling.ScheduledTriggerTest
   [junit4] OK      0.02s J0 | ScheduledTriggerTest.testIgnoredEvent
   [junit4] OK      18.0s J0 | ScheduledTriggerTest.testTrigger
   [junit4] Completed [5/5] on J0 in 19.59s, 2 tests
   [junit4] 
   [junit4] JVM J0:     2.02 ..    82.08 =    80.07s
   [junit4] JVM J1:     1.98 ..    63.20 =    61.22s
   [junit4] Execution time total: 1 minute 22 seconds
   [junit4] Tests summary: 5 suites, 10 tests
   [junit4] Could not remove temporary path: C:\Users\jenkins\workspace\Lucene-Solr-master-Windows\solr\build\solr-core\test\J1 (java.nio.file.DirectoryNotEmptyException: Remaining files: [C:\Users\jenkins\workspace\Lucene-Solr-master-Windows\solr\build\solr-core\test\J1\temp])
   [junit4] Could not remove temporary path: C:\Users\jenkins\workspace\Lucene-Solr-master-Windows\solr\build\solr-core\test\J0 (java.nio.file.DirectoryNotEmptyException: Remaining files: [C:\Users\jenkins\workspace\Lucene-Solr-master-Windows\solr\build\solr-core\test\J0\temp])
     [echo] 5 slowest tests:
[junit4:tophints] 227.03s | org.apache.solr.cloud.TestPullReplicaErrorHandling
[junit4:tophints] 121.54s | org.apache.solr.cloud.ZkFailoverTest
[junit4:tophints] 120.47s | org.apache.solr.cloud.ReplicationFactorTest
[junit4:tophints] 111.56s | org.apache.solr.search.facet.SpatialHeatmapFacetsTest
[junit4:tophints] 108.76s | org.apache.solr.cloud.TestTlogReplica

-check-totals:
WARNING: An illegal reflective access operation has occurred
WARNING: Illegal reflective access by org.codehaus.groovy.reflection.CachedClass (file:/C:/Users/jenkins/.ivy2/cache/org.codehaus.groovy/groovy-all/jars/groovy-all-2.4.15.jar) to method java.lang.Object.finalize()
WARNING: Please consider reporting this to the maintainers of org.codehaus.groovy.reflection.CachedClass
WARNING: Use --illegal-access=warn to enable warnings of further illegal reflective access operations
WARNING: All illegal access operations will be denied in a future release

test-nocompile:

BUILD SUCCESSFUL
Total time: 1 minute 29 seconds
[repro] Failures:
[repro]   0/5 failed: org.apache.solr.cloud.autoscaling.ScheduledTriggerTest
[repro]   2/5 failed: org.apache.solr.common.util.TestTimeSource
[repro] Exiting with code 1

C:\Users\jenkins\workspace\Lucene-Solr-master-Windows>IF EXIST lucene\build move /y lucene\build lucene\build.repro 
        1 dir(s) moved.

C:\Users\jenkins\workspace\Lucene-Solr-master-Windows>IF EXIST solr\build move /y solr\build solr\build.repro 
        1 dir(s) moved.

C:\Users\jenkins\workspace\Lucene-Solr-master-Windows>IF EXIST lucene\build.orig move /y lucene\build.orig lucene\build 
        1 dir(s) moved.

C:\Users\jenkins\workspace\Lucene-Solr-master-Windows>IF EXIST solr\build.orig move /y solr\build.orig solr\build 
        1 dir(s) moved.

C:\Users\jenkins\workspace\Lucene-Solr-master-Windows>exit 0 
Archiving artifacts
Setting ANT_1_8_2_HOME=C:\Users\jenkins\tools\hudson.tasks.Ant_AntInstallation\ANT_1.8.2
[WARNINGS] Parsing warnings in console log with parser Java Compiler (javac)
Setting ANT_1_8_2_HOME=C:\Users\jenkins\tools\hudson.tasks.Ant_AntInstallation\ANT_1.8.2
Setting ANT_1_8_2_HOME=C:\Users\jenkins\tools\hudson.tasks.Ant_AntInstallation\ANT_1.8.2
<Git Blamer> Using GitBlamer to create author and commit information for all warnings.
<Git Blamer> GIT_COMMIT=a929003f5b2792dedef6563203a86b99ac54e5df, workspace=C:\Users\jenkins\workspace\Lucene-Solr-master-Windows
[WARNINGS] Computing warning deltas based on reference build #7382
Recording test results
Setting ANT_1_8_2_HOME=C:\Users\jenkins\tools\hudson.tasks.Ant_AntInstallation\ANT_1.8.2
Build step 'Publish JUnit test result report' changed build result to UNSTABLE
Email was triggered for: Unstable (Test Failures)
Sending email for trigger: Unstable (Test Failures)
Setting ANT_1_8_2_HOME=C:\Users\jenkins\tools\hudson.tasks.Ant_AntInstallation\ANT_1.8.2
Setting ANT_1_8_2_HOME=C:\Users\jenkins\tools\hudson.tasks.Ant_AntInstallation\ANT_1.8.2
Setting ANT_1_8_2_HOME=C:\Users\jenkins\tools\hudson.tasks.Ant_AntInstallation\ANT_1.8.2
Setting ANT_1_8_2_HOME=C:\Users\jenkins\tools\hudson.tasks.Ant_AntInstallation\ANT_1.8.2

Mime
View raw message