lucene-dev mailing list archives

Site index · List index
Message view « Date » · « Thread »
Top « Date » · « Thread »
From Apache Jenkins Server <jenk...@builds.apache.org>
Subject [JENKINS] Lucene-Solr-Tests-7.x - Build # 647 - Still Unstable
Date Wed, 20 Jun 2018 00:12:05 GMT
Build: https://builds.apache.org/job/Lucene-Solr-Tests-7.x/647/

1 tests failed.
FAILED:  junit.framework.TestSuite.org.apache.solr.update.MaxSizeAutoCommitTest

Error Message:
ObjectTracker found 1 object(s) that were not released!!! [TransactionLog] org.apache.solr.common.util.ObjectReleaseTracker$ObjectTrackerException: org.apache.solr.update.TransactionLog  at org.apache.solr.common.util.ObjectReleaseTracker.track(ObjectReleaseTracker.java:42)  at org.apache.solr.update.TransactionLog.<init>(TransactionLog.java:187)  at org.apache.solr.update.UpdateLog.newTransactionLog(UpdateLog.java:466)  at org.apache.solr.update.UpdateLog.ensureLog(UpdateLog.java:1321)  at org.apache.solr.update.UpdateLog.add(UpdateLog.java:570)  at org.apache.solr.update.UpdateLog.add(UpdateLog.java:550)  at org.apache.solr.update.DirectUpdateHandler2.doNormalUpdate(DirectUpdateHandler2.java:345)  at org.apache.solr.update.DirectUpdateHandler2.addDoc0(DirectUpdateHandler2.java:283)  at org.apache.solr.update.DirectUpdateHandler2.addDoc(DirectUpdateHandler2.java:233)  at org.apache.solr.update.processor.RunUpdateProcessor.processAdd(RunUpdateProcessorFactory.java:67)  at org.apache.solr.update.processor.UpdateRequestProcessor.processAdd(UpdateRequestProcessor.java:55)  at org.apache.solr.update.processor.DistributedUpdateProcessor.doLocalAdd(DistributedUpdateProcessor.java:950)  at org.apache.solr.update.processor.DistributedUpdateProcessor.versionAdd(DistributedUpdateProcessor.java:1168)  at org.apache.solr.update.processor.DistributedUpdateProcessor.processAdd(DistributedUpdateProcessor.java:633)  at org.apache.solr.update.processor.LogUpdateProcessorFactory$LogUpdateProcessor.processAdd(LogUpdateProcessorFactory.java:103)  at org.apache.solr.handler.loader.XMLLoader.processUpdate(XMLLoader.java:261)  at org.apache.solr.handler.loader.XMLLoader.load(XMLLoader.java:188)  at org.apache.solr.handler.UpdateRequestHandler$1.load(UpdateRequestHandler.java:97)  at org.apache.solr.handler.ContentStreamHandlerBase.handleRequestBody(ContentStreamHandlerBase.java:68)  at org.apache.solr.handler.RequestHandlerBase.handleRequest(RequestHandlerBase.java:199)  at org.apache.solr.update.MaxSizeAutoCommitTest.simpleTest(MaxSizeAutoCommitTest.java:106)  at sun.reflect.NativeMethodAccessorImpl.invoke0(Native Method)  at sun.reflect.NativeMethodAccessorImpl.invoke(NativeMethodAccessorImpl.java:62)  at sun.reflect.DelegatingMethodAccessorImpl.invoke(DelegatingMethodAccessorImpl.java:43)  at java.lang.reflect.Method.invoke(Method.java:498)  at com.carrotsearch.randomizedtesting.RandomizedRunner.invoke(RandomizedRunner.java:1737)  at com.carrotsearch.randomizedtesting.RandomizedRunner$8.evaluate(RandomizedRunner.java:934)  at com.carrotsearch.randomizedtesting.RandomizedRunner$9.evaluate(RandomizedRunner.java:970)  at com.carrotsearch.randomizedtesting.RandomizedRunner$10.evaluate(RandomizedRunner.java:984)  at com.carrotsearch.randomizedtesting.rules.SystemPropertiesRestoreRule$1.evaluate(SystemPropertiesRestoreRule.java:57)  at org.apache.lucene.util.TestRuleSetupTeardownChained$1.evaluate(TestRuleSetupTeardownChained.java:49)  at org.apache.lucene.util.AbstractBeforeAfterRule$1.evaluate(AbstractBeforeAfterRule.java:45)  at org.apache.lucene.util.TestRuleThreadAndTestName$1.evaluate(TestRuleThreadAndTestName.java:48)  at org.apache.lucene.util.TestRuleIgnoreAfterMaxFailures$1.evaluate(TestRuleIgnoreAfterMaxFailures.java:64)  at org.apache.lucene.util.TestRuleMarkFailure$1.evaluate(TestRuleMarkFailure.java:47)  at com.carrotsearch.randomizedtesting.rules.StatementAdapter.evaluate(StatementAdapter.java:36)  at com.carrotsearch.randomizedtesting.ThreadLeakControl$StatementRunner.run(ThreadLeakControl.java:368)  at com.carrotsearch.randomizedtesting.ThreadLeakControl.forkTimeoutingTask(ThreadLeakControl.java:817)  at com.carrotsearch.randomizedtesting.ThreadLeakControl$3.evaluate(ThreadLeakControl.java:468)  at com.carrotsearch.randomizedtesting.RandomizedRunner.runSingleTest(RandomizedRunner.java:943)  at com.carrotsearch.randomizedtesting.RandomizedRunner$5.evaluate(RandomizedRunner.java:829)  at com.carrotsearch.randomizedtesting.RandomizedRunner$6.evaluate(RandomizedRunner.java:879)  at com.carrotsearch.randomizedtesting.RandomizedRunner$7.evaluate(RandomizedRunner.java:890)  at com.carrotsearch.randomizedtesting.rules.StatementAdapter.evaluate(StatementAdapter.java:36)  at com.carrotsearch.randomizedtesting.rules.SystemPropertiesRestoreRule$1.evaluate(SystemPropertiesRestoreRule.java:57)  at org.apache.lucene.util.AbstractBeforeAfterRule$1.evaluate(AbstractBeforeAfterRule.java:45)  at com.carrotsearch.randomizedtesting.rules.StatementAdapter.evaluate(StatementAdapter.java:36)  at org.apache.lucene.util.TestRuleStoreClassName$1.evaluate(TestRuleStoreClassName.java:41)  at com.carrotsearch.randomizedtesting.rules.NoShadowingOrOverridesOnMethodsRule$1.evaluate(NoShadowingOrOverridesOnMethodsRule.java:40)  at com.carrotsearch.randomizedtesting.rules.NoShadowingOrOverridesOnMethodsRule$1.evaluate(NoShadowingOrOverridesOnMethodsRule.java:40)  at com.carrotsearch.randomizedtesting.rules.StatementAdapter.evaluate(StatementAdapter.java:36)  at com.carrotsearch.randomizedtesting.rules.StatementAdapter.evaluate(StatementAdapter.java:36)  at com.carrotsearch.randomizedtesting.rules.StatementAdapter.evaluate(StatementAdapter.java:36)  at org.apache.lucene.util.TestRuleAssertionsRequired$1.evaluate(TestRuleAssertionsRequired.java:53)  at org.apache.lucene.util.TestRuleMarkFailure$1.evaluate(TestRuleMarkFailure.java:47)  at org.apache.lucene.util.TestRuleIgnoreAfterMaxFailures$1.evaluate(TestRuleIgnoreAfterMaxFailures.java:64)  at org.apache.lucene.util.TestRuleIgnoreTestSuites$1.evaluate(TestRuleIgnoreTestSuites.java:54)  at com.carrotsearch.randomizedtesting.rules.StatementAdapter.evaluate(StatementAdapter.java:36)  at com.carrotsearch.randomizedtesting.ThreadLeakControl$StatementRunner.run(ThreadLeakControl.java:368)  at java.lang.Thread.run(Thread.java:748)  

Stack Trace:
java.lang.AssertionError: ObjectTracker found 1 object(s) that were not released!!! [TransactionLog]
org.apache.solr.common.util.ObjectReleaseTracker$ObjectTrackerException: org.apache.solr.update.TransactionLog
	at org.apache.solr.common.util.ObjectReleaseTracker.track(ObjectReleaseTracker.java:42)
	at org.apache.solr.update.TransactionLog.<init>(TransactionLog.java:187)
	at org.apache.solr.update.UpdateLog.newTransactionLog(UpdateLog.java:466)
	at org.apache.solr.update.UpdateLog.ensureLog(UpdateLog.java:1321)
	at org.apache.solr.update.UpdateLog.add(UpdateLog.java:570)
	at org.apache.solr.update.UpdateLog.add(UpdateLog.java:550)
	at org.apache.solr.update.DirectUpdateHandler2.doNormalUpdate(DirectUpdateHandler2.java:345)
	at org.apache.solr.update.DirectUpdateHandler2.addDoc0(DirectUpdateHandler2.java:283)
	at org.apache.solr.update.DirectUpdateHandler2.addDoc(DirectUpdateHandler2.java:233)
	at org.apache.solr.update.processor.RunUpdateProcessor.processAdd(RunUpdateProcessorFactory.java:67)
	at org.apache.solr.update.processor.UpdateRequestProcessor.processAdd(UpdateRequestProcessor.java:55)
	at org.apache.solr.update.processor.DistributedUpdateProcessor.doLocalAdd(DistributedUpdateProcessor.java:950)
	at org.apache.solr.update.processor.DistributedUpdateProcessor.versionAdd(DistributedUpdateProcessor.java:1168)
	at org.apache.solr.update.processor.DistributedUpdateProcessor.processAdd(DistributedUpdateProcessor.java:633)
	at org.apache.solr.update.processor.LogUpdateProcessorFactory$LogUpdateProcessor.processAdd(LogUpdateProcessorFactory.java:103)
	at org.apache.solr.handler.loader.XMLLoader.processUpdate(XMLLoader.java:261)
	at org.apache.solr.handler.loader.XMLLoader.load(XMLLoader.java:188)
	at org.apache.solr.handler.UpdateRequestHandler$1.load(UpdateRequestHandler.java:97)
	at org.apache.solr.handler.ContentStreamHandlerBase.handleRequestBody(ContentStreamHandlerBase.java:68)
	at org.apache.solr.handler.RequestHandlerBase.handleRequest(RequestHandlerBase.java:199)
	at org.apache.solr.update.MaxSizeAutoCommitTest.simpleTest(MaxSizeAutoCommitTest.java:106)
	at sun.reflect.NativeMethodAccessorImpl.invoke0(Native Method)
	at sun.reflect.NativeMethodAccessorImpl.invoke(NativeMethodAccessorImpl.java:62)
	at sun.reflect.DelegatingMethodAccessorImpl.invoke(DelegatingMethodAccessorImpl.java:43)
	at java.lang.reflect.Method.invoke(Method.java:498)
	at com.carrotsearch.randomizedtesting.RandomizedRunner.invoke(RandomizedRunner.java:1737)
	at com.carrotsearch.randomizedtesting.RandomizedRunner$8.evaluate(RandomizedRunner.java:934)
	at com.carrotsearch.randomizedtesting.RandomizedRunner$9.evaluate(RandomizedRunner.java:970)
	at com.carrotsearch.randomizedtesting.RandomizedRunner$10.evaluate(RandomizedRunner.java:984)
	at com.carrotsearch.randomizedtesting.rules.SystemPropertiesRestoreRule$1.evaluate(SystemPropertiesRestoreRule.java:57)
	at org.apache.lucene.util.TestRuleSetupTeardownChained$1.evaluate(TestRuleSetupTeardownChained.java:49)
	at org.apache.lucene.util.AbstractBeforeAfterRule$1.evaluate(AbstractBeforeAfterRule.java:45)
	at org.apache.lucene.util.TestRuleThreadAndTestName$1.evaluate(TestRuleThreadAndTestName.java:48)
	at org.apache.lucene.util.TestRuleIgnoreAfterMaxFailures$1.evaluate(TestRuleIgnoreAfterMaxFailures.java:64)
	at org.apache.lucene.util.TestRuleMarkFailure$1.evaluate(TestRuleMarkFailure.java:47)
	at com.carrotsearch.randomizedtesting.rules.StatementAdapter.evaluate(StatementAdapter.java:36)
	at com.carrotsearch.randomizedtesting.ThreadLeakControl$StatementRunner.run(ThreadLeakControl.java:368)
	at com.carrotsearch.randomizedtesting.ThreadLeakControl.forkTimeoutingTask(ThreadLeakControl.java:817)
	at com.carrotsearch.randomizedtesting.ThreadLeakControl$3.evaluate(ThreadLeakControl.java:468)
	at com.carrotsearch.randomizedtesting.RandomizedRunner.runSingleTest(RandomizedRunner.java:943)
	at com.carrotsearch.randomizedtesting.RandomizedRunner$5.evaluate(RandomizedRunner.java:829)
	at com.carrotsearch.randomizedtesting.RandomizedRunner$6.evaluate(RandomizedRunner.java:879)
	at com.carrotsearch.randomizedtesting.RandomizedRunner$7.evaluate(RandomizedRunner.java:890)
	at com.carrotsearch.randomizedtesting.rules.StatementAdapter.evaluate(StatementAdapter.java:36)
	at com.carrotsearch.randomizedtesting.rules.SystemPropertiesRestoreRule$1.evaluate(SystemPropertiesRestoreRule.java:57)
	at org.apache.lucene.util.AbstractBeforeAfterRule$1.evaluate(AbstractBeforeAfterRule.java:45)
	at com.carrotsearch.randomizedtesting.rules.StatementAdapter.evaluate(StatementAdapter.java:36)
	at org.apache.lucene.util.TestRuleStoreClassName$1.evaluate(TestRuleStoreClassName.java:41)
	at com.carrotsearch.randomizedtesting.rules.NoShadowingOrOverridesOnMethodsRule$1.evaluate(NoShadowingOrOverridesOnMethodsRule.java:40)
	at com.carrotsearch.randomizedtesting.rules.NoShadowingOrOverridesOnMethodsRule$1.evaluate(NoShadowingOrOverridesOnMethodsRule.java:40)
	at com.carrotsearch.randomizedtesting.rules.StatementAdapter.evaluate(StatementAdapter.java:36)
	at com.carrotsearch.randomizedtesting.rules.StatementAdapter.evaluate(StatementAdapter.java:36)
	at com.carrotsearch.randomizedtesting.rules.StatementAdapter.evaluate(StatementAdapter.java:36)
	at org.apache.lucene.util.TestRuleAssertionsRequired$1.evaluate(TestRuleAssertionsRequired.java:53)
	at org.apache.lucene.util.TestRuleMarkFailure$1.evaluate(TestRuleMarkFailure.java:47)
	at org.apache.lucene.util.TestRuleIgnoreAfterMaxFailures$1.evaluate(TestRuleIgnoreAfterMaxFailures.java:64)
	at org.apache.lucene.util.TestRuleIgnoreTestSuites$1.evaluate(TestRuleIgnoreTestSuites.java:54)
	at com.carrotsearch.randomizedtesting.rules.StatementAdapter.evaluate(StatementAdapter.java:36)
	at com.carrotsearch.randomizedtesting.ThreadLeakControl$StatementRunner.run(ThreadLeakControl.java:368)
	at java.lang.Thread.run(Thread.java:748)


	at __randomizedtesting.SeedInfo.seed([80129DF59B5CC3E9]:0)
	at org.junit.Assert.fail(Assert.java:93)
	at org.junit.Assert.assertTrue(Assert.java:43)
	at org.junit.Assert.assertNull(Assert.java:551)
	at org.apache.solr.SolrTestCaseJ4.teardownTestCases(SolrTestCaseJ4.java:304)
	at sun.reflect.NativeMethodAccessorImpl.invoke0(Native Method)
	at sun.reflect.NativeMethodAccessorImpl.invoke(NativeMethodAccessorImpl.java:62)
	at sun.reflect.DelegatingMethodAccessorImpl.invoke(DelegatingMethodAccessorImpl.java:43)
	at java.lang.reflect.Method.invoke(Method.java:498)
	at com.carrotsearch.randomizedtesting.RandomizedRunner.invoke(RandomizedRunner.java:1737)
	at com.carrotsearch.randomizedtesting.RandomizedRunner$7.evaluate(RandomizedRunner.java:897)
	at com.carrotsearch.randomizedtesting.rules.StatementAdapter.evaluate(StatementAdapter.java:36)
	at com.carrotsearch.randomizedtesting.rules.SystemPropertiesRestoreRule$1.evaluate(SystemPropertiesRestoreRule.java:57)
	at org.apache.lucene.util.AbstractBeforeAfterRule$1.evaluate(AbstractBeforeAfterRule.java:45)
	at com.carrotsearch.randomizedtesting.rules.StatementAdapter.evaluate(StatementAdapter.java:36)
	at org.apache.lucene.util.TestRuleStoreClassName$1.evaluate(TestRuleStoreClassName.java:41)
	at com.carrotsearch.randomizedtesting.rules.NoShadowingOrOverridesOnMethodsRule$1.evaluate(NoShadowingOrOverridesOnMethodsRule.java:40)
	at com.carrotsearch.randomizedtesting.rules.NoShadowingOrOverridesOnMethodsRule$1.evaluate(NoShadowingOrOverridesOnMethodsRule.java:40)
	at com.carrotsearch.randomizedtesting.rules.StatementAdapter.evaluate(StatementAdapter.java:36)
	at com.carrotsearch.randomizedtesting.rules.StatementAdapter.evaluate(StatementAdapter.java:36)
	at com.carrotsearch.randomizedtesting.rules.StatementAdapter.evaluate(StatementAdapter.java:36)
	at org.apache.lucene.util.TestRuleAssertionsRequired$1.evaluate(TestRuleAssertionsRequired.java:53)
	at org.apache.lucene.util.TestRuleMarkFailure$1.evaluate(TestRuleMarkFailure.java:47)
	at org.apache.lucene.util.TestRuleIgnoreAfterMaxFailures$1.evaluate(TestRuleIgnoreAfterMaxFailures.java:64)
	at org.apache.lucene.util.TestRuleIgnoreTestSuites$1.evaluate(TestRuleIgnoreTestSuites.java:54)
	at com.carrotsearch.randomizedtesting.rules.StatementAdapter.evaluate(StatementAdapter.java:36)
	at com.carrotsearch.randomizedtesting.ThreadLeakControl$StatementRunner.run(ThreadLeakControl.java:368)
	at java.lang.Thread.run(Thread.java:748)




Build Log:
[...truncated 12604 lines...]
   [junit4] Suite: org.apache.solr.update.MaxSizeAutoCommitTest
   [junit4]   2> Creating dataDir: /home/jenkins/jenkins-slave/workspace/Lucene-Solr-Tests-7.x/solr/build/solr-core/test/J2/temp/solr.update.MaxSizeAutoCommitTest_80129DF59B5CC3E9-001/init-core-data-001
   [junit4]   2> 394468 WARN  (SUITE-MaxSizeAutoCommitTest-seed#[80129DF59B5CC3E9]-worker) [    ] o.a.s.SolrTestCaseJ4 startTrackingSearchers: numOpens=9 numCloses=9
   [junit4]   2> 394512 INFO  (SUITE-MaxSizeAutoCommitTest-seed#[80129DF59B5CC3E9]-worker) [    ] o.a.s.SolrTestCaseJ4 Using TrieFields (NUMERIC_POINTS_SYSPROP=false) w/NUMERIC_DOCVALUES_SYSPROP=true
   [junit4]   2> 394530 INFO  (SUITE-MaxSizeAutoCommitTest-seed#[80129DF59B5CC3E9]-worker) [    ] o.a.s.SolrTestCaseJ4 Randomized ssl (true) and clientAuth (false) via: @org.apache.solr.util.RandomizeSSL(reason=, ssl=NaN, value=NaN, clientAuth=NaN)
   [junit4]   2> 394530 INFO  (SUITE-MaxSizeAutoCommitTest-seed#[80129DF59B5CC3E9]-worker) [    ] o.a.s.SolrTestCaseJ4 SecureRandom sanity checks: test.solr.allowed.securerandom=null & java.security.egd=file:/dev/./urandom
   [junit4] IGNOR/A 0.00s J2 | MaxSizeAutoCommitTest.endToEndTest {seed=[80129DF59B5CC3E9:9A44F2C37BEEE4EB]}
   [junit4]    > Assumption #1: 'badapple' test group is disabled (@BadApple(bugUrl=https://issues.apache.org/jira/browse/SOLR-12028))
   [junit4] IGNOR/A 0.00s J2 | MaxSizeAutoCommitTest.endToEndTest {seed=[80129DF59B5CC3E9:2E124E3F4F2C2FC7]}
   [junit4]    > Assumption #1: 'badapple' test group is disabled (@BadApple(bugUrl=https://issues.apache.org/jira/browse/SOLR-12028))
   [junit4] IGNOR/A 0.00s J2 | MaxSizeAutoCommitTest.endToEndTest {seed=[80129DF59B5CC3E9:A0FBD8E31EE8670C]}
   [junit4]    > Assumption #1: 'badapple' test group is disabled (@BadApple(bugUrl=https://issues.apache.org/jira/browse/SOLR-12028))
   [junit4] IGNOR/A 0.00s J2 | MaxSizeAutoCommitTest.endToEndTest {seed=[80129DF59B5CC3E9:9115730672163C25]}
   [junit4]    > Assumption #1: 'badapple' test group is disabled (@BadApple(bugUrl=https://issues.apache.org/jira/browse/SOLR-12028))
   [junit4] IGNOR/A 0.00s J2 | MaxSizeAutoCommitTest.endToEndTest {seed=[80129DF59B5CC3E9:DDD4F6ABD31EFC9E]}
   [junit4]    > Assumption #1: 'badapple' test group is disabled (@BadApple(bugUrl=https://issues.apache.org/jira/browse/SOLR-12028))
   [junit4]   2> 394547 INFO  (TEST-MaxSizeAutoCommitTest.simpleTest-seed#[80129DF59B5CC3E9]) [    ] o.a.s.SolrTestCaseJ4 ###Starting simpleTest
   [junit4]   2> 397536 INFO  (TEST-MaxSizeAutoCommitTest.simpleTest-seed#[80129DF59B5CC3E9]) [    ] o.a.s.SolrTestCaseJ4 ####initCore
   [junit4]   2> 397537 INFO  (TEST-MaxSizeAutoCommitTest.simpleTest-seed#[80129DF59B5CC3E9]) [    ] o.a.s.c.SolrResourceLoader [null] Added 2 libs to classloader, from paths: [/home/jenkins/jenkins-slave/workspace/Lucene-Solr-Tests-7.x/solr/core/src/test-files/solr/collection1/lib, /home/jenkins/jenkins-slave/workspace/Lucene-Solr-Tests-7.x/solr/core/src/test-files/solr/collection1/lib/classes]
   [junit4]   2> 397810 INFO  (TEST-MaxSizeAutoCommitTest.simpleTest-seed#[80129DF59B5CC3E9]) [    ] o.a.s.c.SolrConfig Using Lucene MatchVersion: 7.5.0
   [junit4]   2> 397959 INFO  (TEST-MaxSizeAutoCommitTest.simpleTest-seed#[80129DF59B5CC3E9]) [    ] o.a.s.s.IndexSchema [null] Schema name=test
   [junit4]   2> 398690 INFO  (TEST-MaxSizeAutoCommitTest.simpleTest-seed#[80129DF59B5CC3E9]) [    ] o.a.s.s.IndexSchema Loaded schema test/1.0 with uniqueid field id
   [junit4]   2> 399578 INFO  (TEST-MaxSizeAutoCommitTest.simpleTest-seed#[80129DF59B5CC3E9]) [    ] o.a.s.c.TransientSolrCoreCacheDefault Allocating transient cache for 2147483647 transient cores
   [junit4]   2> 399578 INFO  (TEST-MaxSizeAutoCommitTest.simpleTest-seed#[80129DF59B5CC3E9]) [    ] o.a.s.h.a.MetricsHistoryHandler No .system collection, keeping metrics history in memory.
   [junit4]   2> 399705 INFO  (TEST-MaxSizeAutoCommitTest.simpleTest-seed#[80129DF59B5CC3E9]) [    ] o.a.s.m.r.SolrJmxReporter JMX monitoring for 'solr.node' (registry 'solr.node') enabled at server: com.sun.jmx.mbeanserver.JmxMBeanServer@34ae4f9
   [junit4]   2> 399792 INFO  (TEST-MaxSizeAutoCommitTest.simpleTest-seed#[80129DF59B5CC3E9]) [    ] o.a.s.m.r.SolrJmxReporter JMX monitoring for 'solr.jvm' (registry 'solr.jvm') enabled at server: com.sun.jmx.mbeanserver.JmxMBeanServer@34ae4f9
   [junit4]   2> 399793 INFO  (TEST-MaxSizeAutoCommitTest.simpleTest-seed#[80129DF59B5CC3E9]) [    ] o.a.s.m.r.SolrJmxReporter JMX monitoring for 'solr.jetty' (registry 'solr.jetty') enabled at server: com.sun.jmx.mbeanserver.JmxMBeanServer@34ae4f9
   [junit4]   2> 399830 INFO  (coreLoadExecutor-604-thread-1) [    x:collection1] o.a.s.c.SolrResourceLoader [null] Added 2 libs to classloader, from paths: [/home/jenkins/jenkins-slave/workspace/Lucene-Solr-Tests-7.x/solr/core/src/test-files/solr/collection1/lib, /home/jenkins/jenkins-slave/workspace/Lucene-Solr-Tests-7.x/solr/core/src/test-files/solr/collection1/lib/classes]
   [junit4]   2> 400129 INFO  (coreLoadExecutor-604-thread-1) [    x:collection1] o.a.s.c.SolrConfig Using Lucene MatchVersion: 7.5.0
   [junit4]   2> 400233 INFO  (coreLoadExecutor-604-thread-1) [    x:collection1] o.a.s.s.IndexSchema [collection1] Schema name=test
   [junit4]   2> 400958 INFO  (coreLoadExecutor-604-thread-1) [    x:collection1] o.a.s.s.IndexSchema Loaded schema test/1.0 with uniqueid field id
   [junit4]   2> 401032 INFO  (coreLoadExecutor-604-thread-1) [    x:collection1] o.a.s.c.CoreContainer Creating SolrCore 'collection1' using configuration from instancedir /home/jenkins/jenkins-slave/workspace/Lucene-Solr-Tests-7.x/solr/core/src/test-files/solr/collection1, trusted=true
   [junit4]   2> 401046 INFO  (coreLoadExecutor-604-thread-1) [    x:collection1] o.a.s.m.r.SolrJmxReporter JMX monitoring for 'solr.core.collection1' (registry 'solr.core.collection1') enabled at server: com.sun.jmx.mbeanserver.JmxMBeanServer@34ae4f9
   [junit4]   2> 401046 INFO  (coreLoadExecutor-604-thread-1) [    x:collection1] o.a.s.c.SolrCore solr.RecoveryStrategy.Builder
   [junit4]   2> 401046 INFO  (coreLoadExecutor-604-thread-1) [    x:collection1] o.a.s.c.SolrCore [[collection1] ] Opening new SolrCore at [/home/jenkins/jenkins-slave/workspace/Lucene-Solr-Tests-7.x/solr/core/src/test-files/solr/collection1], dataDir=[/home/jenkins/jenkins-slave/workspace/Lucene-Solr-Tests-7.x/solr/build/solr-core/test/J2/temp/solr.update.MaxSizeAutoCommitTest_80129DF59B5CC3E9-001/init-core-data-001/]
   [junit4]   2> 401048 INFO  (coreLoadExecutor-604-thread-1) [    x:collection1] o.a.s.u.RandomMergePolicy RandomMergePolicy wrapping class org.apache.lucene.index.LogDocMergePolicy: [LogDocMergePolicy: minMergeSize=1000, mergeFactor=24, maxMergeSize=9223372036854775807, maxMergeSizeForForcedMerge=9223372036854775807, calibrateSizeByDeletes=false, maxMergeDocs=2147483647, maxCFSSegmentSizeMB=8.796093022207999E12, noCFSRatio=0.0]
   [junit4]   2> 401140 WARN  (coreLoadExecutor-604-thread-1) [    x:collection1] o.a.s.c.RequestHandlers INVALID paramSet a in requestHandler {type = requestHandler,name = /dump,class = DumpRequestHandler,attributes = {initParams=a, name=/dump, class=DumpRequestHandler},args = {defaults={a=A,b=B}}}
   [junit4]   2> 401466 INFO  (coreLoadExecutor-604-thread-1) [    x:collection1] o.a.s.u.UpdateHandler Using UpdateLog implementation: org.apache.solr.update.UpdateLog
   [junit4]   2> 401466 INFO  (coreLoadExecutor-604-thread-1) [    x:collection1] o.a.s.u.UpdateLog Initializing UpdateLog: dataDir= defaultSyncLevel=FLUSH numRecordsToKeep=100 maxNumLogsToKeep=10 numVersionBuckets=65536
   [junit4]   2> 401515 INFO  (coreLoadExecutor-604-thread-1) [    x:collection1] o.a.s.u.CommitTracker Hard AutoCommit: disabled
   [junit4]   2> 401515 INFO  (coreLoadExecutor-604-thread-1) [    x:collection1] o.a.s.u.CommitTracker Soft AutoCommit: disabled
   [junit4]   2> 401549 INFO  (coreLoadExecutor-604-thread-1) [    x:collection1] o.a.s.u.RandomMergePolicy RandomMergePolicy wrapping class org.apache.lucene.index.LogDocMergePolicy: [LogDocMergePolicy: minMergeSize=1000, mergeFactor=28, maxMergeSize=9223372036854775807, maxMergeSizeForForcedMerge=9223372036854775807, calibrateSizeByDeletes=true, maxMergeDocs=2147483647, maxCFSSegmentSizeMB=8.796093022207999E12, noCFSRatio=0.16912734590659362]
   [junit4]   2> 401550 INFO  (coreLoadExecutor-604-thread-1) [    x:collection1] o.a.s.s.SolrIndexSearcher Opening [Searcher@3b3d6232[collection1] main]
   [junit4]   2> 401550 WARN  (coreLoadExecutor-604-thread-1) [    x:collection1] o.a.s.r.ManagedResourceStorage Cannot write to config directory /home/jenkins/jenkins-slave/workspace/Lucene-Solr-Tests-7.x/solr/core/src/test-files/solr/collection1/conf; switching to use InMemory storage instead.
   [junit4]   2> 401551 INFO  (coreLoadExecutor-604-thread-1) [    x:collection1] o.a.s.h.ReplicationHandler Commits will be reserved for 10000ms.
   [junit4]   2> 401551 INFO  (coreLoadExecutor-604-thread-1) [    x:collection1] o.a.s.u.UpdateLog Could not find max version in index or recent updates, using new clock 1603741056833159168
   [junit4]   2> 401655 INFO  (searcherExecutor-605-thread-1-processing-x:collection1) [    x:collection1] o.a.s.c.SolrCore [collection1] Registered new searcher Searcher@3b3d6232[collection1] main{ExitableDirectoryReader(UninvertingDirectoryReader())}
   [junit4]   2> 401664 INFO  (TEST-MaxSizeAutoCommitTest.simpleTest-seed#[80129DF59B5CC3E9]) [    ] o.a.s.SolrTestCaseJ4 ####initCore end
   [junit4]   2> 401696 INFO  (TEST-MaxSizeAutoCommitTest.simpleTest-seed#[80129DF59B5CC3E9]) [    ] o.a.s.u.p.LogUpdateProcessorFactory [collection1] {add=[0 (1603741056953745408), 1 (1603741056985202688), 2 (1603741056985202689)]} 0 30
   [junit4]   2> 401928 INFO  (TEST-MaxSizeAutoCommitTest.simpleTest-seed#[80129DF59B5CC3E9]) [    ] o.a.s.u.p.LogUpdateProcessorFactory [collection1] {add=[3 (1603741057227423744), 4 (1603741057228472320), 5 (1603741057228472321)]} 0 0
   [junit4]   2> 402151 INFO  (TEST-MaxSizeAutoCommitTest.simpleTest-seed#[80129DF59B5CC3E9]) [    ] o.a.s.u.p.LogUpdateProcessorFactory [collection1] {add=[6 (1603741057462304768), 7 (1603741057462304769), 8 (1603741057462304770)]} 0 0
   [junit4]   2> 402361 INFO  (TEST-MaxSizeAutoCommitTest.simpleTest-seed#[80129DF59B5CC3E9]) [    ] o.a.s.u.p.LogUpdateProcessorFactory [collection1] {add=[9 (1603741057682505728), 10 (1603741057682505729), 11 (1603741057682505730)]} 0 0
   [junit4]   2> 402564 INFO  (TEST-MaxSizeAutoCommitTest.simpleTest-seed#[80129DF59B5CC3E9]) [    ] o.a.s.u.p.LogUpdateProcessorFactory [collection1] {add=[12 (1603741057894318080), 13 (1603741057894318081), 14 (1603741057894318082)]} 0 1
   [junit4]   2> 402769 INFO  (TEST-MaxSizeAutoCommitTest.simpleTest-seed#[80129DF59B5CC3E9]) [    ] o.a.s.u.p.LogUpdateProcessorFactory [collection1] {add=[15 (1603741058109276160), 16 (1603741058110324736), 17 (1603741058110324737)]} 0 0
   [junit4]   2> 402984 INFO  (TEST-MaxSizeAutoCommitTest.simpleTest-seed#[80129DF59B5CC3E9]) [    ] o.a.s.u.p.LogUpdateProcessorFactory [collection1] {add=[18 (1603741058334720000), 19 (1603741058335768576), 20 (1603741058335768577)]} 0 0
   [junit4]   2> 403195 INFO  (TEST-MaxSizeAutoCommitTest.simpleTest-seed#[80129DF59B5CC3E9]) [    ] o.a.s.u.p.LogUpdateProcessorFactory [collection1] {add=[21 (1603741058557018112), 22 (1603741058557018113), 23 (1603741058557018114)]} 0 0
   [junit4]   2> 403430 INFO  (TEST-MaxSizeAutoCommitTest.simpleTest-seed#[80129DF59B5CC3E9]) [    ] o.a.s.u.p.LogUpdateProcessorFactory [collection1] {add=[24 (1603741058786656256), 25 (1603741058787704832), 26 (1603741058787704833)]} 0 16
   [junit4]   2> 403431 INFO  (commitScheduler-608-thread-1) [    ] o.a.s.u.DirectUpdateHandler2 start commit{,optimize=false,openSearcher=false,waitSearcher=true,expungeDeletes=false,softCommit=false,prepareCommit=false}
   [junit4]   2> 403431 INFO  (commitScheduler-608-thread-1) [    ] o.a.s.u.SolrIndexWriter Calling setCommitData with IW:org.apache.solr.update.SolrIndexWriter@1886175e commitCommandVersion:0
   [junit4]   2> 403543 INFO  (TEST-MaxSizeAutoCommitTest.simpleTest-seed#[80129DF59B5CC3E9]) [    ] o.a.s.u.p.LogUpdateProcessorFactory [collection1] {add=[27 (1603741058919825408), 28 (1603741058921922560), 29 (1603741058921922561)]} 0 1
   [junit4]   2> 403771 INFO  (TEST-MaxSizeAutoCommitTest.simpleTest-seed#[80129DF59B5CC3E9]) [    ] o.a.s.SolrTestCaseJ4 ###Ending simpleTest
   [junit4]   2> 403771 INFO  (TEST-MaxSizeAutoCommitTest.simpleTest-seed#[80129DF59B5CC3E9]) [    ] o.a.s.SolrTestCaseJ4 ###deleteCore
   [junit4]   2> 403771 INFO  (TEST-MaxSizeAutoCommitTest.simpleTest-seed#[80129DF59B5CC3E9]) [    ] o.a.s.c.CoreContainer Shutting down CoreContainer instance=469501913
   [junit4]   2> 403771 INFO  (TEST-MaxSizeAutoCommitTest.simpleTest-seed#[80129DF59B5CC3E9]) [    ] o.a.s.m.SolrMetricManager Closing metric reporters for registry=solr.node, tag=null
   [junit4]   2> 403771 INFO  (TEST-MaxSizeAutoCommitTest.simpleTest-seed#[80129DF59B5CC3E9]) [    ] o.a.s.m.r.SolrJmxReporter Closing reporter [org.apache.solr.metrics.reporters.SolrJmxReporter@62a2861f: rootName = null, domain = solr.node, service url = null, agent id = null] for registry solr.node / com.codahale.metrics.MetricRegistry@2be253d
   [junit4]   2> 403775 INFO  (TEST-MaxSizeAutoCommitTest.simpleTest-seed#[80129DF59B5CC3E9]) [    ] o.a.s.m.SolrMetricManager Closing metric reporters for registry=solr.jvm, tag=null
   [junit4]   2> 403775 INFO  (TEST-MaxSizeAutoCommitTest.simpleTest-seed#[80129DF59B5CC3E9]) [    ] o.a.s.m.r.SolrJmxReporter Closing reporter [org.apache.solr.metrics.reporters.SolrJmxReporter@58032fb4: rootName = null, domain = solr.jvm, service url = null, agent id = null] for registry solr.jvm / com.codahale.metrics.MetricRegistry@6f8b9682
   [junit4]   2> 403796 INFO  (TEST-MaxSizeAutoCommitTest.simpleTest-seed#[80129DF59B5CC3E9]) [    ] o.a.s.m.SolrMetricManager Closing metric reporters for registry=solr.jetty, tag=null
   [junit4]   2> 403796 INFO  (TEST-MaxSizeAutoCommitTest.simpleTest-seed#[80129DF59B5CC3E9]) [    ] o.a.s.m.r.SolrJmxReporter Closing reporter [org.apache.solr.metrics.reporters.SolrJmxReporter@6843b11b: rootName = null, domain = solr.jetty, service url = null, agent id = null] for registry solr.jetty / com.codahale.metrics.MetricRegistry@4de3a9f2
   [junit4]   2> 403814 INFO  (coreCloseExecutor-610-thread-1) [    x:collection1] o.a.s.c.SolrCore [collection1]  CLOSING SolrCore org.apache.solr.core.SolrCore@3b1a605c
   [junit4]   2> 403815 INFO  (coreCloseExecutor-610-thread-1) [    x:collection1] o.a.s.m.SolrMetricManager Closing metric reporters for registry=solr.core.collection1, tag=3b1a605c
   [junit4]   2> 403815 INFO  (coreCloseExecutor-610-thread-1) [    x:collection1] o.a.s.m.r.SolrJmxReporter Closing reporter [org.apache.solr.metrics.reporters.SolrJmxReporter@4c75edae: rootName = null, domain = solr.core.collection1, service url = null, agent id = null] for registry solr.core.collection1 / com.codahale.metrics.MetricRegistry@661e9b60
   [junit4]   2> 403833 INFO  (commitScheduler-608-thread-1) [    ] o.a.s.s.SolrIndexSearcher Opening [Searcher@2a44967b[collection1] realtime]
   [junit4]   2> 403834 ERROR (commitScheduler-608-thread-1) [    ] o.a.s.u.CommitTracker auto commit error...:org.apache.solr.common.SolrException: Error opening new searcher
   [junit4]   2> 	at org.apache.solr.core.SolrCore.openNewSearcher(SolrCore.java:2126)
   [junit4]   2> 	at org.apache.solr.update.DirectUpdateHandler2.commit(DirectUpdateHandler2.java:705)
   [junit4]   2> 	at org.apache.solr.update.CommitTracker.run(CommitTracker.java:269)
   [junit4]   2> 	at java.util.concurrent.Executors$RunnableAdapter.call(Executors.java:511)
   [junit4]   2> 	at java.util.concurrent.FutureTask.run(FutureTask.java:266)
   [junit4]   2> 	at java.util.concurrent.ScheduledThreadPoolExecutor$ScheduledFutureTask.access$201(ScheduledThreadPoolExecutor.java:180)
   [junit4]   2> 	at java.util.concurrent.ScheduledThreadPoolExecutor$ScheduledFutureTask.run(ScheduledThreadPoolExecutor.java:293)
   [junit4]   2> 	at java.util.concurrent.ThreadPoolExecutor.runWorker(ThreadPoolExecutor.java:1149)
   [junit4]   2> 	at java.util.concurrent.ThreadPoolExecutor$Worker.run(ThreadPoolExecutor.java:624)
   [junit4]   2> 	at java.lang.Thread.run(Thread.java:748)
   [junit4]   2> Caused by: org.apache.solr.common.SolrException: openNewSearcher called on closed core
   [junit4]   2> 	at org.apache.solr.core.SolrCore.openNewSearcher(SolrCore.java:2113)
   [junit4]   2> 	... 9 more
   [junit4]   2> 
   [junit4]   2> 403924 INFO  (coreCloseExecutor-610-thread-1) [    x:collection1] o.a.s.u.DirectUpdateHandler2 Committing on IndexWriter close.
   [junit4]   2> 403924 INFO  (coreCloseExecutor-610-thread-1) [    x:collection1] o.a.s.u.SolrIndexWriter Calling setCommitData with IW:org.apache.solr.update.SolrIndexWriter@1886175e commitCommandVersion:0
   [junit4] IGNOR/A 0.00s J2 | MaxSizeAutoCommitTest.deleteTest
   [junit4]    > Assumption #1: 'badapple' test group is disabled (@BadApple(bugUrl=https://issues.apache.org/jira/browse/SOLR-12028))
   [junit4]   2> 404021 INFO  (TEST-MaxSizeAutoCommitTest.testRedundantDeletes-seed#[80129DF59B5CC3E9]) [    ] o.a.s.SolrTestCaseJ4 ###Starting testRedundantDeletes
   [junit4]   2> 404022 INFO  (TEST-MaxSizeAutoCommitTest.testRedundantDeletes-seed#[80129DF59B5CC3E9]) [    ] o.a.s.SolrTestCaseJ4 ####initCore
   [junit4]   2> 404022 INFO  (TEST-MaxSizeAutoCommitTest.testRedundantDeletes-seed#[80129DF59B5CC3E9]) [    ] o.a.s.c.SolrResourceLoader [null] Added 2 libs to classloader, from paths: [/home/jenkins/jenkins-slave/workspace/Lucene-Solr-Tests-7.x/solr/core/src/test-files/solr/collection1/lib, /home/jenkins/jenkins-slave/workspace/Lucene-Solr-Tests-7.x/solr/core/src/test-files/solr/collection1/lib/classes]
   [junit4]   2> 404167 INFO  (TEST-MaxSizeAutoCommitTest.testRedundantDeletes-seed#[80129DF59B5CC3E9]) [    ] o.a.s.c.SolrConfig Using Lucene MatchVersion: 7.5.0
   [junit4]   2> 404216 INFO  (TEST-MaxSizeAutoCommitTest.testRedundantDeletes-seed#[80129DF59B5CC3E9]) [    ] o.a.s.s.IndexSchema [null] Schema name=test
   [junit4]   2> 404880 INFO  (TEST-MaxSizeAutoCommitTest.testRedundantDeletes-seed#[80129DF59B5CC3E9]) [    ] o.a.s.s.IndexSchema Loaded schema test/1.0 with uniqueid field id
   [junit4]   2> 405334 INFO  (TEST-MaxSizeAutoCommitTest.testRedundantDeletes-seed#[80129DF59B5CC3E9]) [    ] o.a.s.c.TransientSolrCoreCacheDefault Allocating transient cache for 2147483647 transient cores
   [junit4]   2> 405335 INFO  (TEST-MaxSizeAutoCommitTest.testRedundantDeletes-seed#[80129DF59B5CC3E9]) [    ] o.a.s.h.a.MetricsHistoryHandler No .system collection, keeping metrics history in memory.
   [junit4]   2> 405399 INFO  (TEST-MaxSizeAutoCommitTest.testRedundantDeletes-seed#[80129DF59B5CC3E9]) [    ] o.a.s.m.r.SolrJmxReporter JMX monitoring for 'solr.node' (registry 'solr.node') enabled at server: com.sun.jmx.mbeanserver.JmxMBeanServer@34ae4f9
   [junit4]   2> 405456 INFO  (TEST-MaxSizeAutoCommitTest.testRedundantDeletes-seed#[80129DF59B5CC3E9]) [    ] o.a.s.m.r.SolrJmxReporter JMX monitoring for 'solr.jvm' (registry 'solr.jvm') enabled at server: com.sun.jmx.mbeanserver.JmxMBeanServer@34ae4f9
   [junit4]   2> 405457 INFO  (TEST-MaxSizeAutoCommitTest.testRedundantDeletes-seed#[80129DF59B5CC3E9]) [    ] o.a.s.m.r.SolrJmxReporter JMX monitoring for 'solr.jetty' (registry 'solr.jetty') enabled at server: com.sun.jmx.mbeanserver.JmxMBeanServer@34ae4f9
   [junit4]   2> 405527 INFO  (coreLoadExecutor-620-thread-1) [    x:collection1] o.a.s.c.SolrResourceLoader [null] Added 2 libs to classloader, from paths: [/home/jenkins/jenkins-slave/workspace/Lucene-Solr-Tests-7.x/solr/core/src/test-files/solr/collection1/lib, /home/jenkins/jenkins-slave/workspace/Lucene-Solr-Tests-7.x/solr/core/src/test-files/solr/collection1/lib/classes]
   [junit4]   2> 405699 INFO  (coreLoadExecutor-620-thread-1) [    x:collection1] o.a.s.c.SolrConfig Using Lucene MatchVersion: 7.5.0
   [junit4]   2> 405756 INFO  (coreLoadExecutor-620-thread-1) [    x:collection1] o.a.s.s.IndexSchema [collection1] Schema name=test
   [junit4]   2> 406267 INFO  (coreLoadExecutor-620-thread-1) [    x:collection1] o.a.s.s.IndexSchema Loaded schema test/1.0 with uniqueid field id
   [junit4]   2> 406343 INFO  (coreLoadExecutor-620-thread-1) [    x:collection1] o.a.s.c.CoreContainer Creating SolrCore 'collection1' using configuration from instancedir /home/jenkins/jenkins-slave/workspace/Lucene-Solr-Tests-7.x/solr/core/src/test-files/solr/collection1, trusted=true
   [junit4]   2> 406343 INFO  (coreLoadExecutor-620-thread-1) [    x:collection1] o.a.s.m.r.SolrJmxReporter JMX monitoring for 'solr.core.collection1' (registry 'solr.core.collection1') enabled at server: com.sun.jmx.mbeanserver.JmxMBeanServer@34ae4f9
   [junit4]   2> 406343 INFO  (coreLoadExecutor-620-thread-1) [    x:collection1] o.a.s.c.SolrCore solr.RecoveryStrategy.Builder
   [junit4]   2> 406343 INFO  (coreLoadExecutor-620-thread-1) [    x:collection1] o.a.s.c.SolrCore [[collection1] ] Opening new SolrCore at [/home/jenkins/jenkins-slave/workspace/Lucene-Solr-Tests-7.x/solr/core/src/test-files/solr/collection1], dataDir=[/home/jenkins/jenkins-slave/workspace/Lucene-Solr-Tests-7.x/solr/build/solr-core/test/J2/temp/solr.update.MaxSizeAutoCommitTest_80129DF59B5CC3E9-001/init-core-data-001/]
   [junit4]   2> 406357 INFO  (coreLoadExecutor-620-thread-1) [    x:collection1] o.a.s.u.RandomMergePolicy RandomMergePolicy wrapping class org.apache.lucene.index.LogDocMergePolicy: [LogDocMergePolicy: minMergeSize=1000, mergeFactor=24, maxMergeSize=9223372036854775807, maxMergeSizeForForcedMerge=9223372036854775807, calibrateSizeByDeletes=false, maxMergeDocs=2147483647, maxCFSSegmentSizeMB=8.796093022207999E12, noCFSRatio=0.0]
   [junit4]   2> 406360 WARN  (coreLoadExecutor-620-thread-1) [    x:collection1] o.a.s.c.RequestHandlers INVALID paramSet a in requestHandler {type = requestHandler,name = /dump,class = DumpRequestHandler,attributes = {initParams=a, name=/dump, class=DumpRequestHandler},args = {defaults={a=A,b=B}}}
   [junit4]   2> 406573 INFO  (coreLoadExecutor-620-thread-1) [    x:collection1] o.a.s.u.UpdateHandler Using UpdateLog implementation: org.apache.solr.update.UpdateLog
   [junit4]   2> 406573 INFO  (coreLoadExecutor-620-thread-1) [    x:collection1] o.a.s.u.UpdateLog Initializing UpdateLog: dataDir= defaultSyncLevel=FLUSH numRecordsToKeep=100 maxNumLogsToKeep=10 numVersionBuckets=65536
   [junit4]   2> 406574 INFO  (coreLoadExecutor-620-thread-1) [    x:collection1] o.a.s.u.CommitTracker Hard AutoCommit: disabled
   [junit4]   2> 406574 INFO  (coreLoadExecutor-620-thread-1) [    x:collection1] o.a.s.u.CommitTracker Soft AutoCommit: disabled
   [junit4]   2> 406574 INFO  (coreLoadExecutor-620-thread-1) [    x:collection1] o.a.s.u.RandomMergePolicy RandomMergePolicy wrapping class org.apache.lucene.index.LogDocMergePolicy: [LogDocMergePolicy: minMergeSize=1000, mergeFactor=28, maxMergeSize=9223372036854775807, maxMergeSizeForForcedMerge=9223372036854775807, calibrateSizeByDeletes=true, maxMergeDocs=2147483647, maxCFSSegmentSizeMB=8.796093022207999E12, noCFSRatio=0.16912734590659362]
   [junit4]   2> 406586 INFO  (coreLoadExecutor-620-thread-1) [    x:collection1] o.a.s.s.SolrIndexSearcher Opening [Searcher@4ae86cad[collection1] main]
   [junit4]   2> 406586 WARN  (coreLoadExecutor-620-thread-1) [    x:collection1] o.a.s.r.ManagedResourceStorage Cannot write to config directory /home/jenkins/jenkins-slave/workspace/Lucene-Solr-Tests-7.x/solr/core/src/test-files/solr/collection1/conf; switching to use InMemory storage instead.
   [junit4]   2> 406587 INFO  (coreLoadExecutor-620-thread-1) [    x:collection1] o.a.s.h.ReplicationHandler Commits will be reserved for 10000ms.
   [junit4]   2> 406587 INFO  (coreLoadExecutor-620-thread-1) [    x:collection1] o.a.s.u.UpdateLog Could not find max version in index or recent updates, using new clock 1603741062113787904
   [junit4]   2> 406592 INFO  (TEST-MaxSizeAutoCommitTest.testRedundantDeletes-seed#[80129DF59B5CC3E9]) [    ] o.a.s.SolrTestCaseJ4 ####initCore end
   [junit4]   2> 406615 INFO  (searcherExecutor-621-thread-1-processing-x:collection1) [    x:collection1] o.a.s.c.SolrCore [collection1] Registered new searcher Searcher@4ae86cad[collection1] main{ExitableDirectoryReader(UninvertingDirectoryReader())}
   [junit4]   2> 406721 INFO  (commitScheduler-624-thread-1) [    ] o.a.s.u.DirectUpdateHandler2 start commit{,optimize=false,openSearcher=false,waitSearcher=true,expungeDeletes=false,softCommit=false,prepareCommit=false}
   [junit4]   2> 406721 INFO  (commitScheduler-624-thread-1) [    ] o.a.s.u.SolrIndexWriter Calling setCommitData with IW:org.apache.solr.update.SolrIndexWriter@43b91915 commitCommandVersion:0
   [junit4]   2> 406761 INFO  (TEST-MaxSizeAutoCommitTest.testRedundantDeletes-seed#[80129DF59B5CC3E9]) [    ] o.a.s.u.p.LogUpdateProcessorFactory [collection1] {add=[0 (1603741062120079360), 1 (1603741062152585216), 2 (1603741062152585217), 3 (1603741062152585218), 4 (1603741062152585219), 5 (1603741062152585220), 6 (1603741062152585221), 7 (1603741062153633792), 8 (1603741062153633793), 9 (1603741062153633794), ... (150 adds)]} 0 168
   [junit4]   2> 406907 INFO  (commitScheduler-624-thread-1) [    ] o.a.s.s.SolrIndexSearcher Opening [Searcher@3c595457[collection1] realtime]
   [junit4]   2> 406925 INFO  (commitScheduler-624-thread-1) [    ] o.a.s.u.DirectUpdateHandler2 end_commit_flush
   [junit4]   2> 406925 INFO  (commitScheduler-624-thread-1) [    ] o.a.s.u.DirectUpdateHandler2 start commit{,optimize=false,openSearcher=false,waitSearcher=true,expungeDeletes=false,softCommit=false,prepareCommit=false}
   [junit4]   2> 406925 INFO  (commitScheduler-624-thread-1) [    ] o.a.s.u.SolrIndexWriter Calling setCommitData with IW:org.apache.solr.update.SolrIndexWriter@43b91915 commitCommandVersion:0
   [junit4]   2> 406925 INFO  (commitScheduler-624-thread-1) [    ] o.a.s.s.SolrIndexSearcher Opening [Searcher@5c355650[collection1] realtime]
   [junit4]   2> 406989 INFO  (commitScheduler-624-thread-1) [    ] o.a.s.u.DirectUpdateHandler2 end_commit_flush
   [junit4]   2> 407063 INFO  (TEST-MaxSizeAutoCommitTest.testRedundantDeletes-seed#[80129DF59B5CC3E9]) [    ] o.a.s.u.p.LogUpdateProcessorFactory [collection1] {delete=[100 (-1603741062611861504)]} 0 53
   [junit4]   2> 407064 INFO  (TEST-MaxSizeAutoCommitTest.testRedundantDeletes-seed#[80129DF59B5CC3E9]) [    ] o.a.s.u.p.LogUpdateProcessorFactory [collection1] {delete=[100 (-1603741062613958656)]} 0 53
   [junit4]   2> 407064 INFO  (TEST-MaxSizeAutoCommitTest.testRedundantDeletes-seed#[80129DF59B5CC3E9]) [    ] o.a.s.u.p.LogUpdateProcessorFactory [collection1] {delete=[100 (-1603741062613958657)]} 0 54
   [junit4]   2> 407064 INFO  (TEST-MaxSizeAutoCommitTest.testRedundantDeletes-seed#[80129DF59B5CC3E9]) [    ] o.a.s.u.p.LogUpdateProcessorFactory [collection1] {delete=[100 (-1603741062613958658)]} 0 54
   [junit4]   2> 407064 INFO  (TEST-MaxSizeAutoCommitTest.testRedundantDeletes-seed#[80129DF59B5CC3E9]) [    ] o.a.s.u.p.LogUpdateProcessorFactory [collection1] {delete=[100 (-1603741062613958659)]} 0 54
   [junit4]   2> 407064 INFO  (TEST-MaxSizeAutoCommitTest.testRedundantDeletes-seed#[80129DF59B5CC3E9]) [    ] o.a.s.u.p.LogUpdateProcessorFactory [collection1] {delete=[100 (-1603741062613958660)]} 0 54
   [junit4]   2> 407065 INFO  (TEST-MaxSizeAutoCommitTest.testRedundantDeletes-seed#[80129DF59B5CC3E9]) [    ] o.a.s.u.p.LogUpdateProcessorFactory [collection1] {delete=[100 (-1603741062613958661)]} 0 54
   [junit4]   2> 407065 INFO  (TEST-MaxSizeAutoCommitTest.testRedundantDeletes-seed#[80129DF59B5CC3E9]) [    ] o.a.s.u.p.LogUpdateProcessorFactory [collection1] {delete=[100 (-1603741062615007232)]} 0 54
   [junit4]   2> 407065 INFO  (TEST-MaxSizeAutoCommitTest.testRedundantDeletes-seed#[80129DF59B5CC3E9]) [    ] o.a.s.u.p.LogUpdateProcessorFactory [collection1] {delete=[100 (-1603741062615007233)]} 0 55
   [junit4]   2> 407065 INFO  (TEST-MaxSizeAutoCommitTest.testRedundantDeletes-seed#[80129DF59B5CC3E9]) [    ] o.a.s.u.p.LogUpdateProcessorFactory [collection1] {delete=[100 (-1603741062615007234)]} 0 55
   [junit4]   2> 407065 INFO  (TEST-MaxSizeAutoCommitTest.testRedundantDeletes-seed#[80129DF59B5CC3E9]) [    ] o.a.s.u.p.LogUpdateProcessorFactory [collection1] {delete=[100 (-1603741062615007235)]} 0 55
   [junit4]   2> 407065 INFO  (TEST-MaxSizeAutoCommitTest.testRedundantDeletes-seed#[80129DF59B5CC3E9]) [    ] o.a.s.u.p.LogUpdateProcessorFactory [collection1] {delete=[100 (-1603741062615007236)]} 0 55
   [junit4]   2> 407065 INFO  (TEST-MaxSizeAutoCommitTest.testRedundantDeletes-seed#[80129DF59B5CC3E9]) [    ] o.a.s.u.p.LogUpdateProcessorFactory [collection1] {delete=[100 (-1603741062615007237)]} 0 55
   [junit4]   2> 407065 INFO  (TEST-MaxSizeAutoCommitTest.testRedundantDeletes-seed#[80129DF59B5CC3E9]) [    ] o.a.s.u.p.LogUpdateProcessorFactory [collection1] {delete=[100 (-1603741062615007238)]} 0 55
   [junit4]   2> 407066 INFO  (TEST-MaxSizeAutoCommitTest.testRedundantDeletes-seed#[80129DF59B5CC3E9]) [    ] o.a.s.u.p.LogUpdateProcessorFactory [collection1] {delete=[100 (-1603741062615007239)]} 0 55
   [junit4]   2> 407066 INFO  (TEST-MaxSizeAutoCommitTest.testRedundantDeletes-seed#[80129DF59B5CC3E9]) [    ] o.a.s.u.p.LogUpdateProcessorFactory [collection1] {delete=[100 (-1603741062616055808)]} 0 55
   [junit4]   2> 407066 INFO  (TEST-MaxSizeAutoCommitTest.testRedundantDeletes-seed#[80129DF59B5CC3E9]) [    ] o.a.s.u.p.LogUpdateProcessorFactory [collection1] {delete=[100 (-1603741062616055809)]} 0 56
   [junit4]   2> 407066 INFO  (TEST-MaxSizeAutoCommitTest.testRedundantDeletes-seed#[80129DF59B5CC3E9]) [    ] o.a.s.u.p.LogUpdateProcessorFactory [collection1] {delete=[100 (-1603741062616055810)]} 0 56
   [junit4]   2> 407066 INFO  (TEST-MaxSizeAutoCommitTest.testRedundantDeletes-seed#[80129DF59B5CC3E9]) [    ] o.a.s.u.p.LogUpdateProcessorFactory [collection1] {delete=[100 (-1603741062616055811)]} 0 56
   [junit4]   2> 407066 INFO  (TEST-MaxSizeAutoCommitTest.testRedundantDeletes-seed#[80129DF59B5CC3E9]) [    ] o.a.s.u.p.LogUpdateProcessorFactory [collection1] {delete=[100 (-1603741062616055812)]} 0 56
   [junit4]   2> 407066 INFO  (TEST-MaxSizeAutoCommitTest.testRedundantDeletes-seed#[80129DF59B5CC3E9]) [    ] o.a.s.u.p.LogUpdateProcessorFactory [collection1] {delete=[100 (-1603741062616055813)]} 0 56
   [junit4]   2> 407067 INFO  (TEST-MaxSizeAutoCommitTest.testRedundantDeletes-seed#[80129DF59B5CC3E9]) [    ] o.a.s.u.p.LogUpdateProcessorFactory [collection1] {delete=[100 (-1603741062616055814)]} 0 56
   [junit4]   2> 407067 INFO  (TEST-MaxSizeAutoCommitTest.testRedundantDeletes-seed#[80129DF59B5CC3E9]) [    ] o.a.s.u.p.LogUpdateProcessorFactory [collection1] {delete=[100 (-1603741062617104384)]} 0 56
   [junit4]   2> 407067 INFO  (TEST-MaxSizeAutoCommitTest.testRedundantDeletes-seed#[80129DF59B5CC3E9]) [    ] o.a.s.u.p.LogUpdateProcessorFactory [collection1] {delete=[100 (-1603741062617104385)]} 0 56
   [junit4]   2> 407067 INFO  (TEST-MaxSizeAutoCommitTest.testRedundantDeletes-seed#[80129DF59B5CC3E9]) [    ] o.a.s.u.p.LogUpdateProcessorFactory [collection1] {delete=[100 (-1603741062617104386)]} 0 57
   [junit4]   2> 407067 INFO  (TEST-MaxSizeAutoCommitTest.testRedundantDeletes-seed#[80129DF59B5CC3E9]) [    ] o.a.s.u.p.LogUpdateProcessorFactory [collection1] {delete=[100 (-1603741062617104387)]} 0 57
   [junit4]   2> 407067 INFO  (TEST-MaxSizeAutoCommitTest.testRedundantDeletes-seed#[80129DF59B5CC3E9]) [    ] o.a.s.u.p.LogUpdateProcessorFactory [collection1] {delete=[100 (-1603741062617104388)]} 0 57
   [junit4]   2> 407067 INFO  (TEST-MaxSizeAutoCommitTest.testRedundantDeletes-seed#[80129DF59B5CC3E9]) [    ] o.a.s.u.p.LogUpdateProcessorFactory [collection1] {delete=[100 (-1603741062617104389)]} 0 57
   [junit4]   2> 407067 INFO  (TEST-MaxSizeAutoCommitTest.testRedundantDeletes-seed#[80129DF59B5CC3E9]) [    ] o.a.s.u.p.LogUpdateProcessorFactory [collection1] {delete=[100 (-1603741062617104390)]} 0 57
   [junit4]   2> 407095 INFO  (TEST-MaxSizeAutoCommitTest.testRedundantDeletes-seed#[80129DF59B5CC3E9]) [    ] o.a.s.u.p.LogUpdateProcessorFactory [collection1] {delete=[100 (-1603741062617104391)]} 0 84
   [junit4]   2> 407095 INFO  (TEST-MaxSizeAutoCommitTest.testRedundantDeletes-seed#[80129DF59B5CC3E9]) [    ] o.a.s.u.p.LogUpdateProcessorFactory [collection1] {delete=[100 (-1603741062646464512)]} 0 85
   [junit4]   2> 407095 INFO  (TEST-MaxSizeAutoCommitTest.testRedundantDeletes-seed#[80129DF59B5CC3E9]) [    ] o.a.s.u.p.LogUpdateProcessorFactory [collection1] {delete=[100 (-1603741062646464513)]} 0 85
   [junit4]   2> 407095 INFO  (TEST-MaxSizeAutoCommitTest.testRedundantDeletes-seed#[80129DF59B5CC3E9]) [    ] o.a.s.u.p.LogUpdateProcessorFactory [collection1] {delete=[100 (-1603741062646464514)]} 0 85
   [junit4]   2> 407095 INFO  (TEST-MaxSizeAutoCommitTest.testRedundantDeletes-seed#[80129DF59B5CC3E9]) [    ] o.a.s.u.p.LogUpdateProcessorFactory [collection1] {delete=[100 (-1603741062646464515)]} 0 85
   [junit4]   2> 407095 INFO  (TEST-MaxSizeAutoCommitTest.testRedundantDeletes-seed#[80129DF59B5CC3E9]) [    ] o.a.s.u.p.LogUpdateProcessorFactory [collection1] {delete=[100 (-1603741062646464516)]} 0 85
   [junit4]   2> 407096 INFO  (TEST-MaxSizeAutoCommitTest.testRedundantDeletes-seed#[80129DF59B5CC3E9]) [    ] o.a.s.u.p.LogUpdateProcessorFactory [collection1] {delete=[100 (-1603741062646464517)]} 0 85
   [junit4]   2> 407096 INFO  (TEST-MaxSizeAutoCommitTest.testRedundantDeletes-seed#[80129DF59B5CC3E9]) [    ] o.a.s.u.p.LogUpdateProcessorFactory [collection1] {delete=[100 (-1603741062647513088)]} 0 85
   [junit4]   2> 407096 INFO  (TEST-MaxSizeAutoCommitTest.testRedundantDeletes-seed#[80129DF59B5CC3E9]) [    ] o.a.s.u.p.LogUpdateProcessorFactory [collection1] {delete=[100 (-1603741062647513089)]} 0 86
   [junit4]   2> 407096 INFO  (TEST-MaxSizeAutoCommitTest.testRedundantDeletes-seed#[80129DF59B5CC3E9]) [    ] o.a.s.u.p.LogUpdateProcessorFactory [collection1] {delete=[100 (-1603741062647513090)]} 0 86
   [junit4]   2> 407096 INFO  (TEST-MaxSizeAutoCommitTest.testRedundantDeletes-seed#[80129DF59B5CC3E9]) [    ] o.a.s.u.p.LogUpdateProcessorFactory [collection1] {delete=[100 (-1603741062647513091)]} 0 86
   [junit4]   2> 407096 INFO  (TEST-MaxSizeAutoCommitTest.testRedundantDeletes-seed#[80129DF59B5CC3E9]) [    ] o.a.s.u.p.LogUpdateProcessorFactory [collection1] {delete=[100 (-1603741062647513092)]} 0 86
   [junit4]   2> 407096 INFO  (TEST-MaxSizeAutoCommitTest.testRedundantDeletes-seed#[80129DF59B5CC3E9]) [    ] o.a.s.u.p.LogUpdateProcessorFactory [collection1] {delete=[100 (-1603741062647513093)]} 0 86
   [junit4]   2> 407096 INFO  (TEST-MaxSizeAutoCommitTest.testRedundantDeletes-seed#[80129DF59B5CC3E9]) [    ] o.a.s.u.p.LogUpdateProcessorFactory [collection1] {delete=[100 (-1603741062647513094)]} 0 86
   [junit4]   2> 407097 INFO  (TEST-MaxSizeAutoCommitTest.testRedundantDeletes-seed#[80129DF59B5CC3E9]) [    ] o.a.s.u.p.LogUpdateProcessorFactory [collection1] {delete=[100 (-1603741062648561664)]} 0 86
   [junit4]   2> 407097 INFO  (TEST-MaxSizeAutoCommitTest.testRedundantDeletes-seed#[80129DF59B5CC3E9]) [    ] o.a.s.u.p.LogUpdateProcessorFactory [collection1] {delete=[100 (-1603741062648561665)]} 0 86
   [junit4]   2> 407097 INFO  (TEST-MaxSizeAutoCommitTest.testRedundantDeletes-seed#[80129DF59B5CC3E9]) [    ] o.a.s.u.p.LogUpdateProcessorFactory [collection1] {delete=[100 (-1603741062648561666)]} 0 87
   [junit4]   2> 407097 INFO  (TEST-MaxSizeAutoCommitTest.testRedundantDeletes-seed#[80129DF59B5CC3E9]) [    ] o.a.s.u.p.LogUpdateProcessorFactory [collection1] {delete=[100 (-1603741062648561667)]} 0 87
   [junit4]   2> 407097 INFO  (TEST-MaxSizeAutoCommitTest.testRedundantDeletes-seed#[80129DF59B5CC3E9]) [    ] o.a.s.u.p.LogUpdateProcessorFactory [collection1] {delete=[100 (-1603741062648561668)]} 0 87
   [junit4]   2> 407097 INFO  (TEST-MaxSizeAutoCommitTest.testRedundantDeletes-seed#[80129DF59B5CC3E9]) [    ] o.a.s.u.p.LogUpdateProcessorFactory [collection1] {delete=[100 (-1603741062648561669)]} 0 87
   [junit4]   2> 407097 INFO  (TEST-MaxSizeAutoCommitTest.testRedundantDeletes-seed#[80129DF59B5CC3E9]) [    ] o.a.s.u.p.LogUpdateProcessorFactory [collection1] {delete=[100 (-1603741062648561670)]} 0 87
   [junit4]   2> 407098 INFO  (commitScheduler-624-thread-1) [    ] o.a.s.u.DirectUpdateHandler2 start commit{,optimize=false,openSearcher=false,waitSearcher=true,expungeDeletes=false,softCommit=false,prepareCommit=false}
   [junit4]   2> 407098 INFO  (commitScheduler-624-thread-1) [    ] o.a.s.u.SolrIndexWriter Calling setCommitData with IW:org.apache.solr.update.SolrIndexWriter@43b91915 commitCommandVersion:0
   [junit4]   2> 407120 INFO  (commitScheduler-624-thread-1) [    ] o.a.s.s.SolrIndexSearcher Opening [Searcher@2f26e609[collection1] realtime]
   [junit4]   2> 407136 INFO  (commitScheduler-624-thread-1) [    ] o.a.s.u.DirectUpdateHandler2 end_commit_flush
   [junit4]   2> 407156 INFO  (TEST-MaxSizeAutoCommitTest.testRedundantDeletes-seed#[80129DF59B5CC3E9]) [    ] o.a.s.u.p.LogUpdateProcessorFactory [collection1] {delete=[100 (-1603741062710427648)]} 0 146
   [junit4]   2> 407157 INFO  (TEST-MaxSizeAutoCommitTest.testRedundantDeletes-seed#[80129DF59B5CC3E9]) [    ] o.a.s.u.p.LogUpdateProcessorFactory [collection1] {delete=[100 (-1603741062710427649)]} 0 146
   [junit4]   2> 407157 INFO  (TEST-MaxSizeAutoCommitTest.testRedundantDeletes-seed#[80129DF59B5CC3E9]) [    ] o.a.s.u.p.LogUpdateProcessorFactory [collection1] {delete=[100 (-1603741062711476224)]} 0 146
   [junit4]   2> 407157 INFO  (TEST-MaxSizeAutoCommitTest.testRedundantDeletes-seed#[80129DF59B5CC3E9]) [    ] o.a.s.u.p.LogUpdateProcessorFactory [collection1] {delete=[100 (-1603741062711476225)]} 0 147
   [junit4]   2> 407157 INFO  (TEST-MaxSizeAutoCommitTest.testRedundantDeletes-seed#[80129DF59B5CC3E9]) [    ] o.a.s.u.p.LogUpdateProcessorFactory [collection1] {delete=[100 (-1603741062711476226)]} 0 147
   [junit4]   2> 407157 INFO  (TEST-MaxSizeAutoCommitTest.testRedundantDeletes-seed#[80129DF59B5CC3E9]) [    ] o.a.s.u.p.LogUpdateProcessorFactory [collection1] {delete=[100 (-1603741062711476227)]} 0 147
   [junit4]   2> 407157 INFO  (TEST-MaxSizeAutoCommitTest.testRedundantDeletes-seed#[80129DF59B5CC3E9]) [    ] o.a.s.u.p.LogUpdateProcessorFactory [collection1] {delete=[100 (-1603741062711476228)]} 0 147
   [junit4]   2> 407157 INFO  (TEST-MaxSizeAutoCommitTest.testRedundantDeletes-seed#[80129DF59B5CC3E9]) [    ] o.a.s.u.p.LogUpdateProcessorFactory [collection1] {delete=[100 (-1603741062711476229)]} 0 147
   [junit4]   2> 407157 INFO  (TEST-MaxSizeAutoCommitTest.testRedundantDeletes-seed#[80129DF59B5CC3E9]) [    ] o.a.s.u.p.LogUpdateProcessorFactory [collection1] {delete=[100 (-1603741062711476230)]} 0 147
   [junit4]   2> 407158 INFO  (TEST-MaxSizeAutoCommitTest.testRedundantDeletes-seed#[80129DF59B5CC3E9]) [    ] o.a.s.u.p.LogUpdateProcessorFactory [collection1] {delete=[100 (-1603741062712524800)]} 0 147
   [junit4]   2> 407158 INFO  (TEST-MaxSizeAutoCommitTest.testRedundantDeletes-seed#[80129DF59B5CC3E9]) [    ] o.a.s.u.p.LogUpdateProcessorFactory [collection1] {delete=[100 (-1603741062712524801)]} 0 147
   [junit4]   2> 407158 INFO  (TEST-MaxSizeAutoCommitTest.testRedundantDeletes-seed#[80129DF59B5CC3E9]) [    ] o.a.s.u.p.LogUpdateProcessorFactory [collection1] {delete=[100 (-1603741062712524802)]} 0 148
   [junit4]   2> 407158 INFO  (TEST-MaxSizeAutoCommitTest.testRedundantDeletes-seed#[80129DF59B5CC3E9]) [    ] o.a.s.u.p.LogUpdateProcessorFactory [collection1] {delete=[100 (-1603741062712524803)]} 0 148
   [junit4]   2> 407158 INFO  (TEST-MaxSizeAutoCommitTest.testRedundantDeletes-seed#[80129DF59B5CC3E9]) [    ] o.a.s.u.p.LogUpdateProcessorFactory [collection1] {delete=[100 (-1603741062712524804)]} 0 148
   [junit4]   2> 407158 INFO  (TEST-MaxSizeAutoCommitTest.testRedundantDeletes-seed#[80129DF59B5CC3E9]) [    ] o.a.s.u.p.LogUpdateProcessorFactory [collection1] {delete=[100 (-1603741062712524805)]} 0 148
   [junit4]   2> 407158 INFO  (TEST-MaxSizeAutoCommitTest.testRedundantDeletes-seed#[80129DF59B5CC3E9]) [    ] o.a.s.u.p.LogUpdateProcessorFactory [collection1] {delete=[100 (-1603741062712524806)]} 0 148
   [junit4]   2> 407158 INFO  (TEST-MaxSizeAutoCommitTest.testRedundantDeletes-seed#[80129DF59B5CC3E9]) [    ] o.a.s.u.p.LogUpdateProcessorFactory [collection1] {delete=[100 (-1603741062712524807)]} 0 148
   [junit4]   2> 407159 INFO  (TEST-MaxSizeAutoCommitTest.testRedundantDeletes-seed#[80129DF59B5CC3E9]) [    ] o.a.s.u.p.LogUpdateProcessorFactory [collection1] {delete=[100 (-1603741062713573376)]} 0 148
   [junit4]   2> 407159 INFO  (TEST-MaxSizeAutoCommitTest.testRedundantDeletes-seed#[80129DF59B5CC3E9]) [    ] o.a.s.u.p.LogUpdateProcessorFactory [collection1] {delete=[100 (-1603741062713573377)]} 0 148
   [junit4]   2> 407159 INFO  (TEST-MaxSizeAutoCommitTest.testRedundantDeletes-seed#[80129DF59B5CC3E9]) [    ] o.a.s.u.p.LogUpdateProcessorFactory [collection1] {delete=[100 (-1603741062713573378)]} 0 149
   [junit4]   2> 407159 INFO  (TEST-MaxSizeAutoCommitTest.testRedundantDeletes-seed#[80129DF59B5CC3E9]) [    ] o.a.s.u.p.LogUpdateProcessorFactory [collection1] {delete=[100 (-1603741062713573379)]} 0 149
   [junit4]   2> 407159 INFO  (TEST-MaxSizeAutoCommitTest.testRedundantDeletes-seed#[80129DF59B5CC3E9]) [    ] o.a.s.u.p.LogUpdateProcessorFactory [collection1] {delete=[100 (-1603741062713573380)]} 0 149
   [junit4]   2> 407159 INFO  (TEST-MaxSizeAutoCommitTest.testRedundantDeletes-seed#[80129DF59B5CC3E9]) [    ] o.a.s.u.p.LogUpdateProcessorFactory [collection1] {delete=[100 (-1603741062713573381)]} 0 149
   [junit4]   2> 407159 INFO  (TEST-MaxSizeAutoCommitTest.testRedundantDeletes-seed#[80129DF59B5CC3E9]) [    ] o.a.s.u.p.LogUpdateProcessorFactory [collection1] {delete=[100 (-1603741062713573382)]} 0 149
   [junit4]   2> 407159 INFO  (TEST-MaxSizeAutoCommitTest.testRedundantDeletes-seed#[80129DF59B5CC3E9]) [    ] o.a.s.u.p.LogUpdateProcessorFactory [collection1] {delete=[100 (-1603741062713573383)]} 0 149
   [junit4]   2> 407192 INFO  (TEST-MaxSizeAutoCommitTest.testRedundantDeletes-seed#[80129DF59B5CC3E9]) [    ] o.a.s.u.p.LogUpdateProcessorFactory [collection1] {delete=[100 (-1603741062713573384)]} 0 149
   [junit4]   2> 407192 INFO  (TEST-MaxSizeAutoCommitTest.testRedundantDeletes-seed#[80129DF59B5CC3E9]) [    ] o.a.s.u.p.LogUpdateProcessorFactory [collection1] {delete=[100 (-1603741062748176384)]} 0 182
   [junit4]   2> 407192 INFO  (TEST-MaxSizeAutoCommitTest.testRedundantDeletes-seed#[80129DF59B5CC3E9]) [    ] o.a.s.u.p.LogUpdateProcessorFactory [collection1] {delete=[100 (-1603741062748176385)]} 0 182
   [junit4]   2> 407193 INFO  (TEST-MaxSizeAutoCommitTest.testRedundantDeletes-seed#[80129DF59B5CC3E9]) [    ] o.a.s.u.p.LogUpdateProcessorFactory [collection1] {delete=[100 (-1603741062749224960)]} 0 182
   [junit4]   2> 407193 INFO  (TEST-MaxSizeAutoCommitTest.testRedundantDeletes-seed#[80129DF59B5CC3E9]) [    ] o.a.s.u.p.LogUpdateProcessorFactory [collection1] {delete=[100 (-1603741062749224961)]} 0 182
   [junit4]   2> 407193 INFO  (TEST-MaxSizeAutoCommitTest.testRedundantDeletes-seed#[80129DF59B5CC3E9]) [    ] o.a.s.u.p.LogUpdateProcessorFactory [collection1] {delete=[100 (-1603741062749224962)]} 0 183
   [junit4]   2> 407193 INFO  (TEST-MaxSizeAutoCommitTest.testRedundantDeletes-seed#[80129DF59B5CC3E9]) [    ] o.a.s.u.p.LogUpdateProcessorFactory [collection1] {delete=[100 (-1603741062749224963)]} 0 183
   [junit4]   2> 407193 INFO  (TEST-MaxSizeAutoCommitTest.testRedundantDeletes-seed#[80129DF59B5CC3E9]) [    ] o.a.s.u.p.LogUpdateProcessorFactory [collection1] {delete=[100 (-1603741062749224964)]} 0 183
   [junit4]   2> 407193 INFO  (TEST-MaxSizeAutoCommitTest.testRedundantDeletes-seed#[80129DF59B5CC3E9]) [    ] o.a.s.u.p.LogUpdateProcessorFactory [collection1] {delete=[100 (-1603741062749224965)]} 0 183
   [junit4]   2> 407193 INFO  (TEST-MaxSizeAutoCommitTest.testRedundantDeletes-seed#[80129DF59B5CC3E9]) [    ] o.a.s.u.p.LogUpdateProcessorFactory [collection1] {delete=[100 (-1603741062749224966)]} 0 183
   [junit4]   2> 407193 INFO  (TEST-MaxSizeAutoCommitTest.testRedundantDeletes-seed#[80129DF59B5CC3E9]) [    ] o.a.s.u.p.LogUpdateProcessorFactory [collection1] {delete=[100 (-1603741062749224967)]} 0 183
   [junit4]   2> 407193 INFO  (TEST-MaxSizeAutoCommitTest.testRedundantDeletes-seed#[80129DF59B5CC3E9]) [    ] o.a.s.u.p.LogUpdateProcessorFactory [collection1] {delete=[100 (-1603741062749224968)]} 0 183
   [junit4]   2> 407194 INFO  (TEST-MaxSizeAutoCommitTest.testRedundantDeletes-seed#[80129DF59B5CC3E9]) [    ] o.a.s.u.p.LogUpdateProcessorFactory [collection1] {delete=[100 (-1603741062750273536)]} 0 183
   [junit4]   2> 407194 INFO  (TEST-MaxSizeAutoCommitTest.testRedundantDeletes-seed#[80129DF59B5CC3E9]) [    ] o.a.s.u.p.LogUpdateProcessorFactory [collection1] {delete=[100 (-1603741062750273537)]} 0 183
   [junit4]   2> 407194 INFO  (TEST-MaxSizeAutoCommitTest.testRedundantDeletes-seed#[80129DF59B5CC3E9]) [    ] o.a.s.u.p.LogUpdateProcessorFactory [collection1] {delete=[100 (-1603741062750273538)]} 0 184
   [junit4]   2> 407194 INFO  (TEST-MaxSizeAutoCommitTest.testRedundantDeletes-seed#[80129DF59B5CC3E9]) [    ] o.a.s.u.p.LogUpdateProcessorFactory [collection1] {delete=[100 (-1603741062750273539)]} 0 184
   [junit4]   2> 407194 INFO  (TEST-MaxSizeAutoCommitTest.testRedundantDeletes-seed#[80129DF59B5CC3E9]) [    ] o.a.s.u.p.LogUpdateProcessorFactory [collection1] {delete=[100 (-1603741062750273540)]} 0 184
   [junit4]   2> 407194 INFO  (TEST-MaxSizeAutoCommitTest.testRedundantDeletes-seed#[80129DF59B5CC3E9]) [    ] o.a.s.u.p.LogUpdateProcessorFactory [collection1] {delete=[100 (-1603741062750273541)]} 0 184
   [junit4]   2> 407195 INFO  (TEST-MaxSizeAutoCommitTest.testRedundantDeletes-seed#[80129DF59B5CC3E9]) [    ] o.a.s.u.p.LogUpdateProcessorFactory [collection1] {delete=[100 (-1603741062750273542)]} 0 184
   [junit4]   2> 407195 INFO  (TEST-MaxSizeAutoCommitTest.testRedundantDeletes-seed#[80129DF59B5CC3E9]) [    ] o.a.s.u.p.LogUpdateProcessorFactory [collection1] {delete=[100 (-1603741062751322112)]} 0 184
   [junit4]   2> 407195 INFO  (TEST-MaxSizeAutoCommitTest.testRedundantDeletes-seed#[80129DF59B5CC3E9]) [    ] o.a.s.u.p.LogUpdateProcessorFactory [collection1] {delete=[100 (-1603741062751322113)]} 0 185
   [junit4]   2> 407195 INFO  (TEST-MaxSizeAutoCommitTest.testRedundantDeletes-seed#[80129DF59B5CC3E9]) [    ] o.a.s.u.p.LogUpdateProcessorFactory [collection1] {delete=[100 (-1603741062751322114)]} 0 185
   [junit4]   2> 407195 INFO  (TEST-MaxSizeAutoCommitTest.testRedundantDeletes-seed#[80129DF59B5CC3E9]) [    ] o.a.s.u.p.LogUpdateProcessorFactory [collection1] {delete=[100 (-1603741062751322115)]} 0 185
   [junit4]   2> 407195 INFO  (TEST-MaxSizeAutoCommitTest.testRedundantDeletes-seed#[80129DF59B5CC3E9]) [    ] o.a.s.u.p.LogUpdateProcessorFactory [collection1] {delete=[100 (-1603741062751322116)]} 0 185
   [junit4]   2> 407195 INFO  (TEST-MaxSizeAutoCommitTest.testRedundantDeletes-seed#[80129DF59B5CC3E9]) [    ] o.a.s.u.p.LogUpdateProcessorFactory [collection1] {delete=[100 (-1603741062751322117)]} 0 185
   [junit4]   2> 407208 INFO  (commitScheduler-624-thread-1) [    ] o.a.s.u.DirectUpdateHandler2 start commit{,optimize=false,openSearcher=false,waitSearcher=true,expungeDeletes=false,softCommit=false,prepareCommit=false}
   [junit4]   2> 407208 INFO  (commitScheduler-624-thread-1) [    ] o.a.s.u.SolrIndexWriter Calling setCommitData with IW:org.apache.solr.update.SolrIndexWriter@43b91915 commitCommandVersion:0
   [junit4]   2> 407209 INFO  (commitScheduler-624-thread-1) [    ] o.a.s.s.SolrIndexSearcher Opening [Searcher@27d1f0[collection1] realtime]
   [junit4]   2> 407282 INFO  (commitScheduler-624-thread-1) [    ] o.a.s.u.DirectUpdateHandler2 end_commit_flush
   [junit4]   2> 407290 INFO  (TEST-MaxSizeAutoCommitTest.testRedundantDeletes-seed#[80129DF59B5CC3E9]) [    ] o.a.s.u.p.LogUpdateProcessorFactory [collection1] {delete=[100 (-1603741062812139520)]} 0 280
   [junit4]   2> 407291 INFO  (TEST-MaxSizeAutoCommitTest.testRedundantDeletes-seed#[80129DF59B5CC3E9]) [    ] o.a.s.u.p.LogUpdateProcessorFactory [collection1] {delete=[100 (-1603741062850936832)]} 0 280
   [junit4]   2> 407291 INFO  (TEST-MaxSizeAutoCommitTest.testRedundantDeletes-seed#[80129DF59B5CC3E9]) [    ] o.a.s.u.p.LogUpdateProcessorFactory [collection1] {delete=[100 (-1603741062851985408)]} 0 280
   [junit4]   2> 407291 INFO  (TEST-MaxSizeAutoCommitTest.testRedundantDeletes-seed#[80129DF59B5CC3E9]) [    ] o.a.s.u.p.LogUpdateProcessorFactory [collection1] {delete=[100 (-1603741062851985409)]} 0 280
   [junit4]   2> 407291 INFO  (TEST-MaxSizeAutoCommitTest.testRedundantDeletes-seed#[80129DF59B5CC3E9]) [    ] o.a.s.u.p.LogUpdateProcessorFactory [collection1] {delete=[100 (-1603741062851985410)]} 0 281
   [junit4]   2> 407291 INFO  (TEST-MaxSizeAutoCommitTest.testRedundantDeletes-seed#[80129DF59B5CC3E9]) [    ] o.a.s.u.p.LogUpdateProcessorFactory [collection1] {delete=[100 (-1603741062851985411)]} 0 281
   [junit4]   2> 407291 INFO  (TEST-MaxSizeAutoCommitTest.testRedundantDeletes-seed#[80129DF59B5CC3E9]) [    ] o.a.s.u.p.LogUpdateProcessorFactory [collection1] {delete=[100 (-1603741062851985412)]} 0 281
   [junit4]   2> 407291 INFO  (TEST-MaxSizeAutoCommitTest.testRedundantDeletes-seed#[80129DF59B5CC3E9]) [    ] o.a.s.u.p.LogUpdateProcessorFactory [collection1] {delete=[100 (-1603741062851985413)]} 0 281
   [junit4]   2> 407291 INFO  (TEST-MaxSizeAutoCommitTest.testRedundantDeletes-seed#[80129DF59B5CC3E9]) [    ] o.a.s.u.p.LogUpdateProcessorFactory [collection1] {delete=[100 (-1603741062851985414)]} 0 281
   [junit4]   2> 407291 INFO  (TEST-MaxSizeAutoCommitTest.testRedundantDeletes-seed#[80129DF59B5CC3E9]) [    ] o.a.s.u.p.LogUpdateProcessorFactory [collection1] {delete=[100 (-1603741062851985415)]} 0 281
   [junit4]   2> 407292 INFO  (TEST-MaxSizeAutoCommitTest.testRedundantDeletes-seed#[80129DF59B5CC3E9]) [    ] o.a.s.u.p.LogUpdateProcessorFactory [collection1] {delete=[100 (-1603741062853033984)]} 0 281
   [junit4]   2> 407292 INFO  (TEST-MaxSizeAutoCommitTest.testRedundantDeletes-seed#[80129DF59B5CC3E9]) [    ] o.a.s.u.p.LogUpdateProcessorFactory [collection1] {delete=[100 (-1603741062853033985)]} 0 281
   [junit4]   2> 407292 INFO  (TEST-MaxSizeAutoCommitTest.testRedundantDeletes-seed#[80129DF59B5CC3E9]) [    ] o.a.s.u.p.LogUpdateProcessorFactory [collection1] {delete=[100 (-1603741062853033986)]} 0 282
   [junit4]   2> 407292 INFO  (TEST-MaxSizeAutoCommitTest.testRedundantDeletes-seed#[80129DF59B5CC3E9]) [    ] o.a.s.u.p.LogUpdateProcessorFactory [collection1] {delete=[100 (-1603741062853033987)]} 0 282
   [junit4]   2> 407292 INFO  (TEST-MaxSizeAutoCommitTest.testRedundantDeletes-seed#[80129DF59B5CC3E9]) [    ] o.a.s.u.p.LogUpdateProcessorFactory [collection1] {delete=[100 (-1603741062853033988)]} 0 282
   [junit4]   2> 407292 INFO  (TEST-MaxSizeAutoCommitTest.testRedundantDeletes-seed#[80129DF59B5CC3E9]) [    ] o.a.s.u.p.LogUpdateProcessorFactory [collection1] {delete=[100 (-1603741062853033989)]} 0 282
   [junit4]   2> 407292 INFO  (TEST-MaxSizeAutoCommitTest.testRedundantDeletes-seed#[80129DF59B5CC3E9]) [    ] o.a.s.u.p.LogUpdateProcessorFactory [collection1] {delete=[100 (-1603741062853033990)]} 0 282
   [junit4]   2> 407292 INFO  (TEST-MaxSizeAutoCommitTest.testRedundantDeletes-seed#[80129DF59B5CC3E9]) [    ] o.a.s.u.p.LogUpdateProcessorFactory [collection1] {delete=[100 (-1603741062853033991)]} 0 282
   [junit4]   2> 407293 INFO  (TEST-MaxSizeAutoCommitTest.testRedundantDeletes-seed#[80129DF59B5CC3E9]) [    ] o.a.s.u.p.LogUpdateProcessorFactory [collection1] {delete=[100 (-1603741062853033992)]} 0 282
   [junit4]   2> 407293 INFO  (TEST-MaxSizeAutoCommitTest.testRedundantDeletes-seed#[80129DF59B5CC3E9]) [    ] o.a.s.u.p.LogUpdateProcessorFactory [collection1] {delete=[100 (-1603741062854082560)]} 0 282
   [junit4]   2> 407293 INFO  (TEST-MaxSizeAutoCommitTest.testRedundantDeletes-seed#[80129DF59B5CC3E9]) [    ] o.a.s.u.p.LogUpdateProcessorFactory [collection1] {delete=[100 (-1603741062854082561)]} 0 282
   [junit4]   2> 407293 INFO  (TEST-MaxSizeAutoCommitTest.testRedundantDeletes-seed#[80129DF59B5CC3E9]) [    ] o.a.s.u.p.LogUpdateProcessorFactory [collection1] {delete=[100 (-1603741062854082562)]} 0 283
   [junit4]   2> 407293 INFO  (TEST-MaxSizeAutoCommitTest.testRedundantDeletes-seed#[80129DF59B5CC3E9]) [    ] o.a.s.u.p.LogUpdateProcessorFactory [collection1] {delete=[100 (-1603741062854082563)]} 0 283
   [junit4]   2> 407293 INFO  (TEST-MaxSizeAutoCommitTest.testRedundantDeletes-seed#[80129DF59B5CC3E9]) [    ] o.a.s.u.p.LogUpdateProcessorFactory [collection1] {delete=[100 (-1603741062854082564)]} 0 283
   [junit4]   2> 407293 INFO  (TEST-MaxSizeAutoCommitTest.testRedundantDeletes-seed#[80129DF59B5CC3E9]) [    ] o.a.s.u.p.LogUpdateProcessorFactory [collection1] {delete=[100 (-1603741062854082565)]} 0 283
   [junit4]   2> 407293 INFO  (TEST-MaxSizeAutoCommitTest.testRedundantDeletes-seed#[80129DF59B5CC3E9]) [    ] o.a.s.u.p.LogUpdateProcessorFactory [collection1] {delete=[100 (-1603741062854082566)]} 0 283
   [junit4]   2> 407293 INFO  (TEST-MaxSizeAutoCommitTest.testRedundantDeletes-seed#[80129DF59B5CC3E9]) [    ] o.a.s.u.p.LogUpdateProcessorFactory [collection1] {delete=[100 (-1603741062854082567)]} 0 283
   [junit4]   2> 407306 INFO  (TEST-MaxSizeAutoCommitTest.testRedundantDeletes-seed#[80129DF59B5CC3E9]) [    ] o.a.s.u.p.LogUpdateProcessorFactory [collection1] {delete=[100 (-1603741062867714048)]} 0 296
   [junit4]   2> 407307 INFO  (TEST-MaxSizeAutoCommitTest.testRedundantDeletes-seed#[80129DF59B5CC3E9]) [    ] o.a.s.u.p.LogUpdateProcessorFactory [collection1] {delete=[100 (-1603741062868762624)]} 0 296
   [junit4]   2> 407307 INFO  (TEST-MaxSizeAutoCommitTest.testRedundantDeletes-seed#[80129DF59B5CC3E9]) [    ] o.a.s.u.p.LogUpdateProcessorFactory [collection1] {delete=[100 (-1603741062868762625)]} 0 296
   [junit4]   2> 407307 INFO  (TEST-MaxSizeAutoCommitTest.testRedundantDeletes-seed#[80129DF59B5CC3E9]) [    ] o.a.s.u.p.LogUpdateProcessorFactory [collection1] {delete=[100 (-1603741062868762626)]} 0 297
   [junit4]   2> 407307 INFO  (TEST-MaxSizeAutoCommitTest.testRedundantDeletes-seed#[80129DF59B5CC3E9]) [    ] o.a.s.u.p.LogUpdateProcessorFactory [collection1] {delete=[100 (-1603741062868762627)]} 0 297
   [junit4]   2> 407307 INFO  (TEST-MaxSizeAutoCommitTest.testRedundantDeletes-seed#[80129DF59B5CC3E9]) [    ] o.a.s.u.p.LogUpdateProcessorFactory [collection1] {delete=[100 (-1603741062868762628)]} 0 297
   [junit4]   2> 407307 INFO  (TEST-MaxSizeAutoCommitTest.testRedundantDeletes-seed#[80129DF59B5CC3E9]) [    ] o.a.s.u.p.LogUpdateProcessorFactory [collection1] {delete=[100 (-1603741062868762629)]} 0 297
   [junit4]   2> 407307 INFO  (TEST-MaxSizeAutoCommitTest.testRedundantDeletes-seed#[80129DF59B5CC3E9]) [    ] o.a.s.u.p.LogUpdateProcessorFactory [collection1] {delete=[100 (-1603741062868762630)]} 0 297
   [junit4]   2> 407307 INFO  (TEST-MaxSizeAutoCommitTest.testRedundantDeletes-seed#[80129DF59B5CC3E9]) [    ] o.a.s.u.p.LogUpdateProcessorFactory [collection1] {delete=[100 (-1603741062868762631)]} 0 297
   [junit4]   2> 407308 INFO  (TEST-MaxSizeAutoCommitTest.testRedundantDeletes-seed#[80129DF59B5CC3E9]) [    ] o.a.s.u.p.LogUpdateProcessorFactory [collection1] {delete=[100 (-1603741062868762632)]} 0 297
   [junit4]   2> 407308 INFO  (TEST-MaxSizeAutoCommitTest.testRedundantDeletes-seed#[80129DF59B5CC3E9]) [    ] o.a.s.u.p.LogUpdateProcessorFactory [collection1] {delete=[100 (-1603741062869811200)]} 0 297
   [junit4]   2> 407308 INFO  (TEST-MaxSizeAutoCommitTest.testRedundantDeletes-seed#[80129DF59B5CC3E9]) [    ] o.a.s.u.p.LogUpdateProcessorFactory [collection1] {delete=[100 (-1603741062869811201)]} 0 297
   [junit4]   2> 407308 INFO  (TEST-MaxSizeAutoCommitTest.testRedundantDeletes-seed#[80129DF59B5CC3E9]) [    ] o.a.s.u.p.LogUpdateProcessorFactory [collection1] {delete=[100 (-1603741062869811202)]} 0 298
   [junit4]   2> 407308 INFO  (TEST-MaxSizeAutoCommitTest.testRedundantDeletes-seed#[80129DF59B5CC3E9]) [    ] o.a.s.u.p.LogUpdateProcessorFactory [collection1] {delete=[100 (-1603741062869811203)]} 0 298
   [junit4]   2> 407308 INFO  (TEST-MaxSizeAutoCommitTest.testRedundantDeletes-seed#[80129DF59B5CC3E9]) [    ] o.a.s.u.p.LogUpdateProcessorFactory [collection1] {delete=[100 (-1603741062869811204)]} 0 298
   [junit4]   2> 407308 INFO  (TEST-MaxSizeAutoCommitTest.testRedundantDeletes-seed#[80129DF59B5CC3E9]) [    ] o.a.s.u.p.LogUpdateProcessorFactory [collection1] {delete=[100 (-1603741062869811205)]} 0 298
   [junit4]   2> 407308 INFO  (TEST-MaxSizeAutoCommitTest.testRedundantDeletes-seed#[80129DF59B5CC3E9]) [    ] o.a.s.u.p.LogUpdateProcessorFactory [collection1] {delete=[100 (-1603741062869811206)]} 0 298
   [junit4]   2> 407308 INFO  (TEST-MaxSizeAutoCommitTest.testRedundantDeletes-seed#[80129DF59B5CC3E9]) [    ] o.a.s.u.p.LogUpdateProcessorFactory [collection1] {delete=[100 (-1603741062869811207)]} 0 298
   [junit4]   2> 407309 INFO  (TEST-MaxSizeAutoCommitTest.testRedundantDeletes-seed#[80129DF59B5CC3E9]) [    ] o.a.s.u.p.LogUpdateProcessorFactory [collection1] {delete=[100 (-1603741062869811208)]} 0 298
   [junit4]   2> 407309 INFO  (TEST-MaxSizeAutoCommitTest.testRedundantDeletes-seed#[80129DF59B5CC3E9]) [    ] o.a.s.u.p.LogUpdateProcessorFactory [collection1] {delete=[100 (-1603741062870859776)]} 0 298
   [junit4]   2> 407326 INFO  (TEST-MaxSizeAutoCommitTest.testRedundantDeletes-seed#[80129DF59B5CC3E9]) [    ] o.a.s.u.p.LogUpdateProcessorFactory [collection1] {delete=[100 (-1603741062870859777)]} 0 316
   [junit4]   2> 407327 INFO  (TEST-MaxSizeAutoCommitTest.testRedundantDeletes-seed#[80129DF59B5CC3E9]) [    ] o.a.s.u.p.LogUpdateProcessorFactory [collection1] {delete=[100 (-1603741062889734144)]} 0 316
   [junit4]   2> 407327 INFO  (TEST-MaxSizeAutoCommitTest.testRedundantDeletes-seed#[80129DF59B5CC3E9]) [    ] o.a.s.u.p.LogUpdateProcessorFactory [collection1] {delete=[100 (-1603741062889734145)]} 0 317
   [junit4]   2> 407328 INFO  (commitScheduler-624-thread-1) [    ] o.a.s.u.DirectUpdateHandler2 start commit{,optimize=false,openSearcher=false,waitSearcher=true,expungeDeletes=false,softCommit=false,prepareCommit=false}
   [junit4]   2> 407328 INFO  (commitScheduler-624-thread-1) [    ] o.a.s.u.SolrIndexWriter Calling setCommitData with IW:org.apache.solr.update.SolrIndexWriter@43b91915 commitCommandVersion:0
   [junit4]   2> 407329 INFO  (commitScheduler-624-thread-1) [    ] o.a.s.s.SolrIndexSearcher Opening [Searcher@156fb7bf[collection1] realtime]
   [junit4]   2> 407412 INFO  (commitScheduler-624-thread-1) [    ] o.a.s.u.DirectUpdateHandler2 end_commit_flush
   [junit4]   2> 407412 INFO  (TEST-MaxSizeAutoCommitTest.testRedundantDeletes-seed#[80129DF59B5CC3E9]) [    ] o.a.s.u.p.LogUpdateProcessorFactory [collection1] {delete=[100 (-1603741062945308672)]} 0 402
   [junit4]   2> 407413 INFO  (TEST-MaxSizeAutoCommitTest.testRedundantDeletes-seed#[80129DF59B5CC3E9]) [    ] o.a.s.u.p.LogUpdateProcessorFactory [collection1] {delete=[100 (-1603741062979911680)]} 0 402
   [junit4]   2> 407413 INFO  (TEST-MaxSizeAutoCommitTest.testRedundantDeletes-seed#[80129DF59B5CC3E9]) [    ] o.a.s.u.p.LogUpdateProcessorFactory [collection1] {delete=[100 (-1603741062979911681)]} 0 402
   [junit4]   2> 407413 INFO  (TEST-MaxSizeAutoCommitTest.testRedundantDeletes-seed#[80129DF59B5CC3E9]) [    ] o.a.s.u.p.LogUpdateProcessorFactory [collection1] {delete=[100 (-1603741062979911682)]} 0 403
   [junit4]   2> 407413 INFO  (TEST-MaxSizeAutoCommitTest.testRedundantDeletes-seed#[80129DF59B5CC3E9]) [    ] o.a.s.u.p.LogUpdateProcessorFactory [collection1] {delete=[100 (-1603741062979911683)]} 0 403
   [junit4]   2> 407413 INFO  (TEST-MaxSizeAutoCommitTest.testRedundantDeletes-seed#[80129DF59B5CC3E9]) [    ] o.a.s.u.p.LogUpdateProcessorFactory [collection1] {delete=[100 (-1603741062979911684)]} 0 403
   [junit4]   2> 407413 INFO  (TEST-MaxSizeAutoCommitTest.testRedundantDeletes-seed#[80129DF59B5CC3E9]) [    ] o.a.s.u.p.LogUpdateProcessorFactory [collection1] {delete=[100 (-1603741062979911685)]} 0 403
   [junit4]   2> 407413 INFO  (TEST-MaxSizeAutoCommitTest.testRedundantDeletes-seed#[80129DF59B5CC3E9]) [    ] o.a.s.u.p.LogUpdateProcessorFactory [collection1] {delete=[100 (-1603741062979911686)]} 0 403
   [junit4]   2> 407414 INFO  (TEST-MaxSizeAutoCommitTest.testRedundantDeletes-seed#[80129DF59B5CC3E9]) [    ] o.a.s.u.p.LogUpdateProcessorFactory [collection1] {delete=[100 (-1603741062980960256)]} 0 403
   [junit4]   2> 407414 INFO  (TEST-MaxSizeAutoCommitTest.testRedundantDeletes-seed#[80129DF59B5CC3E9]) [    ] o.a.s.u.p.LogUpdateProcessorFactory [collection1] {delete=[100 (-1603741062980960257)]} 0 403
   [junit4]   2> 407414 INFO  (TEST-MaxSizeAutoCommitTest.testRedundantDeletes-seed#[80129DF59B5CC3E9]) [    ] o.a.s.u.p.LogUpdateProcessorFactory [collection1] {delete=[100 (-1603741062980960258)]} 0 404
   [junit4]   2> 407414 INFO  (TEST-MaxSizeAutoCommitTest.testRedundantDeletes-seed#[80129DF59B5CC3E9]) [    ] o.a.s.u.p.LogUpdateProcessorFactory [collection1] {delete=[100 (-1603741062980960259)]} 0 404
   [junit4]   2> 407414 INFO  (TEST-MaxSizeAutoCommitTest.testRedundantDeletes-seed#[80129DF59B5CC3E9]) [    ] o.a.s.u.p.LogUpdateProcessorFactory [collection1] {delete=[100 (-1603741062980960260)]} 0 404
   [junit4]   2> 407414 INFO  (TEST-MaxSizeAutoCommitTest.testRedundantDeletes-seed#[80129DF59B5CC3E9]) [    ] o.a.s.u.p.LogUpdateProcessorFactory [collection1] {delete=[100 (-1603741062980960261)]} 0 404
   [junit4]   2> 407414 INFO  (TEST-MaxSizeAutoCommitTest.testRedundantDeletes-seed#[80129DF59B5CC3E9]) [    ] o.a.s.u.p.LogUpdateProcessorFactory [collection1] {delete=[100 (-1603741062980960262)]} 0 404
   [junit4]   2> 407414 INFO  (TEST-MaxSizeAutoCommitTest.testRedundantDeletes-seed#[80129DF59B5CC3E9]) [    ] o.a.s.u.p.LogUpdateProcessorFactory [collection1] {delete=[100 (-1603741062980960263)]} 0 404
   [junit4]   2> 407415 INFO  (TEST-MaxSizeAutoCommitTest.testRedundantDeletes-seed#[80129DF59B5CC3E9]) [    ] o.a.s.u.p.LogUpdateProcessorFactory [collection1] {delete=[100 (-1603741062982008832)]} 0 404
   [junit4]   2> 407415 INFO  (TEST-MaxSizeAutoCommitTest.testRedundantDeletes-seed#[80129DF59B5CC3E9]) [    ] o.a.s.u.p.LogUpdateProcessorFactory [collection1] {delete=[100 (-1603741062982008833)]} 0 404
   [junit4]   2> 407415 INFO  (TEST-MaxSizeAutoCommitTest.testRedundantDeletes-seed#[80129DF59B5CC3E9]) [    ] o.a.s.u.p.LogUpdateProcessorFactory [collection1] {delete=[100 (-1603741062982008834)]} 0 405
   [junit4]   2> 407415 INFO  (TEST-MaxSizeAutoCommitTest.testRedundantDeletes-seed#[80129DF59B5CC3E9]) [    ] o.a.s.u.p.LogUpdateProcessorFactory [collection1] {delete=[100 (-1603741062982008835)]} 0 405
   [junit4]   2> 407415 INFO  (TEST-MaxSizeAutoCommitTest.testRedundantDeletes-seed#[80129DF59B5CC3E9]) [    ] o.a.s.u.p.LogUpdateProcessorFactory [collection1] {delete=[100 (-1603741062982008836)]} 0 405
   [junit4]   2> 407415 INFO  (TEST-MaxSizeAutoCommitTest.testRedundantDeletes-seed#[80129DF59B5CC3E9]) [    ] o.a.s.u.p.LogUpdateProcessorFactory [collection1] {delete=[100 (-1603741062982008837)]} 0 405
   [junit4]   2> 407415 INFO  (TEST-MaxSizeAutoCommitTest.testRedundantDeletes-seed#[80129DF59B5CC3E9]) [    ] o.a.s.u.p.LogUpdateProcessorFactory [collection1] {delete=[100 (-1603741062982008838)]} 0 405
   [junit4]   2> 407415 INFO  (TEST-MaxSizeAutoCommitTest.testRedundantDeletes-seed#[80129DF59B5CC3E9]) [    ] o.a.s.u.p.LogUpdateProcessorFactory [collection1] {delete=[100 (-1603741062982008839)]} 0 405
   [junit4]   2> 407415 INFO  (TEST-MaxSizeAutoCommitTest.testRedundantDeletes-seed#[80129DF59B5CC3E9]) [    ] o.a.s.u.p.LogUpdateProcessorFactory [collection1] {delete=[100 (-1603741062982008840)]} 0 405
   [junit4]   2> 407428 INFO  (TEST-MaxSizeAutoCommitTest.testRedundantDeletes-seed#[80129DF59B5CC3E9]) [    ] o.a.s.u.p.LogUpdateProcessorFactory [collection1] {delete=[100 (-1603741062995640320)]} 0 418
   [junit4]   2> 407428 INFO  (TEST-MaxSizeAutoCommitTest.testRedundantDeletes-seed#[80129DF59B5CC3E9]) [    ] o.a.s.u.p.LogUpdateProcessorFactory [collection1] {delete=[100 (-1603741062995640321)]} 0 418
   [junit4]   2> 407430 INFO  (TEST-MaxSizeAutoCommitTest.testRedundantDeletes-seed#[80129DF59B5CC3E9]) [    ] o.a.s.u.p.LogUpdateProcessorFactory [collection1] {delete=[100 (-1603741062996688896)]} 0 419
   [junit4]   2> 407430 INFO  (TEST-MaxSizeAutoCommitTest.testRedundantDeletes-seed#[80129DF59B5CC3E9]) [    ] o.a.s.u.p.LogUpdateProcessorFactory [collection1] {delete=[100 (-1603741062997737472)]} 0 420
   [junit4]   2> 407448 INFO  (TEST-MaxSizeAutoCommitTest.testRedundantDeletes-seed#[80129DF59B5CC3E9]) [    ] o.a.s.u.p.LogUpdateProcessorFactory [collection1] {delete=[100 (-1603741063016611840)]} 0 438
   [junit4]   2> 407448 INFO  (TEST-MaxSizeAutoCommitTest.testRedundantDeletes-seed#[80129DF59B5CC3E9]) [    ] o.a.s.u.p.LogUpdateProcessorFactory [collection1] {delete=[100 (-1603741063016611841)]} 0 438
   [junit4]   2> 407448 INFO  (TEST-MaxSizeAutoCommitTest.testRedundantDeletes-seed#[80129DF59B5CC3E9]) [    ] o.a.s.u.p.LogUpdateProcessorFactory [collection1] {delete=[100 (-1603741063016611842)]} 0 438
   [junit4]   2> 407449 INFO  (TEST-MaxSizeAutoCommitTest.testRedundantDeletes-seed#[80129DF59B5CC3E9]) [    ] o.a.s.u.p.LogUpdateProcessorFactory [collection1] {delete=[100 (-1603741063017660416)]} 0 438
   [junit4]   2> 407449 INFO  (TEST-MaxSizeAutoCommitTest.testRedundantDeletes-seed#[80129DF59B5CC3E9]) [    ] o.a.s.u.p.LogUpdateProcessorFactory [collection1] {delete=[100 (-1603741063017660417)]} 0 438
   [junit4]   2> 407449 INFO  (TEST-MaxSizeAutoCommitTest.testRedundantDeletes-seed#[80129DF59B5CC3E9]) [    ] o.a.s.u.p.LogUpdateProcessorFactory [collection1] {delete=[100 (-1603741063017660418)]} 0 439
   [junit4]   2> 407449 INFO  (TEST-MaxSizeAutoCommitTest.testRedundantDeletes-seed#[80129DF59B5CC3E9]) [    ] o.a.s.u.p.LogUpdateProcessorFactory [collection1] {delete=[100 (-1603741063017660419)]} 0 439
   [junit4]   2> 407449 INFO  (TEST-MaxSizeAutoCommitTest.testRedundantDeletes-seed#[80129DF59B5CC3E9]) [    ] o.a.s.u.p.LogUpdateProcessorFactory [collection1] {delete=[100 (-1603741063017660420)]} 0 439
   [junit4]   2> 407449 INFO  (TEST-MaxSizeAutoCommitTest.testRedundantDeletes-seed#[80129DF59B5CC3E9]) [    ] o.a.s.u.p.LogUpdateProcessorFactory [collection1] {delete=[100 (-1603741063017660421)]} 0 439
   [junit4]   2> 407449 INFO  (TEST-MaxSizeAutoCommitTest.testRedundantDeletes-seed#[80129DF59B5CC3E9]) [    ] o.a.s.u.p.LogUpdateProcessorFactory [collection1] {delete=[100 (-1603741063017660422)]} 0 439
   [junit4]   2> 407449 INFO  (TEST-MaxSizeAutoCommitTest.testRedundantDeletes-seed#[80129DF59B5CC3E9]) [    ] o.a.s.u.p.LogUpdateProcessorFactory [collection1] {delete=[100 (-1603741063017660423)]} 0 439
   [junit4]   2> 407450 INFO  (TEST-MaxSizeAutoCommitTest.testRedundantDeletes-seed#[80129DF59B5CC3E9]) [    ] o.a.s.u.p.LogUpdateProcessorFactory [collection1] {delete=[100 (-1603741063017660424)]} 0 439
   [junit4]   2> 407450 INFO  (TEST-MaxSizeAutoCommitTest.testRedundantDeletes-seed#[80129DF59B5CC3E9]) [    ] o.a.s.u.p.LogUpdateProcessorFactory [collection1] {delete=[100 (-1603741063018708992)]} 0 439
   [junit4]   2> 407450 INFO  (TEST-MaxSizeAutoCommitTest.testRedundantDeletes-seed#[80129DF59B5CC3E9]) [    ] o.a.s.u.p.LogUpdateProcessorFactory [collection1] {delete=[100 (-1603741063018708993)]} 0 439
   [junit4]   2> 407450 INFO  (TEST-MaxSizeAutoCommitTest.testRedundantDeletes-seed#[80129DF59B5CC3E9]) [    ] o.a.s.u.p.LogUpdateProcessorFactory [collection1] {delete=[100 (-1603741063018708994)]} 0 440
   [junit4]   2> 407450 INFO  (TEST-MaxSizeAutoCommitTest.testRedundantDeletes-seed#[80129DF59B5CC3E9]) [    ] o.a.s.u.p.LogUpdateProcessorFactory [collection1] {delete=[100 (-1603741063018708995)]} 0 440
   [junit4]   2> 407450 INFO  (TEST-MaxSizeAutoCommitTest.testRedundantDeletes-seed#[80129DF59B5CC3E9]) [    ] o.a.s.u.p.LogUpdateProcessorFactory [collection1] {delete=[100 (-1603741063018708996)]} 0 440
   [junit4]   2> 407450 INFO  (TEST-MaxSizeAutoCommitTest.testRedundantDeletes-seed#[80129DF59B5CC3E9]) [    ] o.a.s.u.p.LogUpdateProcessorFactory [collection1] {delete=[100 (-1603741063018708997)]} 0 440
   [junit4]   2> 407450 INFO  (TEST-MaxSizeAutoCommitTest.testRedundantDeletes-seed#[80129DF59B5CC3E9]) [    ] o.a.s.u.p.LogUpdateProcessorFactory [collection1] {delete=[100 (-1603741063018708998)]} 0 440
   [junit4]   2> 407451 INFO  (TEST-MaxSizeAutoCommitTest.testRedundantDeletes-seed#[80129DF59B5CC3E9]) [    ] o.a.s.u.p.LogUpdateProcessorFactory [collection1] {delete=[100 (-1603741063018708999)]} 0 440
   [junit4]   2> 407451 INFO  (TEST-MaxSizeAutoCommitTest.testRedundantDeletes-seed#[80129DF59B5CC3E9]) [    ] o.a.s.u.p.LogUpdateProcessorFactory [collection1] {delete=[100 (-1603741063019757568)]} 0 440
   [junit4]   2> 407452 INFO  (commitScheduler-624-thread-1) [    ] o.a.s.u.DirectUpdateHandler2 start commit{,optimize=false,openSearcher=false,waitSearcher=true,expungeDeletes=false,softCommit=false,prepareCommit=false}
   [junit4]   2> 407452 INFO  (commitScheduler-624-thread-1) [    ] o.a.s.u.SolrIndexWriter Calling setCommitData with IW:org.apache.solr.update.SolrIndexWriter@43b91915 commitCommandVersion:0
   [junit4]   2> 407467 INFO  (commitScheduler-624-thread-1) [    ] o.a.s.s.SolrIndexSearcher Opening [Searcher@419a3ff7[collection1] realtime]
   [junit4]   2> 407575 INFO  (commitScheduler-624-thread-1) [    ] o.a.s.u.DirectUpdateHandler2 end_commit_flush
   [junit4]   2> 407575 INFO  (TEST-MaxSizeAutoCommitTest.testRedundantDeletes-seed#[80129DF59B5CC3E9]) [    ] o.a.s.u.p.LogUpdateProcessorFactory [collection1] {delete=[100 (-1603741063072186368)]} 0 565
   [junit4]   2> 407576 INFO  (TEST-MaxSizeAutoCommitTest.testRedundantDeletes-seed#[80129DF59B5CC3E9]) [    ] o.a.s.u.p.LogUpdateProcessorFactory [collection1] {delete=[100 (-1603741063150829568)]} 0 565
   [junit4]   2> 407576 INFO  (TEST-MaxSizeAutoCommitTest.testRedundantDeletes-seed#[80129DF59B5CC3E9]) [    ] o.a.s.u.p.LogUpdateProcessorFactory [collection1] {delete=[100 (-1603741063150829569)]} 0 566
   [junit4]   2> 407576 INFO  (TEST-MaxSizeAutoCommitTest.testRedundantDeletes-seed#[80129DF59B5CC3E9]) [    ] o.a.s.u.p.LogUpdateProcessorFactory [collection1] {delete=[100 (-1603741063150829570)]} 0 566
   [junit4]   2> 407576 INFO  (TEST-MaxSizeAutoCommitTest.testRedundantDeletes-seed#[80129DF59B5CC3E9]) [    ] o.a.s.u.p.LogUpdateProcessorFactory [collection1] {delete=[100 (-1603741063150829571)]} 0 566
   [junit4]   2> 407576 INFO  (TEST-MaxSizeAutoCommitTest.testRedundantDeletes-seed#[80129DF59B5CC3E9]) [    ] o.a.s.u.p.LogUpdateProcessorFactory [collection1] {delete=[100 (-1603741063150829572)]} 0 566
   [junit4]   2> 407576 INFO  (TEST-MaxSizeAutoCommitTest.testRedundantDeletes-seed#[80129DF59B5CC3E9]) [    ] o.a.s.u.p.LogUpdateProcessorFactory [collection1] {delete=[100 (-1603741063150829573)]} 0 566
   [junit4]   2> 407576 INFO  (TEST-MaxSizeAutoCommitTest.testRedundantDeletes-seed#[80129DF59B5CC3E9]) [    ] o.a.s.u.p.LogUpdateProcessorFactory [collection1] {delete=[100 (-1603741063150829574)]} 0 566
   [junit4]   2> 407577 INFO  (TEST-MaxSizeAutoCommitTest.testRedundantDeletes-seed#[80129DF59B5CC3E9]) [    ] o.a.s.u.p.LogUpdateProcessorFactory [collection1] {delete=[100 (-1603741063150829575)]} 0 566
   [junit4]   2> 407577 INFO  (TEST-MaxSizeAutoCommitTest.testRedundantDeletes-seed#[80129DF59B5CC3E9]) [    ] o.a.s.u.p.LogUpdateProcessorFactory [collection1] {delete=[100 (-1603741063151878144)]} 0 566
   [junit4]   2> 407577 INFO  (TEST-MaxSizeAutoCommitTest.testRedundantDeletes-seed#[80129DF59B5CC3E9]) [    ] o.a.s.u.p.LogUpdateProcessorFactory [collection1] {delete=[100 (-1603741063151878145)]} 0 566
   [junit4]   2> 407577 INFO  (TEST-MaxSizeAutoCommitTest.testRedundantDeletes-seed#[80129DF59B5CC3E9]) [    ] o.a.s.u.p.LogUpdateProcessorFactory [collection1] {delete=[100 (-1603741063151878146)]} 0 567
   [junit4]   2> 407577 INFO  (TEST-MaxSizeAutoCommitTest.testRedundantDeletes-seed#[80129DF59B5CC3E9]) [    ] o.a.s.u.p.LogUpdateProcessorFactory [collection1] {delete=[100 (-1603741063151878147)]} 0 567
   [junit4]   2> 407577 INFO  (TEST-MaxSizeAutoCommitTest.testRedundantDeletes-seed#[80129DF59B5CC3E9]) [    ] o.a.s.u.p.LogUpdateProcessorFactory [collection1] {delete=[100 (-1603741063151878148)]} 0 567
   [junit4]   2> 407577 INFO  (TEST-MaxSizeAutoCommitTest.testRedundantDeletes-seed#[80129DF59B5CC3E9]) [    ] o.a.s.u.p.LogUpdateProcessorFactory [collection1] {delete=[100 (-1603741063151878149)]} 0 567
   [junit4]   2> 407577 INFO  (TEST-MaxSizeAutoCommitTest.testRedundantDeletes-seed#[80129DF59B5CC3E9]) [    ] o.a.s.u.p.LogUpdateProcessorFactory [collection1] {delete=[100 (-1603741063151878150)]} 0 567
   [junit4]   2> 407577 INFO  (TEST-MaxSizeAutoCommitTest.testRedundantDeletes-seed#[80129DF59B5CC3E9]) [    ] o.a.s.u.p.LogUpdateProcessorFactory [collection1] {delete=[100 (-1603741063151878151)]} 0 567
   [junit4]   2> 407578 INFO  (TEST-MaxSizeAutoCommitTest.testRedundantDeletes-seed#[80129DF59B5CC3E9]) [    ] o.a.s.u.p.LogUpdateProcessorFactory [collection1] {delete=[100 (-1603741063151878152)]} 0 567
   [junit4]   2> 407578 INFO  (TEST-MaxSizeAutoCommitTest.testRedundantDeletes-seed#[80129DF59B5CC3E9]) [    ] o.a.s.u.p.LogUpdateProcessorFactory [collection1] {delete=[100 (-1603741063152926720)]} 0 567
   [junit4]   2> 407578 INFO  (TEST-MaxSizeAutoCommitTest.testRedundantDeletes-seed#[80129DF59B5CC3E9]) [    ] o.a.s.u.p.LogUpdateProcessorFactory [collection1] {delete=[100 (-1603741063152926721)]} 0 568
   [junit4]   2> 407578 INFO  (TEST-MaxSizeAutoCommitTest.testRedundantDeletes-seed#[80129DF59B5CC3E9]) [    ] o.a.s.u.p.LogUpdateProcessorFactory [collection1] {delete=[100 (-1603741063152926722)]} 0 568
   [junit4]   2> 407591 INFO  (TEST-MaxSizeAutoCommitTest.testRedundantDeletes-seed#[80129DF59B5CC3E9]) [    ] o.a.s.u.p.LogUpdateProcessorFactory [collection1] {delete=[100 (-1603741063152926723)]} 0 568
   [junit4]   2> 407591 INFO  (TEST-MaxSizeAutoCommitTest.testRedundantDeletes-seed#[80129DF59B5CC3E9]) [    ] o.a.s.u.p.LogUpdateProcessorFactory [collection1] {delete=[100 (-1603741063166558208)]} 0 581
   [junit4]   2> 407591 INFO  (TEST-MaxSizeAutoCommitTest.testRedundantDeletes-seed#[80129DF59B5CC3E9]) [    ] o.a.s.u.p.LogUpdateProcessorFactory [collection1] {delete=[100 (-1603741063166558209)]} 0 581
   [junit4]   2> 407610 INFO  (TEST-MaxSizeAutoCommitTest.testRedundantDeletes-seed#[80129DF59B5CC3E9]) [    ] o.a.s.u.p.LogUpdateProcessorFactory [collection1] {delete=[100 (-1603741063186481152)]} 0 599
   [junit4]   2> 407610 INFO  (TEST-MaxSizeAutoCommitTest.testRedundantDeletes-seed#[80129DF59B5CC3E9]) [    ] o.a.s.u.p.LogUpdateProcessorFactory [collection1] {delete=[100 (-1603741063186481153)]} 0 600
   [junit4]   2> 407610 INFO  (TEST-MaxSizeAutoCommitTest.testRedundantDeletes-seed#[80129DF59B5CC3E9]) [    ] o.a.s.u.p.LogUpdateProcessorFactory [collection1] {delete=[100 (-1603741063186481154)]} 0 600
   [junit4]   2> 407610 INFO  (TEST-MaxSizeAutoCommitTest.testRedundantDeletes-seed#[80129DF59B5CC3E9]) [    ] o.a.s.u.p.LogUpdateProcessorFactory [collection1] {delete=[10

[...truncated too long message...]

 = /home/jenkins/jenkins-slave/workspace/Lucene-Solr-Tests-7.x/lucene/top-level-ivy-settings.xml

resolve:

ivy-availability-check:
[loadresource] Do not set property disallowed.ivy.jars.list as its length is 0.

-ivy-fail-disallowed-ivy-version:

ivy-fail:

ivy-configure:
[ivy:configure] :: loading settings :: file = /home/jenkins/jenkins-slave/workspace/Lucene-Solr-Tests-7.x/lucene/top-level-ivy-settings.xml

resolve:

ivy-availability-check:
[loadresource] Do not set property disallowed.ivy.jars.list as its length is 0.

-ivy-fail-disallowed-ivy-version:

ivy-fail:

ivy-configure:
[ivy:configure] :: loading settings :: file = /home/jenkins/jenkins-slave/workspace/Lucene-Solr-Tests-7.x/lucene/top-level-ivy-settings.xml

resolve:

ivy-availability-check:
[loadresource] Do not set property disallowed.ivy.jars.list as its length is 0.

-ivy-fail-disallowed-ivy-version:

ivy-fail:

ivy-configure:
[ivy:configure] :: loading settings :: file = /home/jenkins/jenkins-slave/workspace/Lucene-Solr-Tests-7.x/lucene/top-level-ivy-settings.xml

resolve:

ivy-availability-check:
[loadresource] Do not set property disallowed.ivy.jars.list as its length is 0.

-ivy-fail-disallowed-ivy-version:

ivy-fail:

ivy-configure:
[ivy:configure] :: loading settings :: file = /home/jenkins/jenkins-slave/workspace/Lucene-Solr-Tests-7.x/lucene/top-level-ivy-settings.xml

resolve:

jar-checksums:
    [mkdir] Created dir: /home/jenkins/jenkins-slave/workspace/Lucene-Solr-Tests-7.x/lucene/null640881568
     [copy] Copying 39 files to /home/jenkins/jenkins-slave/workspace/Lucene-Solr-Tests-7.x/lucene/null640881568
   [delete] Deleting directory /home/jenkins/jenkins-slave/workspace/Lucene-Solr-Tests-7.x/lucene/null640881568

resolve-example:

ivy-availability-check:
[loadresource] Do not set property disallowed.ivy.jars.list as its length is 0.

-ivy-fail-disallowed-ivy-version:

ivy-fail:

ivy-configure:
[ivy:configure] :: loading settings :: file = /home/jenkins/jenkins-slave/workspace/Lucene-Solr-Tests-7.x/lucene/top-level-ivy-settings.xml

resolve:

resolve-server:

ivy-availability-check:
[loadresource] Do not set property disallowed.ivy.jars.list as its length is 0.

-ivy-fail-disallowed-ivy-version:

ivy-fail:

ivy-fail:

ivy-configure:
[ivy:configure] :: loading settings :: file = /home/jenkins/jenkins-slave/workspace/Lucene-Solr-Tests-7.x/lucene/top-level-ivy-settings.xml

resolve:

resolve:

ivy-availability-check:
[loadresource] Do not set property disallowed.ivy.jars.list as its length is 0.

-ivy-fail-disallowed-ivy-version:

ivy-fail:

ivy-fail:

ivy-configure:
[ivy:configure] :: loading settings :: file = /home/jenkins/jenkins-slave/workspace/Lucene-Solr-Tests-7.x/lucene/top-level-ivy-settings.xml

resolve:

ivy-availability-check:
[loadresource] Do not set property disallowed.ivy.jars.list as its length is 0.

-ivy-fail-disallowed-ivy-version:

ivy-fail:

ivy-fail:

ivy-configure:
[ivy:configure] :: loading settings :: file = /home/jenkins/jenkins-slave/workspace/Lucene-Solr-Tests-7.x/lucene/top-level-ivy-settings.xml

resolve:

ivy-availability-check:
[loadresource] Do not set property disallowed.ivy.jars.list as its length is 0.

-ivy-fail-disallowed-ivy-version:

ivy-fail:

ivy-configure:
[ivy:configure] :: loading settings :: file = /home/jenkins/jenkins-slave/workspace/Lucene-Solr-Tests-7.x/lucene/top-level-ivy-settings.xml

resolve:

ivy-availability-check:
[loadresource] Do not set property disallowed.ivy.jars.list as its length is 0.

-ivy-fail-disallowed-ivy-version:

ivy-fail:

ivy-fail:

ivy-configure:
[ivy:configure] :: loading settings :: file = /home/jenkins/jenkins-slave/workspace/Lucene-Solr-Tests-7.x/lucene/top-level-ivy-settings.xml

resolve:

ivy-availability-check:
[loadresource] Do not set property disallowed.ivy.jars.list as its length is 0.

-ivy-fail-disallowed-ivy-version:

ivy-fail:

ivy-configure:
[ivy:configure] :: loading settings :: file = /home/jenkins/jenkins-slave/workspace/Lucene-Solr-Tests-7.x/lucene/top-level-ivy-settings.xml

resolve:

ivy-availability-check:
[loadresource] Do not set property disallowed.ivy.jars.list as its length is 0.

-ivy-fail-disallowed-ivy-version:

ivy-fail:

ivy-fail:

ivy-configure:
[ivy:configure] :: loading settings :: file = /home/jenkins/jenkins-slave/workspace/Lucene-Solr-Tests-7.x/lucene/top-level-ivy-settings.xml

resolve:

ivy-availability-check:
[loadresource] Do not set property disallowed.ivy.jars.list as its length is 0.

-ivy-fail-disallowed-ivy-version:

ivy-fail:

ivy-fail:

ivy-configure:
[ivy:configure] :: loading settings :: file = /home/jenkins/jenkins-slave/workspace/Lucene-Solr-Tests-7.x/lucene/top-level-ivy-settings.xml

resolve:

ivy-availability-check:
[loadresource] Do not set property disallowed.ivy.jars.list as its length is 0.

-ivy-fail-disallowed-ivy-version:

ivy-fail:

ivy-fail:

ivy-configure:
[ivy:configure] :: loading settings :: file = /home/jenkins/jenkins-slave/workspace/Lucene-Solr-Tests-7.x/lucene/top-level-ivy-settings.xml

resolve:

ivy-availability-check:
[loadresource] Do not set property disallowed.ivy.jars.list as its length is 0.

-ivy-fail-disallowed-ivy-version:

ivy-fail:

ivy-fail:

ivy-configure:
[ivy:configure] :: loading settings :: file = /home/jenkins/jenkins-slave/workspace/Lucene-Solr-Tests-7.x/lucene/top-level-ivy-settings.xml

resolve:

ivy-availability-check:
[loadresource] Do not set property disallowed.ivy.jars.list as its length is 0.

-ivy-fail-disallowed-ivy-version:

ivy-fail:

ivy-fail:

ivy-configure:
[ivy:configure] :: loading settings :: file = /home/jenkins/jenkins-slave/workspace/Lucene-Solr-Tests-7.x/lucene/top-level-ivy-settings.xml

resolve:

ivy-availability-check:
[loadresource] Do not set property disallowed.ivy.jars.list as its length is 0.

-ivy-fail-disallowed-ivy-version:

ivy-fail:

ivy-fail:

ivy-configure:
[ivy:configure] :: loading settings :: file = /home/jenkins/jenkins-slave/workspace/Lucene-Solr-Tests-7.x/lucene/top-level-ivy-settings.xml

resolve:

ivy-availability-check:
[loadresource] Do not set property disallowed.ivy.jars.list as its length is 0.

-ivy-fail-disallowed-ivy-version:

ivy-fail:

ivy-fail:

ivy-configure:
[ivy:configure] :: loading settings :: file = /home/jenkins/jenkins-slave/workspace/Lucene-Solr-Tests-7.x/lucene/top-level-ivy-settings.xml

resolve:

ivy-availability-check:
[loadresource] Do not set property disallowed.ivy.jars.list as its length is 0.

-ivy-fail-disallowed-ivy-version:

ivy-fail:

ivy-fail:

ivy-configure:
[ivy:configure] :: loading settings :: file = /home/jenkins/jenkins-slave/workspace/Lucene-Solr-Tests-7.x/lucene/top-level-ivy-settings.xml

resolve:

ivy-availability-check:
[loadresource] Do not set property disallowed.ivy.jars.list as its length is 0.

-ivy-fail-disallowed-ivy-version:

ivy-fail:

ivy-fail:

ivy-configure:
[ivy:configure] :: loading settings :: file = /home/jenkins/jenkins-slave/workspace/Lucene-Solr-Tests-7.x/lucene/top-level-ivy-settings.xml

resolve:

ivy-availability-check:
[loadresource] Do not set property disallowed.ivy.jars.list as its length is 0.

-ivy-fail-disallowed-ivy-version:

ivy-fail:

ivy-fail:

ivy-configure:
[ivy:configure] :: loading settings :: file = /home/jenkins/jenkins-slave/workspace/Lucene-Solr-Tests-7.x/lucene/top-level-ivy-settings.xml

resolve:

ivy-availability-check:
[loadresource] Do not set property disallowed.ivy.jars.list as its length is 0.

-ivy-fail-disallowed-ivy-version:

ivy-fail:

ivy-fail:

ivy-configure:
[ivy:configure] :: loading settings :: file = /home/jenkins/jenkins-slave/workspace/Lucene-Solr-Tests-7.x/lucene/top-level-ivy-settings.xml

resolve:

jar-checksums:
    [mkdir] Created dir: /home/jenkins/jenkins-slave/workspace/Lucene-Solr-Tests-7.x/solr/null61225359
     [copy] Copying 247 files to /home/jenkins/jenkins-slave/workspace/Lucene-Solr-Tests-7.x/solr/null61225359
   [delete] Deleting directory /home/jenkins/jenkins-slave/workspace/Lucene-Solr-Tests-7.x/solr/null61225359

check-working-copy:
[ivy:cachepath] :: resolving dependencies :: org.eclipse.jgit#org.eclipse.jgit-caller;working
[ivy:cachepath] 	confs: [default]
[ivy:cachepath] 	found org.eclipse.jgit#org.eclipse.jgit;4.6.0.201612231935-r in public
[ivy:cachepath] 	found com.jcraft#jsch;0.1.53 in public
[ivy:cachepath] 	found com.googlecode.javaewah#JavaEWAH;1.1.6 in public
[ivy:cachepath] 	found org.apache.httpcomponents#httpclient;4.3.6 in public
[ivy:cachepath] 	found org.apache.httpcomponents#httpcore;4.3.3 in public
[ivy:cachepath] 	found commons-logging#commons-logging;1.1.3 in public
[ivy:cachepath] 	found commons-codec#commons-codec;1.6 in public
[ivy:cachepath] 	found org.slf4j#slf4j-api;1.7.2 in public
[ivy:cachepath] :: resolution report :: resolve 74ms :: artifacts dl 12ms
	---------------------------------------------------------------------
	|                  |            modules            ||   artifacts   |
	|       conf       | number| search|dwnlded|evicted|| number|dwnlded|
	---------------------------------------------------------------------
	|      default     |   8   |   0   |   0   |   0   ||   8   |   0   |
	---------------------------------------------------------------------
[wc-checker] Initializing working copy...
[wc-checker] SLF4J: Failed to load class "org.slf4j.impl.StaticLoggerBinder".
[wc-checker] SLF4J: Defaulting to no-operation (NOP) logger implementation
[wc-checker] SLF4J: See http://www.slf4j.org/codes.html#StaticLoggerBinder for further details.
[wc-checker] Checking working copy status...

-jenkins-base:

BUILD SUCCESSFUL
Total time: 190 minutes 59 seconds
Archiving artifacts
WARN: No artifacts found that match the file pattern "**/*.events,heapdumps/**,**/hs_err_pid*". Configuration error?
WARN: java.lang.InterruptedException: no matches found within 10000
Recording test results
Build step 'Publish JUnit test result report' changed build result to UNSTABLE
Email was triggered for: Unstable (Test Failures)
Sending email for trigger: Unstable (Test Failures)

Mime
View raw message