lucene-dev mailing list archives

Site index · List index
Message view « Date » · « Thread »
Top « Date » · « Thread »
From Policeman Jenkins Server <jenk...@thetaphi.de>
Subject [JENKINS] Lucene-Solr-BadApples-master-Linux (64bit/jdk-10) - Build # 44 - Unstable!
Date Sat, 02 Jun 2018 07:38:48 GMT
Build: https://jenkins.thetaphi.de/job/Lucene-Solr-BadApples-master-Linux/44/
Java: 64bit/jdk-10 -XX:+UseCompressedOops -XX:+UseSerialGC

12 tests failed.
FAILED:  junit.framework.TestSuite.org.apache.solr.cloud.autoscaling.sim.TestLargeCluster

Error Message:
Suite timeout exceeded (>= 14400000 msec).

Stack Trace:
java.lang.Exception: Suite timeout exceeded (>= 14400000 msec).
	at __randomizedtesting.SeedInfo.seed([4998C326087E645F]:0)


FAILED:  org.apache.solr.TestDistributedSearch.test

Error Message:
IOException occured when talking to server at: http://127.0.0.1:34661//collection1

Stack Trace:
org.apache.solr.client.solrj.SolrServerException: IOException occured when talking to server at: http://127.0.0.1:34661//collection1
	at __randomizedtesting.SeedInfo.seed([4998C326087E645F:C1CCFCFCA68209A7]:0)
	at org.apache.solr.client.solrj.impl.HttpSolrClient.executeMethod(HttpSolrClient.java:657)
	at org.apache.solr.client.solrj.impl.HttpSolrClient.request(HttpSolrClient.java:255)
	at org.apache.solr.client.solrj.impl.HttpSolrClient.request(HttpSolrClient.java:244)
	at org.apache.solr.client.solrj.SolrRequest.process(SolrRequest.java:194)
	at org.apache.solr.client.solrj.SolrClient.deleteByQuery(SolrClient.java:895)
	at org.apache.solr.client.solrj.SolrClient.deleteByQuery(SolrClient.java:858)
	at org.apache.solr.client.solrj.SolrClient.deleteByQuery(SolrClient.java:873)
	at org.apache.solr.BaseDistributedSearchTestCase.del(BaseDistributedSearchTestCase.java:542)
	at org.apache.solr.TestDistributedSearch.test(TestDistributedSearch.java:1035)
	at java.base/jdk.internal.reflect.NativeMethodAccessorImpl.invoke0(Native Method)
	at java.base/jdk.internal.reflect.NativeMethodAccessorImpl.invoke(NativeMethodAccessorImpl.java:62)
	at java.base/jdk.internal.reflect.DelegatingMethodAccessorImpl.invoke(DelegatingMethodAccessorImpl.java:43)
	at java.base/java.lang.reflect.Method.invoke(Method.java:564)
	at com.carrotsearch.randomizedtesting.RandomizedRunner.invoke(RandomizedRunner.java:1737)
	at com.carrotsearch.randomizedtesting.RandomizedRunner$8.evaluate(RandomizedRunner.java:934)
	at com.carrotsearch.randomizedtesting.RandomizedRunner$9.evaluate(RandomizedRunner.java:970)
	at com.carrotsearch.randomizedtesting.RandomizedRunner$10.evaluate(RandomizedRunner.java:984)
	at org.apache.solr.BaseDistributedSearchTestCase$ShardsRepeatRule$ShardsRepeatStatement.callStatement(BaseDistributedSearchTestCase.java:1019)
	at org.apache.solr.BaseDistributedSearchTestCase$ShardsRepeatRule$ShardsStatement.evaluate(BaseDistributedSearchTestCase.java:968)
	at com.carrotsearch.randomizedtesting.rules.SystemPropertiesRestoreRule$1.evaluate(SystemPropertiesRestoreRule.java:57)
	at org.apache.lucene.util.TestRuleSetupTeardownChained$1.evaluate(TestRuleSetupTeardownChained.java:49)
	at org.apache.lucene.util.AbstractBeforeAfterRule$1.evaluate(AbstractBeforeAfterRule.java:45)
	at org.apache.lucene.util.TestRuleThreadAndTestName$1.evaluate(TestRuleThreadAndTestName.java:48)
	at org.apache.lucene.util.TestRuleIgnoreAfterMaxFailures$1.evaluate(TestRuleIgnoreAfterMaxFailures.java:64)
	at org.apache.lucene.util.TestRuleMarkFailure$1.evaluate(TestRuleMarkFailure.java:47)
	at com.carrotsearch.randomizedtesting.rules.StatementAdapter.evaluate(StatementAdapter.java:36)
	at com.carrotsearch.randomizedtesting.ThreadLeakControl$StatementRunner.run(ThreadLeakControl.java:368)
	at com.carrotsearch.randomizedtesting.ThreadLeakControl.forkTimeoutingTask(ThreadLeakControl.java:817)
	at com.carrotsearch.randomizedtesting.ThreadLeakControl$3.evaluate(ThreadLeakControl.java:468)
	at com.carrotsearch.randomizedtesting.RandomizedRunner.runSingleTest(RandomizedRunner.java:943)
	at com.carrotsearch.randomizedtesting.RandomizedRunner$5.evaluate(RandomizedRunner.java:829)
	at com.carrotsearch.randomizedtesting.RandomizedRunner$6.evaluate(RandomizedRunner.java:879)
	at com.carrotsearch.randomizedtesting.RandomizedRunner$7.evaluate(RandomizedRunner.java:890)
	at com.carrotsearch.randomizedtesting.rules.StatementAdapter.evaluate(StatementAdapter.java:36)
	at com.carrotsearch.randomizedtesting.rules.SystemPropertiesRestoreRule$1.evaluate(SystemPropertiesRestoreRule.java:57)
	at org.apache.lucene.util.AbstractBeforeAfterRule$1.evaluate(AbstractBeforeAfterRule.java:45)
	at com.carrotsearch.randomizedtesting.rules.StatementAdapter.evaluate(StatementAdapter.java:36)
	at org.apache.lucene.util.TestRuleStoreClassName$1.evaluate(TestRuleStoreClassName.java:41)
	at com.carrotsearch.randomizedtesting.rules.NoShadowingOrOverridesOnMethodsRule$1.evaluate(NoShadowingOrOverridesOnMethodsRule.java:40)
	at com.carrotsearch.randomizedtesting.rules.NoShadowingOrOverridesOnMethodsRule$1.evaluate(NoShadowingOrOverridesOnMethodsRule.java:40)
	at com.carrotsearch.randomizedtesting.rules.StatementAdapter.evaluate(StatementAdapter.java:36)
	at com.carrotsearch.randomizedtesting.rules.StatementAdapter.evaluate(StatementAdapter.java:36)
	at org.apache.lucene.util.TestRuleAssertionsRequired$1.evaluate(TestRuleAssertionsRequired.java:53)
	at org.apache.lucene.util.TestRuleMarkFailure$1.evaluate(TestRuleMarkFailure.java:47)
	at org.apache.lucene.util.TestRuleIgnoreAfterMaxFailures$1.evaluate(TestRuleIgnoreAfterMaxFailures.java:64)
	at org.apache.lucene.util.TestRuleIgnoreTestSuites$1.evaluate(TestRuleIgnoreTestSuites.java:54)
	at com.carrotsearch.randomizedtesting.rules.StatementAdapter.evaluate(StatementAdapter.java:36)
	at com.carrotsearch.randomizedtesting.ThreadLeakControl$StatementRunner.run(ThreadLeakControl.java:368)
	at java.base/java.lang.Thread.run(Thread.java:844)
Caused by: org.apache.http.NoHttpResponseException: 127.0.0.1:34661 failed to respond
	at org.apache.http.impl.conn.DefaultHttpResponseParser.parseHead(DefaultHttpResponseParser.java:141)
	at org.apache.http.impl.conn.DefaultHttpResponseParser.parseHead(DefaultHttpResponseParser.java:56)
	at org.apache.http.impl.io.AbstractMessageParser.parse(AbstractMessageParser.java:259)
	at org.apache.http.impl.DefaultBHttpClientConnection.receiveResponseHeader(DefaultBHttpClientConnection.java:163)
	at org.apache.http.impl.conn.CPoolProxy.receiveResponseHeader(CPoolProxy.java:165)
	at org.apache.http.protocol.HttpRequestExecutor.doReceiveResponse(HttpRequestExecutor.java:273)
	at org.apache.http.protocol.HttpRequestExecutor.execute(HttpRequestExecutor.java:125)
	at org.apache.http.impl.execchain.MainClientExec.execute(MainClientExec.java:272)
	at org.apache.http.impl.execchain.ProtocolExec.execute(ProtocolExec.java:185)
	at org.apache.http.impl.execchain.RetryExec.execute(RetryExec.java:89)
	at org.apache.http.impl.execchain.RedirectExec.execute(RedirectExec.java:111)
	at org.apache.http.impl.client.InternalHttpClient.doExecute(InternalHttpClient.java:185)
	at org.apache.http.impl.client.CloseableHttpClient.execute(CloseableHttpClient.java:83)
	at org.apache.http.impl.client.CloseableHttpClient.execute(CloseableHttpClient.java:56)
	at org.apache.solr.client.solrj.impl.HttpSolrClient.executeMethod(HttpSolrClient.java:542)
	... 48 more


FAILED:  org.apache.solr.cloud.autoscaling.sim.TestLargeCluster.testAddNode

Error Message:
java.util.concurrent.ExecutionException: java.io.IOException: java.lang.NullPointerException

Stack Trace:
java.io.IOException: java.util.concurrent.ExecutionException: java.io.IOException: java.lang.NullPointerException
	at __randomizedtesting.SeedInfo.seed([4998C326087E645F:EE77DE85C733EB47]:0)
	at org.apache.solr.cloud.autoscaling.sim.SimCloudManager.request(SimCloudManager.java:621)
	at org.apache.solr.cloud.autoscaling.sim.SimCloudManager$1.request(SimCloudManager.java:210)
	at org.apache.solr.client.solrj.SolrClient.request(SolrClient.java:1219)
	at org.apache.solr.cloud.autoscaling.sim.TestLargeCluster.setupTest(TestLargeCluster.java:108)
	at java.base/jdk.internal.reflect.NativeMethodAccessorImpl.invoke0(Native Method)
	at java.base/jdk.internal.reflect.NativeMethodAccessorImpl.invoke(NativeMethodAccessorImpl.java:62)
	at java.base/jdk.internal.reflect.DelegatingMethodAccessorImpl.invoke(DelegatingMethodAccessorImpl.java:43)
	at java.base/java.lang.reflect.Method.invoke(Method.java:564)
	at com.carrotsearch.randomizedtesting.RandomizedRunner.invoke(RandomizedRunner.java:1737)
	at com.carrotsearch.randomizedtesting.RandomizedRunner$9.evaluate(RandomizedRunner.java:968)
	at com.carrotsearch.randomizedtesting.RandomizedRunner$10.evaluate(RandomizedRunner.java:984)
	at com.carrotsearch.randomizedtesting.rules.SystemPropertiesRestoreRule$1.evaluate(SystemPropertiesRestoreRule.java:57)
	at org.apache.lucene.util.TestRuleSetupTeardownChained$1.evaluate(TestRuleSetupTeardownChained.java:49)
	at org.apache.lucene.util.AbstractBeforeAfterRule$1.evaluate(AbstractBeforeAfterRule.java:45)
	at org.apache.lucene.util.TestRuleThreadAndTestName$1.evaluate(TestRuleThreadAndTestName.java:48)
	at org.apache.lucene.util.TestRuleIgnoreAfterMaxFailures$1.evaluate(TestRuleIgnoreAfterMaxFailures.java:64)
	at org.apache.lucene.util.TestRuleMarkFailure$1.evaluate(TestRuleMarkFailure.java:47)
	at com.carrotsearch.randomizedtesting.rules.StatementAdapter.evaluate(StatementAdapter.java:36)
	at com.carrotsearch.randomizedtesting.ThreadLeakControl$StatementRunner.run(ThreadLeakControl.java:368)
	at com.carrotsearch.randomizedtesting.ThreadLeakControl.forkTimeoutingTask(ThreadLeakControl.java:817)
	at com.carrotsearch.randomizedtesting.ThreadLeakControl$3.evaluate(ThreadLeakControl.java:468)
	at com.carrotsearch.randomizedtesting.RandomizedRunner.runSingleTest(RandomizedRunner.java:943)
	at com.carrotsearch.randomizedtesting.RandomizedRunner$5.evaluate(RandomizedRunner.java:829)
	at com.carrotsearch.randomizedtesting.RandomizedRunner$6.evaluate(RandomizedRunner.java:879)
	at com.carrotsearch.randomizedtesting.RandomizedRunner$7.evaluate(RandomizedRunner.java:890)
	at com.carrotsearch.randomizedtesting.rules.StatementAdapter.evaluate(StatementAdapter.java:36)
	at com.carrotsearch.randomizedtesting.rules.SystemPropertiesRestoreRule$1.evaluate(SystemPropertiesRestoreRule.java:57)
	at org.apache.lucene.util.AbstractBeforeAfterRule$1.evaluate(AbstractBeforeAfterRule.java:45)
	at com.carrotsearch.randomizedtesting.rules.StatementAdapter.evaluate(StatementAdapter.java:36)
	at org.apache.lucene.util.TestRuleStoreClassName$1.evaluate(TestRuleStoreClassName.java:41)
	at com.carrotsearch.randomizedtesting.rules.NoShadowingOrOverridesOnMethodsRule$1.evaluate(NoShadowingOrOverridesOnMethodsRule.java:40)
	at com.carrotsearch.randomizedtesting.rules.NoShadowingOrOverridesOnMethodsRule$1.evaluate(NoShadowingOrOverridesOnMethodsRule.java:40)
	at com.carrotsearch.randomizedtesting.rules.StatementAdapter.evaluate(StatementAdapter.java:36)
	at com.carrotsearch.randomizedtesting.rules.StatementAdapter.evaluate(StatementAdapter.java:36)
	at org.apache.lucene.util.TestRuleAssertionsRequired$1.evaluate(TestRuleAssertionsRequired.java:53)
	at org.apache.lucene.util.TestRuleMarkFailure$1.evaluate(TestRuleMarkFailure.java:47)
	at org.apache.lucene.util.TestRuleIgnoreAfterMaxFailures$1.evaluate(TestRuleIgnoreAfterMaxFailures.java:64)
	at org.apache.lucene.util.TestRuleIgnoreTestSuites$1.evaluate(TestRuleIgnoreTestSuites.java:54)
	at com.carrotsearch.randomizedtesting.rules.StatementAdapter.evaluate(StatementAdapter.java:36)
	at com.carrotsearch.randomizedtesting.ThreadLeakControl$StatementRunner.run(ThreadLeakControl.java:368)
	at java.base/java.lang.Thread.run(Thread.java:844)
Caused by: java.util.concurrent.ExecutionException: java.io.IOException: java.lang.NullPointerException
	at java.base/java.util.concurrent.FutureTask.report(FutureTask.java:122)
	at java.base/java.util.concurrent.FutureTask.get(FutureTask.java:191)
	at org.apache.solr.cloud.autoscaling.sim.SimCloudManager.request(SimCloudManager.java:619)
	... 40 more
Caused by: java.io.IOException: java.lang.NullPointerException
	at org.apache.solr.cloud.autoscaling.sim.SimCloudManager.simHandleSolrRequest(SimCloudManager.java:679)
	at org.apache.solr.cloud.autoscaling.sim.SimCloudManager.lambda$request$15(SimCloudManager.java:618)
	at java.base/java.util.concurrent.FutureTask.run(FutureTask.java:264)
	at org.apache.solr.common.util.ExecutorUtil$MDCAwareThreadPoolExecutor.lambda$execute$0(ExecutorUtil.java:209)
	at java.base/java.util.concurrent.ThreadPoolExecutor.runWorker(ThreadPoolExecutor.java:1135)
	at java.base/java.util.concurrent.ThreadPoolExecutor$Worker.run(ThreadPoolExecutor.java:635)
	... 1 more
Caused by: java.lang.NullPointerException
	at org.apache.solr.client.solrj.cloud.autoscaling.Preference.compare(Preference.java:72)
	at org.apache.solr.client.solrj.cloud.autoscaling.Policy.setApproxValuesAndSortNodes(Policy.java:390)
	at org.apache.solr.client.solrj.cloud.autoscaling.Policy$Session.applyRules(Policy.java:315)
	at org.apache.solr.client.solrj.cloud.autoscaling.Policy$Session.<init>(Policy.java:277)
	at org.apache.solr.client.solrj.cloud.autoscaling.Policy.createSession(Policy.java:413)
	at org.apache.solr.cloud.autoscaling.AutoScalingHandler.verifyAutoScalingConf(AutoScalingHandler.java:663)
	at org.apache.solr.cloud.autoscaling.AutoScalingHandler.setAutoScalingConfig(AutoScalingHandler.java:650)
	at org.apache.solr.cloud.autoscaling.AutoScalingHandler.processOps(AutoScalingHandler.java:215)
	at org.apache.solr.cloud.autoscaling.AutoScalingHandler.handleRequestBody(AutoScalingHandler.java:148)
	at org.apache.solr.handler.RequestHandlerBase.handleRequest(RequestHandlerBase.java:199)
	at org.apache.solr.cloud.autoscaling.sim.SimCloudManager.simHandleSolrRequest(SimCloudManager.java:669)
	... 6 more


FAILED:  org.apache.solr.cloud.autoscaling.sim.TestLargeCluster.testNodeLost

Error Message:
java.util.concurrent.ExecutionException: java.io.IOException: java.lang.NullPointerException

Stack Trace:
java.io.IOException: java.util.concurrent.ExecutionException: java.io.IOException: java.lang.NullPointerException
	at __randomizedtesting.SeedInfo.seed([4998C326087E645F:F68D0DD88B9401D9]:0)
	at org.apache.solr.cloud.autoscaling.sim.SimCloudManager.request(SimCloudManager.java:621)
	at org.apache.solr.cloud.autoscaling.sim.SimCloudManager$1.request(SimCloudManager.java:210)
	at org.apache.solr.client.solrj.SolrClient.request(SolrClient.java:1219)
	at org.apache.solr.cloud.autoscaling.sim.TestLargeCluster.setupTest(TestLargeCluster.java:108)
	at java.base/jdk.internal.reflect.NativeMethodAccessorImpl.invoke0(Native Method)
	at java.base/jdk.internal.reflect.NativeMethodAccessorImpl.invoke(NativeMethodAccessorImpl.java:62)
	at java.base/jdk.internal.reflect.DelegatingMethodAccessorImpl.invoke(DelegatingMethodAccessorImpl.java:43)
	at java.base/java.lang.reflect.Method.invoke(Method.java:564)
	at com.carrotsearch.randomizedtesting.RandomizedRunner.invoke(RandomizedRunner.java:1737)
	at com.carrotsearch.randomizedtesting.RandomizedRunner$9.evaluate(RandomizedRunner.java:968)
	at com.carrotsearch.randomizedtesting.RandomizedRunner$10.evaluate(RandomizedRunner.java:984)
	at com.carrotsearch.randomizedtesting.rules.SystemPropertiesRestoreRule$1.evaluate(SystemPropertiesRestoreRule.java:57)
	at org.apache.lucene.util.TestRuleSetupTeardownChained$1.evaluate(TestRuleSetupTeardownChained.java:49)
	at org.apache.lucene.util.AbstractBeforeAfterRule$1.evaluate(AbstractBeforeAfterRule.java:45)
	at org.apache.lucene.util.TestRuleThreadAndTestName$1.evaluate(TestRuleThreadAndTestName.java:48)
	at org.apache.lucene.util.TestRuleIgnoreAfterMaxFailures$1.evaluate(TestRuleIgnoreAfterMaxFailures.java:64)
	at org.apache.lucene.util.TestRuleMarkFailure$1.evaluate(TestRuleMarkFailure.java:47)
	at com.carrotsearch.randomizedtesting.rules.StatementAdapter.evaluate(StatementAdapter.java:36)
	at com.carrotsearch.randomizedtesting.ThreadLeakControl$StatementRunner.run(ThreadLeakControl.java:368)
	at com.carrotsearch.randomizedtesting.ThreadLeakControl.forkTimeoutingTask(ThreadLeakControl.java:817)
	at com.carrotsearch.randomizedtesting.ThreadLeakControl$3.evaluate(ThreadLeakControl.java:468)
	at com.carrotsearch.randomizedtesting.RandomizedRunner.runSingleTest(RandomizedRunner.java:943)
	at com.carrotsearch.randomizedtesting.RandomizedRunner$5.evaluate(RandomizedRunner.java:829)
	at com.carrotsearch.randomizedtesting.RandomizedRunner$6.evaluate(RandomizedRunner.java:879)
	at com.carrotsearch.randomizedtesting.RandomizedRunner$7.evaluate(RandomizedRunner.java:890)
	at com.carrotsearch.randomizedtesting.rules.StatementAdapter.evaluate(StatementAdapter.java:36)
	at com.carrotsearch.randomizedtesting.rules.SystemPropertiesRestoreRule$1.evaluate(SystemPropertiesRestoreRule.java:57)
	at org.apache.lucene.util.AbstractBeforeAfterRule$1.evaluate(AbstractBeforeAfterRule.java:45)
	at com.carrotsearch.randomizedtesting.rules.StatementAdapter.evaluate(StatementAdapter.java:36)
	at org.apache.lucene.util.TestRuleStoreClassName$1.evaluate(TestRuleStoreClassName.java:41)
	at com.carrotsearch.randomizedtesting.rules.NoShadowingOrOverridesOnMethodsRule$1.evaluate(NoShadowingOrOverridesOnMethodsRule.java:40)
	at com.carrotsearch.randomizedtesting.rules.NoShadowingOrOverridesOnMethodsRule$1.evaluate(NoShadowingOrOverridesOnMethodsRule.java:40)
	at com.carrotsearch.randomizedtesting.rules.StatementAdapter.evaluate(StatementAdapter.java:36)
	at com.carrotsearch.randomizedtesting.rules.StatementAdapter.evaluate(StatementAdapter.java:36)
	at org.apache.lucene.util.TestRuleAssertionsRequired$1.evaluate(TestRuleAssertionsRequired.java:53)
	at org.apache.lucene.util.TestRuleMarkFailure$1.evaluate(TestRuleMarkFailure.java:47)
	at org.apache.lucene.util.TestRuleIgnoreAfterMaxFailures$1.evaluate(TestRuleIgnoreAfterMaxFailures.java:64)
	at org.apache.lucene.util.TestRuleIgnoreTestSuites$1.evaluate(TestRuleIgnoreTestSuites.java:54)
	at com.carrotsearch.randomizedtesting.rules.StatementAdapter.evaluate(StatementAdapter.java:36)
	at com.carrotsearch.randomizedtesting.ThreadLeakControl$StatementRunner.run(ThreadLeakControl.java:368)
	at java.base/java.lang.Thread.run(Thread.java:844)
Caused by: java.util.concurrent.ExecutionException: java.io.IOException: java.lang.NullPointerException
	at java.base/java.util.concurrent.FutureTask.report(FutureTask.java:122)
	at java.base/java.util.concurrent.FutureTask.get(FutureTask.java:191)
	at org.apache.solr.cloud.autoscaling.sim.SimCloudManager.request(SimCloudManager.java:619)
	... 40 more
Caused by: java.io.IOException: java.lang.NullPointerException
	at org.apache.solr.cloud.autoscaling.sim.SimCloudManager.simHandleSolrRequest(SimCloudManager.java:679)
	at org.apache.solr.cloud.autoscaling.sim.SimCloudManager.lambda$request$15(SimCloudManager.java:618)
	at java.base/java.util.concurrent.FutureTask.run(FutureTask.java:264)
	at org.apache.solr.common.util.ExecutorUtil$MDCAwareThreadPoolExecutor.lambda$execute$0(ExecutorUtil.java:209)
	at java.base/java.util.concurrent.ThreadPoolExecutor.runWorker(ThreadPoolExecutor.java:1135)
	at java.base/java.util.concurrent.ThreadPoolExecutor$Worker.run(ThreadPoolExecutor.java:635)
	... 1 more
Caused by: java.lang.NullPointerException
	at org.apache.solr.client.solrj.cloud.autoscaling.Preference.compare(Preference.java:72)
	at org.apache.solr.client.solrj.cloud.autoscaling.Policy.setApproxValuesAndSortNodes(Policy.java:390)
	at org.apache.solr.client.solrj.cloud.autoscaling.Policy$Session.applyRules(Policy.java:315)
	at org.apache.solr.client.solrj.cloud.autoscaling.Policy$Session.<init>(Policy.java:277)
	at org.apache.solr.client.solrj.cloud.autoscaling.Policy.createSession(Policy.java:413)
	at org.apache.solr.cloud.autoscaling.AutoScalingHandler.verifyAutoScalingConf(AutoScalingHandler.java:663)
	at org.apache.solr.cloud.autoscaling.AutoScalingHandler.setAutoScalingConfig(AutoScalingHandler.java:650)
	at org.apache.solr.cloud.autoscaling.AutoScalingHandler.processOps(AutoScalingHandler.java:215)
	at org.apache.solr.cloud.autoscaling.AutoScalingHandler.handleRequestBody(AutoScalingHandler.java:148)
	at org.apache.solr.handler.RequestHandlerBase.handleRequest(RequestHandlerBase.java:199)
	at org.apache.solr.cloud.autoscaling.sim.SimCloudManager.simHandleSolrRequest(SimCloudManager.java:669)
	... 6 more


FAILED:  org.apache.solr.cloud.autoscaling.sim.TestLargeCluster.testAddNode

Error Message:
java.util.concurrent.ExecutionException: java.io.IOException: java.lang.NullPointerException

Stack Trace:
java.io.IOException: java.util.concurrent.ExecutionException: java.io.IOException: java.lang.NullPointerException
	at __randomizedtesting.SeedInfo.seed([4998C326087E645F:EE77DE85C733EB47]:0)
	at org.apache.solr.cloud.autoscaling.sim.SimCloudManager.request(SimCloudManager.java:621)
	at org.apache.solr.cloud.autoscaling.sim.SimCloudManager$1.request(SimCloudManager.java:210)
	at org.apache.solr.client.solrj.SolrClient.request(SolrClient.java:1219)
	at org.apache.solr.cloud.autoscaling.sim.TestLargeCluster.setupTest(TestLargeCluster.java:108)
	at java.base/jdk.internal.reflect.NativeMethodAccessorImpl.invoke0(Native Method)
	at java.base/jdk.internal.reflect.NativeMethodAccessorImpl.invoke(NativeMethodAccessorImpl.java:62)
	at java.base/jdk.internal.reflect.DelegatingMethodAccessorImpl.invoke(DelegatingMethodAccessorImpl.java:43)
	at java.base/java.lang.reflect.Method.invoke(Method.java:564)
	at com.carrotsearch.randomizedtesting.RandomizedRunner.invoke(RandomizedRunner.java:1737)
	at com.carrotsearch.randomizedtesting.RandomizedRunner$9.evaluate(RandomizedRunner.java:968)
	at com.carrotsearch.randomizedtesting.RandomizedRunner$10.evaluate(RandomizedRunner.java:984)
	at com.carrotsearch.randomizedtesting.rules.SystemPropertiesRestoreRule$1.evaluate(SystemPropertiesRestoreRule.java:57)
	at org.apache.lucene.util.TestRuleSetupTeardownChained$1.evaluate(TestRuleSetupTeardownChained.java:49)
	at org.apache.lucene.util.AbstractBeforeAfterRule$1.evaluate(AbstractBeforeAfterRule.java:45)
	at org.apache.lucene.util.TestRuleThreadAndTestName$1.evaluate(TestRuleThreadAndTestName.java:48)
	at org.apache.lucene.util.TestRuleIgnoreAfterMaxFailures$1.evaluate(TestRuleIgnoreAfterMaxFailures.java:64)
	at org.apache.lucene.util.TestRuleMarkFailure$1.evaluate(TestRuleMarkFailure.java:47)
	at com.carrotsearch.randomizedtesting.rules.StatementAdapter.evaluate(StatementAdapter.java:36)
	at com.carrotsearch.randomizedtesting.ThreadLeakControl$StatementRunner.run(ThreadLeakControl.java:368)
	at com.carrotsearch.randomizedtesting.ThreadLeakControl.forkTimeoutingTask(ThreadLeakControl.java:817)
	at com.carrotsearch.randomizedtesting.ThreadLeakControl$3.evaluate(ThreadLeakControl.java:468)
	at com.carrotsearch.randomizedtesting.RandomizedRunner.runSingleTest(RandomizedRunner.java:943)
	at com.carrotsearch.randomizedtesting.RandomizedRunner$5.evaluate(RandomizedRunner.java:829)
	at com.carrotsearch.randomizedtesting.RandomizedRunner$6.evaluate(RandomizedRunner.java:879)
	at com.carrotsearch.randomizedtesting.RandomizedRunner$7.evaluate(RandomizedRunner.java:890)
	at com.carrotsearch.randomizedtesting.rules.StatementAdapter.evaluate(StatementAdapter.java:36)
	at com.carrotsearch.randomizedtesting.rules.SystemPropertiesRestoreRule$1.evaluate(SystemPropertiesRestoreRule.java:57)
	at org.apache.lucene.util.AbstractBeforeAfterRule$1.evaluate(AbstractBeforeAfterRule.java:45)
	at com.carrotsearch.randomizedtesting.rules.StatementAdapter.evaluate(StatementAdapter.java:36)
	at org.apache.lucene.util.TestRuleStoreClassName$1.evaluate(TestRuleStoreClassName.java:41)
	at com.carrotsearch.randomizedtesting.rules.NoShadowingOrOverridesOnMethodsRule$1.evaluate(NoShadowingOrOverridesOnMethodsRule.java:40)
	at com.carrotsearch.randomizedtesting.rules.NoShadowingOrOverridesOnMethodsRule$1.evaluate(NoShadowingOrOverridesOnMethodsRule.java:40)
	at com.carrotsearch.randomizedtesting.rules.StatementAdapter.evaluate(StatementAdapter.java:36)
	at com.carrotsearch.randomizedtesting.rules.StatementAdapter.evaluate(StatementAdapter.java:36)
	at org.apache.lucene.util.TestRuleAssertionsRequired$1.evaluate(TestRuleAssertionsRequired.java:53)
	at org.apache.lucene.util.TestRuleMarkFailure$1.evaluate(TestRuleMarkFailure.java:47)
	at org.apache.lucene.util.TestRuleIgnoreAfterMaxFailures$1.evaluate(TestRuleIgnoreAfterMaxFailures.java:64)
	at org.apache.lucene.util.TestRuleIgnoreTestSuites$1.evaluate(TestRuleIgnoreTestSuites.java:54)
	at com.carrotsearch.randomizedtesting.rules.StatementAdapter.evaluate(StatementAdapter.java:36)
	at com.carrotsearch.randomizedtesting.ThreadLeakControl$StatementRunner.run(ThreadLeakControl.java:368)
	at java.base/java.lang.Thread.run(Thread.java:844)
Caused by: java.util.concurrent.ExecutionException: java.io.IOException: java.lang.NullPointerException
	at java.base/java.util.concurrent.FutureTask.report(FutureTask.java:122)
	at java.base/java.util.concurrent.FutureTask.get(FutureTask.java:191)
	at org.apache.solr.cloud.autoscaling.sim.SimCloudManager.request(SimCloudManager.java:619)
	... 40 more
Caused by: java.io.IOException: java.lang.NullPointerException
	at org.apache.solr.cloud.autoscaling.sim.SimCloudManager.simHandleSolrRequest(SimCloudManager.java:679)
	at org.apache.solr.cloud.autoscaling.sim.SimCloudManager.lambda$request$15(SimCloudManager.java:618)
	at java.base/java.util.concurrent.FutureTask.run(FutureTask.java:264)
	at org.apache.solr.common.util.ExecutorUtil$MDCAwareThreadPoolExecutor.lambda$execute$0(ExecutorUtil.java:209)
	at java.base/java.util.concurrent.ThreadPoolExecutor.runWorker(ThreadPoolExecutor.java:1135)
	at java.base/java.util.concurrent.ThreadPoolExecutor$Worker.run(ThreadPoolExecutor.java:635)
	... 1 more
Caused by: java.lang.NullPointerException
	at org.apache.solr.client.solrj.cloud.autoscaling.Preference.compare(Preference.java:72)
	at org.apache.solr.client.solrj.cloud.autoscaling.Policy.setApproxValuesAndSortNodes(Policy.java:390)
	at org.apache.solr.client.solrj.cloud.autoscaling.Policy$Session.applyRules(Policy.java:315)
	at org.apache.solr.client.solrj.cloud.autoscaling.Policy$Session.<init>(Policy.java:277)
	at org.apache.solr.client.solrj.cloud.autoscaling.Policy.createSession(Policy.java:413)
	at org.apache.solr.cloud.autoscaling.AutoScalingHandler.verifyAutoScalingConf(AutoScalingHandler.java:663)
	at org.apache.solr.cloud.autoscaling.AutoScalingHandler.setAutoScalingConfig(AutoScalingHandler.java:650)
	at org.apache.solr.cloud.autoscaling.AutoScalingHandler.processOps(AutoScalingHandler.java:215)
	at org.apache.solr.cloud.autoscaling.AutoScalingHandler.handleRequestBody(AutoScalingHandler.java:148)
	at org.apache.solr.handler.RequestHandlerBase.handleRequest(RequestHandlerBase.java:199)
	at org.apache.solr.cloud.autoscaling.sim.SimCloudManager.simHandleSolrRequest(SimCloudManager.java:669)
	... 6 more


FAILED:  org.apache.solr.cloud.autoscaling.sim.TestLargeCluster.testNodeLost

Error Message:
java.util.concurrent.ExecutionException: java.io.IOException: java.lang.NullPointerException

Stack Trace:
java.io.IOException: java.util.concurrent.ExecutionException: java.io.IOException: java.lang.NullPointerException
	at __randomizedtesting.SeedInfo.seed([4998C326087E645F:F68D0DD88B9401D9]:0)
	at org.apache.solr.cloud.autoscaling.sim.SimCloudManager.request(SimCloudManager.java:621)
	at org.apache.solr.cloud.autoscaling.sim.SimCloudManager$1.request(SimCloudManager.java:210)
	at org.apache.solr.client.solrj.SolrClient.request(SolrClient.java:1219)
	at org.apache.solr.cloud.autoscaling.sim.TestLargeCluster.setupTest(TestLargeCluster.java:108)
	at java.base/jdk.internal.reflect.NativeMethodAccessorImpl.invoke0(Native Method)
	at java.base/jdk.internal.reflect.NativeMethodAccessorImpl.invoke(NativeMethodAccessorImpl.java:62)
	at java.base/jdk.internal.reflect.DelegatingMethodAccessorImpl.invoke(DelegatingMethodAccessorImpl.java:43)
	at java.base/java.lang.reflect.Method.invoke(Method.java:564)
	at com.carrotsearch.randomizedtesting.RandomizedRunner.invoke(RandomizedRunner.java:1737)
	at com.carrotsearch.randomizedtesting.RandomizedRunner$9.evaluate(RandomizedRunner.java:968)
	at com.carrotsearch.randomizedtesting.RandomizedRunner$10.evaluate(RandomizedRunner.java:984)
	at com.carrotsearch.randomizedtesting.rules.SystemPropertiesRestoreRule$1.evaluate(SystemPropertiesRestoreRule.java:57)
	at org.apache.lucene.util.TestRuleSetupTeardownChained$1.evaluate(TestRuleSetupTeardownChained.java:49)
	at org.apache.lucene.util.AbstractBeforeAfterRule$1.evaluate(AbstractBeforeAfterRule.java:45)
	at org.apache.lucene.util.TestRuleThreadAndTestName$1.evaluate(TestRuleThreadAndTestName.java:48)
	at org.apache.lucene.util.TestRuleIgnoreAfterMaxFailures$1.evaluate(TestRuleIgnoreAfterMaxFailures.java:64)
	at org.apache.lucene.util.TestRuleMarkFailure$1.evaluate(TestRuleMarkFailure.java:47)
	at com.carrotsearch.randomizedtesting.rules.StatementAdapter.evaluate(StatementAdapter.java:36)
	at com.carrotsearch.randomizedtesting.ThreadLeakControl$StatementRunner.run(ThreadLeakControl.java:368)
	at com.carrotsearch.randomizedtesting.ThreadLeakControl.forkTimeoutingTask(ThreadLeakControl.java:817)
	at com.carrotsearch.randomizedtesting.ThreadLeakControl$3.evaluate(ThreadLeakControl.java:468)
	at com.carrotsearch.randomizedtesting.RandomizedRunner.runSingleTest(RandomizedRunner.java:943)
	at com.carrotsearch.randomizedtesting.RandomizedRunner$5.evaluate(RandomizedRunner.java:829)
	at com.carrotsearch.randomizedtesting.RandomizedRunner$6.evaluate(RandomizedRunner.java:879)
	at com.carrotsearch.randomizedtesting.RandomizedRunner$7.evaluate(RandomizedRunner.java:890)
	at com.carrotsearch.randomizedtesting.rules.StatementAdapter.evaluate(StatementAdapter.java:36)
	at com.carrotsearch.randomizedtesting.rules.SystemPropertiesRestoreRule$1.evaluate(SystemPropertiesRestoreRule.java:57)
	at org.apache.lucene.util.AbstractBeforeAfterRule$1.evaluate(AbstractBeforeAfterRule.java:45)
	at com.carrotsearch.randomizedtesting.rules.StatementAdapter.evaluate(StatementAdapter.java:36)
	at org.apache.lucene.util.TestRuleStoreClassName$1.evaluate(TestRuleStoreClassName.java:41)
	at com.carrotsearch.randomizedtesting.rules.NoShadowingOrOverridesOnMethodsRule$1.evaluate(NoShadowingOrOverridesOnMethodsRule.java:40)
	at com.carrotsearch.randomizedtesting.rules.NoShadowingOrOverridesOnMethodsRule$1.evaluate(NoShadowingOrOverridesOnMethodsRule.java:40)
	at com.carrotsearch.randomizedtesting.rules.StatementAdapter.evaluate(StatementAdapter.java:36)
	at com.carrotsearch.randomizedtesting.rules.StatementAdapter.evaluate(StatementAdapter.java:36)
	at org.apache.lucene.util.TestRuleAssertionsRequired$1.evaluate(TestRuleAssertionsRequired.java:53)
	at org.apache.lucene.util.TestRuleMarkFailure$1.evaluate(TestRuleMarkFailure.java:47)
	at org.apache.lucene.util.TestRuleIgnoreAfterMaxFailures$1.evaluate(TestRuleIgnoreAfterMaxFailures.java:64)
	at org.apache.lucene.util.TestRuleIgnoreTestSuites$1.evaluate(TestRuleIgnoreTestSuites.java:54)
	at com.carrotsearch.randomizedtesting.rules.StatementAdapter.evaluate(StatementAdapter.java:36)
	at com.carrotsearch.randomizedtesting.ThreadLeakControl$StatementRunner.run(ThreadLeakControl.java:368)
	at java.base/java.lang.Thread.run(Thread.java:844)
Caused by: java.util.concurrent.ExecutionException: java.io.IOException: java.lang.NullPointerException
	at java.base/java.util.concurrent.FutureTask.report(FutureTask.java:122)
	at java.base/java.util.concurrent.FutureTask.get(FutureTask.java:191)
	at org.apache.solr.cloud.autoscaling.sim.SimCloudManager.request(SimCloudManager.java:619)
	... 40 more
Caused by: java.io.IOException: java.lang.NullPointerException
	at org.apache.solr.cloud.autoscaling.sim.SimCloudManager.simHandleSolrRequest(SimCloudManager.java:679)
	at org.apache.solr.cloud.autoscaling.sim.SimCloudManager.lambda$request$15(SimCloudManager.java:618)
	at java.base/java.util.concurrent.FutureTask.run(FutureTask.java:264)
	at org.apache.solr.common.util.ExecutorUtil$MDCAwareThreadPoolExecutor.lambda$execute$0(ExecutorUtil.java:209)
	at java.base/java.util.concurrent.ThreadPoolExecutor.runWorker(ThreadPoolExecutor.java:1135)
	at java.base/java.util.concurrent.ThreadPoolExecutor$Worker.run(ThreadPoolExecutor.java:635)
	... 1 more
Caused by: java.lang.NullPointerException
	at org.apache.solr.client.solrj.cloud.autoscaling.Preference.compare(Preference.java:72)
	at org.apache.solr.client.solrj.cloud.autoscaling.Policy.setApproxValuesAndSortNodes(Policy.java:390)
	at org.apache.solr.client.solrj.cloud.autoscaling.Policy$Session.applyRules(Policy.java:315)
	at org.apache.solr.client.solrj.cloud.autoscaling.Policy$Session.<init>(Policy.java:277)
	at org.apache.solr.client.solrj.cloud.autoscaling.Policy.createSession(Policy.java:413)
	at org.apache.solr.cloud.autoscaling.AutoScalingHandler.verifyAutoScalingConf(AutoScalingHandler.java:663)
	at org.apache.solr.cloud.autoscaling.AutoScalingHandler.setAutoScalingConfig(AutoScalingHandler.java:650)
	at org.apache.solr.cloud.autoscaling.AutoScalingHandler.processOps(AutoScalingHandler.java:215)
	at org.apache.solr.cloud.autoscaling.AutoScalingHandler.handleRequestBody(AutoScalingHandler.java:148)
	at org.apache.solr.handler.RequestHandlerBase.handleRequest(RequestHandlerBase.java:199)
	at org.apache.solr.cloud.autoscaling.sim.SimCloudManager.simHandleSolrRequest(SimCloudManager.java:669)
	... 6 more


FAILED:  org.apache.solr.cloud.autoscaling.sim.TestLargeCluster.testAddNode

Error Message:
java.util.concurrent.ExecutionException: java.io.IOException: java.lang.NullPointerException

Stack Trace:
java.io.IOException: java.util.concurrent.ExecutionException: java.io.IOException: java.lang.NullPointerException
	at __randomizedtesting.SeedInfo.seed([4998C326087E645F:EE77DE85C733EB47]:0)
	at org.apache.solr.cloud.autoscaling.sim.SimCloudManager.request(SimCloudManager.java:621)
	at org.apache.solr.cloud.autoscaling.sim.SimCloudManager$1.request(SimCloudManager.java:210)
	at org.apache.solr.client.solrj.SolrClient.request(SolrClient.java:1219)
	at org.apache.solr.cloud.autoscaling.sim.TestLargeCluster.setupTest(TestLargeCluster.java:108)
	at java.base/jdk.internal.reflect.NativeMethodAccessorImpl.invoke0(Native Method)
	at java.base/jdk.internal.reflect.NativeMethodAccessorImpl.invoke(NativeMethodAccessorImpl.java:62)
	at java.base/jdk.internal.reflect.DelegatingMethodAccessorImpl.invoke(DelegatingMethodAccessorImpl.java:43)
	at java.base/java.lang.reflect.Method.invoke(Method.java:564)
	at com.carrotsearch.randomizedtesting.RandomizedRunner.invoke(RandomizedRunner.java:1737)
	at com.carrotsearch.randomizedtesting.RandomizedRunner$9.evaluate(RandomizedRunner.java:968)
	at com.carrotsearch.randomizedtesting.RandomizedRunner$10.evaluate(RandomizedRunner.java:984)
	at com.carrotsearch.randomizedtesting.rules.SystemPropertiesRestoreRule$1.evaluate(SystemPropertiesRestoreRule.java:57)
	at org.apache.lucene.util.TestRuleSetupTeardownChained$1.evaluate(TestRuleSetupTeardownChained.java:49)
	at org.apache.lucene.util.AbstractBeforeAfterRule$1.evaluate(AbstractBeforeAfterRule.java:45)
	at org.apache.lucene.util.TestRuleThreadAndTestName$1.evaluate(TestRuleThreadAndTestName.java:48)
	at org.apache.lucene.util.TestRuleIgnoreAfterMaxFailures$1.evaluate(TestRuleIgnoreAfterMaxFailures.java:64)
	at org.apache.lucene.util.TestRuleMarkFailure$1.evaluate(TestRuleMarkFailure.java:47)
	at com.carrotsearch.randomizedtesting.rules.StatementAdapter.evaluate(StatementAdapter.java:36)
	at com.carrotsearch.randomizedtesting.ThreadLeakControl$StatementRunner.run(ThreadLeakControl.java:368)
	at com.carrotsearch.randomizedtesting.ThreadLeakControl.forkTimeoutingTask(ThreadLeakControl.java:817)
	at com.carrotsearch.randomizedtesting.ThreadLeakControl$3.evaluate(ThreadLeakControl.java:468)
	at com.carrotsearch.randomizedtesting.RandomizedRunner.runSingleTest(RandomizedRunner.java:943)
	at com.carrotsearch.randomizedtesting.RandomizedRunner$5.evaluate(RandomizedRunner.java:829)
	at com.carrotsearch.randomizedtesting.RandomizedRunner$6.evaluate(RandomizedRunner.java:879)
	at com.carrotsearch.randomizedtesting.RandomizedRunner$7.evaluate(RandomizedRunner.java:890)
	at com.carrotsearch.randomizedtesting.rules.StatementAdapter.evaluate(StatementAdapter.java:36)
	at com.carrotsearch.randomizedtesting.rules.SystemPropertiesRestoreRule$1.evaluate(SystemPropertiesRestoreRule.java:57)
	at org.apache.lucene.util.AbstractBeforeAfterRule$1.evaluate(AbstractBeforeAfterRule.java:45)
	at com.carrotsearch.randomizedtesting.rules.StatementAdapter.evaluate(StatementAdapter.java:36)
	at org.apache.lucene.util.TestRuleStoreClassName$1.evaluate(TestRuleStoreClassName.java:41)
	at com.carrotsearch.randomizedtesting.rules.NoShadowingOrOverridesOnMethodsRule$1.evaluate(NoShadowingOrOverridesOnMethodsRule.java:40)
	at com.carrotsearch.randomizedtesting.rules.NoShadowingOrOverridesOnMethodsRule$1.evaluate(NoShadowingOrOverridesOnMethodsRule.java:40)
	at com.carrotsearch.randomizedtesting.rules.StatementAdapter.evaluate(StatementAdapter.java:36)
	at com.carrotsearch.randomizedtesting.rules.StatementAdapter.evaluate(StatementAdapter.java:36)
	at org.apache.lucene.util.TestRuleAssertionsRequired$1.evaluate(TestRuleAssertionsRequired.java:53)
	at org.apache.lucene.util.TestRuleMarkFailure$1.evaluate(TestRuleMarkFailure.java:47)
	at org.apache.lucene.util.TestRuleIgnoreAfterMaxFailures$1.evaluate(TestRuleIgnoreAfterMaxFailures.java:64)
	at org.apache.lucene.util.TestRuleIgnoreTestSuites$1.evaluate(TestRuleIgnoreTestSuites.java:54)
	at com.carrotsearch.randomizedtesting.rules.StatementAdapter.evaluate(StatementAdapter.java:36)
	at com.carrotsearch.randomizedtesting.ThreadLeakControl$StatementRunner.run(ThreadLeakControl.java:368)
	at java.base/java.lang.Thread.run(Thread.java:844)
Caused by: java.util.concurrent.ExecutionException: java.io.IOException: java.lang.NullPointerException
	at java.base/java.util.concurrent.FutureTask.report(FutureTask.java:122)
	at java.base/java.util.concurrent.FutureTask.get(FutureTask.java:191)
	at org.apache.solr.cloud.autoscaling.sim.SimCloudManager.request(SimCloudManager.java:619)
	... 40 more
Caused by: java.io.IOException: java.lang.NullPointerException
	at org.apache.solr.cloud.autoscaling.sim.SimCloudManager.simHandleSolrRequest(SimCloudManager.java:679)
	at org.apache.solr.cloud.autoscaling.sim.SimCloudManager.lambda$request$15(SimCloudManager.java:618)
	at java.base/java.util.concurrent.FutureTask.run(FutureTask.java:264)
	at org.apache.solr.common.util.ExecutorUtil$MDCAwareThreadPoolExecutor.lambda$execute$0(ExecutorUtil.java:209)
	at java.base/java.util.concurrent.ThreadPoolExecutor.runWorker(ThreadPoolExecutor.java:1135)
	at java.base/java.util.concurrent.ThreadPoolExecutor$Worker.run(ThreadPoolExecutor.java:635)
	... 1 more
Caused by: java.lang.NullPointerException


FAILED:  org.apache.solr.cloud.autoscaling.sim.TestLargeCluster.testNodeLost

Error Message:
java.util.concurrent.ExecutionException: java.io.IOException: java.lang.NullPointerException

Stack Trace:
java.io.IOException: java.util.concurrent.ExecutionException: java.io.IOException: java.lang.NullPointerException
	at __randomizedtesting.SeedInfo.seed([4998C326087E645F:F68D0DD88B9401D9]:0)
	at org.apache.solr.cloud.autoscaling.sim.SimCloudManager.request(SimCloudManager.java:621)
	at org.apache.solr.cloud.autoscaling.sim.SimCloudManager$1.request(SimCloudManager.java:210)
	at org.apache.solr.client.solrj.SolrClient.request(SolrClient.java:1219)
	at org.apache.solr.cloud.autoscaling.sim.TestLargeCluster.setupTest(TestLargeCluster.java:108)
	at java.base/jdk.internal.reflect.NativeMethodAccessorImpl.invoke0(Native Method)
	at java.base/jdk.internal.reflect.NativeMethodAccessorImpl.invoke(NativeMethodAccessorImpl.java:62)
	at java.base/jdk.internal.reflect.DelegatingMethodAccessorImpl.invoke(DelegatingMethodAccessorImpl.java:43)
	at java.base/java.lang.reflect.Method.invoke(Method.java:564)
	at com.carrotsearch.randomizedtesting.RandomizedRunner.invoke(RandomizedRunner.java:1737)
	at com.carrotsearch.randomizedtesting.RandomizedRunner$9.evaluate(RandomizedRunner.java:968)
	at com.carrotsearch.randomizedtesting.RandomizedRunner$10.evaluate(RandomizedRunner.java:984)
	at com.carrotsearch.randomizedtesting.rules.SystemPropertiesRestoreRule$1.evaluate(SystemPropertiesRestoreRule.java:57)
	at org.apache.lucene.util.TestRuleSetupTeardownChained$1.evaluate(TestRuleSetupTeardownChained.java:49)
	at org.apache.lucene.util.AbstractBeforeAfterRule$1.evaluate(AbstractBeforeAfterRule.java:45)
	at org.apache.lucene.util.TestRuleThreadAndTestName$1.evaluate(TestRuleThreadAndTestName.java:48)
	at org.apache.lucene.util.TestRuleIgnoreAfterMaxFailures$1.evaluate(TestRuleIgnoreAfterMaxFailures.java:64)
	at org.apache.lucene.util.TestRuleMarkFailure$1.evaluate(TestRuleMarkFailure.java:47)
	at com.carrotsearch.randomizedtesting.rules.StatementAdapter.evaluate(StatementAdapter.java:36)
	at com.carrotsearch.randomizedtesting.ThreadLeakControl$StatementRunner.run(ThreadLeakControl.java:368)
	at com.carrotsearch.randomizedtesting.ThreadLeakControl.forkTimeoutingTask(ThreadLeakControl.java:817)
	at com.carrotsearch.randomizedtesting.ThreadLeakControl$3.evaluate(ThreadLeakControl.java:468)
	at com.carrotsearch.randomizedtesting.RandomizedRunner.runSingleTest(RandomizedRunner.java:943)
	at com.carrotsearch.randomizedtesting.RandomizedRunner$5.evaluate(RandomizedRunner.java:829)
	at com.carrotsearch.randomizedtesting.RandomizedRunner$6.evaluate(RandomizedRunner.java:879)
	at com.carrotsearch.randomizedtesting.RandomizedRunner$7.evaluate(RandomizedRunner.java:890)
	at com.carrotsearch.randomizedtesting.rules.StatementAdapter.evaluate(StatementAdapter.java:36)
	at com.carrotsearch.randomizedtesting.rules.SystemPropertiesRestoreRule$1.evaluate(SystemPropertiesRestoreRule.java:57)
	at org.apache.lucene.util.AbstractBeforeAfterRule$1.evaluate(AbstractBeforeAfterRule.java:45)
	at com.carrotsearch.randomizedtesting.rules.StatementAdapter.evaluate(StatementAdapter.java:36)
	at org.apache.lucene.util.TestRuleStoreClassName$1.evaluate(TestRuleStoreClassName.java:41)
	at com.carrotsearch.randomizedtesting.rules.NoShadowingOrOverridesOnMethodsRule$1.evaluate(NoShadowingOrOverridesOnMethodsRule.java:40)
	at com.carrotsearch.randomizedtesting.rules.NoShadowingOrOverridesOnMethodsRule$1.evaluate(NoShadowingOrOverridesOnMethodsRule.java:40)
	at com.carrotsearch.randomizedtesting.rules.StatementAdapter.evaluate(StatementAdapter.java:36)
	at com.carrotsearch.randomizedtesting.rules.StatementAdapter.evaluate(StatementAdapter.java:36)
	at org.apache.lucene.util.TestRuleAssertionsRequired$1.evaluate(TestRuleAssertionsRequired.java:53)
	at org.apache.lucene.util.TestRuleMarkFailure$1.evaluate(TestRuleMarkFailure.java:47)
	at org.apache.lucene.util.TestRuleIgnoreAfterMaxFailures$1.evaluate(TestRuleIgnoreAfterMaxFailures.java:64)
	at org.apache.lucene.util.TestRuleIgnoreTestSuites$1.evaluate(TestRuleIgnoreTestSuites.java:54)
	at com.carrotsearch.randomizedtesting.rules.StatementAdapter.evaluate(StatementAdapter.java:36)
	at com.carrotsearch.randomizedtesting.ThreadLeakControl$StatementRunner.run(ThreadLeakControl.java:368)
	at java.base/java.lang.Thread.run(Thread.java:844)
Caused by: java.util.concurrent.ExecutionException: java.io.IOException: java.lang.NullPointerException
	at java.base/java.util.concurrent.FutureTask.report(FutureTask.java:122)
	at java.base/java.util.concurrent.FutureTask.get(FutureTask.java:191)
	at org.apache.solr.cloud.autoscaling.sim.SimCloudManager.request(SimCloudManager.java:619)
	... 40 more
Caused by: java.io.IOException: java.lang.NullPointerException
	at org.apache.solr.cloud.autoscaling.sim.SimCloudManager.simHandleSolrRequest(SimCloudManager.java:679)
	at org.apache.solr.cloud.autoscaling.sim.SimCloudManager.lambda$request$15(SimCloudManager.java:618)
	at java.base/java.util.concurrent.FutureTask.run(FutureTask.java:264)
	at org.apache.solr.common.util.ExecutorUtil$MDCAwareThreadPoolExecutor.lambda$execute$0(ExecutorUtil.java:209)
	at java.base/java.util.concurrent.ThreadPoolExecutor.runWorker(ThreadPoolExecutor.java:1135)
	at java.base/java.util.concurrent.ThreadPoolExecutor$Worker.run(ThreadPoolExecutor.java:635)
	... 1 more
Caused by: java.lang.NullPointerException


FAILED:  org.apache.solr.cloud.autoscaling.sim.TestLargeCluster.testBasic

Error Message:
Test abandoned because suite timeout was reached.

Stack Trace:
java.lang.Exception: Test abandoned because suite timeout was reached.
	at __randomizedtesting.SeedInfo.seed([4998C326087E645F]:0)


FAILED:  org.apache.solr.cloud.autoscaling.sim.TestLargeCluster.testAddNode

Error Message:
trigger did not fire

Stack Trace:
java.lang.AssertionError: trigger did not fire
	at __randomizedtesting.SeedInfo.seed([4998C326087E645F:EE77DE85C733EB47]:0)
	at org.junit.Assert.fail(Assert.java:93)
	at org.junit.Assert.assertTrue(Assert.java:43)
	at org.apache.solr.cloud.autoscaling.sim.TestLargeCluster.testAddNode(TestLargeCluster.java:267)
	at java.base/jdk.internal.reflect.NativeMethodAccessorImpl.invoke0(Native Method)
	at java.base/jdk.internal.reflect.NativeMethodAccessorImpl.invoke(NativeMethodAccessorImpl.java:62)
	at java.base/jdk.internal.reflect.DelegatingMethodAccessorImpl.invoke(DelegatingMethodAccessorImpl.java:43)
	at java.base/java.lang.reflect.Method.invoke(Method.java:564)
	at com.carrotsearch.randomizedtesting.RandomizedRunner.invoke(RandomizedRunner.java:1737)
	at com.carrotsearch.randomizedtesting.RandomizedRunner$8.evaluate(RandomizedRunner.java:934)
	at com.carrotsearch.randomizedtesting.RandomizedRunner$9.evaluate(RandomizedRunner.java:970)
	at com.carrotsearch.randomizedtesting.RandomizedRunner$10.evaluate(RandomizedRunner.java:984)
	at com.carrotsearch.randomizedtesting.rules.SystemPropertiesRestoreRule$1.evaluate(SystemPropertiesRestoreRule.java:57)
	at org.apache.lucene.util.TestRuleSetupTeardownChained$1.evaluate(TestRuleSetupTeardownChained.java:49)
	at org.apache.lucene.util.AbstractBeforeAfterRule$1.evaluate(AbstractBeforeAfterRule.java:45)
	at org.apache.lucene.util.TestRuleThreadAndTestName$1.evaluate(TestRuleThreadAndTestName.java:48)
	at org.apache.lucene.util.TestRuleIgnoreAfterMaxFailures$1.evaluate(TestRuleIgnoreAfterMaxFailures.java:64)
	at org.apache.lucene.util.TestRuleMarkFailure$1.evaluate(TestRuleMarkFailure.java:47)
	at com.carrotsearch.randomizedtesting.rules.StatementAdapter.evaluate(StatementAdapter.java:36)
	at com.carrotsearch.randomizedtesting.ThreadLeakControl$StatementRunner.run(ThreadLeakControl.java:368)
	at com.carrotsearch.randomizedtesting.ThreadLeakControl.forkTimeoutingTask(ThreadLeakControl.java:817)
	at com.carrotsearch.randomizedtesting.ThreadLeakControl$3.evaluate(ThreadLeakControl.java:468)
	at com.carrotsearch.randomizedtesting.RandomizedRunner.runSingleTest(RandomizedRunner.java:943)
	at com.carrotsearch.randomizedtesting.RandomizedRunner$5.evaluate(RandomizedRunner.java:829)
	at com.carrotsearch.randomizedtesting.RandomizedRunner$6.evaluate(RandomizedRunner.java:879)
	at com.carrotsearch.randomizedtesting.RandomizedRunner$7.evaluate(RandomizedRunner.java:890)
	at com.carrotsearch.randomizedtesting.rules.StatementAdapter.evaluate(StatementAdapter.java:36)
	at com.carrotsearch.randomizedtesting.rules.SystemPropertiesRestoreRule$1.evaluate(SystemPropertiesRestoreRule.java:57)
	at org.apache.lucene.util.AbstractBeforeAfterRule$1.evaluate(AbstractBeforeAfterRule.java:45)
	at com.carrotsearch.randomizedtesting.rules.StatementAdapter.evaluate(StatementAdapter.java:36)
	at org.apache.lucene.util.TestRuleStoreClassName$1.evaluate(TestRuleStoreClassName.java:41)
	at com.carrotsearch.randomizedtesting.rules.NoShadowingOrOverridesOnMethodsRule$1.evaluate(NoShadowingOrOverridesOnMethodsRule.java:40)
	at com.carrotsearch.randomizedtesting.rules.NoShadowingOrOverridesOnMethodsRule$1.evaluate(NoShadowingOrOverridesOnMethodsRule.java:40)
	at com.carrotsearch.randomizedtesting.rules.StatementAdapter.evaluate(StatementAdapter.java:36)
	at com.carrotsearch.randomizedtesting.rules.StatementAdapter.evaluate(StatementAdapter.java:36)
	at org.apache.lucene.util.TestRuleAssertionsRequired$1.evaluate(TestRuleAssertionsRequired.java:53)
	at org.apache.lucene.util.TestRuleMarkFailure$1.evaluate(TestRuleMarkFailure.java:47)
	at org.apache.lucene.util.TestRuleIgnoreAfterMaxFailures$1.evaluate(TestRuleIgnoreAfterMaxFailures.java:64)
	at org.apache.lucene.util.TestRuleIgnoreTestSuites$1.evaluate(TestRuleIgnoreTestSuites.java:54)
	at com.carrotsearch.randomizedtesting.rules.StatementAdapter.evaluate(StatementAdapter.java:36)
	at com.carrotsearch.randomizedtesting.ThreadLeakControl$StatementRunner.run(ThreadLeakControl.java:368)
	at java.base/java.lang.Thread.run(Thread.java:844)


FAILED:  org.apache.solr.cloud.autoscaling.sim.TestLargeCluster.testAddNode

Error Message:
java.util.concurrent.ExecutionException: java.io.IOException: java.lang.NullPointerException

Stack Trace:
java.io.IOException: java.util.concurrent.ExecutionException: java.io.IOException: java.lang.NullPointerException
	at __randomizedtesting.SeedInfo.seed([4998C326087E645F:EE77DE85C733EB47]:0)
	at org.apache.solr.cloud.autoscaling.sim.SimCloudManager.request(SimCloudManager.java:621)
	at org.apache.solr.cloud.autoscaling.sim.SimCloudManager$1.request(SimCloudManager.java:210)
	at org.apache.solr.client.solrj.SolrClient.request(SolrClient.java:1219)
	at org.apache.solr.cloud.autoscaling.sim.TestLargeCluster.setupTest(TestLargeCluster.java:108)
	at java.base/jdk.internal.reflect.NativeMethodAccessorImpl.invoke0(Native Method)
	at java.base/jdk.internal.reflect.NativeMethodAccessorImpl.invoke(NativeMethodAccessorImpl.java:62)
	at java.base/jdk.internal.reflect.DelegatingMethodAccessorImpl.invoke(DelegatingMethodAccessorImpl.java:43)
	at java.base/java.lang.reflect.Method.invoke(Method.java:564)
	at com.carrotsearch.randomizedtesting.RandomizedRunner.invoke(RandomizedRunner.java:1737)
	at com.carrotsearch.randomizedtesting.RandomizedRunner$9.evaluate(RandomizedRunner.java:968)
	at com.carrotsearch.randomizedtesting.RandomizedRunner$10.evaluate(RandomizedRunner.java:984)
	at com.carrotsearch.randomizedtesting.rules.SystemPropertiesRestoreRule$1.evaluate(SystemPropertiesRestoreRule.java:57)
	at org.apache.lucene.util.TestRuleSetupTeardownChained$1.evaluate(TestRuleSetupTeardownChained.java:49)
	at org.apache.lucene.util.AbstractBeforeAfterRule$1.evaluate(AbstractBeforeAfterRule.java:45)
	at org.apache.lucene.util.TestRuleThreadAndTestName$1.evaluate(TestRuleThreadAndTestName.java:48)
	at org.apache.lucene.util.TestRuleIgnoreAfterMaxFailures$1.evaluate(TestRuleIgnoreAfterMaxFailures.java:64)
	at org.apache.lucene.util.TestRuleMarkFailure$1.evaluate(TestRuleMarkFailure.java:47)
	at com.carrotsearch.randomizedtesting.rules.StatementAdapter.evaluate(StatementAdapter.java:36)
	at com.carrotsearch.randomizedtesting.ThreadLeakControl$StatementRunner.run(ThreadLeakControl.java:368)
	at com.carrotsearch.randomizedtesting.ThreadLeakControl.forkTimeoutingTask(ThreadLeakControl.java:817)
	at com.carrotsearch.randomizedtesting.ThreadLeakControl$3.evaluate(ThreadLeakControl.java:468)
	at com.carrotsearch.randomizedtesting.RandomizedRunner.runSingleTest(RandomizedRunner.java:943)
	at com.carrotsearch.randomizedtesting.RandomizedRunner$5.evaluate(RandomizedRunner.java:829)
	at com.carrotsearch.randomizedtesting.RandomizedRunner$6.evaluate(RandomizedRunner.java:879)
	at com.carrotsearch.randomizedtesting.RandomizedRunner$7.evaluate(RandomizedRunner.java:890)
	at com.carrotsearch.randomizedtesting.rules.StatementAdapter.evaluate(StatementAdapter.java:36)
	at com.carrotsearch.randomizedtesting.rules.SystemPropertiesRestoreRule$1.evaluate(SystemPropertiesRestoreRule.java:57)
	at org.apache.lucene.util.AbstractBeforeAfterRule$1.evaluate(AbstractBeforeAfterRule.java:45)
	at com.carrotsearch.randomizedtesting.rules.StatementAdapter.evaluate(StatementAdapter.java:36)
	at org.apache.lucene.util.TestRuleStoreClassName$1.evaluate(TestRuleStoreClassName.java:41)
	at com.carrotsearch.randomizedtesting.rules.NoShadowingOrOverridesOnMethodsRule$1.evaluate(NoShadowingOrOverridesOnMethodsRule.java:40)
	at com.carrotsearch.randomizedtesting.rules.NoShadowingOrOverridesOnMethodsRule$1.evaluate(NoShadowingOrOverridesOnMethodsRule.java:40)
	at com.carrotsearch.randomizedtesting.rules.StatementAdapter.evaluate(StatementAdapter.java:36)
	at com.carrotsearch.randomizedtesting.rules.StatementAdapter.evaluate(StatementAdapter.java:36)
	at org.apache.lucene.util.TestRuleAssertionsRequired$1.evaluate(TestRuleAssertionsRequired.java:53)
	at org.apache.lucene.util.TestRuleMarkFailure$1.evaluate(TestRuleMarkFailure.java:47)
	at org.apache.lucene.util.TestRuleIgnoreAfterMaxFailures$1.evaluate(TestRuleIgnoreAfterMaxFailures.java:64)
	at org.apache.lucene.util.TestRuleIgnoreTestSuites$1.evaluate(TestRuleIgnoreTestSuites.java:54)
	at com.carrotsearch.randomizedtesting.rules.StatementAdapter.evaluate(StatementAdapter.java:36)
	at com.carrotsearch.randomizedtesting.ThreadLeakControl$StatementRunner.run(ThreadLeakControl.java:368)
	at java.base/java.lang.Thread.run(Thread.java:844)
Caused by: java.util.concurrent.ExecutionException: java.io.IOException: java.lang.NullPointerException
	at java.base/java.util.concurrent.FutureTask.report(FutureTask.java:122)
	at java.base/java.util.concurrent.FutureTask.get(FutureTask.java:191)
	at org.apache.solr.cloud.autoscaling.sim.SimCloudManager.request(SimCloudManager.java:619)
	... 40 more
Caused by: java.io.IOException: java.lang.NullPointerException
	at org.apache.solr.cloud.autoscaling.sim.SimCloudManager.simHandleSolrRequest(SimCloudManager.java:679)
	at org.apache.solr.cloud.autoscaling.sim.SimCloudManager.lambda$request$15(SimCloudManager.java:618)
	at java.base/java.util.concurrent.FutureTask.run(FutureTask.java:264)
	at org.apache.solr.common.util.ExecutorUtil$MDCAwareThreadPoolExecutor.lambda$execute$0(ExecutorUtil.java:209)
	at java.base/java.util.concurrent.ThreadPoolExecutor.runWorker(ThreadPoolExecutor.java:1135)
	at java.base/java.util.concurrent.ThreadPoolExecutor$Worker.run(ThreadPoolExecutor.java:635)
	... 1 more
Caused by: java.lang.NullPointerException
	at org.apache.solr.client.solrj.cloud.autoscaling.Preference.compare(Preference.java:72)
	at org.apache.solr.client.solrj.cloud.autoscaling.Policy.setApproxValuesAndSortNodes(Policy.java:390)
	at org.apache.solr.client.solrj.cloud.autoscaling.Policy$Session.applyRules(Policy.java:315)
	at org.apache.solr.client.solrj.cloud.autoscaling.Policy$Session.<init>(Policy.java:277)
	at org.apache.solr.client.solrj.cloud.autoscaling.Policy.createSession(Policy.java:413)
	at org.apache.solr.cloud.autoscaling.AutoScalingHandler.verifyAutoScalingConf(AutoScalingHandler.java:663)
	at org.apache.solr.cloud.autoscaling.AutoScalingHandler.setAutoScalingConfig(AutoScalingHandler.java:650)
	at org.apache.solr.cloud.autoscaling.AutoScalingHandler.processOps(AutoScalingHandler.java:215)
	at org.apache.solr.cloud.autoscaling.AutoScalingHandler.handleRequestBody(AutoScalingHandler.java:148)
	at org.apache.solr.handler.RequestHandlerBase.handleRequest(RequestHandlerBase.java:199)
	at org.apache.solr.cloud.autoscaling.sim.SimCloudManager.simHandleSolrRequest(SimCloudManager.java:669)
	... 6 more


FAILED:  org.apache.solr.cloud.autoscaling.sim.TestLargeCluster.testNodeLost

Error Message:
java.util.concurrent.ExecutionException: java.io.IOException: java.lang.NullPointerException

Stack Trace:
java.io.IOException: java.util.concurrent.ExecutionException: java.io.IOException: java.lang.NullPointerException
	at __randomizedtesting.SeedInfo.seed([4998C326087E645F:F68D0DD88B9401D9]:0)
	at org.apache.solr.cloud.autoscaling.sim.SimCloudManager.request(SimCloudManager.java:621)
	at org.apache.solr.cloud.autoscaling.sim.SimCloudManager$1.request(SimCloudManager.java:210)
	at org.apache.solr.client.solrj.SolrClient.request(SolrClient.java:1219)
	at org.apache.solr.cloud.autoscaling.sim.TestLargeCluster.setupTest(TestLargeCluster.java:108)
	at java.base/jdk.internal.reflect.NativeMethodAccessorImpl.invoke0(Native Method)
	at java.base/jdk.internal.reflect.NativeMethodAccessorImpl.invoke(NativeMethodAccessorImpl.java:62)
	at java.base/jdk.internal.reflect.DelegatingMethodAccessorImpl.invoke(DelegatingMethodAccessorImpl.java:43)
	at java.base/java.lang.reflect.Method.invoke(Method.java:564)
	at com.carrotsearch.randomizedtesting.RandomizedRunner.invoke(RandomizedRunner.java:1737)
	at com.carrotsearch.randomizedtesting.RandomizedRunner$9.evaluate(RandomizedRunner.java:968)
	at com.carrotsearch.randomizedtesting.RandomizedRunner$10.evaluate(RandomizedRunner.java:984)
	at com.carrotsearch.randomizedtesting.rules.SystemPropertiesRestoreRule$1.evaluate(SystemPropertiesRestoreRule.java:57)
	at org.apache.lucene.util.TestRuleSetupTeardownChained$1.evaluate(TestRuleSetupTeardownChained.java:49)
	at org.apache.lucene.util.AbstractBeforeAfterRule$1.evaluate(AbstractBeforeAfterRule.java:45)
	at org.apache.lucene.util.TestRuleThreadAndTestName$1.evaluate(TestRuleThreadAndTestName.java:48)
	at org.apache.lucene.util.TestRuleIgnoreAfterMaxFailures$1.evaluate(TestRuleIgnoreAfterMaxFailures.java:64)
	at org.apache.lucene.util.TestRuleMarkFailure$1.evaluate(TestRuleMarkFailure.java:47)
	at com.carrotsearch.randomizedtesting.rules.StatementAdapter.evaluate(StatementAdapter.java:36)
	at com.carrotsearch.randomizedtesting.ThreadLeakControl$StatementRunner.run(ThreadLeakControl.java:368)
	at com.carrotsearch.randomizedtesting.ThreadLeakControl.forkTimeoutingTask(ThreadLeakControl.java:817)
	at com.carrotsearch.randomizedtesting.ThreadLeakControl$3.evaluate(ThreadLeakControl.java:468)
	at com.carrotsearch.randomizedtesting.RandomizedRunner.runSingleTest(RandomizedRunner.java:943)
	at com.carrotsearch.randomizedtesting.RandomizedRunner$5.evaluate(RandomizedRunner.java:829)
	at com.carrotsearch.randomizedtesting.RandomizedRunner$6.evaluate(RandomizedRunner.java:879)
	at com.carrotsearch.randomizedtesting.RandomizedRunner$7.evaluate(RandomizedRunner.java:890)
	at com.carrotsearch.randomizedtesting.rules.StatementAdapter.evaluate(StatementAdapter.java:36)
	at com.carrotsearch.randomizedtesting.rules.SystemPropertiesRestoreRule$1.evaluate(SystemPropertiesRestoreRule.java:57)
	at org.apache.lucene.util.AbstractBeforeAfterRule$1.evaluate(AbstractBeforeAfterRule.java:45)
	at com.carrotsearch.randomizedtesting.rules.StatementAdapter.evaluate(StatementAdapter.java:36)
	at org.apache.lucene.util.TestRuleStoreClassName$1.evaluate(TestRuleStoreClassName.java:41)
	at com.carrotsearch.randomizedtesting.rules.NoShadowingOrOverridesOnMethodsRule$1.evaluate(NoShadowingOrOverridesOnMethodsRule.java:40)
	at com.carrotsearch.randomizedtesting.rules.NoShadowingOrOverridesOnMethodsRule$1.evaluate(NoShadowingOrOverridesOnMethodsRule.java:40)
	at com.carrotsearch.randomizedtesting.rules.StatementAdapter.evaluate(StatementAdapter.java:36)
	at com.carrotsearch.randomizedtesting.rules.StatementAdapter.evaluate(StatementAdapter.java:36)
	at org.apache.lucene.util.TestRuleAssertionsRequired$1.evaluate(TestRuleAssertionsRequired.java:53)
	at org.apache.lucene.util.TestRuleMarkFailure$1.evaluate(TestRuleMarkFailure.java:47)
	at org.apache.lucene.util.TestRuleIgnoreAfterMaxFailures$1.evaluate(TestRuleIgnoreAfterMaxFailures.java:64)
	at org.apache.lucene.util.TestRuleIgnoreTestSuites$1.evaluate(TestRuleIgnoreTestSuites.java:54)
	at com.carrotsearch.randomizedtesting.rules.StatementAdapter.evaluate(StatementAdapter.java:36)
	at com.carrotsearch.randomizedtesting.ThreadLeakControl$StatementRunner.run(ThreadLeakControl.java:368)
	at java.base/java.lang.Thread.run(Thread.java:844)
Caused by: java.util.concurrent.ExecutionException: java.io.IOException: java.lang.NullPointerException
	at java.base/java.util.concurrent.FutureTask.report(FutureTask.java:122)
	at java.base/java.util.concurrent.FutureTask.get(FutureTask.java:191)
	at org.apache.solr.cloud.autoscaling.sim.SimCloudManager.request(SimCloudManager.java:619)
	... 40 more
Caused by: java.io.IOException: java.lang.NullPointerException
	at org.apache.solr.cloud.autoscaling.sim.SimCloudManager.simHandleSolrRequest(SimCloudManager.java:679)
	at org.apache.solr.cloud.autoscaling.sim.SimCloudManager.lambda$request$15(SimCloudManager.java:618)
	at java.base/java.util.concurrent.FutureTask.run(FutureTask.java:264)
	at org.apache.solr.common.util.ExecutorUtil$MDCAwareThreadPoolExecutor.lambda$execute$0(ExecutorUtil.java:209)
	at java.base/java.util.concurrent.ThreadPoolExecutor.runWorker(ThreadPoolExecutor.java:1135)
	at java.base/java.util.concurrent.ThreadPoolExecutor$Worker.run(ThreadPoolExecutor.java:635)
	... 1 more
Caused by: java.lang.NullPointerException
	at org.apache.solr.client.solrj.cloud.autoscaling.Preference.compare(Preference.java:72)
	at org.apache.solr.client.solrj.cloud.autoscaling.Policy.setApproxValuesAndSortNodes(Policy.java:390)
	at org.apache.solr.client.solrj.cloud.autoscaling.Policy$Session.applyRules(Policy.java:315)
	at org.apache.solr.client.solrj.cloud.autoscaling.Policy$Session.<init>(Policy.java:277)
	at org.apache.solr.client.solrj.cloud.autoscaling.Policy.createSession(Policy.java:413)
	at org.apache.solr.cloud.autoscaling.AutoScalingHandler.verifyAutoScalingConf(AutoScalingHandler.java:663)
	at org.apache.solr.cloud.autoscaling.AutoScalingHandler.setAutoScalingConfig(AutoScalingHandler.java:650)
	at org.apache.solr.cloud.autoscaling.AutoScalingHandler.processOps(AutoScalingHandler.java:215)
	at org.apache.solr.cloud.autoscaling.AutoScalingHandler.handleRequestBody(AutoScalingHandler.java:148)
	at org.apache.solr.handler.RequestHandlerBase.handleRequest(RequestHandlerBase.java:199)
	at org.apache.solr.cloud.autoscaling.sim.SimCloudManager.simHandleSolrRequest(SimCloudManager.java:669)
	... 6 more




Build Log:
[...truncated 13795 lines...]
   [junit4] Suite: org.apache.solr.TestDistributedSearch
   [junit4]   2> Creating dataDir: /home/jenkins/workspace/Lucene-Solr-BadApples-master-Linux/solr/build/solr-core/test/J2/temp/solr.TestDistributedSearch_4998C326087E645F-001/init-core-data-001
   [junit4]   2> 1755832 WARN  (SUITE-TestDistributedSearch-seed#[4998C326087E645F]-worker) [    ] o.a.s.SolrTestCaseJ4 startTrackingSearchers: numOpens=2 numCloses=2
   [junit4]   2> 1755832 INFO  (SUITE-TestDistributedSearch-seed#[4998C326087E645F]-worker) [    ] o.a.s.SolrTestCaseJ4 Using PointFields (NUMERIC_POINTS_SYSPROP=true) w/NUMERIC_DOCVALUES_SYSPROP=true
   [junit4]   2> 1755832 INFO  (SUITE-TestDistributedSearch-seed#[4998C326087E645F]-worker) [    ] o.a.s.SolrTestCaseJ4 Randomized ssl (false) and clientAuth (false) via: @org.apache.solr.SolrTestCaseJ4$SuppressSSL(bugUrl="https://issues.apache.org/jira/browse/SOLR-9061")
   [junit4]   2> 1755832 INFO  (SUITE-TestDistributedSearch-seed#[4998C326087E645F]-worker) [    ] o.a.s.SolrTestCaseJ4 SecureRandom sanity checks: test.solr.allowed.securerandom=null & java.security.egd=file:/dev/./urandom
   [junit4]   2> 1755832 INFO  (SUITE-TestDistributedSearch-seed#[4998C326087E645F]-worker) [    ] o.a.s.BaseDistributedSearchTestCase Setting hostContext system property: /
   [junit4]   2> 1755941 INFO  (TEST-TestDistributedSearch.test-seed#[4998C326087E645F]) [    ] o.a.s.SolrTestCaseJ4 Writing core.properties file to /home/jenkins/workspace/Lucene-Solr-BadApples-master-Linux/solr/build/solr-core/test/J2/temp/solr.TestDistributedSearch_4998C326087E645F-001/tempDir-001/control/cores/collection1
   [junit4]   2> 1755942 INFO  (TEST-TestDistributedSearch.test-seed#[4998C326087E645F]) [    ] o.e.j.s.Server jetty-9.4.10.v20180503; built: 2018-05-03T15:56:21.710Z; git: daa59876e6f384329b122929e70a80934569428c; jvm 10+46
   [junit4]   2> 1755942 INFO  (TEST-TestDistributedSearch.test-seed#[4998C326087E645F]) [    ] o.e.j.s.session DefaultSessionIdManager workerName=node0
   [junit4]   2> 1755942 INFO  (TEST-TestDistributedSearch.test-seed#[4998C326087E645F]) [    ] o.e.j.s.session No SessionScavenger set, using defaults
   [junit4]   2> 1755942 INFO  (TEST-TestDistributedSearch.test-seed#[4998C326087E645F]) [    ] o.e.j.s.session node0 Scavenging every 600000ms
   [junit4]   2> 1755943 INFO  (TEST-TestDistributedSearch.test-seed#[4998C326087E645F]) [    ] o.e.j.s.h.ContextHandler Started o.e.j.s.ServletContextHandler@3b3af35c{/,null,AVAILABLE}
   [junit4]   2> 1755943 INFO  (TEST-TestDistributedSearch.test-seed#[4998C326087E645F]) [    ] o.e.j.s.AbstractConnector Started ServerConnector@4776d827{HTTP/1.1,[http/1.1]}{127.0.0.1:44237}
   [junit4]   2> 1755943 INFO  (TEST-TestDistributedSearch.test-seed#[4998C326087E645F]) [    ] o.e.j.s.Server Started @1755971ms
   [junit4]   2> 1755943 INFO  (TEST-TestDistributedSearch.test-seed#[4998C326087E645F]) [    ] o.a.s.c.s.e.JettySolrRunner Jetty properties: {hostContext=/, hostPort=44237, coreRootDirectory=/home/jenkins/workspace/Lucene-Solr-BadApples-master-Linux/solr/build/solr-core/test/J2/temp/solr.TestDistributedSearch_4998C326087E645F-001/tempDir-001/control/cores}
   [junit4]   2> 1755944 ERROR (TEST-TestDistributedSearch.test-seed#[4998C326087E645F]) [    ] o.a.s.u.StartupLoggingUtils Missing Java Option solr.log.dir. Logging may be missing or incomplete.
   [junit4]   2> 1755944 INFO  (TEST-TestDistributedSearch.test-seed#[4998C326087E645F]) [    ] o.a.s.s.SolrDispatchFilter Using logger factory org.apache.logging.slf4j.Log4jLoggerFactory
   [junit4]   2> 1755944 INFO  (TEST-TestDistributedSearch.test-seed#[4998C326087E645F]) [    ] o.a.s.s.SolrDispatchFilter  ___      _       Welcome to Apache Solr? version 8.0.0
   [junit4]   2> 1755944 INFO  (TEST-TestDistributedSearch.test-seed#[4998C326087E645F]) [    ] o.a.s.s.SolrDispatchFilter / __| ___| |_ _   Starting in standalone mode on port null
   [junit4]   2> 1755944 INFO  (TEST-TestDistributedSearch.test-seed#[4998C326087E645F]) [    ] o.a.s.s.SolrDispatchFilter \__ \/ _ \ | '_|  Install dir: null
   [junit4]   2> 1755944 INFO  (TEST-TestDistributedSearch.test-seed#[4998C326087E645F]) [    ] o.a.s.s.SolrDispatchFilter |___/\___/_|_|    Start time: 2018-06-02T03:03:49.113537Z
   [junit4]   2> 1755944 INFO  (TEST-TestDistributedSearch.test-seed#[4998C326087E645F]) [    ] o.a.s.c.SolrXmlConfig Loading container configuration from /home/jenkins/workspace/Lucene-Solr-BadApples-master-Linux/solr/build/solr-core/test/J2/temp/solr.TestDistributedSearch_4998C326087E645F-001/tempDir-001/control/solr.xml
   [junit4]   2> 1755946 INFO  (TEST-TestDistributedSearch.test-seed#[4998C326087E645F]) [    ] o.a.s.c.SolrXmlConfig Configuration parameter autoReplicaFailoverWorkLoopDelay is ignored
   [junit4]   2> 1755946 INFO  (TEST-TestDistributedSearch.test-seed#[4998C326087E645F]) [    ] o.a.s.c.SolrXmlConfig Configuration parameter autoReplicaFailoverBadNodeExpiration is ignored
   [junit4]   2> 1755954 INFO  (TEST-TestDistributedSearch.test-seed#[4998C326087E645F]) [    ] o.a.s.c.SolrXmlConfig MBean server found: com.sun.jmx.mbeanserver.JmxMBeanServer@1800a575, but no JMX reporters were configured - adding default JMX reporter.
   [junit4]   2> 1755971 INFO  (TEST-TestDistributedSearch.test-seed#[4998C326087E645F]) [    ] o.a.s.m.r.SolrJmxReporter JMX monitoring for 'solr.node' (registry 'solr.node') enabled at server: com.sun.jmx.mbeanserver.JmxMBeanServer@1800a575
   [junit4]   2> 1755977 INFO  (TEST-TestDistributedSearch.test-seed#[4998C326087E645F]) [    ] o.a.s.m.r.SolrJmxReporter JMX monitoring for 'solr.jvm' (registry 'solr.jvm') enabled at server: com.sun.jmx.mbeanserver.JmxMBeanServer@1800a575
   [junit4]   2> 1755977 INFO  (TEST-TestDistributedSearch.test-seed#[4998C326087E645F]) [    ] o.a.s.m.r.SolrJmxReporter JMX monitoring for 'solr.jetty' (registry 'solr.jetty') enabled at server: com.sun.jmx.mbeanserver.JmxMBeanServer@1800a575
   [junit4]   2> 1755978 INFO  (TEST-TestDistributedSearch.test-seed#[4998C326087E645F]) [    ] o.a.s.c.CorePropertiesLocator Found 1 core definitions underneath /home/jenkins/workspace/Lucene-Solr-BadApples-master-Linux/solr/build/solr-core/test/J2/temp/solr.TestDistributedSearch_4998C326087E645F-001/tempDir-001/control/cores
   [junit4]   2> 1755978 INFO  (TEST-TestDistributedSearch.test-seed#[4998C326087E645F]) [    ] o.a.s.c.CorePropertiesLocator Cores are: [collection1]
   [junit4]   2> 1755978 INFO  (coreLoadExecutor-7578-thread-1) [    ] o.a.s.c.TransientSolrCoreCacheDefault Allocating transient cache for 2147483647 transient cores
   [junit4]   2> 1755979 INFO  (coreLoadExecutor-7578-thread-1) [    x:collection1] o.a.s.c.SolrResourceLoader [null] Added 2 libs to classloader, from paths: [/home/jenkins/workspace/Lucene-Solr-BadApples-master-Linux/solr/core/src/test-files/solr/collection1/lib, /home/jenkins/workspace/Lucene-Solr-BadApples-master-Linux/solr/core/src/test-files/solr/collection1/lib/classes]
   [junit4]   2> 1755992 INFO  (coreLoadExecutor-7578-thread-1) [    x:collection1] o.a.s.c.SolrConfig Using Lucene MatchVersion: 8.0.0
   [junit4]   2> 1756004 INFO  (coreLoadExecutor-7578-thread-1) [    x:collection1] o.a.s.s.IndexSchema [collection1] Schema name=test
   [junit4]   2> 1756051 INFO  (coreLoadExecutor-7578-thread-1) [    x:collection1] o.a.s.s.IndexSchema Loaded schema test/1.0 with uniqueid field id
   [junit4]   2> 1756055 INFO  (coreLoadExecutor-7578-thread-1) [    x:collection1] o.a.s.c.CoreContainer Creating SolrCore 'collection1' using configuration from configset /home/jenkins/workspace/Lucene-Solr-BadApples-master-Linux/solr/core/src/test-files/solr/collection1, trusted=true
   [junit4]   2> 1756055 INFO  (coreLoadExecutor-7578-thread-1) [    x:collection1] o.a.s.m.r.SolrJmxReporter JMX monitoring for 'solr.core.collection1' (registry 'solr.core.collection1') enabled at server: com.sun.jmx.mbeanserver.JmxMBeanServer@1800a575
   [junit4]   2> 1756055 INFO  (coreLoadExecutor-7578-thread-1) [    x:collection1] o.a.s.c.SolrCore solr.RecoveryStrategy.Builder
   [junit4]   2> 1756055 INFO  (coreLoadExecutor-7578-thread-1) [    x:collection1] o.a.s.c.SolrCore [[collection1] ] Opening new SolrCore at [/home/jenkins/workspace/Lucene-Solr-BadApples-master-Linux/solr/core/src/test-files/solr/collection1], dataDir=[/home/jenkins/workspace/Lucene-Solr-BadApples-master-Linux/solr/build/solr-core/test/J2/temp/solr.TestDistributedSearch_4998C326087E645F-001/tempDir-001/control/cores/collection1/data/]
   [junit4]   2> 1756056 INFO  (coreLoadExecutor-7578-thread-1) [    x:collection1] o.a.s.u.RandomMergePolicy RandomMergePolicy wrapping class org.apache.lucene.index.AlcoholicMergePolicy: [AlcoholicMergePolicy: minMergeSize=0, mergeFactor=10, maxMergeSize=108510303, maxMergeSizeForForcedMerge=9223372036854775807, calibrateSizeByDeletes=true, maxMergeDocs=2147483647, maxCFSSegmentSizeMB=8.796093022207999E12, noCFSRatio=0.1]
   [junit4]   2> 1756084 INFO  (coreLoadExecutor-7578-thread-1) [    x:collection1] o.a.s.u.UpdateHandler Using UpdateLog implementation: org.apache.solr.update.UpdateLog
   [junit4]   2> 1756084 INFO  (coreLoadExecutor-7578-thread-1) [    x:collection1] o.a.s.u.UpdateLog Initializing UpdateLog: dataDir= defaultSyncLevel=FLUSH numRecordsToKeep=100 maxNumLogsToKeep=10 numVersionBuckets=65536
   [junit4]   2> 1756085 INFO  (coreLoadExecutor-7578-thread-1) [    x:collection1] o.a.s.u.CommitTracker Hard AutoCommit: disabled
   [junit4]   2> 1756085 INFO  (coreLoadExecutor-7578-thread-1) [    x:collection1] o.a.s.u.CommitTracker Soft AutoCommit: disabled
   [junit4]   2> 1756085 INFO  (coreLoadExecutor-7578-thread-1) [    x:collection1] o.a.s.u.RandomMergePolicy RandomMergePolicy wrapping class org.apache.lucene.index.TieredMergePolicy: [TieredMergePolicy: maxMergeAtOnce=41, maxMergeAtOnceExplicit=34, maxMergedSegmentMB=18.109375, floorSegmentMB=1.73828125, forceMergeDeletesPctAllowed=14.727701916268792, segmentsPerTier=25.0, maxCFSSegmentSizeMB=8.796093022207999E12, noCFSRatio=0.424199083861417
   [junit4]   2> 1756086 INFO  (coreLoadExecutor-7578-thread-1) [    x:collection1] o.a.s.s.SolrIndexSearcher Opening [Searcher@59412188[collection1] main]
   [junit4]   2> 1756086 INFO  (coreLoadExecutor-7578-thread-1) [    x:collection1] o.a.s.h.c.SpellCheckComponent Initializing spell checkers
   [junit4]   2> 1756104 INFO  (coreLoadExecutor-7578-thread-1) [    x:collection1] o.a.s.s.DirectSolrSpellChecker init: {name=direct,classname=DirectSolrSpellChecker,field=lowerfilt,minQueryLength=3}
   [junit4]   2> 1756186 INFO  (coreLoadExecutor-7578-thread-1) [    x:collection1] o.a.s.h.ReplicationHandler Commits will be reserved for 10000ms.
   [junit4]   2> 1756186 INFO  (searcherExecutor-7579-thread-1-processing-x:collection1) [    x:collection1] o.a.s.h.c.SpellCheckComponent Loading spell index for spellchecker: default
   [junit4]   2> 1756186 INFO  (coreLoadExecutor-7578-thread-1) [    x:collection1] o.a.s.u.UpdateLog Could not find max version in index or recent updates, using new clock 1602128318934548480
   [junit4]   2> 1756186 INFO  (searcherExecutor-7579-thread-1-processing-x:collection1) [    x:collection1] o.a.s.h.c.SpellCheckComponent Loading spell index for spellchecker: direct
   [junit4]   2> 1756186 INFO  (searcherExecutor-7579-thread-1-processing-x:collection1) [    x:collection1] o.a.s.h.c.SpellCheckComponent Loading spell index for spellchecker: wordbreak
   [junit4]   2> 1756186 INFO  (searcherExecutor-7579-thread-1-processing-x:collection1) [    x:collection1] o.a.s.h.c.SpellCheckComponent Loading spell index for spellchecker: multipleFields
   [junit4]   2> 1756186 INFO  (searcherExecutor-7579-thread-1-processing-x:collection1) [    x:collection1] o.a.s.h.c.SpellCheckComponent Loading spell index for spellchecker: jarowinkler
   [junit4]   2> 1756187 INFO  (searcherExecutor-7579-thread-1-processing-x:collection1) [    x:collection1] o.a.s.h.c.SpellCheckComponent Loading spell index for spellchecker: external
   [junit4]   2> 1756187 INFO  (searcherExecutor-7579-thread-1-processing-x:collection1) [    x:collection1] o.a.s.h.c.SpellCheckComponent Loading spell index for spellchecker: freq
   [junit4]   2> 1756187 INFO  (searcherExecutor-7579-thread-1-processing-x:collection1) [    x:collection1] o.a.s.h.c.SpellCheckComponent Loading spell index for spellchecker: fqcn
   [junit4]   2> 1756187 INFO  (searcherExecutor-7579-thread-1-processing-x:collection1) [    x:collection1] o.a.s.h.c.SpellCheckComponent Loading spell index for spellchecker: perDict
   [junit4]   2> 1756188 INFO  (searcherExecutor-7579-thread-1-processing-x:collection1) [    x:collection1] o.a.s.c.SolrCore [collection1] Registered new searcher Searcher@59412188[collection1] main{ExitableDirectoryReader(UninvertingDirectoryReader())}
   [junit4]   2> 1756275 INFO  (TEST-TestDistributedSearch.test-seed#[4998C326087E645F]) [    ] o.a.s.SolrTestCaseJ4 Writing core.properties file to /home/jenkins/workspace/Lucene-Solr-BadApples-master-Linux/solr/build/solr-core/test/J2/temp/solr.TestDistributedSearch_4998C326087E645F-001/tempDir-001/shard0/cores/collection1
   [junit4]   2> 1756276 INFO  (TEST-TestDistributedSearch.test-seed#[4998C326087E645F]) [    ] o.e.j.s.Server jetty-9.4.10.v20180503; built: 2018-05-03T15:56:21.710Z; git: daa59876e6f384329b122929e70a80934569428c; jvm 10+46
   [junit4]   2> 1756277 INFO  (TEST-TestDistributedSearch.test-seed#[4998C326087E645F]) [    ] o.e.j.s.session DefaultSessionIdManager workerName=node0
   [junit4]   2> 1756277 INFO  (TEST-TestDistributedSearch.test-seed#[4998C326087E645F]) [    ] o.e.j.s.session No SessionScavenger set, using defaults
   [junit4]   2> 1756277 INFO  (TEST-TestDistributedSearch.test-seed#[4998C326087E645F]) [    ] o.e.j.s.session node0 Scavenging every 660000ms
   [junit4]   2> 1756277 INFO  (TEST-TestDistributedSearch.test-seed#[4998C326087E645F]) [    ] o.e.j.s.h.ContextHandler Started o.e.j.s.ServletContextHandler@15b01990{/,null,AVAILABLE}
   [junit4]   2> 1756277 INFO  (TEST-TestDistributedSearch.test-seed#[4998C326087E645F]) [    ] o.e.j.s.AbstractConnector Started ServerConnector@37375b28{HTTP/1.1,[http/1.1]}{127.0.0.1:35605}
   [junit4]   2> 1756278 INFO  (TEST-TestDistributedSearch.test-seed#[4998C326087E645F]) [    ] o.e.j.s.Server Started @1756305ms
   [junit4]   2> 1756278 INFO  (TEST-TestDistributedSearch.test-seed#[4998C326087E645F]) [    ] o.a.s.c.s.e.JettySolrRunner Jetty properties: {hostContext=/, hostPort=35605, coreRootDirectory=/home/jenkins/workspace/Lucene-Solr-BadApples-master-Linux/solr/build/solr-core/test/J2/temp/solr.TestDistributedSearch_4998C326087E645F-001/tempDir-001/shard0/cores}
   [junit4]   2> 1756278 ERROR (TEST-TestDistributedSearch.test-seed#[4998C326087E645F]) [    ] o.a.s.u.StartupLoggingUtils Missing Java Option solr.log.dir. Logging may be missing or incomplete.
   [junit4]   2> 1756278 INFO  (TEST-TestDistributedSearch.test-seed#[4998C326087E645F]) [    ] o.a.s.s.SolrDispatchFilter Using logger factory org.apache.logging.slf4j.Log4jLoggerFactory
   [junit4]   2> 1756278 INFO  (TEST-TestDistributedSearch.test-seed#[4998C326087E645F]) [    ] o.a.s.s.SolrDispatchFilter  ___      _       Welcome to Apache Solr? version 8.0.0
   [junit4]   2> 1756278 INFO  (TEST-TestDistributedSearch.test-seed#[4998C326087E645F]) [    ] o.a.s.s.SolrDispatchFilter / __| ___| |_ _   Starting in standalone mode on port null
   [junit4]   2> 1756278 INFO  (TEST-TestDistributedSearch.test-seed#[4998C326087E645F]) [    ] o.a.s.s.SolrDispatchFilter \__ \/ _ \ | '_|  Install dir: null
   [junit4]   2> 1756278 INFO  (TEST-TestDistributedSearch.test-seed#[4998C326087E645F]) [    ] o.a.s.s.SolrDispatchFilter |___/\___/_|_|    Start time: 2018-06-02T03:03:49.447445Z
   [junit4]   2> 1756278 INFO  (TEST-TestDistributedSearch.test-seed#[4998C326087E645F]) [    ] o.a.s.c.SolrXmlConfig Loading container configuration from /home/jenkins/workspace/Lucene-Solr-BadApples-master-Linux/solr/build/solr-core/test/J2/temp/solr.TestDistributedSearch_4998C326087E645F-001/tempDir-001/shard0/solr.xml
   [junit4]   2> 1756280 INFO  (TEST-TestDistributedSearch.test-seed#[4998C326087E645F]) [    ] o.a.s.c.SolrXmlConfig Configuration parameter autoReplicaFailoverWorkLoopDelay is ignored
   [junit4]   2> 1756280 INFO  (TEST-TestDistributedSearch.test-seed#[4998C326087E645F]) [    ] o.a.s.c.SolrXmlConfig Configuration parameter autoReplicaFailoverBadNodeExpiration is ignored
   [junit4]   2> 1756280 INFO  (TEST-TestDistributedSearch.test-seed#[4998C326087E645F]) [    ] o.a.s.c.SolrXmlConfig MBean server found: com.sun.jmx.mbeanserver.JmxMBeanServer@1800a575, but no JMX reporters were configured - adding default JMX reporter.
   [junit4]   2> 1756310 INFO  (TEST-TestDistributedSearch.test-seed#[4998C326087E645F]) [    ] o.a.s.m.r.SolrJmxReporter JMX monitoring for 'solr.node' (registry 'solr.node') enabled at server: com.sun.jmx.mbeanserver.JmxMBeanServer@1800a575
   [junit4]   2> 1756321 INFO  (TEST-TestDistributedSearch.test-seed#[4998C326087E645F]) [    ] o.a.s.m.r.SolrJmxReporter JMX monitoring for 'solr.jvm' (registry 'solr.jvm') enabled at server: com.sun.jmx.mbeanserver.JmxMBeanServer@1800a575
   [junit4]   2> 1756321 INFO  (TEST-TestDistributedSearch.test-seed#[4998C326087E645F]) [    ] o.a.s.m.r.SolrJmxReporter JMX monitoring for 'solr.jetty' (registry 'solr.jetty') enabled at server: com.sun.jmx.mbeanserver.JmxMBeanServer@1800a575
   [junit4]   2> 1756322 INFO  (TEST-TestDistributedSearch.test-seed#[4998C326087E645F]) [    ] o.a.s.c.CorePropertiesLocator Found 1 core definitions underneath /home/jenkins/workspace/Lucene-Solr-BadApples-master-Linux/solr/build/solr-core/test/J2/temp/solr.TestDistributedSearch_4998C326087E645F-001/tempDir-001/shard0/cores
   [junit4]   2> 1756322 INFO  (TEST-TestDistributedSearch.test-seed#[4998C326087E645F]) [    ] o.a.s.c.CorePropertiesLocator Cores are: [collection1]
   [junit4]   2> 1756322 INFO  (coreLoadExecutor-7590-thread-1) [    ] o.a.s.c.TransientSolrCoreCacheDefault Allocating transient cache for 2147483647 transient cores
   [junit4]   2> 1756322 INFO  (coreLoadExecutor-7590-thread-1) [    x:collection1] o.a.s.c.SolrResourceLoader [null] Added 2 libs to classloader, from paths: [/home/jenkins/workspace/Lucene-Solr-BadApples-master-Linux/solr/core/src/test-files/solr/collection1/lib, /home/jenkins/workspace/Lucene-Solr-BadApples-master-Linux/solr/core/src/test-files/solr/collection1/lib/classes]
   [junit4]   2> 1756335 INFO  (coreLoadExecutor-7590-thread-1) [    x:collection1] o.a.s.c.SolrConfig Using Lucene MatchVersion: 8.0.0
   [junit4]   2> 1756347 INFO  (coreLoadExecutor-7590-thread-1) [    x:collection1] o.a.s.s.IndexSchema [collection1] Schema name=test
   [junit4]   2> 1756401 INFO  (coreLoadExecutor-7590-thread-1) [    x:collection1] o.a.s.s.IndexSchema Loaded schema test/1.0 with uniqueid field id
   [junit4]   2> 1756405 INFO  (coreLoadExecutor-7590-thread-1) [    x:collection1] o.a.s.c.CoreContainer Creating SolrCore 'collection1' using configuration from configset /home/jenkins/workspace/Lucene-Solr-BadApples-master-Linux/solr/core/src/test-files/solr/collection1, trusted=true
   [junit4]   2> 1756405 INFO  (coreLoadExecutor-7590-thread-1) [    x:collection1] o.a.s.m.r.SolrJmxReporter JMX monitoring for 'solr.core.collection1' (registry 'solr.core.collection1') enabled at server: com.sun.jmx.mbeanserver.JmxMBeanServer@1800a575
   [junit4]   2> 1756405 INFO  (coreLoadExecutor-7590-thread-1) [    x:collection1] o.a.s.c.SolrCore solr.RecoveryStrategy.Builder
   [junit4]   2> 1756405 INFO  (coreLoadExecutor-7590-thread-1) [    x:collection1] o.a.s.c.SolrCore [[collection1] ] Opening new SolrCore at [/home/jenkins/workspace/Lucene-Solr-BadApples-master-Linux/solr/core/src/test-files/solr/collection1], dataDir=[/home/jenkins/workspace/Lucene-Solr-BadApples-master-Linux/solr/build/solr-core/test/J2/temp/solr.TestDistributedSearch_4998C326087E645F-001/tempDir-001/shard0/cores/collection1/data/]
   [junit4]   2> 1756407 INFO  (coreLoadExecutor-7590-thread-1) [    x:collection1] o.a.s.u.RandomMergePolicy RandomMergePolicy wrapping class org.apache.lucene.index.AlcoholicMergePolicy: [AlcoholicMergePolicy: minMergeSize=0, mergeFactor=10, maxMergeSize=108510303, maxMergeSizeForForcedMerge=9223372036854775807, calibrateSizeByDeletes=true, maxMergeDocs=2147483647, maxCFSSegmentSizeMB=8.796093022207999E12, noCFSRatio=0.1]
   [junit4]   2> 1756452 INFO  (coreLoadExecutor-7590-thread-1) [    x:collection1] o.a.s.u.UpdateHandler Using UpdateLog implementation: org.apache.solr.update.UpdateLog
   [junit4]   2> 1756452 INFO  (coreLoadExecutor-7590-thread-1) [    x:collection1] o.a.s.u.UpdateLog Initializing UpdateLog: dataDir= defaultSyncLevel=FLUSH numRecordsToKeep=100 maxNumLogsToKeep=10 numVersionBuckets=65536
   [junit4]   2> 1756453 INFO  (coreLoadExecutor-7590-thread-1) [    x:collection1] o.a.s.u.CommitTracker Hard AutoCommit: disabled
   [junit4]   2> 1756453 INFO  (coreLoadExecutor-7590-thread-1) [    x:collection1] o.a.s.u.CommitTracker Soft AutoCommit: disabled
   [junit4]   2> 1756453 INFO  (coreLoadExecutor-7590-thread-1) [    x:collection1] o.a.s.u.RandomMergePolicy RandomMergePolicy wrapping class org.apache.lucene.index.TieredMergePolicy: [TieredMergePolicy: maxMergeAtOnce=41, maxMergeAtOnceExplicit=34, maxMergedSegmentMB=18.109375, floorSegmentMB=1.73828125, forceMergeDeletesPctAllowed=14.727701916268792, segmentsPerTier=25.0, maxCFSSegmentSizeMB=8.796093022207999E12, noCFSRatio=0.424199083861417
   [junit4]   2> 1756454 INFO  (coreLoadExecutor-7590-thread-1) [    x:collection1] o.a.s.s.SolrIndexSearcher Opening [Searcher@47159f85[collection1] main]
   [junit4]   2> 1756454 INFO  (coreLoadExecutor-7590-thread-1) [    x:collection1] o.a.s.h.c.SpellCheckComponent Initializing spell checkers
   [junit4]   2> 1756475 INFO  (coreLoadExecutor-7590-thread-1) [    x:collection1] o.a.s.s.DirectSolrSpellChecker init: {name=direct,classname=DirectSolrSpellChecker,field=lowerfilt,minQueryLength=3}
   [junit4]   2> 1756558 INFO  (coreLoadExecutor-7590-thread-1) [    x:collection1] o.a.s.h.ReplicationHandler Commits will be reserved for 10000ms.
   [junit4]   2> 1756558 INFO  (searcherExecutor-7591-thread-1-processing-x:collection1) [    x:collection1] o.a.s.h.c.SpellCheckComponent Loading spell index for spellchecker: default
   [junit4]   2> 1756558 INFO  (coreLoadExecutor-7590-thread-1) [    x:collection1] o.a.s.u.UpdateLog Could not find max version in index or recent updates, using new clock 1602128319324618752
   [junit4]   2> 1756558 INFO  (searcherExecutor-7591-thread-1-processing-x:collection1) [    x:collection1] o.a.s.h.c.SpellCheckComponent Loading spell index for spellchecker: direct
   [junit4]   2> 1756558 INFO  (searcherExecutor-7591-thread-1-processing-x:collection1) [    x:collection1] o.a.s.h.c.SpellCheckComponent Loading spell index for spellchecker: wordbreak
   [junit4]   2> 1756558 INFO  (searcherExecutor-7591-thread-1-processing-x:collection1) [    x:collection1] o.a.s.h.c.SpellCheckComponent Loading spell index for spellchecker: multipleFields
   [junit4]   2> 1756558 INFO  (searcherExecutor-7591-thread-1-processing-x:collection1) [    x:collection1] o.a.s.h.c.SpellCheckComponent Loading spell index for spellchecker: jarowinkler
   [junit4]   2> 1756558 INFO  (searcherExecutor-7591-thread-1-processing-x:collection1) [    x:collection1] o.a.s.h.c.SpellCheckComponent Loading spell index for spellchecker: external
   [junit4]   2> 1756558 INFO  (searcherExecutor-7591-thread-1-processing-x:collection1) [    x:collection1] o.a.s.h.c.SpellCheckComponent Loading spell index for spellchecker: freq
   [junit4]   2> 1756558 INFO  (searcherExecutor-7591-thread-1-processing-x:collection1) [    x:collection1] o.a.s.h.c.SpellCheckComponent Loading spell index for spellchecker: fqcn
   [junit4]   2> 1756559 INFO  (searcherExecutor-7591-thread-1-processing-x:collection1) [    x:collection1] o.a.s.h.c.SpellCheckComponent Loading spell index for spellchecker: perDict
   [junit4]   2> 1756559 INFO  (searcherExecutor-7591-thread-1-processing-x:collection1) [    x:collection1] o.a.s.c.SolrCore [collection1] Registered new searcher Searcher@47159f85[collection1] main{ExitableDirectoryReader(UninvertingDirectoryReader())}
   [junit4]   2> 1756560 INFO  (TEST-TestDistributedSearch.test-seed#[4998C326087E645F]) [    ] o.a.s.SolrTestCaseJ4 ###Starting test
   [junit4]   2> 1756562 INFO  (qtp607643788-21126) [    x:collection1] o.a.s.u.p.LogUpdateProcessorFactory [collection1]  webapp= path=/update params={wt=javabin&version=2}{deleteByQuery=*:* (-1602128319327764480)} 0 0
   [junit4]   2> 1756563 INFO  (qtp2071625264-21144) [    x:collection1] o.a.s.u.p.LogUpdateProcessorFactory [collection1]  webapp= path=/update params={wt=javabin&version=2}{deleteByQuery=*:* (-1602128319328813056)} 0 0
   [junit4]   2> 1756564 INFO  (qtp607643788-21120) [    x:collection1] o.a.s.u.p.LogUpdateProcessorFactory [collection1]  webapp= path=/update params={wt=javabin&version=2}{add=[1 (1602128319330910208)]} 0 0
   [junit4]   2> 1756565 INFO  (qtp2071625264-21138) [    x:collection1] o.a.s.u.p.LogUpdateProcessorFactory [collection1]  webapp= path=/update params={wt=javabin&version=2}{add=[1 (1602128319331958784)]} 0 0
   [junit4]   2> 1756566 INFO  (qtp607643788-21125) [    x:collection1] o.a.s.u.p.LogUpdateProcessorFactory [collection1]  webapp= path=/update params={wt=javabin&version=2}{add=[2 (1602128319333007360)]} 0 0
   [junit4]   2> 1756566 INFO  (qtp2071625264-21143) [    x:collection1] o.a.s.u.p.LogUpdateProcessorFactory [collection1]  webapp= path=/update params={wt=javabin&version=2}{add=[2 (1602128319333007360)]} 0 0
   [junit4]   2> 1756567 INFO  (qtp607643788-21124) [    x:collection1] o.a.s.u.p.LogUpdateProcessorFactory [collection1]  webapp= path=/update params={wt=javabin&version=2}{add=[3 (1602128319334055936)]} 0 0
   [junit4]   2> 1756567 INFO  (qtp2071625264-21142) [    x:collection1] o.a.s.u.p.LogUpdateProcessorFactory [collection1]  webapp= path=/update params={wt=javabin&version=2}{add=[3 (1602128319334055936)]} 0 0
   [junit4]   2> 1756568 INFO  (qtp607643788-21125) [    x:collection1] o.a.s.u.p.LogUpdateProcessorFactory [collection1]  webapp= path=/update params={wt=javabin&version=2}{add=[4 (1602128319334055937)]} 0 0
   [junit4]   2> 1756568 INFO  (qtp2071625264-21143) [    x:collection1] o.a.s.u.p.LogUpdateProcessorFactory [collection1]  webapp= path=/update params={wt=javabin&version=2}{add=[4 (1602128319335104512)]} 0 0
   [junit4]   2> 1756568 INFO  (qtp607643788-21124) [    x:collection1] o.a.s.u.p.LogUpdateProcessorFactory [collection1]  webapp= path=/update params={wt=javabin&version=2}{add=[5 (1602128319335104512)]} 0 0
   [junit4]   2> 1756569 INFO  (qtp2071625264-21142) [    x:collection1] o.a.s.u.p.LogUpdateProcessorFactory [collection1]  webapp= path=/update params={wt=javabin&version=2}{add=[5 (1602128319336153088)]} 0 0
   [junit4]   2> 1756569 INFO  (qtp607643788-21125) [    x:collection1] o.a.s.u.p.LogUpdateProcessorFactory [collection1]  webapp= path=/update params={wt=javabin&version=2}{add=[6 (1602128319336153088)]} 0 0
   [junit4]   2> 1756569 INFO  (qtp2071625264-21143) [    x:collection1] o.a.s.u.p.LogUpdateProcessorFactory [collection1]  webapp= path=/update params={wt=javabin&version=2}{add=[6 (1602128319336153089)]} 0 0
   [junit4]   2> 1756570 INFO  (qtp607643788-21124) [    x:collection1] o.a.s.u.p.LogUpdateProcessorFactory [collection1]  webapp= path=/update params={wt=javabin&version=2}{add=[7 (1602128319337201664)]} 0 0
   [junit4]   2> 1756570 INFO  (qtp2071625264-21142) [    x:collection1] o.a.s.u.p.LogUpdateProcessorFactory [collection1]  webapp= path=/update params={wt=javabin&version=2}{add=[7 (1602128319337201664)]} 0 0
   [junit4]   2> 1756570 INFO  (qtp607643788-21125) [    x:collection1] o.a.s.u.p.LogUpdateProcessorFactory [collection1]  webapp= path=/update params={wt=javabin&version=2}{add=[8 (1602128319337201665)]} 0 0
   [junit4]   2> 1756570 INFO  (qtp2071625264-21143) [    x:collection1] o.a.s.u.p.LogUpdateProcessorFactory [collection1]  webapp= path=/update params={wt=javabin&version=2}{add=[8 (1602128319337201665)]} 0 0
   [junit4]   2> 1756571 INFO  (qtp607643788-21124) [    x:collection1] o.a.s.u

[...truncated too long message...]

va:194)
   [junit4]   2>         at java.base@10/java.util.concurrent.locks.AbstractQueuedSynchronizer$ConditionObject.await(AbstractQueuedSynchronizer.java:2075)
   [junit4]   2>         at java.base@10/java.util.concurrent.LinkedBlockingQueue.take(LinkedBlockingQueue.java:435)
   [junit4]   2>         at java.base@10/java.util.concurrent.ThreadPoolExecutor.getTask(ThreadPoolExecutor.java:1061)
   [junit4]   2>         at java.base@10/java.util.concurrent.ThreadPoolExecutor.runWorker(ThreadPoolExecutor.java:1121)
   [junit4]   2>         at java.base@10/java.util.concurrent.ThreadPoolExecutor$Worker.run(ThreadPoolExecutor.java:635)
   [junit4]   2>         at java.base@10/java.lang.Thread.run(Thread.java:844)
   [junit4]   2>   124) Thread[id=688, name=simCloudManagerPool-291-thread-50, state=WAITING, group=TGRP-TestLargeCluster]
   [junit4]   2>         at java.base@10/jdk.internal.misc.Unsafe.park(Native Method)
   [junit4]   2>         at java.base@10/java.util.concurrent.locks.LockSupport.park(LockSupport.java:194)
   [junit4]   2>         at java.base@10/java.util.concurrent.locks.AbstractQueuedSynchronizer$ConditionObject.await(AbstractQueuedSynchronizer.java:2075)
   [junit4]   2>         at java.base@10/java.util.concurrent.LinkedBlockingQueue.take(LinkedBlockingQueue.java:435)
   [junit4]   2>         at java.base@10/java.util.concurrent.ThreadPoolExecutor.getTask(ThreadPoolExecutor.java:1061)
   [junit4]   2>         at java.base@10/java.util.concurrent.ThreadPoolExecutor.runWorker(ThreadPoolExecutor.java:1121)
   [junit4]   2>         at java.base@10/java.util.concurrent.ThreadPoolExecutor$Worker.run(ThreadPoolExecutor.java:635)
   [junit4]   2>         at java.base@10/java.lang.Thread.run(Thread.java:844)
   [junit4]   2>   125) Thread[id=649, name=simCloudManagerPool-291-thread-11, state=WAITING, group=TGRP-TestLargeCluster]
   [junit4]   2>         at java.base@10/jdk.internal.misc.Unsafe.park(Native Method)
   [junit4]   2>         at java.base@10/java.util.concurrent.locks.LockSupport.park(LockSupport.java:194)
   [junit4]   2>         at java.base@10/java.util.concurrent.locks.AbstractQueuedSynchronizer$ConditionObject.await(AbstractQueuedSynchronizer.java:2075)
   [junit4]   2>         at java.base@10/java.util.concurrent.LinkedBlockingQueue.take(LinkedBlockingQueue.java:435)
   [junit4]   2>         at java.base@10/java.util.concurrent.ThreadPoolExecutor.getTask(ThreadPoolExecutor.java:1061)
   [junit4]   2>         at java.base@10/java.util.concurrent.ThreadPoolExecutor.runWorker(ThreadPoolExecutor.java:1121)
   [junit4]   2>         at java.base@10/java.util.concurrent.ThreadPoolExecutor$Worker.run(ThreadPoolExecutor.java:635)
   [junit4]   2>         at java.base@10/java.lang.Thread.run(Thread.java:844)
   [junit4]   2>   126) Thread[id=652, name=simCloudManagerPool-291-thread-14, state=WAITING, group=TGRP-TestLargeCluster]
   [junit4]   2>         at java.base@10/jdk.internal.misc.Unsafe.park(Native Method)
   [junit4]   2>         at java.base@10/java.util.concurrent.locks.LockSupport.park(LockSupport.java:194)
   [junit4]   2>         at java.base@10/java.util.concurrent.locks.AbstractQueuedSynchronizer$ConditionObject.await(AbstractQueuedSynchronizer.java:2075)
   [junit4]   2>         at java.base@10/java.util.concurrent.LinkedBlockingQueue.take(LinkedBlockingQueue.java:435)
   [junit4]   2>         at java.base@10/java.util.concurrent.ThreadPoolExecutor.getTask(ThreadPoolExecutor.java:1061)
   [junit4]   2>         at java.base@10/java.util.concurrent.ThreadPoolExecutor.runWorker(ThreadPoolExecutor.java:1121)
   [junit4]   2>         at java.base@10/java.util.concurrent.ThreadPoolExecutor$Worker.run(ThreadPoolExecutor.java:635)
   [junit4]   2>         at java.base@10/java.lang.Thread.run(Thread.java:844)
   [junit4]   2>   127) Thread[id=676, name=simCloudManagerPool-291-thread-38, state=WAITING, group=TGRP-TestLargeCluster]
   [junit4]   2>         at java.base@10/jdk.internal.misc.Unsafe.park(Native Method)
   [junit4]   2>         at java.base@10/java.util.concurrent.locks.LockSupport.park(LockSupport.java:194)
   [junit4]   2>         at java.base@10/java.util.concurrent.locks.AbstractQueuedSynchronizer$ConditionObject.await(AbstractQueuedSynchronizer.java:2075)
   [junit4]   2>         at java.base@10/java.util.concurrent.LinkedBlockingQueue.take(LinkedBlockingQueue.java:435)
   [junit4]   2>         at java.base@10/java.util.concurrent.ThreadPoolExecutor.getTask(ThreadPoolExecutor.java:1061)
   [junit4]   2>         at java.base@10/java.util.concurrent.ThreadPoolExecutor.runWorker(ThreadPoolExecutor.java:1121)
   [junit4]   2>         at java.base@10/java.util.concurrent.ThreadPoolExecutor$Worker.run(ThreadPoolExecutor.java:635)
   [junit4]   2>         at java.base@10/java.lang.Thread.run(Thread.java:844)
   [junit4]   2>   128) Thread[id=700, name=simCloudManagerPool-291-thread-62, state=WAITING, group=TGRP-TestLargeCluster]
   [junit4]   2>         at java.base@10/jdk.internal.misc.Unsafe.park(Native Method)
   [junit4]   2>         at java.base@10/java.util.concurrent.locks.LockSupport.park(LockSupport.java:194)
   [junit4]   2>         at java.base@10/java.util.concurrent.locks.AbstractQueuedSynchronizer$ConditionObject.await(AbstractQueuedSynchronizer.java:2075)
   [junit4]   2>         at java.base@10/java.util.concurrent.LinkedBlockingQueue.take(LinkedBlockingQueue.java:435)
   [junit4]   2>         at java.base@10/java.util.concurrent.ThreadPoolExecutor.getTask(ThreadPoolExecutor.java:1061)
   [junit4]   2>         at java.base@10/java.util.concurrent.ThreadPoolExecutor.runWorker(ThreadPoolExecutor.java:1121)
   [junit4]   2>         at java.base@10/java.util.concurrent.ThreadPoolExecutor$Worker.run(ThreadPoolExecutor.java:635)
   [junit4]   2>         at java.base@10/java.lang.Thread.run(Thread.java:844)
   [junit4]   2>   129) Thread[id=753, name=simCloudManagerPool-291-thread-115, state=WAITING, group=TGRP-TestLargeCluster]
   [junit4]   2>         at java.base@10/jdk.internal.misc.Unsafe.park(Native Method)
   [junit4]   2>         at java.base@10/java.util.concurrent.locks.LockSupport.park(LockSupport.java:194)
   [junit4]   2>         at java.base@10/java.util.concurrent.locks.AbstractQueuedSynchronizer$ConditionObject.await(AbstractQueuedSynchronizer.java:2075)
   [junit4]   2>         at java.base@10/java.util.concurrent.LinkedBlockingQueue.take(LinkedBlockingQueue.java:435)
   [junit4]   2>         at java.base@10/java.util.concurrent.ThreadPoolExecutor.getTask(ThreadPoolExecutor.java:1061)
   [junit4]   2>         at java.base@10/java.util.concurrent.ThreadPoolExecutor.runWorker(ThreadPoolExecutor.java:1121)
   [junit4]   2>         at java.base@10/java.util.concurrent.ThreadPoolExecutor$Worker.run(ThreadPoolExecutor.java:635)
   [junit4]   2>         at java.base@10/java.lang.Thread.run(Thread.java:844)
   [junit4]   2> NOTE: test params are: codec=CheapBastard, sim=Asserting(org.apache.lucene.search.similarities.AssertingSimilarity@5e80796f), locale=pt-PT, timezone=Asia/Thimphu
   [junit4]   2> NOTE: Linux 4.13.0-41-generic amd64/Oracle Corporation 10 (64-bit)/cpus=8,threads=136,free=388441544,total=536870912
   [junit4]   2> NOTE: All tests run in this JVM: [TestDistributedSearch, TestDistributedSearch, TestLargeCluster]
   [junit4]   2> NOTE: reproduce with: ant test  -Dtestcase=TestLargeCluster -Dtests.seed=4998C326087E645F -Dtests.multiplier=3 -Dtests.slow=true -Dtests.badapples=true -Dtests.locale=pt-PT -Dtests.timezone=Asia/Thimphu -Dtests.asserts=true -Dtests.file.encoding=US-ASCII
   [junit4] ERROR   0.00s J1 | TestLargeCluster (suite) <<<
   [junit4]    > Throwable #1: java.lang.Exception: Suite timeout exceeded (>= 14400000 msec).
   [junit4]    > 	at __randomizedtesting.SeedInfo.seed([4998C326087E645F]:0)
   [junit4] Completed [10/10 (5!)] on J1 in 14424.06s, 2 tests, 2 errors <<< FAILURES!

[...truncated 19 lines...]
BUILD FAILED
/home/jenkins/workspace/Lucene-Solr-BadApples-master-Linux/lucene/common-build.xml:1568: The following error occurred while executing this line:
/home/jenkins/workspace/Lucene-Solr-BadApples-master-Linux/lucene/common-build.xml:1092: There were test failures: 10 suites, 23 tests, 1 suite-level error, 7 errors, 1 failure [seed: 4998C326087E645F]

Total time: 242 minutes 22 seconds

[repro] Setting last failure code to 256

[repro] Failures:
[repro]   0/5 failed: org.apache.solr.TestDistributedSearch
[repro]   5/5 failed: org.apache.solr.cloud.autoscaling.sim.TestLargeCluster
[repro] Exiting with code 256
+ mv lucene/build lucene/build.repro
+ mv solr/build solr/build.repro
+ mv lucene/build.orig lucene/build
+ mv solr/build.orig solr/build
Archiving artifacts
Setting ANT_1_8_2_HOME=/var/lib/jenkins/tools/hudson.tasks.Ant_AntInstallation/ANT_1.8.2
[WARNINGS] Parsing warnings in console log with parser Java Compiler (javac)
Setting ANT_1_8_2_HOME=/var/lib/jenkins/tools/hudson.tasks.Ant_AntInstallation/ANT_1.8.2
Setting ANT_1_8_2_HOME=/var/lib/jenkins/tools/hudson.tasks.Ant_AntInstallation/ANT_1.8.2
<Git Blamer> Using GitBlamer to create author and commit information for all warnings.
<Git Blamer> GIT_COMMIT=4888adf08a70c25b4d931a2bdfdcfe3979ba3936, workspace=/var/lib/jenkins/workspace/Lucene-Solr-BadApples-master-Linux
[WARNINGS] Computing warning deltas based on reference build #43
Recording test results
Setting ANT_1_8_2_HOME=/var/lib/jenkins/tools/hudson.tasks.Ant_AntInstallation/ANT_1.8.2
Build step 'Publish JUnit test result report' changed build result to UNSTABLE
Email was triggered for: Unstable (Test Failures)
Sending email for trigger: Unstable (Test Failures)
Setting ANT_1_8_2_HOME=/var/lib/jenkins/tools/hudson.tasks.Ant_AntInstallation/ANT_1.8.2
Setting ANT_1_8_2_HOME=/var/lib/jenkins/tools/hudson.tasks.Ant_AntInstallation/ANT_1.8.2
Setting ANT_1_8_2_HOME=/var/lib/jenkins/tools/hudson.tasks.Ant_AntInstallation/ANT_1.8.2
Setting ANT_1_8_2_HOME=/var/lib/jenkins/tools/hudson.tasks.Ant_AntInstallation/ANT_1.8.2

Mime
View raw message