lucene-dev mailing list archives

Site index · List index
Message view « Date » · « Thread »
Top « Date » · « Thread »
From Policeman Jenkins Server <jenk...@thetaphi.de>
Subject [JENKINS] Lucene-Solr-7.3-Linux (64bit/jdk-9.0.4) - Build # 201 - Unstable!
Date Thu, 10 May 2018 04:10:01 GMT
Build: https://jenkins.thetaphi.de/job/Lucene-Solr-7.3-Linux/201/
Java: 64bit/jdk-9.0.4 -XX:+UseCompressedOops -XX:+UseParallelGC

4 tests failed.
FAILED:  junit.framework.TestSuite.org.apache.solr.analytics.legacy.facet.LegacyQueryFacetCloudTest

Error Message:
Could not find collection:collection1

Stack Trace:
java.lang.AssertionError: Could not find collection:collection1
	at __randomizedtesting.SeedInfo.seed([347EF7E43E3B83A3]:0)
	at org.junit.Assert.fail(Assert.java:93)
	at org.junit.Assert.assertTrue(Assert.java:43)
	at org.junit.Assert.assertNotNull(Assert.java:526)
	at org.apache.solr.cloud.AbstractDistribZkTestBase.waitForRecoveriesToFinish(AbstractDistribZkTestBase.java:155)
	at org.apache.solr.analytics.legacy.LegacyAbstractAnalyticsCloudTest.setupCollection(LegacyAbstractAnalyticsCloudTest.java:51)
	at java.base/jdk.internal.reflect.NativeMethodAccessorImpl.invoke0(Native Method)
	at java.base/jdk.internal.reflect.NativeMethodAccessorImpl.invoke(NativeMethodAccessorImpl.java:62)
	at java.base/jdk.internal.reflect.DelegatingMethodAccessorImpl.invoke(DelegatingMethodAccessorImpl.java:43)
	at java.base/java.lang.reflect.Method.invoke(Method.java:564)
	at com.carrotsearch.randomizedtesting.RandomizedRunner.invoke(RandomizedRunner.java:1737)
	at com.carrotsearch.randomizedtesting.RandomizedRunner$6.evaluate(RandomizedRunner.java:874)
	at com.carrotsearch.randomizedtesting.RandomizedRunner$7.evaluate(RandomizedRunner.java:890)
	at com.carrotsearch.randomizedtesting.rules.StatementAdapter.evaluate(StatementAdapter.java:36)
	at com.carrotsearch.randomizedtesting.rules.SystemPropertiesRestoreRule$1.evaluate(SystemPropertiesRestoreRule.java:57)
	at org.apache.lucene.util.AbstractBeforeAfterRule$1.evaluate(AbstractBeforeAfterRule.java:45)
	at com.carrotsearch.randomizedtesting.rules.StatementAdapter.evaluate(StatementAdapter.java:36)
	at org.apache.lucene.util.TestRuleStoreClassName$1.evaluate(TestRuleStoreClassName.java:41)
	at com.carrotsearch.randomizedtesting.rules.NoShadowingOrOverridesOnMethodsRule$1.evaluate(NoShadowingOrOverridesOnMethodsRule.java:40)
	at com.carrotsearch.randomizedtesting.rules.NoShadowingOrOverridesOnMethodsRule$1.evaluate(NoShadowingOrOverridesOnMethodsRule.java:40)
	at com.carrotsearch.randomizedtesting.rules.StatementAdapter.evaluate(StatementAdapter.java:36)
	at com.carrotsearch.randomizedtesting.rules.StatementAdapter.evaluate(StatementAdapter.java:36)
	at org.apache.lucene.util.TestRuleAssertionsRequired$1.evaluate(TestRuleAssertionsRequired.java:53)
	at org.apache.lucene.util.TestRuleMarkFailure$1.evaluate(TestRuleMarkFailure.java:47)
	at org.apache.lucene.util.TestRuleIgnoreAfterMaxFailures$1.evaluate(TestRuleIgnoreAfterMaxFailures.java:64)
	at org.apache.lucene.util.TestRuleIgnoreTestSuites$1.evaluate(TestRuleIgnoreTestSuites.java:54)
	at com.carrotsearch.randomizedtesting.rules.StatementAdapter.evaluate(StatementAdapter.java:36)
	at com.carrotsearch.randomizedtesting.ThreadLeakControl$StatementRunner.run(ThreadLeakControl.java:368)
	at java.base/java.lang.Thread.run(Thread.java:844)


FAILED:  org.apache.solr.analytics.legacy.facet.LegacyQueryFacetCloudTest.queryTest

Error Message:
{responseHeader={zkConnected=true,status=0,QTime=92,params={o.fr.s.sum=sum(float_fd),indent=true,o.ir.s.sum=sum(int_id),o.lr.qf.string.q=[string_sd:abc1, string_sd:abc2],o.fr.qf.lad.q=[long_ld:[20 TO *], long_ld:[30 TO *], double_dd:[* TO 50]],o.ir.s.median=median(int_id),o.lr.qf=string,o.ir.s.mean=mean(int_id),o.ir.qf.float1.q=float_fd:[* TO 50],o.lr.s.sum=sum(long_ld),o.ir.qf.float2.q=float_fd:[* TO 30],o.fr.s.percentile_8=percentile(8,float_fd),o.ir.s.percentile_8=percentile(8,int_id),o.fr.s.median=median(float_fd),o.fr.qf=lad,wt=javabin,o.lr.s.mean=mean(long_ld),_stateVer_=collection1:4,o.lr.s.percentile_8=percentile(8,long_ld),rows=0,version=2,q=*:*,o.ir.qf=[float1, float2],o.lr.s.median=median(long_ld),olap=true,o.fr.s.mean=mean(float_fd)}},response={numFound=100,start=0,maxScore=1.0,docs=[]},stats={lr={median=16.0,mean=16.38,percentile_8=2,sum=1638.0,queryFacets={string={string_sd:abc1={median=15.0,mean=16.4,percentile_8=1,sum=246.0},string_sd:abc2={median=14.5,mean=14.071428571428571,percentile_8=1,sum=197.0}}}},ir={median=24.5,mean=28.91,percentile_8=4,sum=2891.0,queryFacets={float1={float_fd:[* TO 50]={median=25.0,mean=25.0,percentile_8=4,sum=1450.0}},float2={float_fd:[* TO 30]={median=18.5,mean=16.842105263157894,percentile_8=3,sum=640.0}}}},fr={median=42.5,mean=42.99,percentile_8=4.0,sum=4299.0,queryFacets={lad={long_ld:[30 TO *]={median=50.5,mean=50.5,percentile_8=30.0,sum=606.0},double_dd:[* TO 50]={median=42.5,mean=42.99,percentile_8=4.0,sum=4299.0},long_ld:[20 TO *]={median=32.5,mean=39.225,percentile_8=3.0,sum=1569.0}}}}}} expected:<[1450.0]> but was:<[2900.0, 0.0]>

Stack Trace:
java.lang.AssertionError: {responseHeader={zkConnected=true,status=0,QTime=92,params={o.fr.s.sum=sum(float_fd),indent=true,o.ir.s.sum=sum(int_id),o.lr.qf.string.q=[string_sd:abc1, string_sd:abc2],o.fr.qf.lad.q=[long_ld:[20 TO *], long_ld:[30 TO *], double_dd:[* TO 50]],o.ir.s.median=median(int_id),o.lr.qf=string,o.ir.s.mean=mean(int_id),o.ir.qf.float1.q=float_fd:[* TO 50],o.lr.s.sum=sum(long_ld),o.ir.qf.float2.q=float_fd:[* TO 30],o.fr.s.percentile_8=percentile(8,float_fd),o.ir.s.percentile_8=percentile(8,int_id),o.fr.s.median=median(float_fd),o.fr.qf=lad,wt=javabin,o.lr.s.mean=mean(long_ld),_stateVer_=collection1:4,o.lr.s.percentile_8=percentile(8,long_ld),rows=0,version=2,q=*:*,o.ir.qf=[float1, float2],o.lr.s.median=median(long_ld),olap=true,o.fr.s.mean=mean(float_fd)}},response={numFound=100,start=0,maxScore=1.0,docs=[]},stats={lr={median=16.0,mean=16.38,percentile_8=2,sum=1638.0,queryFacets={string={string_sd:abc1={median=15.0,mean=16.4,percentile_8=1,sum=246.0},string_sd:abc2={median=14.5,mean=14.071428571428571,percentile_8=1,sum=197.0}}}},ir={median=24.5,mean=28.91,percentile_8=4,sum=2891.0,queryFacets={float1={float_fd:[* TO 50]={median=25.0,mean=25.0,percentile_8=4,sum=1450.0}},float2={float_fd:[* TO 30]={median=18.5,mean=16.842105263157894,percentile_8=3,sum=640.0}}}},fr={median=42.5,mean=42.99,percentile_8=4.0,sum=4299.0,queryFacets={lad={long_ld:[30 TO *]={median=50.5,mean=50.5,percentile_8=30.0,sum=606.0},double_dd:[* TO 50]={median=42.5,mean=42.99,percentile_8=4.0,sum=4299.0},long_ld:[20 TO *]={median=32.5,mean=39.225,percentile_8=3.0,sum=1569.0}}}}}} expected:<[1450.0]> but was:<[2900.0, 0.0]>
	at __randomizedtesting.SeedInfo.seed([347EF7E43E3B83A3:A967B9055891CC36]:0)
	at org.junit.Assert.fail(Assert.java:93)
	at org.junit.Assert.failNotEquals(Assert.java:647)
	at org.junit.Assert.assertEquals(Assert.java:128)
	at org.apache.solr.analytics.legacy.facet.LegacyQueryFacetCloudTest.queryTest(LegacyQueryFacetCloudTest.java:142)
	at java.base/jdk.internal.reflect.NativeMethodAccessorImpl.invoke0(Native Method)
	at java.base/jdk.internal.reflect.NativeMethodAccessorImpl.invoke(NativeMethodAccessorImpl.java:62)
	at java.base/jdk.internal.reflect.DelegatingMethodAccessorImpl.invoke(DelegatingMethodAccessorImpl.java:43)
	at java.base/java.lang.reflect.Method.invoke(Method.java:564)
	at com.carrotsearch.randomizedtesting.RandomizedRunner.invoke(RandomizedRunner.java:1737)
	at com.carrotsearch.randomizedtesting.RandomizedRunner$8.evaluate(RandomizedRunner.java:934)
	at com.carrotsearch.randomizedtesting.RandomizedRunner$9.evaluate(RandomizedRunner.java:970)
	at com.carrotsearch.randomizedtesting.RandomizedRunner$10.evaluate(RandomizedRunner.java:984)
	at com.carrotsearch.randomizedtesting.rules.SystemPropertiesRestoreRule$1.evaluate(SystemPropertiesRestoreRule.java:57)
	at org.apache.lucene.util.TestRuleSetupTeardownChained$1.evaluate(TestRuleSetupTeardownChained.java:49)
	at org.apache.lucene.util.AbstractBeforeAfterRule$1.evaluate(AbstractBeforeAfterRule.java:45)
	at org.apache.lucene.util.TestRuleThreadAndTestName$1.evaluate(TestRuleThreadAndTestName.java:48)
	at org.apache.lucene.util.TestRuleIgnoreAfterMaxFailures$1.evaluate(TestRuleIgnoreAfterMaxFailures.java:64)
	at org.apache.lucene.util.TestRuleMarkFailure$1.evaluate(TestRuleMarkFailure.java:47)
	at com.carrotsearch.randomizedtesting.rules.StatementAdapter.evaluate(StatementAdapter.java:36)
	at com.carrotsearch.randomizedtesting.ThreadLeakControl$StatementRunner.run(ThreadLeakControl.java:368)
	at com.carrotsearch.randomizedtesting.ThreadLeakControl.forkTimeoutingTask(ThreadLeakControl.java:817)
	at com.carrotsearch.randomizedtesting.ThreadLeakControl$3.evaluate(ThreadLeakControl.java:468)
	at com.carrotsearch.randomizedtesting.RandomizedRunner.runSingleTest(RandomizedRunner.java:943)
	at com.carrotsearch.randomizedtesting.RandomizedRunner$5.evaluate(RandomizedRunner.java:829)
	at com.carrotsearch.randomizedtesting.RandomizedRunner$6.evaluate(RandomizedRunner.java:879)
	at com.carrotsearch.randomizedtesting.RandomizedRunner$7.evaluate(RandomizedRunner.java:890)
	at com.carrotsearch.randomizedtesting.rules.StatementAdapter.evaluate(StatementAdapter.java:36)
	at com.carrotsearch.randomizedtesting.rules.SystemPropertiesRestoreRule$1.evaluate(SystemPropertiesRestoreRule.java:57)
	at org.apache.lucene.util.AbstractBeforeAfterRule$1.evaluate(AbstractBeforeAfterRule.java:45)
	at com.carrotsearch.randomizedtesting.rules.StatementAdapter.evaluate(StatementAdapter.java:36)
	at org.apache.lucene.util.TestRuleStoreClassName$1.evaluate(TestRuleStoreClassName.java:41)
	at com.carrotsearch.randomizedtesting.rules.NoShadowingOrOverridesOnMethodsRule$1.evaluate(NoShadowingOrOverridesOnMethodsRule.java:40)
	at com.carrotsearch.randomizedtesting.rules.NoShadowingOrOverridesOnMethodsRule$1.evaluate(NoShadowingOrOverridesOnMethodsRule.java:40)
	at com.carrotsearch.randomizedtesting.rules.StatementAdapter.evaluate(StatementAdapter.java:36)
	at com.carrotsearch.randomizedtesting.rules.StatementAdapter.evaluate(StatementAdapter.java:36)
	at org.apache.lucene.util.TestRuleAssertionsRequired$1.evaluate(TestRuleAssertionsRequired.java:53)
	at org.apache.lucene.util.TestRuleMarkFailure$1.evaluate(TestRuleMarkFailure.java:47)
	at org.apache.lucene.util.TestRuleIgnoreAfterMaxFailures$1.evaluate(TestRuleIgnoreAfterMaxFailures.java:64)
	at org.apache.lucene.util.TestRuleIgnoreTestSuites$1.evaluate(TestRuleIgnoreTestSuites.java:54)
	at com.carrotsearch.randomizedtesting.rules.StatementAdapter.evaluate(StatementAdapter.java:36)
	at com.carrotsearch.randomizedtesting.ThreadLeakControl$StatementRunner.run(ThreadLeakControl.java:368)
	at java.base/java.lang.Thread.run(Thread.java:844)


FAILED:  org.apache.solr.analytics.legacy.facet.LegacyQueryFacetCloudTest.queryTest

Error Message:
{responseHeader={zkConnected=true,status=0,QTime=98,params={o.fr.s.sum=sum(float_fd),indent=true,o.ir.s.sum=sum(int_id),o.lr.qf.string.q=[string_sd:abc1, string_sd:abc2],o.fr.qf.lad.q=[long_ld:[20 TO *], long_ld:[30 TO *], double_dd:[* TO 50]],o.ir.s.median=median(int_id),o.lr.qf=string,o.ir.s.mean=mean(int_id),o.ir.qf.float1.q=float_fd:[* TO 50],o.lr.s.sum=sum(long_ld),o.ir.qf.float2.q=float_fd:[* TO 30],o.fr.s.percentile_8=percentile(8,float_fd),o.ir.s.percentile_8=percentile(8,int_id),o.fr.s.median=median(float_fd),o.fr.qf=lad,wt=javabin,o.lr.s.mean=mean(long_ld),_stateVer_=collection1:4,o.lr.s.percentile_8=percentile(8,long_ld),rows=0,version=2,q=*:*,o.ir.qf=[float1, float2],o.lr.s.median=median(long_ld),olap=true,o.fr.s.mean=mean(float_fd)}},response={numFound=100,start=0,maxScore=1.0,docs=[]},stats={lr={median=16.0,mean=16.38,percentile_8=2,sum=1638.0,queryFacets={string={string_sd:abc1={median=15.0,mean=16.4,percentile_8=1,sum=246.0},string_sd:abc2={median=14.5,mean=14.071428571428571,percentile_8=1,sum=197.0}}}},ir={median=24.5,mean=28.91,percentile_8=4,sum=2891.0,queryFacets={float1={float_fd:[* TO 50]={median=25.0,mean=25.0,percentile_8=4,sum=1450.0}},float2={float_fd:[* TO 30]={median=18.5,mean=16.842105263157894,percentile_8=3,sum=640.0}}}},fr={median=42.5,mean=42.99,percentile_8=4.0,sum=4299.0,queryFacets={lad={long_ld:[30 TO *]={median=50.5,mean=50.5,percentile_8=30.0,sum=606.0},double_dd:[* TO 50]={median=42.5,mean=42.99,percentile_8=4.0,sum=4299.0},long_ld:[20 TO *]={median=32.5,mean=39.225,percentile_8=3.0,sum=1569.0}}}}}} expected:<[1450.0]> but was:<[2900.0, 0.0]>

Stack Trace:
java.lang.AssertionError: {responseHeader={zkConnected=true,status=0,QTime=98,params={o.fr.s.sum=sum(float_fd),indent=true,o.ir.s.sum=sum(int_id),o.lr.qf.string.q=[string_sd:abc1, string_sd:abc2],o.fr.qf.lad.q=[long_ld:[20 TO *], long_ld:[30 TO *], double_dd:[* TO 50]],o.ir.s.median=median(int_id),o.lr.qf=string,o.ir.s.mean=mean(int_id),o.ir.qf.float1.q=float_fd:[* TO 50],o.lr.s.sum=sum(long_ld),o.ir.qf.float2.q=float_fd:[* TO 30],o.fr.s.percentile_8=percentile(8,float_fd),o.ir.s.percentile_8=percentile(8,int_id),o.fr.s.median=median(float_fd),o.fr.qf=lad,wt=javabin,o.lr.s.mean=mean(long_ld),_stateVer_=collection1:4,o.lr.s.percentile_8=percentile(8,long_ld),rows=0,version=2,q=*:*,o.ir.qf=[float1, float2],o.lr.s.median=median(long_ld),olap=true,o.fr.s.mean=mean(float_fd)}},response={numFound=100,start=0,maxScore=1.0,docs=[]},stats={lr={median=16.0,mean=16.38,percentile_8=2,sum=1638.0,queryFacets={string={string_sd:abc1={median=15.0,mean=16.4,percentile_8=1,sum=246.0},string_sd:abc2={median=14.5,mean=14.071428571428571,percentile_8=1,sum=197.0}}}},ir={median=24.5,mean=28.91,percentile_8=4,sum=2891.0,queryFacets={float1={float_fd:[* TO 50]={median=25.0,mean=25.0,percentile_8=4,sum=1450.0}},float2={float_fd:[* TO 30]={median=18.5,mean=16.842105263157894,percentile_8=3,sum=640.0}}}},fr={median=42.5,mean=42.99,percentile_8=4.0,sum=4299.0,queryFacets={lad={long_ld:[30 TO *]={median=50.5,mean=50.5,percentile_8=30.0,sum=606.0},double_dd:[* TO 50]={median=42.5,mean=42.99,percentile_8=4.0,sum=4299.0},long_ld:[20 TO *]={median=32.5,mean=39.225,percentile_8=3.0,sum=1569.0}}}}}} expected:<[1450.0]> but was:<[2900.0, 0.0]>
	at __randomizedtesting.SeedInfo.seed([347EF7E43E3B83A3:A967B9055891CC36]:0)
	at org.junit.Assert.fail(Assert.java:93)
	at org.junit.Assert.failNotEquals(Assert.java:647)
	at org.junit.Assert.assertEquals(Assert.java:128)
	at org.apache.solr.analytics.legacy.facet.LegacyQueryFacetCloudTest.queryTest(LegacyQueryFacetCloudTest.java:142)
	at java.base/jdk.internal.reflect.NativeMethodAccessorImpl.invoke0(Native Method)
	at java.base/jdk.internal.reflect.NativeMethodAccessorImpl.invoke(NativeMethodAccessorImpl.java:62)
	at java.base/jdk.internal.reflect.DelegatingMethodAccessorImpl.invoke(DelegatingMethodAccessorImpl.java:43)
	at java.base/java.lang.reflect.Method.invoke(Method.java:564)
	at com.carrotsearch.randomizedtesting.RandomizedRunner.invoke(RandomizedRunner.java:1737)
	at com.carrotsearch.randomizedtesting.RandomizedRunner$8.evaluate(RandomizedRunner.java:934)
	at com.carrotsearch.randomizedtesting.RandomizedRunner$9.evaluate(RandomizedRunner.java:970)
	at com.carrotsearch.randomizedtesting.RandomizedRunner$10.evaluate(RandomizedRunner.java:984)
	at com.carrotsearch.randomizedtesting.rules.SystemPropertiesRestoreRule$1.evaluate(SystemPropertiesRestoreRule.java:57)
	at org.apache.lucene.util.TestRuleSetupTeardownChained$1.evaluate(TestRuleSetupTeardownChained.java:49)
	at org.apache.lucene.util.AbstractBeforeAfterRule$1.evaluate(AbstractBeforeAfterRule.java:45)
	at org.apache.lucene.util.TestRuleThreadAndTestName$1.evaluate(TestRuleThreadAndTestName.java:48)
	at org.apache.lucene.util.TestRuleIgnoreAfterMaxFailures$1.evaluate(TestRuleIgnoreAfterMaxFailures.java:64)
	at org.apache.lucene.util.TestRuleMarkFailure$1.evaluate(TestRuleMarkFailure.java:47)
	at com.carrotsearch.randomizedtesting.rules.StatementAdapter.evaluate(StatementAdapter.java:36)
	at com.carrotsearch.randomizedtesting.ThreadLeakControl$StatementRunner.run(ThreadLeakControl.java:368)
	at com.carrotsearch.randomizedtesting.ThreadLeakControl.forkTimeoutingTask(ThreadLeakControl.java:817)
	at com.carrotsearch.randomizedtesting.ThreadLeakControl$3.evaluate(ThreadLeakControl.java:468)
	at com.carrotsearch.randomizedtesting.RandomizedRunner.runSingleTest(RandomizedRunner.java:943)
	at com.carrotsearch.randomizedtesting.RandomizedRunner$5.evaluate(RandomizedRunner.java:829)
	at com.carrotsearch.randomizedtesting.RandomizedRunner$6.evaluate(RandomizedRunner.java:879)
	at com.carrotsearch.randomizedtesting.RandomizedRunner$7.evaluate(RandomizedRunner.java:890)
	at com.carrotsearch.randomizedtesting.rules.StatementAdapter.evaluate(StatementAdapter.java:36)
	at com.carrotsearch.randomizedtesting.rules.SystemPropertiesRestoreRule$1.evaluate(SystemPropertiesRestoreRule.java:57)
	at org.apache.lucene.util.AbstractBeforeAfterRule$1.evaluate(AbstractBeforeAfterRule.java:45)
	at com.carrotsearch.randomizedtesting.rules.StatementAdapter.evaluate(StatementAdapter.java:36)
	at org.apache.lucene.util.TestRuleStoreClassName$1.evaluate(TestRuleStoreClassName.java:41)
	at com.carrotsearch.randomizedtesting.rules.NoShadowingOrOverridesOnMethodsRule$1.evaluate(NoShadowingOrOverridesOnMethodsRule.java:40)
	at com.carrotsearch.randomizedtesting.rules.NoShadowingOrOverridesOnMethodsRule$1.evaluate(NoShadowingOrOverridesOnMethodsRule.java:40)
	at com.carrotsearch.randomizedtesting.rules.StatementAdapter.evaluate(StatementAdapter.java:36)
	at com.carrotsearch.randomizedtesting.rules.StatementAdapter.evaluate(StatementAdapter.java:36)
	at org.apache.lucene.util.TestRuleAssertionsRequired$1.evaluate(TestRuleAssertionsRequired.java:53)
	at org.apache.lucene.util.TestRuleMarkFailure$1.evaluate(TestRuleMarkFailure.java:47)
	at org.apache.lucene.util.TestRuleIgnoreAfterMaxFailures$1.evaluate(TestRuleIgnoreAfterMaxFailures.java:64)
	at org.apache.lucene.util.TestRuleIgnoreTestSuites$1.evaluate(TestRuleIgnoreTestSuites.java:54)
	at com.carrotsearch.randomizedtesting.rules.StatementAdapter.evaluate(StatementAdapter.java:36)
	at com.carrotsearch.randomizedtesting.ThreadLeakControl$StatementRunner.run(ThreadLeakControl.java:368)
	at java.base/java.lang.Thread.run(Thread.java:844)


FAILED:  org.apache.solr.core.TestJmxIntegration.testJmxRegistration

Error Message:
org.apache.lucene.store.AlreadyClosedException: this IndexReader is closed

Stack Trace:
javax.management.RuntimeMBeanException: org.apache.lucene.store.AlreadyClosedException: this IndexReader is closed
	at __randomizedtesting.SeedInfo.seed([5CBA8F81C09A0EAD:D26BEBBBADDB56C8]:0)
	at java.management/com.sun.jmx.interceptor.DefaultMBeanServerInterceptor.rethrow(DefaultMBeanServerInterceptor.java:829)
	at java.management/com.sun.jmx.interceptor.DefaultMBeanServerInterceptor.rethrowMaybeMBeanException(DefaultMBeanServerInterceptor.java:842)
	at java.management/com.sun.jmx.interceptor.DefaultMBeanServerInterceptor.getAttribute(DefaultMBeanServerInterceptor.java:645)
	at java.management/com.sun.jmx.mbeanserver.JmxMBeanServer.getAttribute(JmxMBeanServer.java:678)
	at org.apache.solr.core.TestJmxIntegration.testJmxRegistration(TestJmxIntegration.java:134)
	at java.base/jdk.internal.reflect.NativeMethodAccessorImpl.invoke0(Native Method)
	at java.base/jdk.internal.reflect.NativeMethodAccessorImpl.invoke(NativeMethodAccessorImpl.java:62)
	at java.base/jdk.internal.reflect.DelegatingMethodAccessorImpl.invoke(DelegatingMethodAccessorImpl.java:43)
	at java.base/java.lang.reflect.Method.invoke(Method.java:564)
	at com.carrotsearch.randomizedtesting.RandomizedRunner.invoke(RandomizedRunner.java:1737)
	at com.carrotsearch.randomizedtesting.RandomizedRunner$8.evaluate(RandomizedRunner.java:934)
	at com.carrotsearch.randomizedtesting.RandomizedRunner$9.evaluate(RandomizedRunner.java:970)
	at com.carrotsearch.randomizedtesting.RandomizedRunner$10.evaluate(RandomizedRunner.java:984)
	at com.carrotsearch.randomizedtesting.rules.SystemPropertiesRestoreRule$1.evaluate(SystemPropertiesRestoreRule.java:57)
	at org.apache.lucene.util.TestRuleSetupTeardownChained$1.evaluate(TestRuleSetupTeardownChained.java:49)
	at org.apache.lucene.util.AbstractBeforeAfterRule$1.evaluate(AbstractBeforeAfterRule.java:45)
	at org.apache.lucene.util.TestRuleThreadAndTestName$1.evaluate(TestRuleThreadAndTestName.java:48)
	at org.apache.lucene.util.TestRuleIgnoreAfterMaxFailures$1.evaluate(TestRuleIgnoreAfterMaxFailures.java:64)
	at org.apache.lucene.util.TestRuleMarkFailure$1.evaluate(TestRuleMarkFailure.java:47)
	at com.carrotsearch.randomizedtesting.rules.StatementAdapter.evaluate(StatementAdapter.java:36)
	at com.carrotsearch.randomizedtesting.ThreadLeakControl$StatementRunner.run(ThreadLeakControl.java:368)
	at com.carrotsearch.randomizedtesting.ThreadLeakControl.forkTimeoutingTask(ThreadLeakControl.java:817)
	at com.carrotsearch.randomizedtesting.ThreadLeakControl$3.evaluate(ThreadLeakControl.java:468)
	at com.carrotsearch.randomizedtesting.RandomizedRunner.runSingleTest(RandomizedRunner.java:943)
	at com.carrotsearch.randomizedtesting.RandomizedRunner$5.evaluate(RandomizedRunner.java:829)
	at com.carrotsearch.randomizedtesting.RandomizedRunner$6.evaluate(RandomizedRunner.java:879)
	at com.carrotsearch.randomizedtesting.RandomizedRunner$7.evaluate(RandomizedRunner.java:890)
	at com.carrotsearch.randomizedtesting.rules.StatementAdapter.evaluate(StatementAdapter.java:36)
	at com.carrotsearch.randomizedtesting.rules.SystemPropertiesRestoreRule$1.evaluate(SystemPropertiesRestoreRule.java:57)
	at org.apache.lucene.util.AbstractBeforeAfterRule$1.evaluate(AbstractBeforeAfterRule.java:45)
	at com.carrotsearch.randomizedtesting.rules.StatementAdapter.evaluate(StatementAdapter.java:36)
	at org.apache.lucene.util.TestRuleStoreClassName$1.evaluate(TestRuleStoreClassName.java:41)
	at com.carrotsearch.randomizedtesting.rules.NoShadowingOrOverridesOnMethodsRule$1.evaluate(NoShadowingOrOverridesOnMethodsRule.java:40)
	at com.carrotsearch.randomizedtesting.rules.NoShadowingOrOverridesOnMethodsRule$1.evaluate(NoShadowingOrOverridesOnMethodsRule.java:40)
	at com.carrotsearch.randomizedtesting.rules.StatementAdapter.evaluate(StatementAdapter.java:36)
	at com.carrotsearch.randomizedtesting.rules.StatementAdapter.evaluate(StatementAdapter.java:36)
	at org.apache.lucene.util.TestRuleAssertionsRequired$1.evaluate(TestRuleAssertionsRequired.java:53)
	at org.apache.lucene.util.TestRuleMarkFailure$1.evaluate(TestRuleMarkFailure.java:47)
	at org.apache.lucene.util.TestRuleIgnoreAfterMaxFailures$1.evaluate(TestRuleIgnoreAfterMaxFailures.java:64)
	at org.apache.lucene.util.TestRuleIgnoreTestSuites$1.evaluate(TestRuleIgnoreTestSuites.java:54)
	at com.carrotsearch.randomizedtesting.rules.StatementAdapter.evaluate(StatementAdapter.java:36)
	at com.carrotsearch.randomizedtesting.ThreadLeakControl$StatementRunner.run(ThreadLeakControl.java:368)
	at java.base/java.lang.Thread.run(Thread.java:844)
Caused by: org.apache.lucene.store.AlreadyClosedException: this IndexReader is closed
	at org.apache.lucene.index.IndexReader.ensureOpen(IndexReader.java:268)
	at org.apache.lucene.index.StandardDirectoryReader.getVersion(StandardDirectoryReader.java:338)
	at org.apache.lucene.index.FilterDirectoryReader.getVersion(FilterDirectoryReader.java:119)
	at org.apache.lucene.index.FilterDirectoryReader.getVersion(FilterDirectoryReader.java:119)
	at org.apache.solr.search.SolrIndexSearcher.lambda$initializeMetrics$14(SolrIndexSearcher.java:2265)
	at org.apache.solr.metrics.reporters.jmx.JmxMetricsReporter$JmxGauge.getValue(JmxMetricsReporter.java:209)
	at jdk.internal.reflect.GeneratedMethodAccessor110.invoke(Unknown Source)
	at java.base/jdk.internal.reflect.DelegatingMethodAccessorImpl.invoke(DelegatingMethodAccessorImpl.java:43)
	at java.base/java.lang.reflect.Method.invoke(Method.java:564)
	at sun.reflect.misc.Trampoline.invoke(MethodUtil.java:71)
	at jdk.internal.reflect.GeneratedMethodAccessor2.invoke(Unknown Source)
	at java.base/jdk.internal.reflect.DelegatingMethodAccessorImpl.invoke(DelegatingMethodAccessorImpl.java:43)
	at java.base/java.lang.reflect.Method.invoke(Method.java:564)
	at java.base/sun.reflect.misc.MethodUtil.invoke(MethodUtil.java:260)
	at java.management/com.sun.jmx.mbeanserver.StandardMBeanIntrospector.invokeM2(StandardMBeanIntrospector.java:112)
	at java.management/com.sun.jmx.mbeanserver.StandardMBeanIntrospector.invokeM2(StandardMBeanIntrospector.java:46)
	at java.management/com.sun.jmx.mbeanserver.MBeanIntrospector.invokeM(MBeanIntrospector.java:237)
	at java.management/com.sun.jmx.mbeanserver.PerInterface.getAttribute(PerInterface.java:83)
	at java.management/com.sun.jmx.mbeanserver.MBeanSupport.getAttribute(MBeanSupport.java:206)
	at java.management/com.sun.jmx.interceptor.DefaultMBeanServerInterceptor.getAttribute(DefaultMBeanServerInterceptor.java:641)
	... 40 more




Build Log:
[...truncated 13740 lines...]
   [junit4] Suite: org.apache.solr.core.TestJmxIntegration
   [junit4]   2> Creating dataDir: /home/jenkins/workspace/Lucene-Solr-7.3-Linux/solr/build/solr-core/test/J2/temp/solr.core.TestJmxIntegration_5CBA8F81C09A0EAD-001/init-core-data-001
   [junit4]   2> 1064911 WARN  (SUITE-TestJmxIntegration-seed#[5CBA8F81C09A0EAD]-worker) [    ] o.a.s.SolrTestCaseJ4 startTrackingSearchers: numOpens=1 numCloses=1
   [junit4]   2> 1064911 INFO  (SUITE-TestJmxIntegration-seed#[5CBA8F81C09A0EAD]-worker) [    ] o.a.s.SolrTestCaseJ4 Using PointFields (NUMERIC_POINTS_SYSPROP=true) w/NUMERIC_DOCVALUES_SYSPROP=false
   [junit4]   2> 1064912 INFO  (SUITE-TestJmxIntegration-seed#[5CBA8F81C09A0EAD]-worker) [    ] o.a.s.SolrTestCaseJ4 Randomized ssl (false) and clientAuth (true) via: @org.apache.solr.util.RandomizeSSL(reason="", ssl=0.0/0.0, value=0.0/0.0, clientAuth=0.0/0.0)
   [junit4]   2> 1064912 INFO  (SUITE-TestJmxIntegration-seed#[5CBA8F81C09A0EAD]-worker) [    ] o.a.s.SolrTestCaseJ4 SecureRandom sanity checks: test.solr.allowed.securerandom=null & java.security.egd=file:/dev/./urandom
   [junit4]   2> 1064912 INFO  (SUITE-TestJmxIntegration-seed#[5CBA8F81C09A0EAD]-worker) [    ] o.a.s.SolrTestCaseJ4 ####initCore
   [junit4]   2> 1064912 INFO  (SUITE-TestJmxIntegration-seed#[5CBA8F81C09A0EAD]-worker) [    ] o.a.s.c.SolrResourceLoader [null] Added 2 libs to classloader, from paths: [/home/jenkins/workspace/Lucene-Solr-7.3-Linux/solr/core/src/test-files/solr/collection1/lib, /home/jenkins/workspace/Lucene-Solr-7.3-Linux/solr/core/src/test-files/solr/collection1/lib/classes]
   [junit4]   2> 1064927 INFO  (SUITE-TestJmxIntegration-seed#[5CBA8F81C09A0EAD]-worker) [    ] o.a.s.c.SolrConfig Using Lucene MatchVersion: 7.3.1
   [junit4]   2> 1064945 INFO  (SUITE-TestJmxIntegration-seed#[5CBA8F81C09A0EAD]-worker) [    ] o.a.s.s.IndexSchema [null] Schema name=test
   [junit4]   2> 1065017 INFO  (SUITE-TestJmxIntegration-seed#[5CBA8F81C09A0EAD]-worker) [    ] o.a.s.s.IndexSchema Loaded schema test/1.0 with uniqueid field id
   [junit4]   2> 1065036 INFO  (SUITE-TestJmxIntegration-seed#[5CBA8F81C09A0EAD]-worker) [    ] o.a.s.m.r.SolrJmxReporter JMX monitoring for 'solr.node' (registry 'solr.node') enabled at server: com.sun.jmx.mbeanserver.JmxMBeanServer@18aed392
   [junit4]   2> 1065042 INFO  (SUITE-TestJmxIntegration-seed#[5CBA8F81C09A0EAD]-worker) [    ] o.a.s.m.r.SolrJmxReporter JMX monitoring for 'solr.jvm' (registry 'solr.jvm') enabled at server: com.sun.jmx.mbeanserver.JmxMBeanServer@18aed392
   [junit4]   2> 1065042 INFO  (SUITE-TestJmxIntegration-seed#[5CBA8F81C09A0EAD]-worker) [    ] o.a.s.m.r.SolrJmxReporter JMX monitoring for 'solr.jetty' (registry 'solr.jetty') enabled at server: com.sun.jmx.mbeanserver.JmxMBeanServer@18aed392
   [junit4]   2> 1065043 INFO  (coreLoadExecutor-4489-thread-1) [    ] o.a.s.c.TransientSolrCoreCacheDefault Allocating transient cache for 2147483647 transient cores
   [junit4]   2> 1065043 INFO  (coreLoadExecutor-4489-thread-1) [    x:collection1] o.a.s.c.SolrResourceLoader [null] Added 2 libs to classloader, from paths: [/home/jenkins/workspace/Lucene-Solr-7.3-Linux/solr/core/src/test-files/solr/collection1/lib, /home/jenkins/workspace/Lucene-Solr-7.3-Linux/solr/core/src/test-files/solr/collection1/lib/classes]
   [junit4]   2> 1065066 INFO  (coreLoadExecutor-4489-thread-1) [    x:collection1] o.a.s.c.SolrConfig Using Lucene MatchVersion: 7.3.1
   [junit4]   2> 1065085 INFO  (coreLoadExecutor-4489-thread-1) [    x:collection1] o.a.s.s.IndexSchema [collection1] Schema name=test
   [junit4]   2> 1065172 INFO  (coreLoadExecutor-4489-thread-1) [    x:collection1] o.a.s.s.IndexSchema Loaded schema test/1.0 with uniqueid field id
   [junit4]   2> 1065179 INFO  (coreLoadExecutor-4489-thread-1) [    x:collection1] o.a.s.c.CoreContainer Creating SolrCore 'collection1' using configuration from instancedir /home/jenkins/workspace/Lucene-Solr-7.3-Linux/solr/core/src/test-files/solr/collection1, trusted=true
   [junit4]   2> 1065179 INFO  (coreLoadExecutor-4489-thread-1) [    x:collection1] o.a.s.m.r.SolrJmxReporter JMX monitoring for 'solr.core.collection1' (registry 'solr.core.collection1') enabled at server: com.sun.jmx.mbeanserver.JmxMBeanServer@18aed392
   [junit4]   2> 1065179 INFO  (coreLoadExecutor-4489-thread-1) [    x:collection1] o.a.s.c.SolrCore solr.RecoveryStrategy.Builder
   [junit4]   2> 1065179 INFO  (coreLoadExecutor-4489-thread-1) [    x:collection1] o.a.s.c.SolrCore [[collection1] ] Opening new SolrCore at [/home/jenkins/workspace/Lucene-Solr-7.3-Linux/solr/core/src/test-files/solr/collection1], dataDir=[/home/jenkins/workspace/Lucene-Solr-7.3-Linux/solr/build/solr-core/test/J2/temp/solr.core.TestJmxIntegration_5CBA8F81C09A0EAD-001/init-core-data-001/]
   [junit4]   2> 1065180 INFO  (coreLoadExecutor-4489-thread-1) [    x:collection1] o.a.s.u.RandomMergePolicy RandomMergePolicy wrapping class org.apache.lucene.index.LogByteSizeMergePolicy: [LogByteSizeMergePolicy: minMergeSize=1677721, mergeFactor=37, maxMergeSize=2147483648, maxMergeSizeForForcedMerge=9223372036854775807, calibrateSizeByDeletes=true, maxMergeDocs=2147483647, maxCFSSegmentSizeMB=8.796093022207999E12, noCFSRatio=0.0]
   [junit4]   2> 1065228 INFO  (coreLoadExecutor-4489-thread-1) [    x:collection1] o.a.s.u.UpdateHandler Using UpdateLog implementation: org.apache.solr.update.UpdateLog
   [junit4]   2> 1065228 INFO  (coreLoadExecutor-4489-thread-1) [    x:collection1] o.a.s.u.UpdateLog Initializing UpdateLog: dataDir= defaultSyncLevel=FLUSH numRecordsToKeep=100 maxNumLogsToKeep=10 numVersionBuckets=65536
   [junit4]   2> 1065229 INFO  (coreLoadExecutor-4489-thread-1) [    x:collection1] o.a.s.u.CommitTracker Hard AutoCommit: disabled
   [junit4]   2> 1065229 INFO  (coreLoadExecutor-4489-thread-1) [    x:collection1] o.a.s.u.CommitTracker Soft AutoCommit: disabled
   [junit4]   2> 1065229 INFO  (coreLoadExecutor-4489-thread-1) [    x:collection1] o.a.s.u.RandomMergePolicy RandomMergePolicy wrapping class org.apache.lucene.index.MockRandomMergePolicy: org.apache.lucene.index.MockRandomMergePolicy@45b5afcb
   [junit4]   2> 1065230 INFO  (coreLoadExecutor-4489-thread-1) [    x:collection1] o.a.s.s.SolrIndexSearcher Opening [Searcher@62bf9571[collection1] main]
   [junit4]   2> 1065230 INFO  (coreLoadExecutor-4489-thread-1) [    x:collection1] o.a.s.h.c.SpellCheckComponent Initializing spell checkers
   [junit4]   2> 1065743 INFO  (coreLoadExecutor-4489-thread-1) [    x:collection1] o.a.s.s.DirectSolrSpellChecker init: {name=direct,classname=DirectSolrSpellChecker,field=lowerfilt,minQueryLength=3}
   [junit4]   2> 1065874 INFO  (coreLoadExecutor-4489-thread-1) [    x:collection1] o.a.s.h.ReplicationHandler Commits will be reserved for 10000ms.
   [junit4]   2> 1065874 INFO  (searcherExecutor-4490-thread-1-processing-x:collection1) [    x:collection1] o.a.s.h.c.SpellCheckComponent Loading spell index for spellchecker: default
   [junit4]   2> 1065874 INFO  (coreLoadExecutor-4489-thread-1) [    x:collection1] o.a.s.u.UpdateLog Could not find max version in index or recent updates, using new clock 1600047075209248768
   [junit4]   2> 1065874 INFO  (searcherExecutor-4490-thread-1-processing-x:collection1) [    x:collection1] o.a.s.h.c.SpellCheckComponent Loading spell index for spellchecker: direct
   [junit4]   2> 1065874 INFO  (searcherExecutor-4490-thread-1-processing-x:collection1) [    x:collection1] o.a.s.h.c.SpellCheckComponent Loading spell index for spellchecker: wordbreak
   [junit4]   2> 1065874 INFO  (searcherExecutor-4490-thread-1-processing-x:collection1) [    x:collection1] o.a.s.h.c.SpellCheckComponent Loading spell index for spellchecker: multipleFields
   [junit4]   2> 1065874 INFO  (searcherExecutor-4490-thread-1-processing-x:collection1) [    x:collection1] o.a.s.h.c.SpellCheckComponent Loading spell index for spellchecker: jarowinkler
   [junit4]   2> 1065874 INFO  (searcherExecutor-4490-thread-1-processing-x:collection1) [    x:collection1] o.a.s.h.c.SpellCheckComponent Loading spell index for spellchecker: external
   [junit4]   2> 1065875 INFO  (searcherExecutor-4490-thread-1-processing-x:collection1) [    x:collection1] o.a.s.h.c.SpellCheckComponent Loading spell index for spellchecker: freq
   [junit4]   2> 1065875 INFO  (searcherExecutor-4490-thread-1-processing-x:collection1) [    x:collection1] o.a.s.h.c.SpellCheckComponent Loading spell index for spellchecker: fqcn
   [junit4]   2> 1065875 INFO  (searcherExecutor-4490-thread-1-processing-x:collection1) [    x:collection1] o.a.s.h.c.SpellCheckComponent Loading spell index for spellchecker: perDict
   [junit4]   2> 1065875 INFO  (searcherExecutor-4490-thread-1-processing-x:collection1) [    x:collection1] o.a.s.c.SolrCore [collection1] Registered new searcher Searcher@62bf9571[collection1] main{ExitableDirectoryReader(UninvertingDirectoryReader())}
   [junit4]   2> 1065876 INFO  (SUITE-TestJmxIntegration-seed#[5CBA8F81C09A0EAD]-worker) [    ] o.a.s.SolrTestCaseJ4 ####initCore end
   [junit4]   2> 1065877 INFO  (TEST-TestJmxIntegration.testJmxRegistration-seed#[5CBA8F81C09A0EAD]) [    ] o.a.s.SolrTestCaseJ4 ###Starting testJmxRegistration
   [junit4]   2> 1065877 INFO  (TEST-TestJmxIntegration.testJmxRegistration-seed#[5CBA8F81C09A0EAD]) [    ] o.a.s.u.DirectUpdateHandler2 [collection1] REMOVING ALL DOCUMENTS FROM INDEX
   [junit4]   2> 1065878 INFO  (TEST-TestJmxIntegration.testJmxRegistration-seed#[5CBA8F81C09A0EAD]) [    ] o.a.s.s.SolrIndexSearcher Opening [Searcher@23fb56c4[collection1] realtime]
   [junit4]   2> 1065878 INFO  (TEST-TestJmxIntegration.testJmxRegistration-seed#[5CBA8F81C09A0EAD]) [    ] o.a.s.u.p.LogUpdateProcessorFactory [collection1]  webapp=null path=null params={_version_=-9223372036854775807&update.distrib=FROMLEADER&versions=true&wt=json&indent=true}{deleteByQuery=*:* (-9223372036854775807)} 0 0
   [junit4]   2> 1065878 INFO  (TEST-TestJmxIntegration.testJmxRegistration-seed#[5CBA8F81C09A0EAD]) [    ] o.a.s.u.DirectUpdateHandler2 start commit{_version_=1600047075213443072,optimize=false,openSearcher=true,waitSearcher=true,expungeDeletes=false,softCommit=false,prepareCommit=false}
   [junit4]   2> 1065878 INFO  (TEST-TestJmxIntegration.testJmxRegistration-seed#[5CBA8F81C09A0EAD]) [    ] o.a.s.u.SolrIndexWriter Calling setCommitData with IW:org.apache.solr.update.SolrIndexWriter@13a56d5e commitCommandVersion:1600047075213443072
   [junit4]   2> 1065878 INFO  (TEST-TestJmxIntegration.testJmxRegistration-seed#[5CBA8F81C09A0EAD]) [    ] o.a.s.s.SolrIndexSearcher Opening [Searcher@28c0bd70[collection1] main]
   [junit4]   2> 1065879 INFO  (TEST-TestJmxIntegration.testJmxRegistration-seed#[5CBA8F81C09A0EAD]) [    ] o.a.s.u.DirectUpdateHandler2 end_commit_flush
   [junit4]   2> 1065880 INFO  (searcherExecutor-4490-thread-1) [    ] o.a.s.c.SolrCore [collection1] Registered new searcher Searcher@28c0bd70[collection1] main{ExitableDirectoryReader(UninvertingDirectoryReader())}
   [junit4]   2> 1065880 INFO  (TEST-TestJmxIntegration.testJmxRegistration-seed#[5CBA8F81C09A0EAD]) [    ] o.a.s.u.p.LogUpdateProcessorFactory [collection1]  webapp=null path=null params={}{commit=} 0 1
   [junit4]   2> 1065961 INFO  (TEST-TestJmxIntegration.testJmxRegistration-seed#[5CBA8F81C09A0EAD]) [    ] o.a.s.SolrTestCaseJ4 ###Ending testJmxRegistration
   [junit4]   2> NOTE: reproduce with: ant test  -Dtestcase=TestJmxIntegration -Dtests.method=testJmxRegistration -Dtests.seed=5CBA8F81C09A0EAD -Dtests.multiplier=3 -Dtests.slow=true -Dtests.locale=prg -Dtests.timezone=America/Grenada -Dtests.asserts=true -Dtests.file.encoding=US-ASCII
   [junit4] ERROR   0.09s J2 | TestJmxIntegration.testJmxRegistration <<<
   [junit4]    > Throwable #1: javax.management.RuntimeMBeanException: org.apache.lucene.store.AlreadyClosedException: this IndexReader is closed
   [junit4]    > 	at __randomizedtesting.SeedInfo.seed([5CBA8F81C09A0EAD:D26BEBBBADDB56C8]:0)
   [junit4]    > 	at java.management/com.sun.jmx.interceptor.DefaultMBeanServerInterceptor.rethrow(DefaultMBeanServerInterceptor.java:829)
   [junit4]    > 	at java.management/com.sun.jmx.interceptor.DefaultMBeanServerInterceptor.rethrowMaybeMBeanException(DefaultMBeanServerInterceptor.java:842)
   [junit4]    > 	at java.management/com.sun.jmx.interceptor.DefaultMBeanServerInterceptor.getAttribute(DefaultMBeanServerInterceptor.java:645)
   [junit4]    > 	at java.management/com.sun.jmx.mbeanserver.JmxMBeanServer.getAttribute(JmxMBeanServer.java:678)
   [junit4]    > 	at org.apache.solr.core.TestJmxIntegration.testJmxRegistration(TestJmxIntegration.java:134)
   [junit4]    > 	at java.base/jdk.internal.reflect.NativeMethodAccessorImpl.invoke0(Native Method)
   [junit4]    > 	at java.base/jdk.internal.reflect.NativeMethodAccessorImpl.invoke(NativeMethodAccessorImpl.java:62)
   [junit4]    > 	at java.base/jdk.internal.reflect.DelegatingMethodAccessorImpl.invoke(DelegatingMethodAccessorImpl.java:43)
   [junit4]    > 	at java.base/java.lang.reflect.Method.invoke(Method.java:564)
   [junit4]    > 	at java.base/java.lang.Thread.run(Thread.java:844)
   [junit4]    > Caused by: org.apache.lucene.store.AlreadyClosedException: this IndexReader is closed
   [junit4]    > 	at org.apache.lucene.index.IndexReader.ensureOpen(IndexReader.java:268)
   [junit4]    > 	at org.apache.lucene.index.StandardDirectoryReader.getVersion(StandardDirectoryReader.java:338)
   [junit4]    > 	at org.apache.lucene.index.FilterDirectoryReader.getVersion(FilterDirectoryReader.java:119)
   [junit4]    > 	at org.apache.lucene.index.FilterDirectoryReader.getVersion(FilterDirectoryReader.java:119)
   [junit4]    > 	at org.apache.solr.search.SolrIndexSearcher.lambda$initializeMetrics$14(SolrIndexSearcher.java:2265)
   [junit4]    > 	at org.apache.solr.metrics.reporters.jmx.JmxMetricsReporter$JmxGauge.getValue(JmxMetricsReporter.java:209)
   [junit4]    > 	at jdk.internal.reflect.GeneratedMethodAccessor110.invoke(Unknown Source)
   [junit4]    > 	at java.base/jdk.internal.reflect.DelegatingMethodAccessorImpl.invoke(DelegatingMethodAccessorImpl.java:43)
   [junit4]    > 	at java.base/java.lang.reflect.Method.invoke(Method.java:564)
   [junit4]    > 	at jdk.internal.reflect.GeneratedMethodAccessor2.invoke(Unknown Source)
   [junit4]    > 	at java.base/jdk.internal.reflect.DelegatingMethodAccessorImpl.invoke(DelegatingMethodAccessorImpl.java:43)
   [junit4]    > 	at java.base/java.lang.reflect.Method.invoke(Method.java:564)
   [junit4]    > 	at java.base/sun.reflect.misc.MethodUtil.invoke(MethodUtil.java:260)
   [junit4]    > 	at java.management/com.sun.jmx.mbeanserver.StandardMBeanIntrospector.invokeM2(StandardMBeanIntrospector.java:112)
   [junit4]    > 	at java.management/com.sun.jmx.mbeanserver.StandardMBeanIntrospector.invokeM2(StandardMBeanIntrospector.java:46)
   [junit4]    > 	at java.management/com.sun.jmx.mbeanserver.MBeanIntrospector.invokeM(MBeanIntrospector.java:237)
   [junit4]    > 	at java.management/com.sun.jmx.mbeanserver.PerInterface.getAttribute(PerInterface.java:83)
   [junit4]    > 	at java.management/com.sun.jmx.mbeanserver.MBeanSupport.getAttribute(MBeanSupport.java:206)
   [junit4]    > 	at java.management/com.sun.jmx.interceptor.DefaultMBeanServerInterceptor.getAttribute(DefaultMBeanServerInterceptor.java:641)
   [junit4]    > 	... 40 more
   [junit4]   2> 1065964 INFO  (TEST-TestJmxIntegration.testJmxOnCoreReload-seed#[5CBA8F81C09A0EAD]) [    ] o.a.s.SolrTestCaseJ4 ###Starting testJmxOnCoreReload
   [junit4]   2> 1065964 INFO  (TEST-TestJmxIntegration.testJmxOnCoreReload-seed#[5CBA8F81C09A0EAD]) [    ] o.a.s.u.DirectUpdateHandler2 [collection1] REMOVING ALL DOCUMENTS FROM INDEX
   [junit4]   2> 1065964 INFO  (TEST-TestJmxIntegration.testJmxOnCoreReload-seed#[5CBA8F81C09A0EAD]) [    ] o.a.s.s.SolrIndexSearcher Opening [Searcher@5824b685[collection1] realtime]
   [junit4]   2> 1065964 INFO  (TEST-TestJmxIntegration.testJmxOnCoreReload-seed#[5CBA8F81C09A0EAD]) [    ] o.a.s.u.p.LogUpdateProcessorFactory [collection1]  webapp=null path=null params={_version_=-9223372036854775807&update.distrib=FROMLEADER&versions=true&wt=json&indent=true}{deleteByQuery=*:* (-9223372036854775807)} 0 0
   [junit4]   2> 1065964 INFO  (TEST-TestJmxIntegration.testJmxOnCoreReload-seed#[5CBA8F81C09A0EAD]) [    ] o.a.s.u.DirectUpdateHandler2 start commit{_version_=1600047075303620608,optimize=false,openSearcher=true,waitSearcher=true,expungeDeletes=false,softCommit=false,prepareCommit=false}
   [junit4]   2> 1065965 INFO  (TEST-TestJmxIntegration.testJmxOnCoreReload-seed#[5CBA8F81C09A0EAD]) [    ] o.a.s.u.SolrIndexWriter Calling setCommitData with IW:org.apache.solr.update.SolrIndexWriter@13a56d5e commitCommandVersion:1600047075303620608
   [junit4]   2> 1065965 INFO  (TEST-TestJmxIntegration.testJmxOnCoreReload-seed#[5CBA8F81C09A0EAD]) [    ] o.a.s.s.SolrIndexSearcher Opening [Searcher@27bbc81d[collection1] main]
   [junit4]   2> 1065965 INFO  (TEST-TestJmxIntegration.testJmxOnCoreReload-seed#[5CBA8F81C09A0EAD]) [    ] o.a.s.u.DirectUpdateHandler2 end_commit_flush
   [junit4]   2> 1065966 INFO  (searcherExecutor-4490-thread-1) [    ] o.a.s.c.SolrCore [collection1] Registered new searcher Searcher@27bbc81d[collection1] main{ExitableDirectoryReader(UninvertingDirectoryReader())}
   [junit4]   2> 1065966 INFO  (TEST-TestJmxIntegration.testJmxOnCoreReload-seed#[5CBA8F81C09A0EAD]) [    ] o.a.s.u.p.LogUpdateProcessorFactory [collection1]  webapp=null path=null params={}{commit=} 0 1
   [junit4]   2> 1065967 INFO  (TEST-TestJmxIntegration.testJmxOnCoreReload-seed#[5CBA8F81C09A0EAD]) [    ] o.a.s.c.S.Request [collection1]  webapp=null path=null params={q=*:*&wt=xml} hits=0 status=0 QTime=0
   [junit4]   2> 1065993 INFO  (TEST-TestJmxIntegration.testJmxOnCoreReload-seed#[5CBA8F81C09A0EAD]) [    ] o.a.s.c.TestJmxIntegration Before Reload: size of all core metrics: 434 MBeans: 434
   [junit4]   2> 1065993 ERROR (TEST-TestJmxIntegration.testJmxOnCoreReload-seed#[5CBA8F81C09A0EAD]) [    ] o.a.s.c.CorePropertiesLocator Couldn't load core descriptor from /home/jenkins/workspace/Lucene-Solr-7.3-Linux/solr/core/src/test-files/solr/collection1/core.properties:java.nio.file.NoSuchFileException: /home/jenkins/workspace/Lucene-Solr-7.3-Linux/solr/core/src/test-files/solr/collection1/core.properties
   [junit4]   2> 1065994 INFO  (TEST-TestJmxIntegration.testJmxOnCoreReload-seed#[5CBA8F81C09A0EAD]) [    ] o.a.s.c.SolrResourceLoader [null] Added 2 libs to classloader, from paths: [/home/jenkins/workspace/Lucene-Solr-7.3-Linux/solr/core/src/test-files/solr/collection1/lib, /home/jenkins/workspace/Lucene-Solr-7.3-Linux/solr/core/src/test-files/solr/collection1/lib/classes]
   [junit4]   2> 1066021 INFO  (TEST-TestJmxIntegration.testJmxOnCoreReload-seed#[5CBA8F81C09A0EAD]) [    ] o.a.s.c.SolrConfig Using Lucene MatchVersion: 7.3.1
   [junit4]   2> 1066037 INFO  (TEST-TestJmxIntegration.testJmxOnCoreReload-seed#[5CBA8F81C09A0EAD]) [    ] o.a.s.s.IndexSchema [collection1] Schema name=test
   [junit4]   2> 1066102 INFO  (TEST-TestJmxIntegration.testJmxOnCoreReload-seed#[5CBA8F81C09A0EAD]) [    ] o.a.s.s.IndexSchema Loaded schema test/1.0 with uniqueid field id
   [junit4]   2> 1066106 INFO  (TEST-TestJmxIntegration.testJmxOnCoreReload-seed#[5CBA8F81C09A0EAD]) [    ] o.a.s.c.CoreContainer Reloading SolrCore 'collection1' using configuration from instancedir /home/jenkins/workspace/Lucene-Solr-7.3-Linux/solr/core/src/test-files/solr/collection1
   [junit4]   2> 1066128 INFO  (TEST-TestJmxIntegration.testJmxOnCoreReload-seed#[5CBA8F81C09A0EAD]) [    x:collection1] o.a.s.m.r.SolrJmxReporter JMX monitoring for 'solr.core.collection1' (registry 'solr.core.collection1') enabled at server: com.sun.jmx.mbeanserver.JmxMBeanServer@18aed392
   [junit4]   2> 1066128 INFO  (TEST-TestJmxIntegration.testJmxOnCoreReload-seed#[5CBA8F81C09A0EAD]) [    x:collection1] o.a.s.c.SolrCore [[collection1] ] Opening new SolrCore at [/home/jenkins/workspace/Lucene-Solr-7.3-Linux/solr/core/src/test-files/solr/collection1], dataDir=[/home/jenkins/workspace/Lucene-Solr-7.3-Linux/solr/build/solr-core/test/J2/temp/solr.core.TestJmxIntegration_5CBA8F81C09A0EAD-001/init-core-data-001/]
   [junit4]   2> 1066165 INFO  (TEST-TestJmxIntegration.testJmxOnCoreReload-seed#[5CBA8F81C09A0EAD]) [    x:collection1] o.a.s.u.CommitTracker Hard AutoCommit: disabled
   [junit4]   2> 1066165 INFO  (TEST-TestJmxIntegration.testJmxOnCoreReload-seed#[5CBA8F81C09A0EAD]) [    x:collection1] o.a.s.u.CommitTracker Soft AutoCommit: disabled
   [junit4]   2> 1066166 INFO  (TEST-TestJmxIntegration.testJmxOnCoreReload-seed#[5CBA8F81C09A0EAD]) [    x:collection1] o.a.s.s.SolrIndexSearcher Opening [Searcher@67a691fa[collection1] main]
   [junit4]   2> 1066166 INFO  (TEST-TestJmxIntegration.testJmxOnCoreReload-seed#[5CBA8F81C09A0EAD]) [    x:collection1] o.a.s.h.c.SpellCheckComponent Initializing spell checkers
   [junit4]   2> 1066167 INFO  (TEST-TestJmxIntegration.testJmxOnCoreReload-seed#[5CBA8F81C09A0EAD]) [    x:collection1] o.a.s.s.DirectSolrSpellChecker init: {name=direct,classname=DirectSolrSpellChecker,field=lowerfilt,minQueryLength=3}
   [junit4]   2> 1066168 INFO  (TEST-TestJmxIntegration.testJmxOnCoreReload-seed#[5CBA8F81C09A0EAD]) [    x:collection1] o.a.s.h.ReplicationHandler Commits will be reserved for 10000ms.
   [junit4]   2> 1066169 INFO  (searcherExecutor-4495-thread-1-processing-x:collection1) [    x:collection1] o.a.s.h.c.SpellCheckComponent Loading spell index for spellchecker: default
   [junit4]   2> 1066169 INFO  (TEST-TestJmxIntegration.testJmxOnCoreReload-seed#[5CBA8F81C09A0EAD]) [    x:collection1] o.a.s.u.UpdateLog Could not find max version in index or recent updates, using new clock 1600047075518578688
   [junit4]   2> 1066169 INFO  (searcherExecutor-4495-thread-1-processing-x:collection1) [    x:collection1] o.a.s.h.c.SpellCheckComponent Loading spell index for spellchecker: direct
   [junit4]   2> 1066169 INFO  (searcherExecutor-4495-thread-1-processing-x:collection1) [    x:collection1] o.a.s.h.c.SpellCheckComponent Loading spell index for spellchecker: wordbreak
   [junit4]   2> 1066169 INFO  (searcherExecutor-4495-thread-1-processing-x:collection1) [    x:collection1] o.a.s.h.c.SpellCheckComponent Loading spell index for spellchecker: multipleFields
   [junit4]   2> 1066169 INFO  (searcherExecutor-4495-thread-1-processing-x:collection1) [    x:collection1] o.a.s.h.c.SpellCheckComponent Loading spell index for spellchecker: jarowinkler
   [junit4]   2> 1066169 INFO  (searcherExecutor-4495-thread-1-processing-x:collection1) [    x:collection1] o.a.s.h.c.SpellCheckComponent Loading spell index for spellchecker: external
   [junit4]   2> 1066170 INFO  (searcherExecutor-4495-thread-1-processing-x:collection1) [    x:collection1] o.a.s.h.c.SpellCheckComponent Loading spell index for spellchecker: freq
   [junit4]   2> 1066170 INFO  (searcherExecutor-4495-thread-1-processing-x:collection1) [    x:collection1] o.a.s.h.c.SpellCheckComponent Loading spell index for spellchecker: fqcn
   [junit4]   2> 1066170 INFO  (searcherExecutor-4495-thread-1-processing-x:collection1) [    x:collection1] o.a.s.h.c.SpellCheckComponent Loading spell index for spellchecker: perDict
   [junit4]   2> 1066170 INFO  (TEST-TestJmxIntegration.testJmxOnCoreReload-seed#[5CBA8F81C09A0EAD]) [    x:collection1] o.a.s.u.RandomMergePolicy RandomMergePolicy wrapping class org.apache.lucene.index.TieredMergePolicy: [TieredMergePolicy: maxMergeAtOnce=28, maxMergeAtOnceExplicit=11, maxMergedSegmentMB=94.060546875, floorSegmentMB=1.4365234375, forceMergeDeletesPctAllowed=19.06370028753628, segmentsPerTier=24.0, maxCFSSegmentSizeMB=8.796093022207999E12, noCFSRatio=0.10030701628364565
   [junit4]   2> 1066170 INFO  (TEST-TestJmxIntegration.testJmxOnCoreReload-seed#[5CBA8F81C09A0EAD]) [    x:collection1] o.a.s.u.DefaultSolrCoreState New IndexWriter is ready to be used.
   [junit4]   2> 1066172 INFO  (searcherExecutor-4495-thread-1-processing-x:collection1) [    x:collection1] o.a.s.c.SolrCore [collection1] Registered new searcher Searcher@67a691fa[collection1] main{ExitableDirectoryReader(UninvertingDirectoryReader())}
   [junit4]   2> 1066173 INFO  (TEST-TestJmxIntegration.testJmxOnCoreReload-seed#[5CBA8F81C09A0EAD]) [    x:collection1] o.a.s.s.SolrIndexSearcher Opening [Searcher@519eb03f[collection1] main]
   [junit4]   2> 1066173 INFO  (TEST-TestJmxIntegration.testJmxOnCoreReload-seed#[5CBA8F81C09A0EAD]) [    x:collection1] o.a.s.c.SolrCore [collection1]  CLOSING SolrCore org.apache.solr.core.SolrCore@327c710e
   [junit4]   2> 1066173 INFO  (TEST-TestJmxIntegration.testJmxOnCoreReload-seed#[5CBA8F81C09A0EAD]) [    x:collection1] o.a.s.m.SolrMetricManager Closing metric reporters for registry=solr.core.collection1, tag=847016206
   [junit4]   2> 1066173 INFO  (TEST-TestJmxIntegration.testJmxOnCoreReload-seed#[5CBA8F81C09A0EAD]) [    x:collection1] o.a.s.m.r.SolrJmxReporter Closing reporter [org.apache.solr.metrics.reporters.SolrJmxReporter@719fbc95: rootName = null, domain = solr.core.collection1, service url = null, agent id = null] for registry solr.core.collection1 / com.codahale.metrics.MetricRegistry@5891222c
   [junit4]   2> 1066174 INFO  (searcherExecutor-4495-thread-1-processing-x:collection1) [    x:collection1] o.a.s.c.SolrCore [collection1] Registered new searcher Searcher@519eb03f[collection1] main{ExitableDirectoryReader(UninvertingDirectoryReader())}
   [junit4]   2> 1066183 INFO  (TEST-TestJmxIntegration.testJmxOnCoreReload-seed#[5CBA8F81C09A0EAD]) [    x:collection1] o.a.s.c.S.Request [collection1]  webapp=null path=null params={q=*:*&wt=xml} hits=0 status=0 QTime=0
   [junit4]   2> 1066206 INFO  (TEST-TestJmxIntegration.testJmxOnCoreReload-seed#[5CBA8F81C09A0EAD]) [    x:collection1] o.a.s.c.TestJmxIntegration After Reload: size of all core metrics: 434 MBeans: 434
   [junit4]   2> 1066206 INFO  (TEST-TestJmxIntegration.testJmxOnCoreReload-seed#[5CBA8F81C09A0EAD]) [    x:collection1] o.a.s.SolrTestCaseJ4 ###Ending testJmxOnCoreReload
   [junit4]   2> 1066207 INFO  (TEST-TestJmxIntegration.testJmxUpdate-seed#[5CBA8F81C09A0EAD]) [    x:collection1] o.a.s.SolrTestCaseJ4 ###Starting testJmxUpdate
   [junit4]   2> 1066207 INFO  (TEST-TestJmxIntegration.testJmxUpdate-seed#[5CBA8F81C09A0EAD]) [    x:collection1] o.a.s.u.DirectUpdateHandler2 [collection1] REMOVING ALL DOCUMENTS FROM INDEX
   [junit4]   2> 1066208 INFO  (TEST-TestJmxIntegration.testJmxUpdate-seed#[5CBA8F81C09A0EAD]) [    x:collection1] o.a.s.s.SolrIndexSearcher Opening [Searcher@3b5f2214[collection1] realtime]
   [junit4]   2> 1066208 INFO  (TEST-TestJmxIntegration.testJmxUpdate-seed#[5CBA8F81C09A0EAD]) [    x:collection1] o.a.s.u.p.LogUpdateProcessorFactory [collection1]  webapp=null path=null params={_version_=-9223372036854775807&update.distrib=FROMLEADER&versions=true&wt=json&indent=true}{deleteByQuery=*:* (-9223372036854775807)} 0 0
   [junit4]   2> 1066208 INFO  (TEST-TestJmxIntegration.testJmxUpdate-seed#[5CBA8F81C09A0EAD]) [    x:collection1] o.a.s.u.DirectUpdateHandler2 start commit{_version_=1600047075559473152,optimize=false,openSearcher=true,waitSearcher=true,expungeDeletes=false,softCommit=false,prepareCommit=false}
   [junit4]   2> 1066208 INFO  (TEST-TestJmxIntegration.testJmxUpdate-seed#[5CBA8F81C09A0EAD]) [    x:collection1] o.a.s.u.SolrIndexWriter Calling setCommitData with IW:org.apache.solr.update.SolrIndexWriter@1f9116e5 commitCommandVersion:1600047075559473152
   [junit4]   2> 1066208 INFO  (TEST-TestJmxIntegration.testJmxUpdate-seed#[5CBA8F81C09A0EAD]) [    x:collection1] o.a.s.s.SolrIndexSearcher Opening [Searcher@72f8cd29[collection1] main]
   [junit4]   2> 1066208 INFO  (TEST-TestJmxIntegration.testJmxUpdate-seed#[5CBA8F81C09A0EAD]) [    x:collection1] o.a.s.u.DirectUpdateHandler2 end_commit_flush
   [junit4]   2> 1066209 INFO  (searcherExecutor-4495-thread-1-processing-x:collection1) [    x:collection1] o.a.s.c.SolrCore [collection1] Registered new searcher Searcher@72f8cd29[collection1] main{ExitableDirectoryReader(UninvertingDirectoryReader())}
   [junit4]   2> 1066209 INFO  (TEST-TestJmxIntegration.testJmxUpdate-seed#[5CBA8F81C09A0EAD]) [    x:collection1] o.a.s.u.p.LogUpdateProcessorFactory [collection1]  webapp=null path=null params={}{commit=} 0 1
   [junit4]   2> 1066229 INFO  (TEST-TestJmxIntegration.testJmxUpdate-seed#[5CBA8F81C09A0EAD]) [    x:collection1] o.a.s.c.TestJmxIntegration Mbeans in server: [solr:dom1=core,dom2=collection1,dom3=shard2,dom4=replica_n41,category=SEARCHER,scope=searcher,name=searcherName, solr:dom1=core,dom2=collection1,category=QUERY,scope=/terms,name=serverErrors, solr:dom1=core,dom2=collection1,category=QUERY,scope=/dismax,name=handlerStart, solr:dom1=jvm,name0=memory,name1=pools,name2=PS-Survivor-Space,name=max, solr:dom1=core,dom2=collection1,category=QUERY,scope=/mock,name=requests, java.lang:type=Threading, solr:dom1=node,category=QUERY,scope=/admin/metrics/collector,name=handlerStart, solr:dom1=node,category=ADMIN,scope=/admin/metrics,name=requests, solr:dom1=core,dom2=collection1,category=ADMIN,scope=/admin/mbeans,name=shardRequests, solr:dom1=core,dom2=collection1,category=QUERY,scope=/mock,name=errors, solr:dom1=jvm,name0=os,name=systemLoadAverage, solr:dom1=core,dom2=collection1,category=QUERY,scope=/get,name=errors, solr:dom1=core,dom2=collection1,category=QUERY,scope=/spellCheckCompRH1,name=requestTimes, solr:dom1=core,dom2=collection1,category=QUERY,scope=/defaults,name=serverErrors, solr:dom1=core,dom2=collection1,category=QUERY,scope=/search-facet-def,name=requestTimes, solr:dom1=core,dom2=collection1,category=UPDATE,scope=update,name=requestTimes, solr:dom1=core,dom2=collection1,category=UPDATE,scope=/update,name=timeouts, solr:dom1=core,dom2=collection1,category=QUERY,scope=/spellCheckWithWordbreak,name=shardRequests, solr:dom1=node,category=UPDATE,scope=updateShardHandler,name=threadPool.updateExecutor.running, solr:dom1=node,category=QUERY,scope=httpShardHandler,name=threadPool.httpShardExecutor.duration, solr:dom1=core,dom2=collection1,category=QUERY,scope=/mock,name=handlerStart, solr:dom1=node,category=ADMIN,scope=/admin/metrics,name=serverErrors, solr_45787:dom1=solr,dom2=jvm,name0=system,name=properties, solr:dom1=core,dom2=collection1,category=UPDATE,scope=/update,name=handlerStart, solr:dom1=jvm,name0=buffers,name1=mapped,name=TotalCapacity, solr:dom1=core,dom2=collection1,category=UPDATE,scope=/update,name=totalTime, solr:dom1=core,dom2=collection1,category=ADMIN,scope=/admin/luke,name=requests, solr:dom1=jvm,name0=memory,name1=pools,name2=CodeHeap-'non-profiled-nmethods',name=usage, solr:dom1=core,dom2=collection1,category=UPDATE,scope=updateHandler,name=rollbacks, solr:dom1=core,dom2=collection1,category=QUERY,scope=/search-facet-def,name=timeouts, solr_36809:dom1=solr,dom2=jvm,name0=system,name=properties, solr:dom1=node,category=UPDATE,scope=updateShardHandler,name=threadPool.recoveryExecutor.submitted, solr:dom1=node,category=ADMIN,scope=/admin/cores,name=serverErrors, solr:dom1=core,dom2=collection1,category=QUERY,scope=/stream,name=requestTimes, solr:dom1=core,dom2=collection1,category=ADMIN,scope=/admin/system,name=shardRequests, solr:dom1=core,dom2=collection1,category=QUERY,scope=/dismax,name=clientErrors, solr:dom1=node,category=CONTAINER,scope=threadPool,name=coreContainerWorkExecutor.running, solr:dom1=core,dom2=collection1,category=QUERY,scope=/terms,name=timeouts, solr:dom1=core,dom2=collection1,category=QUERY,scope=/graph,name=clientErrors, solr:dom1=core,dom2=collection1,category=UPDATE,scope=/update/json,name=timeouts, solr:dom1=core,dom2=collection1,category=QUERY,scope=/mltrh,name=shardRequests, solr:dom1=node,category=ADMIN,scope=/admin/collections,name=requestTimes, solr:dom1=core,dom2=collection1,category=SEARCHER,scope=searcher,name=reader, solr:dom1=core,dom2=collection1,dom3=shard2,dom4=replica_n41,category=SEARCHER,scope=searcher,name=numDocs, solr:dom1=core,dom2=collection1,category=HIGHLIGHTER,scope=SolrFragmenter,name=gap.requests, solr:dom1=core,dom2=collection1,category=QUERY,scope=/export,name=requestTimes, solr:dom1=core,dom2=collection1,category=HIGHLIGHTER,scope=SolrBoundaryScanner,name=breakIterator.requests, solr:dom1=node,category=ADMIN,scope=/admin/authorization,name=requestTimes, solr_41375:dom1=solr,dom2=jvm,name0=system,name=properties, solr:dom1=core,dom2=collection1,category=QUERY,scope=/debug/dump,name=shardRequests, solr:dom1=node,category=ADMIN,scope=/admin/collections,name=handlerStart, solr:dom1=core,dom2=collection1,category=ADMIN,scope=/admin/segments,name=totalTime, solr_41393:dom1=solr,dom2=jvm,name0=system,name=properties, solr:dom1=node,category=ADMIN,scope=/admin/autoscaling/history,name=clientErrors, solr:dom1=core,dom2=collection1,category=ADMIN,scope=/admin/ping,name=errors, solr:dom1=jvm,name0=memory,name1=pools,name2=PS-Survivor-Space,name=usage, solr:dom1=jvm,name0=memory,name1=pools,name2=Compressed-Class-Space,name=max, solr:dom1=core,dom2=collection1,dom3=shard2,dom4=replica_n41,category=SEARCHER,scope=searcher,name=warmupTime, solr:dom1=core,dom2=collection1,category=ADMIN,scope=/schema,name=clientErrors, solr:dom1=jvm,name0=memory,name1=pools,name2=PS-Old-Gen,name=init, solr_37921:dom1=solr,dom2=jvm,name0=system,name=properties, solr_43961:dom1=solr,dom2=jvm,name0=system,name=properties, solr:dom1=core,dom2=collection1,category=QUERY,scope=/stream,name=timeouts, solr_42433:dom1=solr,dom2=jvm,name0=system,name=properties, solr:dom1=core,dom2=collection1,category=UPDATE,scope=updateHandler,name=errors, solr:dom1=core,dom2=collection1,category=ADMIN,scope=/admin/file,name=errors, solr:dom1=core,dom2=collection1,category=QUERY,scope=/sql,name=requests, solr:dom1=core,dom2=collection1,category=ADMIN,scope=/admin/logging,name=shardRequests, solr:dom1=core,dom2=collection1,dom3=shard2,dom4=replica_n41,category=SEARCHER,scope=searcher,name=maxDoc, solr:dom1=core,dom2=collection1,category=TLOG,name=state, solr:dom1=core,dom2=collection1,category=CORE,scope=fs,name=spins, solr:dom1=jvm,name0=threads,name1=waiting,name=count, solr:dom1=jvm,name0=classes,name=unloaded, solr:dom1=jvm,name0=buffers,name1=direct,name=MemoryUsed, solr:dom1=core,dom2=collection1,category=QUERY,scope=/search-facet-def,name=errors, solr:dom1=core,dom2=collection1,dom3=shard2,dom4=replica_n41,category=CACHE,scope=searcher,name=perSegFilter, solr:dom1=node,category=ADMIN,scope=/admin/cores,name=threadPool.parallelCoreAdminExecutor.submitted, solr:dom1=core,dom2=collection1,category=TLOG,scope=replay,name=remaining.bytes, solr:dom1=core,dom2=collection1,category=ADMIN,scope=/admin/properties,name=timeouts, solr:dom1=node,category=CONTAINER,scope=cores,name=loaded, solr:dom1=core,dom2=collection1,category=ADMIN,scope=/schema,name=handlerStart, solr:dom1=node,category=ADMIN,scope=/admin/autoscaling/history,name=timeouts, solr:dom1=core,dom2=collection1,dom3=shard2,dom4=replica_n41,category=SEARCHER,scope=searcher,name=deletedDocs, solr:dom1=node,category=ADMIN,scope=/admin/authorization,name=handlerStart, solr:dom1=core,dom2=collection1,category=ADMIN,scope=/admin/luke,name=shardRequests, solr_37879:dom1=solr,dom2=jvm,name0=system,name=properties, solr:dom1=core,dom2=collection1,category=QUERY,scope=/mltrh,name=totalTime, solr:dom1=core,dom2=collection1,category=UPDATE,scope=/update,name=clientErrors, solr:dom1=core,dom2=collection1,category=QUERY,scope=/search-facet-invariants,name=clientErrors, solr:dom1=core,dom2=collection1,category=QUERY,scope=/export,name=totalTime, solr:dom1=core,dom2=collection1,category=SEARCHER,scope=new,name=errors, solr:dom1=core,dom2=collection1,category=QUERY,scope=/sql,name=timeouts, solr_38283:dom1=solr,dom2=jvm,name0=system,name=properties, solr:dom1=core,dom2=collection1,category=ADMIN,scope=/config,name=clientErrors, solr:dom1=core,dom2=collection1,category=UPDATE,scope=/update/csv,name=handlerStart, solr:dom1=node,category=QUERY,scope=httpShardHandler,name=threadPool.httpShardExecutor.completed, solr:dom1=core,dom2=collection1,category=QUERY,scope=/debug/dump,name=clientErrors, solr:dom1=core,dom2=collection1,category=REPLICATION,scope=/replication,name=handlerStart, solr:dom1=core,dom2=collection1,category=QUERY,scope=/graph,name=serverErrors, solr:dom1=core,dom2=collection1,category=QUERY,scope=/spellCheckWithWordbreak_Direct,name=serverErrors, java.lang:type=Runtime, solr:dom1=core,dom2=collection1,category=UPDATE,scope=updateHandler,name=cumulativeDeletesById, solr:dom1=core,dom2=collection1,category=QUERY,scope=/defaults,name=timeouts, solr:dom1=core,dom2=collection1,category=UPDATE,scope=updateHandler,name=cumulativeDeletesByQuery, solr:dom1=core,dom2=collection1,category=QUERY,scope=/dismax,name=timeouts, solr:dom1=node,category=ADMIN,scope=/admin/authorization,name=errors, solr:dom1=node,category=UPDATE,scope=updateShardHandler,name=threadPool.recoveryExecutor.duration, solr:dom1=core,dom2=collection1,category=QUERY,scope=/spellCheckWithWordbreak_Direct,name=timeouts, solr:dom1=core,dom2=collection1,category=CORE,scope=fs,name=totalSpace, solr:dom1=core,dom2=collection1,category=QUERY,scope=/spellCheckCompRH_Direct,name=clientErrors, solr:dom1=core,dom2=collection1,category=QUERY,scope=/terms,name=clientErrors, solr_43535:dom1=solr,dom2=jvm,name0=system,name=properties, solr:dom1=core,dom2=collection1,category=ADMIN,scope=/admin/mbeans,name=serverErrors, solr:dom1=core,dom2=collection1,category=QUERY,scope=/search-facet-def,name=handlerStart, solr:dom1=node,category=CONTAINER,scope=threadPool,name=coreContainerWorkExecutor.duration, solr:dom1=core,dom2=collection1,category=QUERY,scope=/spellCheckWithWordbreak_Direct,name=requests, solr:dom1=node,category=ADMIN,scope=/admin/zookeeper,name=clientErrors, solr:dom1=core,dom2=collection1,category=ADMIN,scope=/admin/segments,name=timeouts, solr:dom1=core,dom2=collection1,category=QUERY,scope=/spellCheckWithWordbreak_Direct,name=clientErrors, solr:dom1=node,category=CONTAINER,scope=cores,name=unloaded, solr:dom1=node,category=ADMIN,scope=/admin/metrics,name=requestTimes, solr:dom1=core,dom2=collection1,category=QUERY,scope=/search-facet-invariants,name=serverErrors, java.lang:name=PS Eden Space,type=MemoryPool, solr:dom1=node,category=ADMIN,scope=/admin/metrics,name=timeouts, solr_37029:dom1=solr,dom2=jvm,name0=system,name=properties, solr:dom1=core,dom2=collection1,category=CORE,scope=fs,name=usableSpace, solr:dom1=jvm,name0=os,name=totalPhysicalMemorySize, solr:dom1=core,dom2=collection1,category=QUERY,scope=/spellCheckCompRH,name=serverErrors, solr:dom1=jvm,name0=os,name=totalSwapSpaceSize, solr:dom1=core,dom2=collection1,category=UPDATE,scope=updateHandler,name=cumulativeErrors, java.lang:name=PS Survivor Space,type=MemoryPool, solr:dom1=node,category=QUERY,scope=/admin/metrics/collector,name=requestTimes, solr:dom1=core,dom2=collection1,category=QUERY,scope=/spellCheckCompRH,name=errors, solr:dom1=core,dom2=collection1,category=QUERY,scope=/mlt,name=handlerStart, solr:dom1=jvm,name0=os,name=availableProcessors, solr:dom1=node,category=UPDATE,scope=updateShardHandler,name=threadPool.recoveryExecutor.running, solr:dom1=core,dom2=collection1,category=QUERY,scope=/spellCheckWithWordbreak,name=timeouts, solr:dom1=core,dom2=collection1,category=UPDATE,scope=/update,name=requestTimes, solr_39035:dom1=solr,dom2=jvm,name0=system,name=properties, solr:dom1=core,dom2=collection1,category=QUERY,scope=/spellCheckWithWordbreak,name=errors, solr:dom1=jvm,name0=memory,name1=pools,name2=Compressed-Class-Space,name=used, solr:dom1=node,category=CONTAINER,scope=fs,name=path, solr:dom1=node,category=ADMIN,scope=/admin/zookeeper,name=timeouts, solr:dom1=jvm,name0=threads,name=count, solr:dom1=jetty,name=foo, solr:dom1=node,category=ADMIN,scope=/admin/authorization,name=timeouts, solr:dom1=core,dom2=collection1,category=SEARCHER,scope=searcher,name=caching, solr:dom1=core,dom2=collection1,category=QUERY,scope=/mock,name=serverErrors, solr:dom1=jvm,name0=memory,name1=total,name=used, solr:dom1=core,dom2=collection1,category=HIGHLIGHTER,scope=SolrFormatter,name=html.requests, solr:dom1=node,category=CONTAINER,scope=fs,name=spins, solr:dom1=node,category=ADMIN,scope=/admin/cores,name=clientErrors, solr:dom1=core,dom2=collection1,category=UPDATE,scope=updateHandler,name=deletesByQuery, solr:dom1=core,dom2=collection1,category=ADMIN,scope=/schema,name=timeouts, solr:dom1=core,dom2=collection1,category=UPDATE,scope=/update/json/docs,name=serverErrors, solr:dom1=jvm,name0=threads,name1=new,name=count, solr:dom1=core,dom2=collection1,category=QUERY,scope=/spellCheckWithWordbreak,name=handlerStart, solr:dom1=core,dom2=collection1,category=TLOG,scope=replay,name=ops, solr:dom1=core,dom2=collection1,category=UPDATE,scope=/update,name=shardRequests, solr:dom1=core,dom2=collection1,category=QUERY,scope=/spellCheckCompRH1,name=handlerStart, solr:dom1=jetty,name=foo_bar, solr:dom1=core,dom2=collection1,category=ADMIN,scope=/admin/logging,name=serverErrors, solr:dom1=core,dom2=collection1,category=ADMIN,scope=/admin/threads,name=serverErrors, solr:dom1=core,dom2=collection1,category=ADMIN,scope=/admin/ping,name=requests, solr:dom1=core,dom2=collection1,category=QUERY,scope=/export,name=timeouts, solr:dom1=jvm,name0=memory,name1=pools,name2=PS-Old-Gen,name=committed, solr:dom1=node,category=ADMIN,scope=/admin/autoscaling/history,name=totalTime, solr:dom1=core,dom2=collection1,category=SEARCHER,scope=searcher,name=openedAt, solr:dom1=core,dom2=collection1,category=QUERY,scope=/stream,name=clientErrors, solr:dom1=core,dom2=collection1,category=QUERY,scope=/mlt,name=requestTimes, solr:dom1=node,category=ADMIN,scope=/admin/configs,name=errors, solr:dom1=core,dom2=collection1,category=QUERY,scope=/mock,name=initCount, solr:dom1=core,dom2=collection1,category=UPDATE,scope=update,name=errors, solr:dom1=core,dom2=collection1,category=UPDATE,scope=update,name=clientErrors, solr:dom1=core,dom2=collection1,category=QUERY,scope=/spellCheckWithWordbreak,name=requests, solr:dom1=node,category=ADMIN,scope=/admin/cores,name=handlerStart, solr:dom1=node,category=QUERY,scope=httpShardHandler,name=leasedConnections, solr:dom1=core,dom2=collection1,category=QUERY,scope=/select,name=requests, solr:dom1=core,dom2=collection1,category=UPDATE,scope=updateHandler,name=softAutoCommits, solr:dom1=jvm,name0=memory,name1=pools,name2=CodeHeap-'profiled-nmethods',name=committed, solr:dom1=jvm,name0=memory,name1=non-heap,name=used, solr:dom1=node,category=ADMIN,scope=/admin/metrics,name=handlerStart, solr:dom1=core,dom2=collection1,category=ADMIN,scope=/admin/segments,name=serverErrors, solr:dom1=core,dom2=collection1,category=UPDATE,scope=update,name=shardRequests, solr:dom1=node,category=ADMIN,scope=/admin/collections,name=clientErrors, solr:dom1=core,dom2=collection1,category=CORE,name=refCount, java.nio:name=direct,type=BufferPool, solr:dom1=core,dom2=collection1,category=UPDATE,scope=/update/json,name=totalTime, solr:dom1=node,category=ADMIN,scope=/admin/collections,name=errors, solr:dom1=jvm,name0=threads,name1=daemon,name=count, solr:dom1=node,category=ADMIN,scope=/admin/zookeeper,name=serverErrors, solr:dom1=node,category=CONTAINER,scope=fs,name=coreRoot.path, solr:dom1=core,dom2=collection1,category=ADMIN,scope=/admin/segments,name=errors, solr:dom1=jvm,name0=memory,name1=non-heap,name=init, solr:dom1=node,category=ADMIN,scope=/admin/configs,name=requests, solr:dom1=core,dom2=collection1,category=QUERY,scope=/sql,name=requestTimes, solr:dom1=jvm,name0=memory,name1=pools,name2=CodeHeap-'non-nmethods',name=max, solr:dom1=core,dom2=collection1,category=CACHE,scope=searcher,name=queryResultCache, solr:dom1=core,dom2=collection1,category=QUERY,scope=/spellCheckCompRH,name=requestTimes, solr:dom1=core,dom2=collection1,category=QUERY,scope=/search-facet-invariants,name=totalTime, solr:dom1=node,category=ADMIN,scope=/admin/autoscaling/history,name=handlerStart, solr:dom1=core,dom2=collection1,category=SEARCHER,scope=searcher,name=searcherName, solr:dom1=core,dom2=collection1,category=QUERY,scope=/spellCheckCompRH_Direct,name=handlerStart, solr:dom1=core,dom2=collection1,category=QUERY,scope=/dismax,name=requests, solr:dom1=jvm,name0=memory,name1=heap,name=max, solr:dom1=core,dom2=collection1,category=QUERY,scope=/defaults,name=shardRequests, solr:dom1=node,category=CONTAINER,scope=threadPool,name=coreLoadExecutor.duration, solr:dom1=jvm,name0=memory,name1=pools,name2=CodeHeap-'non-nmethods',name=committed, solr:dom1=core,dom2=collection1,category=UPDATE,scope=/update/csv,name=shardRequests, solr:dom1=core,dom2=collection1,category=REPLICATION,scope=/replication,name=serverErrors, solr:dom1=core,dom2=collection1,category=U
   [junit4]   2> PDATE,scope=update,name=timeouts, solr:dom1=core,dom2=collection1,category=ADMIN,scope=/admin/luke,name=errors, solr_36987:dom1=solr,dom2=jvm,name0=system,name=properties, solr:dom1=node,category=ADMIN,scope=/admin/cores,name=requests, solr:dom1=core,dom2=collection1,category=ADMIN,scope=/admin/mbeans,name=requestTimes, solr:dom1=core,dom2=collection1,category=ADMIN,scope=/admin/file,name=timeouts, solr:dom1=core,dom2=collection1,category=REPLICATION,scope=/replication,name=indexSize, solr:dom1=core,dom2=collection1,category=ADMIN,scope=/admin/ping,name=shardRequests, java.lang:name=CodeHeap 'non-profiled nmethods',type=MemoryPool, solr:dom1=node,category=ADMIN,scope=/admin/zookeeper,name=errors, solr:dom1=core,dom2=collection1,category=ADMIN,scope=/admin/ping,name=timeouts, solr:dom1=node,category=ADMIN,scope=/admin/cores,name=requestTimes, solr:dom1=core,dom2=collection1,category=QUERY,scope=/graph,name=requests, solr:dom1=core,dom2=collection1,category=ADMIN,scope=/schema,name=shardRequests, solr_41943:dom1=solr,dom2=jvm,name0=system,name=properties, solr:dom1=node,category=ADMIN,scope=/admin/configs,name=shardRequests, solr:dom1=jvm,name0=buffers,name1=mapped,name=Count, solr:dom1=core,dom2=collection1,category=ADMIN,scope=/schema,name=requestTimes, solr:dom1=core,dom2=collection1,category=QUERY,scope=/defaults,name=errors, solr:dom1=core,dom2=collection1,category=ADMIN,scope=/admin/segments,name=requests, solr:dom1=core,dom2=collection1,category=ADMIN,scope=/admin/file,name=shardRequests, solr:dom1=core,dom2=collection1,category=QUERY,scope=/search-facet-invariants,name=timeouts, solr:dom1=core,dom2=collection1,category=UPDATE,scope=update,name=totalTime, solr:dom1=core,dom2=collection1,category=UPDATE,scope=update,name=requests, solr:dom1=core,dom2=collection1,category=QUERY,scope=/spellCheckCompRH1,name=clientErrors, solr:dom1=core,dom2=collection1,category=ADMIN,scope=/admin/properties,name=serverErrors, solr:dom1=core,dom2=collection1,category=UPDATE,scope=/update/json/docs,name=clientErrors, java.lang:type=Compilation, solr:dom1=node,category=UPDATE,scope=updateShardHandler,name=threadPool.updateExecutor.submitted, solr:dom1=jvm,name0=memory,name1=pools,name2=Compressed-Class-Space,name=committed, solr:dom1=node,category=ADMIN,scope=/admin/autoscaling/history,name=requests, solr:dom1=node,category=QUERY,scope=/admin/metrics/collector,name=serverErrors, solr_43963:dom1=solr,dom2=jvm,name0=system,name=properties, solr:dom1=core,dom2=collection1,category=TLOG,scope=buffered,name=ops, solr:dom1=core,dom2=collection1,category=REPLICATION,scope=/replication,name=timeouts, solr:dom1=core,dom2=collection1,category=UPDATE,scope=updateHandler,name=adds, solr:dom1=core,dom2=collection1,category=ADMIN,scope=/admin/properties,name=errors, solr:dom1=jvm,name0=os,name=version, solr:dom1=core,dom2=collection1,category=UPDATE,scope=update,name=serverErrors, solr:dom1=node,category=UPDATE,scope=updateShardHandler,name=pendingConnections, solr:dom1=jvm,name0=memory,name1=pools,name2=Metaspace,name=usage, solr:dom1=core,dom2=collection1,category=CACHE,scope=searcher,name=documentCache, solr:dom1=node,category=ADMIN,scope=/admin/authorization,name=shardRequests, solr_45957:dom1=solr,dom2=jvm,name0=system,name=properties, solr:dom1=core,dom2=collection1,category=ADMIN,scope=/admin/plugins,name=totalTime, solr:dom1=core,dom2=collection1,category=QUERY,scope=/graph,name=handlerStart, solr:dom1=core,dom2=collection1,category=QUERY,scope=/mlt,name=errors, solr:dom1=core,dom2=collection1,category=QUERY,scope=/spellCheckWithWordbreak_Direct,name=handlerStart, java.lang:name=Compressed Class Space,type=MemoryPool, solr:dom1=core,dom2=collection1,category=QUERY,scope=/terms,name=requestTimes, solr:dom1=core,dom2=collection1,category=ADMIN,scope=/schema,name=errors, solr:dom1=core,dom2=collection1,category=QUERY,scope=/spellCheckCompRH_Direct,name=totalTime, solr:dom1=core,dom2=collection1,category=UPDATE,scope=/update/csv,name=clientErrors, solr:dom1=core,dom2=collection1,category=ADMIN,scope=/admin/properties,name=totalTime, solr:dom1=core,dom2=collection1,category=UPDATE,scope=/update/csv,name=requests, solr:dom1=jvm,name0=os,name=committedVirtualMemorySize, solr:dom1=core,dom2=collection1,category=QUERY,scope=/tvrh,name=errors, solr:dom1=jvm,name0=memory,name1=pools,name2=PS-Old-Gen,name=usage, solr:dom1=core,dom2=collection1,category=QUERY,scope=/terms,name=requests, solr:dom1=jvm,name0=memory,name1=non-heap,name=max, solr:dom1=jvm,name0=os,name=maxFileDescriptorCount, solr:dom1=core,dom2=collection1,category=HIGHLIGHTER,scope=SolrFragmentsBuilder,name=simple.requests, solr:dom1=core,dom2=collection1,category=CORE,name=coreName, solr:dom1=node,category=CONTAINER,scope=threadPool,name=coreLoadExecutor.running, solr:dom1=core,dom2=collection1,category=QUERY,scope=/sql,name=handlerStart, solr_39981:dom1=solr,dom2=jvm,name0=system,name=properties, solr:dom1=jvm,name0=memory,name1=heap,name=used, solr:dom1=core,dom2=collection1,category=CACHE,scope=searcher,name=perSegFilter, solr:dom1=core,dom2=collection1,dom3=shard2,dom4=replica_n41,category=SEARCHER,scope=searcher,name=caching, solr:dom1=core,dom2=collection1,category=ADMIN,scope=/admin/logging,name=requests, solr:dom1=core,dom2=collection1,category=QUERY,scope=/sql,name=errors, solr:dom1=jvm,name0=memory,name1=pools,name2=CodeHeap-'non-profiled-nmethods',name=init, solr:dom1=core,dom2=collection1,category=REPLICATION,scope=/replication,name=confFilesToReplicate, solr:dom1=core,dom2=collection1,category=UPDATE,scope=/update/json/docs,name=requests, solr:dom1=core,dom2=collection1,category=ADMIN,scope=/admin/luke,name=totalTime, solr:dom1=jvm,name0=os,name=systemCpuLoad, solr:dom1=node,category=CONTAINER,scope=fs,name=coreRoot.usableSpace, solr:dom1=core,dom2=collection1,category=HIGHLIGHTER,scope=SolrFragListBuilder,name=default.requests, solr:dom1=node,category=ADMIN,scope=/admin/info,name=shardRequests, solr:dom1=core,dom2=collection1,category=UPDATE,scope=updateHandler,name=splits, solr:dom1=core,dom2=collection1,category=QUERY,scope=/terms,name=handlerStart, solr:dom1=jvm,name0=memory,name1=pools,name2=CodeHeap-'profiled-nmethods',name=max, solr:dom1=core,dom2=collection1,category=REPLICATION,scope=/replication,name=fetcher, solr:dom1=core,dom2=collection1,category=QUERY,scope=/spellCheckCompRH_Direct,name=requestTimes, solr:dom1=jvm,name0=threads,name1=blocked,name=count, solr:dom1=core,dom2=collection1,category=QUERY,scope=/graph,name=timeouts, solr:dom1=node,category=ADMIN,scope=/admin/zookeeper,name=requestTimes, solr:dom1=node,category=ADMIN,scope=/admin/autoscaling/history,name=shardRequests, solr:dom1=core,dom2=collection1,category=HIGHLIGHTER,scope=SolrBoundaryScanner,name=default.requests, solr:dom1=core,dom2=collection1,category=REPLICATION,scope=/replication,name=totalTime, solr:dom1=jvm,name0=gc,name1=PS-MarkSweep,name=time, solr:dom1=node,category=ADMIN,scope=/admin/collections,name=requests, solr:dom1=node,category=ADMIN,scope=/admin/configs,name=totalTime, solr:dom1=core,dom2=collection1,category=TLOG,scope=applyingBuffered,name=ops, solr:dom1=node,category=ADMIN,scope=/admin/info,name=handlerStart, solr:dom1=core,dom2=collection1,category=QUERY,scope=/search-facet-def,name=totalTime, solr:dom1=jvm,name0=buffers,name1=direct,name=TotalCapacity, solr_38193:dom1=solr,dom2=jvm,name0=system,name=properties, solr:dom1=node,category=ADMIN,scope=/admin/autoscaling/history,name=serverErrors, solr:dom1=core,dom2=collection1,category=ADMIN,scope=/admin/properties,name=clientErrors, solr:dom1=core,dom2=collection1,category=UPDATE,scope=update,name=handlerStart, solr:dom1=core,dom2=collection1,category=REPLICATION,scope=/replication,name=generation, solr:dom1=core,dom2=collection1,category=UPDATE,scope=/update/csv,name=timeouts, solr:dom1=core,dom2=collection1,category=QUERY,scope=/mltrh,name=errors, java.lang:type=OperatingSystem, solr:dom1=core,dom2=collection1,category=ADMIN,scope=/admin/luke,name=timeouts, solr:dom1=core,dom2=collection1,category=QUERY,scope=/tvrh,name=handlerStart, solr:dom1=core,dom2=collection1,category=ADMIN,scope=/admin/threads,name=totalTime, solr:dom1=core,dom2=collection1,category=UPDATE,scope=/update/json/docs,name=timeouts, solr_39745:dom1=solr,dom2=jvm,name0=system,name=properties, solr:dom1=node,category=ADMIN,scope=/admin/metrics,name=shardRequests, solr_42945:dom1=solr,dom2=jvm,name0=system,name=properties, solr:dom1=core,dom2=collection1,category=QUERY,scope=/mock,name=clientErrors, solr:dom1=jvm,name0=threads,name1=terminated,name=count, java.lang:name=Metaspace Manager,type=MemoryManager, solr:dom1=core,dom2=collection1,category=ADMIN,scope=/admin/mbeans,name=handlerStart, solr:dom1=node,category=QUERY,scope=/admin/metrics/collector,name=timeouts, solr_38801:dom1=solr,dom2=jvm,name0=system,name=properties, solr:dom1=core,dom2=collection1,category=QUERY,scope=/spellCheckCompRH1,name=shardRequests, solr:dom1=node,category=QUERY,scope=/admin/metrics/collector,name=shardRequests, solr:dom1=node,category=ADMIN,scope=/admin/metrics,name=totalTime, solr:dom1=core,dom2=collection1,category=QUERY,scope=/spellCheckCompRH1,name=errors, solr:dom1=node,category=ADMIN,scope=/admin/zookeeper,name=handlerStart, java.lang:name=CodeHeap 'profiled nmethods',type=MemoryPool, solr:dom1=jvm,name0=memory,name1=pools,name2=CodeHeap-'non-nmethods',name=init, solr:dom1=core,dom2=collection1,category=TLOG,scope=replay,name=remaining.logs, solr:dom1=core,dom2=collection1,category=ADMIN,scope=/admin/system,name=requestTimes, solr:dom1=core,dom2=collection1,category=CORE,scope=fs,name=path, solr:dom1=node,category=CONTAINER,scope=threadPool,name=coreContainerWorkExecutor.completed, solr:dom1=core,dom2=collection1,category=ADMIN,scope=/admin/properties,name=requests, solr:dom1=core,dom2=collection1,category=QUERY,scope=/sql,name=serverErrors, solr:dom1=core,dom2=collection1,category=QUERY,scope=/sql,name=totalTime, solr:dom1=core,dom2=collection1,category=ADMIN,scope=/admin/logging,name=totalTime, solr:dom1=node,category=ADMIN,scope=/admin/cores,name=threadPool.parallelCoreAdminExecutor.duration, solr:dom1=core,dom2=collection1,category=ADMIN,scope=/admin/luke,name=serverErrors, solr:dom1=core,dom2=collection1,category=QUERY,scope=/spellCheckCompRH,name=totalTime, solr:dom1=core,dom2=collection1,category=UPDATE,scope=/update/json/docs,name=totalTime, solr:dom1=jvm,name0=memory,name1=pools,name2=PS-Eden-Space,name=max, solr:dom1=jvm,name0=memory,name1=pools,name2=PS-Old-Gen,name=used, solr:dom1=core,dom2=collection1,category=REPLICATION,scope=/replication,name=shardRequests, solr:dom1=core,dom2=collection1,category=QUERY,scope=/spellCheckWithWordbreak,name=serverErrors, solr:dom1=core,dom2=collection1,category=INDEX,name=sizeInBytes, solr:dom1=jvm,name0=memory,name1=pools,name2=Metaspace,name=max, solr:dom1=core,dom2=collection1,category=QUERY,scope=/tvrh,name=shardRequests, solr:dom1=node,category=ADMIN,scope=/admin/info,name=requestTimes, solr:dom1=core,dom2=collection1,category=UPDATE,scope=updateHandler,name=commits, solr:dom1=core,dom2=collection1,category=REPLICATION,scope=/replication,name=isSlave, solr:dom1=core,dom2=collection1,category=ADMIN,scope=/admin/threads,name=requests, solr:dom1=core,dom2=collection1,category=QUERY,scope=/sql,name=clientErrors, solr:dom1=core,dom2=collection1,category=ADMIN,scope=/schema,name=serverErrors, solr:dom1=core,dom2=collection1,category=UPDATE,scope=updateHandler,name=cumulativeAdds, solr:dom1=node,category=ADMIN,scope=/admin/authorization,name=clientErrors, solr:dom1=jvm,name0=memory,name1=pools,name2=CodeHeap-'non-profiled-nmethods',name=committed, solr:dom1=core,dom2=collection1,category=ADMIN,scope=/admin/segments,name=shardRequests, solr:dom1=core,dom2=collection1,category=QUERY,scope=/mock,name=timeouts, solr:dom1=core,dom2=collection1,category=QUERY,scope=/mlt,name=serverErrors, solr:dom1=core,dom2=collection1,category=QUERY,scope=/select,name=timeouts, solr:dom1=core,dom2=collection1,category=ADMIN,scope=/admin/mbeans,name=timeouts, solr:dom1=core,dom2=collection1,category=ADMIN,scope=/admin/logging,name=timeouts, solr:dom1=core,dom2=collection1,category=QUERY,scope=/mltrh,name=clientErrors, solr:dom1=jvm,name0=os,name=freeSwapSpaceSize, solr:dom1=core,dom2=collection1,category=QUERY,scope=/get,name=totalTime, java.lang:name=CodeCacheManager,type=MemoryManager, solr:dom1=core,dom2=collection1,category=QUERY,scope=/stream,name=requests, solr:dom1=node,category=QUERY,scope=httpShardHandler,name=availableConnections, solr:dom1=core,dom2=collection1,category=REPLICATION,scope=/replication,name=indexPath, solr:dom1=core,dom2=collection1,category=ADMIN,scope=/admin/threads,name=handlerStart, solr:dom1=core,dom2=collection1,category=QUERY,scope=/debug/dump,name=requestTimes, solr_36823:dom1=solr,dom2=jvm,name0=system,name=properties, solr:dom1=core,dom2=collection1,dom3=shard2,dom4=replica_n41,category=SEARCHER,scope=searcher,name=registeredAt, solr:dom1=jvm,name0=memory,name1=pools,name2=PS-Eden-Space,name=committed, solr:dom1=core,dom2=collection1,category=QUERY,scope=/export,name=requests, solr_45375:dom1=solr,dom2=jvm,name0=system,name=properties, solr:dom1=node,category=ADMIN,scope=/admin/configs,name=handlerStart, solr:dom1=core,dom2=collection1,category=QUERY,scope=/debug/dump,name=totalTime, solr:dom1=core,dom2=collection1,category=REPLICATION,scope=/replication,name=requestTimes, solr:dom1=jvm,name0=memory,name1=pools,name2=PS-Old-Gen,name=used-after-gc, solr:dom1=node,category=ADMIN,scope=/admin/collections,name=timeouts, java.lang:name=PS Scavenge,type=GarbageCollector, solr_35851:dom1=solr,dom2=jvm,name0=system,name=properties, solr_34341:dom1=solr,dom2=jvm,name0=system,name=properties, solr_36089:dom1=solr,dom2=jvm,name0=system,name=properties, solr:dom1=core,dom2=collection1,category=ADMIN,scope=/admin/system,name=timeouts, solr:dom1=core,dom2=collection1,category=QUERY,scope=/graph,name=totalTime, solr:dom1=node,category=ADMIN,scope=/admin/info,name=clientErrors, solr:dom1=jvm,name0=memory,name1=heap,name=usage, solr:dom1=core,dom2=collection1,dom3=shard2,dom4=replica_n41,category=SEARCHER,scope=searcher,name=indexVersion, solr:dom1=core,dom2=collection1,category=INDEX,name=size, solr:dom1=core,dom2=collection1,category=ADMIN,scope=/admin/plugins,name=requestTimes, java.nio:name=mapped,type=BufferPool, solr:dom1=jvm,name0=memory,name1=pools,name2=PS-Eden-Space,name=used-after-gc, com.sun.management:type=DiagnosticCommand, solr:dom1=jvm,name0=memory,name1=pools,name2=CodeHeap-'non-profiled-nmethods',name=max, solr:dom1=core,dom2=collection1,category=REPLICATION,scope=/replication,name=replicationEnabled, solr:dom1=core,dom2=collection1,category=ADMIN,scope=/config,name=serverErrors, solr:dom1=core,dom2=collection1,category=SEARCHER,scope=new,name=maxReached, solr:dom1=node,category=ADMIN,scope=/admin/info,name=totalTime, solr:dom1=core,dom2=collection1,category=ADMIN,scope=/admin/plugins,name=clientErrors, solr:dom1=node,category=ADMIN,scope=/admin/cores,name=threadPool.parallelCoreAdminExecutor.running, solr:dom1=jvm,name0=os,name=arch, solr:dom1=node,category=UPDATE,scope=updateShardHandler,name=threadPool.updateExecutor.duration, solr:dom1=core,dom2=collection1,category=UPDATE,scope=/update/csv,name=serverErrors, solr:dom1=core,dom2=collection1,category=QUERY,scope=/mock,name=shardRequests, solr:dom1=core,dom2=collection1,category=QUERY,scope=/search-facet-def,name=requests, solr:dom1=jvm,name0=os,name=name, solr:dom1=jvm,name0=memory,name1=pools,name2=Compressed-Class-Space,name=init, solr_38753:dom1=solr,dom2=jvm,name0=system,name=properties, solr:dom1=core,dom2=collection1,category=QUERY,scope=/search-facet-def,name=serverErrors, solr:dom1=core,dom2=collection1,category=SEARCHER,scope=searcher,name=maxDoc, solr:dom1=jvm,name0=os,name=processCpuLoad, solr:dom1=core,dom2=collection1,category=UPDATE,scope=/update/json,name=errors, solr:dom1=jvm,name0=memory,name1=pools,name2=Metaspace,name=committed, solr:dom1=core,dom2=collection1,category=HIGHLIGHTER,scope=SolrFragmentsBuilder,name=scoreOrder.requests, solr:dom1=node,category=CONTAINER,scope=fs,name=usableSpace, solr:dom1=core,dom2=collection1,category=QUERY,scope=/spellCheckCompRH1,name=serverErrors, solr:dom1=node,category=ADMIN,scope=/admin/metrics,name=errors, solr:dom1=core,dom2=collection1,category=UPD
   [junit4]   2> ATE,scope=updateHandler,name=merges, solr:dom1=node,category=QUERY,scope=/admin/metrics/collector,name=totalTime, solr:dom1=core,dom2=collection1,category=ADMIN,scope=/admin/ping,name=totalTime, solr:dom1=core,dom2=collection1,category=QUERY,scope=/tvrh,name=serverErrors, solr:dom1=node,category=CONTAINER,scope=version,name=specification, solr:dom1=core,dom2=collection1,category=ADMIN,scope=/admin/plugins,name=errors, solr:dom1=core,dom2=collection1,category=QUERY,scope=/sql,name=shardRequests, solr:dom1=jvm,name0=threads,name1=timed_waiting,name=count, solr_43853:dom1=solr,dom2=jvm,name0=system,name=properties, solr:dom1=core,dom2=collection1,category=CORE,name=instanceDir, solr:dom1=core,dom2=collection1,category=UPDATE,scope=/update/csv,name=errors, solr:dom1=core,dom2=collection1,category=QUERY,scope=/tvrh,name=clientErrors, solr:dom1=core,dom2=collection1,category=ADMIN,scope=/admin/file,name=totalTime, solr:dom1=core,dom2=collection1,category=QUERY,scope=/dismax,name=serverErrors, solr:dom1=core,dom2=collection1,category=ADMIN,scope=/admin/plugins,name=handlerStart, solr:dom1=core,dom2=collection1,category=SEARCHER,scope=searcher,name=deletedDocs, solr:dom1=core,dom2=collection1,category=UPDATE,scope=/update/json,name=clientErrors, solr_39429:dom1=solr,dom2=jvm,name0=system,name=properties, solr:dom1=jvm,name=foo, solr:dom1=core,dom2=collection1,category=QUERY,scope=/spellCheckCompRH1,name=timeouts, solr:dom1=jvm,name0=memory,name1=pools,name2=Metaspace,name=used, solr_43845:dom1=solr,dom2=jvm,name0=system,name=properties, solr:dom1=node,category=ADMIN,scope=/admin/info,name=timeouts, solr:dom1=core,dom2=collection1,category=ADMIN,scope=/config,name=requestTimes, solr:dom1=core,dom2=collection1,category=ADMIN,scope=/admin/system,name=handlerStart, solr:dom1=core,dom2=collection1,category=ADMIN,scope=/admin/threads,name=requestTimes, solr:dom1=core,dom2=collection1,category=QUERY,scope=/mltrh,name=serverErrors, solr:dom1=jvm,name0=memory,name1=pools,name2=CodeHeap-'profiled-nmethods',name=used, JMImplementation:type=MBeanServerDelegate, solr:dom1=core,dom2=collection1,category=SEARCHER,scope=searcher,name=readerDir, solr:dom1=node,category=ADMIN,scope=/admin/autoscaling/history,name=requestTimes, solr:dom1=core,dom2=collection1,category=UPDATE,scope=/update,name=serverErrors, solr:dom1=node,category=ADMIN,scope=/admin/zookeeper,name=requests, solr:dom1=node,category=UPDATE,scope=updateShardHandler,name=threadPool.recoveryExecutor.completed, solr:dom1=core,dom2=collection1,dom3=shard2,dom4=replica_n41,category=SEARCHER,scope=searcher,name=reader, solr_42873:dom1=solr,dom2=jvm,name0=system,name=properties, solr:dom1=core,dom2=collection1,category=QUERY,scope=/spellCheckCompRH,name=handlerStart, solr:dom1=core,dom2=collection1,category=UPDATE,scope=updateHandler,name=deletesById, solr:dom1=core,dom2=collection1,category=ADMIN,scope=/admin/mbeans,name=requests, solr:dom1=core,dom2=collection1,category=ADMIN,scope=/admin/mbeans,name=errors, solr:dom1=core,dom2=collection1,category=SEARCHER,scope=new,name=time, solr_41155:dom1=solr,dom2=jvm,name0=system,name=properties, solr:dom1=core,dom2=collection1,category=QUERY,scope=/mlt,name=shardRequests, solr:dom1=node,category=ADMIN,scope=/admin/collections,name=totalTime, java.lang:type=ClassLoading, solr:dom1=core,dom2=collection1,category=ADMIN,scope=/admin/plugins,name=requests, solr:dom1=core,dom2=collection1,category=ADMIN,scope=/admin/ping,name=clientErrors, solr_36521:dom1=solr,dom2=jvm,name0=system,name=properties, solr:dom1=core,dom2=collection1,category=ADMIN,scope=/admin/file,name=clientErrors, solr:dom1=core,dom2=collection1,category=QUERY,scope=/select,name=requestTimes, solr:dom1=node,category=CONTAINER,scope=threadPool,name=coreContainerWorkExecutor.submitted, solr:dom1=core,dom2=collection1,dom3=shard2,dom4=replica_n41,category=CACHE,scope=searcher,name=filterCache, java.lang:name=Metaspace,type=MemoryPool, solr:dom1=core,dom2=collection1,category=REPLICATION,scope=/replication,name=clientErrors, solr:dom1=core,dom2=collection1,category=UPDATE,scope=updateHandler,name=expungeDeletes, solr:dom1=core,dom2=collection1,category=QUERY,scope=/spellCheckWithWordbreak,name=clientErrors, solr_43195:dom1=solr,dom2=jvm,name0=system,name=properties, solr:dom1=core,dom2=collect

[...truncated too long message...]

.fr.s.sum=sum(float_fd),indent=true,o.ir.s.sum=sum(int_id),o.lr.qf.string.q=[string_sd:abc1, string_sd:abc2],o.fr.qf.lad.q=[long_ld:[20 TO *], long_ld:[30 TO *], double_dd:[* TO 50]],o.ir.s.median=median(int_id),o.lr.qf=string,o.ir.s.mean=mean(int_id),o.ir.qf.float1.q=float_fd:[* TO 50],o.lr.s.sum=sum(long_ld),o.ir.qf.float2.q=float_fd:[* TO 30],o.fr.s.percentile_8=percentile(8,float_fd),o.ir.s.percentile_8=percentile(8,int_id),o.fr.s.median=median(float_fd),o.fr.qf=lad,wt=javabin,o.lr.s.mean=mean(long_ld),_stateVer_=collection1:4,o.lr.s.percentile_8=percentile(8,long_ld),rows=0,version=2,q=*:*,o.ir.qf=[float1, float2],o.lr.s.median=median(long_ld),olap=true,o.fr.s.mean=mean(float_fd)}},response={numFound=100,start=0,maxScore=1.0,docs=[]},stats={lr={median=16.0,mean=16.38,percentile_8=2,sum=1638.0,queryFacets={string={string_sd:abc1={median=15.0,mean=16.4,percentile_8=1,sum=246.0},string_sd:abc2={median=14.5,mean=14.071428571428571,percentile_8=1,sum=197.0}}}},ir={median=24.5,mean=28.91,percentile_8=4,sum=2891.0,queryFacets={float1={float_fd:[* TO 50]={median=25.0,mean=25.0,percentile_8=4,sum=1450.0}},float2={float_fd:[* TO 30]={median=18.5,mean=16.842105263157894,percentile_8=3,sum=640.0}}}},fr={median=42.5,mean=42.99,percentile_8=4.0,sum=4299.0,queryFacets={lad={long_ld:[30 TO *]={median=50.5,mean=50.5,percentile_8=30.0,sum=606.0},double_dd:[* TO 50]={median=42.5,mean=42.99,percentile_8=4.0,sum=4299.0},long_ld:[20 TO *]={median=32.5,mean=39.225,percentile_8=3.0,sum=1569.0}}}}}} expected:<[1450.0]> but was:<[2900.0, 0.0]>
   [junit4]    > 	at __randomizedtesting.SeedInfo.seed([347EF7E43E3B83A3:A967B9055891CC36]:0)
   [junit4]    > 	at org.apache.solr.analytics.legacy.facet.LegacyQueryFacetCloudTest.queryTest(LegacyQueryFacetCloudTest.java:142)
   [junit4]    > 	at java.base/jdk.internal.reflect.NativeMethodAccessorImpl.invoke0(Native Method)
   [junit4]    > 	at java.base/jdk.internal.reflect.NativeMethodAccessorImpl.invoke(NativeMethodAccessorImpl.java:62)
   [junit4]    > 	at java.base/jdk.internal.reflect.DelegatingMethodAccessorImpl.invoke(DelegatingMethodAccessorImpl.java:43)
   [junit4]    > 	at java.base/java.lang.reflect.Method.invoke(Method.java:564)
   [junit4]    > 	at java.base/java.lang.Thread.run(Thread.java:844)
   [junit4]   2> NOTE: leaving temporary files on disk at: /home/jenkins/workspace/Lucene-Solr-7.3-Linux/solr/build/contrib/solr-analytics/test/J2/temp/solr.analytics.legacy.facet.LegacyQueryFacetCloudTest_347EF7E43E3B83A3-001
   [junit4]   2> NOTE: test params are: codec=Asserting(Lucene70): {string_sd=PostingsFormat(name=Direct), id=TestBloomFilteredLucenePostings(BloomFilteringPostingsFormat(Lucene50(blocksize=128)))}, docValues:{long_ld=DocValuesFormat(name=Lucene70), date_dtd=DocValuesFormat(name=Lucene70), _version_=DocValuesFormat(name=Memory), string_sd=DocValuesFormat(name=Direct), int_id=DocValuesFormat(name=Direct), id=DocValuesFormat(name=Lucene70), double_dd=DocValuesFormat(name=Memory), float_fd=DocValuesFormat(name=Direct)}, maxPointsInLeafNode=1149, maxMBSortInHeap=5.5529131483428875, sim=RandomSimilarity(queryNorm=false): {}, locale=bn, timezone=Atlantic/Azores
   [junit4]   2> NOTE: Linux 4.13.0-39-generic amd64/Oracle Corporation 9.0.4 (64-bit)/cpus=8,threads=1,free=455872408,total=517472256
   [junit4]   2> NOTE: All tests run in this JVM: [LegacyQueryFacetCloudTest, LegacyQueryFacetCloudTest]
   [junit4] Completed [4/5 (1!)] on J2 in 4.68s, 1 test, 1 failure <<< FAILURES!

[...truncated 1 lines...]
   [junit4] Suite: org.apache.solr.analytics.legacy.facet.LegacyQueryFacetCloudTest
   [junit4]   2> Creating dataDir: /home/jenkins/workspace/Lucene-Solr-7.3-Linux/solr/build/contrib/solr-analytics/test/J0/temp/solr.analytics.legacy.facet.LegacyQueryFacetCloudTest_347EF7E43E3B83A3-001/init-core-data-001
   [junit4]   2> NOTE: reproduce with: ant test  -Dtestcase=LegacyQueryFacetCloudTest -Dtests.method=queryTest -Dtests.seed=347EF7E43E3B83A3 -Dtests.multiplier=3 -Dtests.slow=true -Dtests.badapples=true -Dtests.locale=bn -Dtests.timezone=Atlantic/Azores -Dtests.asserts=true -Dtests.file.encoding=UTF-8
   [junit4] FAILURE 0.15s J0 | LegacyQueryFacetCloudTest.queryTest <<<
   [junit4]    > Throwable #1: java.lang.AssertionError: {responseHeader={zkConnected=true,status=0,QTime=98,params={o.fr.s.sum=sum(float_fd),indent=true,o.ir.s.sum=sum(int_id),o.lr.qf.string.q=[string_sd:abc1, string_sd:abc2],o.fr.qf.lad.q=[long_ld:[20 TO *], long_ld:[30 TO *], double_dd:[* TO 50]],o.ir.s.median=median(int_id),o.lr.qf=string,o.ir.s.mean=mean(int_id),o.ir.qf.float1.q=float_fd:[* TO 50],o.lr.s.sum=sum(long_ld),o.ir.qf.float2.q=float_fd:[* TO 30],o.fr.s.percentile_8=percentile(8,float_fd),o.ir.s.percentile_8=percentile(8,int_id),o.fr.s.median=median(float_fd),o.fr.qf=lad,wt=javabin,o.lr.s.mean=mean(long_ld),_stateVer_=collection1:4,o.lr.s.percentile_8=percentile(8,long_ld),rows=0,version=2,q=*:*,o.ir.qf=[float1, float2],o.lr.s.median=median(long_ld),olap=true,o.fr.s.mean=mean(float_fd)}},response={numFound=100,start=0,maxScore=1.0,docs=[]},stats={lr={median=16.0,mean=16.38,percentile_8=2,sum=1638.0,queryFacets={string={string_sd:abc1={median=15.0,mean=16.4,percentile_8=1,sum=246.0},string_sd:abc2={median=14.5,mean=14.071428571428571,percentile_8=1,sum=197.0}}}},ir={median=24.5,mean=28.91,percentile_8=4,sum=2891.0,queryFacets={float1={float_fd:[* TO 50]={median=25.0,mean=25.0,percentile_8=4,sum=1450.0}},float2={float_fd:[* TO 30]={median=18.5,mean=16.842105263157894,percentile_8=3,sum=640.0}}}},fr={median=42.5,mean=42.99,percentile_8=4.0,sum=4299.0,queryFacets={lad={long_ld:[30 TO *]={median=50.5,mean=50.5,percentile_8=30.0,sum=606.0},double_dd:[* TO 50]={median=42.5,mean=42.99,percentile_8=4.0,sum=4299.0},long_ld:[20 TO *]={median=32.5,mean=39.225,percentile_8=3.0,sum=1569.0}}}}}} expected:<[1450.0]> but was:<[2900.0, 0.0]>
   [junit4]    > 	at __randomizedtesting.SeedInfo.seed([347EF7E43E3B83A3:A967B9055891CC36]:0)
   [junit4]    > 	at org.apache.solr.analytics.legacy.facet.LegacyQueryFacetCloudTest.queryTest(LegacyQueryFacetCloudTest.java:142)
   [junit4]    > 	at java.base/jdk.internal.reflect.NativeMethodAccessorImpl.invoke0(Native Method)
   [junit4]    > 	at java.base/jdk.internal.reflect.NativeMethodAccessorImpl.invoke(NativeMethodAccessorImpl.java:62)
   [junit4]    > 	at java.base/jdk.internal.reflect.DelegatingMethodAccessorImpl.invoke(DelegatingMethodAccessorImpl.java:43)
   [junit4]    > 	at java.base/java.lang.reflect.Method.invoke(Method.java:564)
   [junit4]    > 	at java.base/java.lang.Thread.run(Thread.java:844)
   [junit4]   2> NOTE: leaving temporary files on disk at: /home/jenkins/workspace/Lucene-Solr-7.3-Linux/solr/build/contrib/solr-analytics/test/J0/temp/solr.analytics.legacy.facet.LegacyQueryFacetCloudTest_347EF7E43E3B83A3-001
   [junit4]   2> May 10, 2018 4:08:45 AM com.carrotsearch.randomizedtesting.ThreadLeakControl checkThreadLeaks
   [junit4]   2> WARNING: Will linger awaiting termination of 7 leaked thread(s).
   [junit4]   2> NOTE: test params are: codec=Asserting(Lucene70): {string_sd=PostingsFormat(name=Direct), id=TestBloomFilteredLucenePostings(BloomFilteringPostingsFormat(Lucene50(blocksize=128)))}, docValues:{long_ld=DocValuesFormat(name=Lucene70), date_dtd=DocValuesFormat(name=Lucene70), _version_=DocValuesFormat(name=Memory), string_sd=DocValuesFormat(name=Direct), int_id=DocValuesFormat(name=Direct), id=DocValuesFormat(name=Lucene70), double_dd=DocValuesFormat(name=Memory), float_fd=DocValuesFormat(name=Direct)}, maxPointsInLeafNode=1149, maxMBSortInHeap=5.5529131483428875, sim=RandomSimilarity(queryNorm=false): {}, locale=bn, timezone=Atlantic/Azores
   [junit4]   2> NOTE: Linux 4.13.0-39-generic amd64/Oracle Corporation 9.0.4 (64-bit)/cpus=8,threads=1,free=376566728,total=515899392
   [junit4]   2> NOTE: All tests run in this JVM: [LegacyQueryFacetCloudTest, LegacyQueryFacetCloudTest]
   [junit4] Completed [5/5 (2!)] on J0 in 4.87s, 1 test, 1 failure <<< FAILURES!

[...truncated 12 lines...]
BUILD FAILED
/home/jenkins/workspace/Lucene-Solr-7.3-Linux/lucene/common-build.xml:1567: The following error occurred while executing this line:
/home/jenkins/workspace/Lucene-Solr-7.3-Linux/lucene/common-build.xml:1091: There were test failures: 5 suites, 5 tests, 2 failures [seed: 347EF7E43E3B83A3]

Total time: 18 seconds

[repro] Setting last failure code to 256

[repro] Failures:
[repro]   0/5 failed: org.apache.solr.core.TestJmxIntegration
[repro]   2/5 failed: org.apache.solr.analytics.legacy.facet.LegacyQueryFacetCloudTest
[repro] Exiting with code 256
+ mv lucene/build lucene/build.repro
+ mv solr/build solr/build.repro
+ mv lucene/build.orig lucene/build
+ mv solr/build.orig solr/build
Archiving artifacts
Setting ANT_1_8_2_HOME=/var/lib/jenkins/tools/hudson.tasks.Ant_AntInstallation/ANT_1.8.2
[WARNINGS] Parsing warnings in console log with parser Java Compiler (javac)
Setting ANT_1_8_2_HOME=/var/lib/jenkins/tools/hudson.tasks.Ant_AntInstallation/ANT_1.8.2
Setting ANT_1_8_2_HOME=/var/lib/jenkins/tools/hudson.tasks.Ant_AntInstallation/ANT_1.8.2
<Git Blamer> Using GitBlamer to create author and commit information for all warnings.
<Git Blamer> GIT_COMMIT=ae0705edb59eaa567fe13ed3a222fdadc7153680, workspace=/var/lib/jenkins/workspace/Lucene-Solr-7.3-Linux
[WARNINGS] Computing warning deltas based on reference build #200
Recording test results
Setting ANT_1_8_2_HOME=/var/lib/jenkins/tools/hudson.tasks.Ant_AntInstallation/ANT_1.8.2
Build step 'Publish JUnit test result report' changed build result to UNSTABLE
Email was triggered for: Unstable (Test Failures)
Sending email for trigger: Unstable (Test Failures)
Setting ANT_1_8_2_HOME=/var/lib/jenkins/tools/hudson.tasks.Ant_AntInstallation/ANT_1.8.2
Setting ANT_1_8_2_HOME=/var/lib/jenkins/tools/hudson.tasks.Ant_AntInstallation/ANT_1.8.2
Setting ANT_1_8_2_HOME=/var/lib/jenkins/tools/hudson.tasks.Ant_AntInstallation/ANT_1.8.2
Setting ANT_1_8_2_HOME=/var/lib/jenkins/tools/hudson.tasks.Ant_AntInstallation/ANT_1.8.2

Mime
View raw message