lucene-dev mailing list archives

Site index · List index
Message view « Date » · « Thread »
Top « Date » · « Thread »
From Policeman Jenkins Server <jenk...@thetaphi.de>
Subject [JENKINS] Lucene-Solr-master-Linux (64bit/jdk-9.0.4) - Build # 21959 - Unstable!
Date Sat, 05 May 2018 06:45:24 GMT
Build: https://jenkins.thetaphi.de/job/Lucene-Solr-master-Linux/21959/
Java: 64bit/jdk-9.0.4 -XX:+UseCompressedOops -XX:+UseConcMarkSweepGC

4 tests failed.
FAILED:  org.apache.solr.cloud.autoscaling.IndexSizeTriggerTest.testMergeIntegration

Error Message:
did not finish processing in time

Stack Trace:
java.lang.AssertionError: did not finish processing in time
	at __randomizedtesting.SeedInfo.seed([69C528660A3DC88A:3A7C6AD6E82C5D70]:0)
	at org.junit.Assert.fail(Assert.java:93)
	at org.junit.Assert.assertTrue(Assert.java:43)
	at org.apache.solr.cloud.autoscaling.IndexSizeTriggerTest.testMergeIntegration(IndexSizeTriggerTest.java:404)
	at java.base/jdk.internal.reflect.NativeMethodAccessorImpl.invoke0(Native Method)
	at java.base/jdk.internal.reflect.NativeMethodAccessorImpl.invoke(NativeMethodAccessorImpl.java:62)
	at java.base/jdk.internal.reflect.DelegatingMethodAccessorImpl.invoke(DelegatingMethodAccessorImpl.java:43)
	at java.base/java.lang.reflect.Method.invoke(Method.java:564)
	at com.carrotsearch.randomizedtesting.RandomizedRunner.invoke(RandomizedRunner.java:1737)
	at com.carrotsearch.randomizedtesting.RandomizedRunner$8.evaluate(RandomizedRunner.java:934)
	at com.carrotsearch.randomizedtesting.RandomizedRunner$9.evaluate(RandomizedRunner.java:970)
	at com.carrotsearch.randomizedtesting.RandomizedRunner$10.evaluate(RandomizedRunner.java:984)
	at com.carrotsearch.randomizedtesting.rules.SystemPropertiesRestoreRule$1.evaluate(SystemPropertiesRestoreRule.java:57)
	at org.apache.lucene.util.TestRuleSetupTeardownChained$1.evaluate(TestRuleSetupTeardownChained.java:49)
	at org.apache.lucene.util.AbstractBeforeAfterRule$1.evaluate(AbstractBeforeAfterRule.java:45)
	at org.apache.lucene.util.TestRuleThreadAndTestName$1.evaluate(TestRuleThreadAndTestName.java:48)
	at org.apache.lucene.util.TestRuleIgnoreAfterMaxFailures$1.evaluate(TestRuleIgnoreAfterMaxFailures.java:64)
	at org.apache.lucene.util.TestRuleMarkFailure$1.evaluate(TestRuleMarkFailure.java:47)
	at com.carrotsearch.randomizedtesting.rules.StatementAdapter.evaluate(StatementAdapter.java:36)
	at com.carrotsearch.randomizedtesting.ThreadLeakControl$StatementRunner.run(ThreadLeakControl.java:368)
	at com.carrotsearch.randomizedtesting.ThreadLeakControl.forkTimeoutingTask(ThreadLeakControl.java:817)
	at com.carrotsearch.randomizedtesting.ThreadLeakControl$3.evaluate(ThreadLeakControl.java:468)
	at com.carrotsearch.randomizedtesting.RandomizedRunner.runSingleTest(RandomizedRunner.java:943)
	at com.carrotsearch.randomizedtesting.RandomizedRunner$5.evaluate(RandomizedRunner.java:829)
	at com.carrotsearch.randomizedtesting.RandomizedRunner$6.evaluate(RandomizedRunner.java:879)
	at com.carrotsearch.randomizedtesting.RandomizedRunner$7.evaluate(RandomizedRunner.java:890)
	at com.carrotsearch.randomizedtesting.rules.StatementAdapter.evaluate(StatementAdapter.java:36)
	at com.carrotsearch.randomizedtesting.rules.SystemPropertiesRestoreRule$1.evaluate(SystemPropertiesRestoreRule.java:57)
	at org.apache.lucene.util.AbstractBeforeAfterRule$1.evaluate(AbstractBeforeAfterRule.java:45)
	at com.carrotsearch.randomizedtesting.rules.StatementAdapter.evaluate(StatementAdapter.java:36)
	at org.apache.lucene.util.TestRuleStoreClassName$1.evaluate(TestRuleStoreClassName.java:41)
	at com.carrotsearch.randomizedtesting.rules.NoShadowingOrOverridesOnMethodsRule$1.evaluate(NoShadowingOrOverridesOnMethodsRule.java:40)
	at com.carrotsearch.randomizedtesting.rules.NoShadowingOrOverridesOnMethodsRule$1.evaluate(NoShadowingOrOverridesOnMethodsRule.java:40)
	at com.carrotsearch.randomizedtesting.rules.StatementAdapter.evaluate(StatementAdapter.java:36)
	at com.carrotsearch.randomizedtesting.rules.StatementAdapter.evaluate(StatementAdapter.java:36)
	at org.apache.lucene.util.TestRuleAssertionsRequired$1.evaluate(TestRuleAssertionsRequired.java:53)
	at org.apache.lucene.util.TestRuleMarkFailure$1.evaluate(TestRuleMarkFailure.java:47)
	at org.apache.lucene.util.TestRuleIgnoreAfterMaxFailures$1.evaluate(TestRuleIgnoreAfterMaxFailures.java:64)
	at org.apache.lucene.util.TestRuleIgnoreTestSuites$1.evaluate(TestRuleIgnoreTestSuites.java:54)
	at com.carrotsearch.randomizedtesting.rules.StatementAdapter.evaluate(StatementAdapter.java:36)
	at com.carrotsearch.randomizedtesting.ThreadLeakControl$StatementRunner.run(ThreadLeakControl.java:368)
	at java.base/java.lang.Thread.run(Thread.java:844)


FAILED:  org.apache.solr.cloud.autoscaling.IndexSizeTriggerTest.testSplitIntegration

Error Message:
last state: DocCollection(testSplitIntegration_collection//clusterstate.json/40)={   "replicationFactor":"2",   "pullReplicas":"0",   "router":{"name":"compositeId"},   "maxShardsPerNode":"2",   "autoAddReplicas":"false",   "nrtReplicas":"2",   "tlogReplicas":"0",   "autoCreated":"true",   "shards":{     "shard2":{       "replicas":{         "core_node3":{           "core":"testSplitIntegration_collection_shard2_replica_n3",           "leader":"true",           "SEARCHER.searcher.maxDoc":11,           "SEARCHER.searcher.deletedDocs":0,           "INDEX.sizeInBytes":1,           "node_name":"127.0.0.1:10001_solr",           "state":"active",           "type":"NRT",           "SEARCHER.searcher.numDocs":11},         "core_node4":{           "core":"testSplitIntegration_collection_shard2_replica_n4",           "SEARCHER.searcher.maxDoc":11,           "SEARCHER.searcher.deletedDocs":0,           "INDEX.sizeInBytes":1,           "node_name":"127.0.0.1:10000_solr",           "state":"active",           "type":"NRT",           "SEARCHER.searcher.numDocs":11}},       "range":"0-7fffffff",       "state":"active"},     "shard1":{       "stateTimestamp":"1525502294338939150",       "replicas":{         "core_node1":{           "core":"testSplitIntegration_collection_shard1_replica_n1",           "leader":"true",           "SEARCHER.searcher.maxDoc":14,           "SEARCHER.searcher.deletedDocs":0,           "INDEX.sizeInBytes":1,           "node_name":"127.0.0.1:10001_solr",           "state":"active",           "type":"NRT",           "SEARCHER.searcher.numDocs":14},         "core_node2":{           "core":"testSplitIntegration_collection_shard1_replica_n2",           "SEARCHER.searcher.maxDoc":14,           "SEARCHER.searcher.deletedDocs":0,           "INDEX.sizeInBytes":1,           "node_name":"127.0.0.1:10000_solr",           "state":"active",           "type":"NRT",           "SEARCHER.searcher.numDocs":14}},       "range":"80000000-ffffffff",       "state":"inactive"},     "shard1_1":{       "parent":"shard1",       "stateTimestamp":"1525502294355002650",       "range":"c0000000-ffffffff",       "state":"active",       "replicas":{         "core_node10":{           "leader":"true",           "core":"testSplitIntegration_collection_shard1_1_replica1",           "SEARCHER.searcher.maxDoc":7,           "SEARCHER.searcher.deletedDocs":0,           "INDEX.sizeInBytes":1,           "node_name":"127.0.0.1:10000_solr",           "base_url":"http://127.0.0.1:10000/solr",           "state":"active",           "type":"NRT",           "SEARCHER.searcher.numDocs":7},         "core_node9":{           "core":"testSplitIntegration_collection_shard1_1_replica0",           "SEARCHER.searcher.maxDoc":7,           "SEARCHER.searcher.deletedDocs":0,           "INDEX.sizeInBytes":1,           "node_name":"127.0.0.1:10001_solr",           "base_url":"http://127.0.0.1:10001/solr",           "state":"active",           "type":"NRT",           "SEARCHER.searcher.numDocs":7}}},     "shard1_0":{       "parent":"shard1",       "stateTimestamp":"1525502294354708550",       "range":"80000000-bfffffff",       "state":"active",       "replicas":{         "core_node7":{           "leader":"true",           "core":"testSplitIntegration_collection_shard1_0_replica0",           "SEARCHER.searcher.maxDoc":7,           "SEARCHER.searcher.deletedDocs":0,           "INDEX.sizeInBytes":1,           "node_name":"127.0.0.1:10001_solr",           "base_url":"http://127.0.0.1:10001/solr",           "state":"active",           "type":"NRT",           "SEARCHER.searcher.numDocs":7},         "core_node8":{           "core":"testSplitIntegration_collection_shard1_0_replica1",           "SEARCHER.searcher.maxDoc":7,           "SEARCHER.searcher.deletedDocs":0,           "INDEX.sizeInBytes":1,           "node_name":"127.0.0.1:10000_solr",           "base_url":"http://127.0.0.1:10000/solr",           "state":"active",           "type":"NRT",           "SEARCHER.searcher.numDocs":7}}}}}

Stack Trace:
java.util.concurrent.TimeoutException: last state: DocCollection(testSplitIntegration_collection//clusterstate.json/40)={
  "replicationFactor":"2",
  "pullReplicas":"0",
  "router":{"name":"compositeId"},
  "maxShardsPerNode":"2",
  "autoAddReplicas":"false",
  "nrtReplicas":"2",
  "tlogReplicas":"0",
  "autoCreated":"true",
  "shards":{
    "shard2":{
      "replicas":{
        "core_node3":{
          "core":"testSplitIntegration_collection_shard2_replica_n3",
          "leader":"true",
          "SEARCHER.searcher.maxDoc":11,
          "SEARCHER.searcher.deletedDocs":0,
          "INDEX.sizeInBytes":1,
          "node_name":"127.0.0.1:10001_solr",
          "state":"active",
          "type":"NRT",
          "SEARCHER.searcher.numDocs":11},
        "core_node4":{
          "core":"testSplitIntegration_collection_shard2_replica_n4",
          "SEARCHER.searcher.maxDoc":11,
          "SEARCHER.searcher.deletedDocs":0,
          "INDEX.sizeInBytes":1,
          "node_name":"127.0.0.1:10000_solr",
          "state":"active",
          "type":"NRT",
          "SEARCHER.searcher.numDocs":11}},
      "range":"0-7fffffff",
      "state":"active"},
    "shard1":{
      "stateTimestamp":"1525502294338939150",
      "replicas":{
        "core_node1":{
          "core":"testSplitIntegration_collection_shard1_replica_n1",
          "leader":"true",
          "SEARCHER.searcher.maxDoc":14,
          "SEARCHER.searcher.deletedDocs":0,
          "INDEX.sizeInBytes":1,
          "node_name":"127.0.0.1:10001_solr",
          "state":"active",
          "type":"NRT",
          "SEARCHER.searcher.numDocs":14},
        "core_node2":{
          "core":"testSplitIntegration_collection_shard1_replica_n2",
          "SEARCHER.searcher.maxDoc":14,
          "SEARCHER.searcher.deletedDocs":0,
          "INDEX.sizeInBytes":1,
          "node_name":"127.0.0.1:10000_solr",
          "state":"active",
          "type":"NRT",
          "SEARCHER.searcher.numDocs":14}},
      "range":"80000000-ffffffff",
      "state":"inactive"},
    "shard1_1":{
      "parent":"shard1",
      "stateTimestamp":"1525502294355002650",
      "range":"c0000000-ffffffff",
      "state":"active",
      "replicas":{
        "core_node10":{
          "leader":"true",
          "core":"testSplitIntegration_collection_shard1_1_replica1",
          "SEARCHER.searcher.maxDoc":7,
          "SEARCHER.searcher.deletedDocs":0,
          "INDEX.sizeInBytes":1,
          "node_name":"127.0.0.1:10000_solr",
          "base_url":"http://127.0.0.1:10000/solr",
          "state":"active",
          "type":"NRT",
          "SEARCHER.searcher.numDocs":7},
        "core_node9":{
          "core":"testSplitIntegration_collection_shard1_1_replica0",
          "SEARCHER.searcher.maxDoc":7,
          "SEARCHER.searcher.deletedDocs":0,
          "INDEX.sizeInBytes":1,
          "node_name":"127.0.0.1:10001_solr",
          "base_url":"http://127.0.0.1:10001/solr",
          "state":"active",
          "type":"NRT",
          "SEARCHER.searcher.numDocs":7}}},
    "shard1_0":{
      "parent":"shard1",
      "stateTimestamp":"1525502294354708550",
      "range":"80000000-bfffffff",
      "state":"active",
      "replicas":{
        "core_node7":{
          "leader":"true",
          "core":"testSplitIntegration_collection_shard1_0_replica0",
          "SEARCHER.searcher.maxDoc":7,
          "SEARCHER.searcher.deletedDocs":0,
          "INDEX.sizeInBytes":1,
          "node_name":"127.0.0.1:10001_solr",
          "base_url":"http://127.0.0.1:10001/solr",
          "state":"active",
          "type":"NRT",
          "SEARCHER.searcher.numDocs":7},
        "core_node8":{
          "core":"testSplitIntegration_collection_shard1_0_replica1",
          "SEARCHER.searcher.maxDoc":7,
          "SEARCHER.searcher.deletedDocs":0,
          "INDEX.sizeInBytes":1,
          "node_name":"127.0.0.1:10000_solr",
          "base_url":"http://127.0.0.1:10000/solr",
          "state":"active",
          "type":"NRT",
          "SEARCHER.searcher.numDocs":7}}}}}
	at __randomizedtesting.SeedInfo.seed([69C528660A3DC88A:504B912625C20174]:0)
	at org.apache.solr.cloud.CloudTestUtils.waitForState(CloudTestUtils.java:111)
	at org.apache.solr.cloud.autoscaling.IndexSizeTriggerTest.testSplitIntegration(IndexSizeTriggerTest.java:299)
	at java.base/jdk.internal.reflect.NativeMethodAccessorImpl.invoke0(Native Method)
	at java.base/jdk.internal.reflect.NativeMethodAccessorImpl.invoke(NativeMethodAccessorImpl.java:62)
	at java.base/jdk.internal.reflect.DelegatingMethodAccessorImpl.invoke(DelegatingMethodAccessorImpl.java:43)
	at java.base/java.lang.reflect.Method.invoke(Method.java:564)
	at com.carrotsearch.randomizedtesting.RandomizedRunner.invoke(RandomizedRunner.java:1737)
	at com.carrotsearch.randomizedtesting.RandomizedRunner$8.evaluate(RandomizedRunner.java:934)
	at com.carrotsearch.randomizedtesting.RandomizedRunner$9.evaluate(RandomizedRunner.java:970)
	at com.carrotsearch.randomizedtesting.RandomizedRunner$10.evaluate(RandomizedRunner.java:984)
	at com.carrotsearch.randomizedtesting.rules.SystemPropertiesRestoreRule$1.evaluate(SystemPropertiesRestoreRule.java:57)
	at org.apache.lucene.util.TestRuleSetupTeardownChained$1.evaluate(TestRuleSetupTeardownChained.java:49)
	at org.apache.lucene.util.AbstractBeforeAfterRule$1.evaluate(AbstractBeforeAfterRule.java:45)
	at org.apache.lucene.util.TestRuleThreadAndTestName$1.evaluate(TestRuleThreadAndTestName.java:48)
	at org.apache.lucene.util.TestRuleIgnoreAfterMaxFailures$1.evaluate(TestRuleIgnoreAfterMaxFailures.java:64)
	at org.apache.lucene.util.TestRuleMarkFailure$1.evaluate(TestRuleMarkFailure.java:47)
	at com.carrotsearch.randomizedtesting.rules.StatementAdapter.evaluate(StatementAdapter.java:36)
	at com.carrotsearch.randomizedtesting.ThreadLeakControl$StatementRunner.run(ThreadLeakControl.java:368)
	at com.carrotsearch.randomizedtesting.ThreadLeakControl.forkTimeoutingTask(ThreadLeakControl.java:817)
	at com.carrotsearch.randomizedtesting.ThreadLeakControl$3.evaluate(ThreadLeakControl.java:468)
	at com.carrotsearch.randomizedtesting.RandomizedRunner.runSingleTest(RandomizedRunner.java:943)
	at com.carrotsearch.randomizedtesting.RandomizedRunner$5.evaluate(RandomizedRunner.java:829)
	at com.carrotsearch.randomizedtesting.RandomizedRunner$6.evaluate(RandomizedRunner.java:879)
	at com.carrotsearch.randomizedtesting.RandomizedRunner$7.evaluate(RandomizedRunner.java:890)
	at com.carrotsearch.randomizedtesting.rules.StatementAdapter.evaluate(StatementAdapter.java:36)
	at com.carrotsearch.randomizedtesting.rules.SystemPropertiesRestoreRule$1.evaluate(SystemPropertiesRestoreRule.java:57)
	at org.apache.lucene.util.AbstractBeforeAfterRule$1.evaluate(AbstractBeforeAfterRule.java:45)
	at com.carrotsearch.randomizedtesting.rules.StatementAdapter.evaluate(StatementAdapter.java:36)
	at org.apache.lucene.util.TestRuleStoreClassName$1.evaluate(TestRuleStoreClassName.java:41)
	at com.carrotsearch.randomizedtesting.rules.NoShadowingOrOverridesOnMethodsRule$1.evaluate(NoShadowingOrOverridesOnMethodsRule.java:40)
	at com.carrotsearch.randomizedtesting.rules.NoShadowingOrOverridesOnMethodsRule$1.evaluate(NoShadowingOrOverridesOnMethodsRule.java:40)
	at com.carrotsearch.randomizedtesting.rules.StatementAdapter.evaluate(StatementAdapter.java:36)
	at com.carrotsearch.randomizedtesting.rules.StatementAdapter.evaluate(StatementAdapter.java:36)
	at org.apache.lucene.util.TestRuleAssertionsRequired$1.evaluate(TestRuleAssertionsRequired.java:53)
	at org.apache.lucene.util.TestRuleMarkFailure$1.evaluate(TestRuleMarkFailure.java:47)
	at org.apache.lucene.util.TestRuleIgnoreAfterMaxFailures$1.evaluate(TestRuleIgnoreAfterMaxFailures.java:64)
	at org.apache.lucene.util.TestRuleIgnoreTestSuites$1.evaluate(TestRuleIgnoreTestSuites.java:54)
	at com.carrotsearch.randomizedtesting.rules.StatementAdapter.evaluate(StatementAdapter.java:36)
	at com.carrotsearch.randomizedtesting.ThreadLeakControl$StatementRunner.run(ThreadLeakControl.java:368)
	at java.base/java.lang.Thread.run(Thread.java:844)


FAILED:  org.apache.solr.cloud.autoscaling.IndexSizeTriggerTest.testTrigger

Error Message:
waitFor not elapsed but produced an event

Stack Trace:
java.lang.AssertionError: waitFor not elapsed but produced an event
	at __randomizedtesting.SeedInfo.seed([69C528660A3DC88A:A0E1EE493F2BBA7]:0)
	at org.junit.Assert.fail(Assert.java:93)
	at org.junit.Assert.assertTrue(Assert.java:43)
	at org.junit.Assert.assertNull(Assert.java:551)
	at org.apache.solr.cloud.autoscaling.IndexSizeTriggerTest.testTrigger(IndexSizeTriggerTest.java:180)
	at java.base/jdk.internal.reflect.NativeMethodAccessorImpl.invoke0(Native Method)
	at java.base/jdk.internal.reflect.NativeMethodAccessorImpl.invoke(NativeMethodAccessorImpl.java:62)
	at java.base/jdk.internal.reflect.DelegatingMethodAccessorImpl.invoke(DelegatingMethodAccessorImpl.java:43)
	at java.base/java.lang.reflect.Method.invoke(Method.java:564)
	at com.carrotsearch.randomizedtesting.RandomizedRunner.invoke(RandomizedRunner.java:1737)
	at com.carrotsearch.randomizedtesting.RandomizedRunner$8.evaluate(RandomizedRunner.java:934)
	at com.carrotsearch.randomizedtesting.RandomizedRunner$9.evaluate(RandomizedRunner.java:970)
	at com.carrotsearch.randomizedtesting.RandomizedRunner$10.evaluate(RandomizedRunner.java:984)
	at com.carrotsearch.randomizedtesting.rules.SystemPropertiesRestoreRule$1.evaluate(SystemPropertiesRestoreRule.java:57)
	at org.apache.lucene.util.TestRuleSetupTeardownChained$1.evaluate(TestRuleSetupTeardownChained.java:49)
	at org.apache.lucene.util.AbstractBeforeAfterRule$1.evaluate(AbstractBeforeAfterRule.java:45)
	at org.apache.lucene.util.TestRuleThreadAndTestName$1.evaluate(TestRuleThreadAndTestName.java:48)
	at org.apache.lucene.util.TestRuleIgnoreAfterMaxFailures$1.evaluate(TestRuleIgnoreAfterMaxFailures.java:64)
	at org.apache.lucene.util.TestRuleMarkFailure$1.evaluate(TestRuleMarkFailure.java:47)
	at com.carrotsearch.randomizedtesting.rules.StatementAdapter.evaluate(StatementAdapter.java:36)
	at com.carrotsearch.randomizedtesting.ThreadLeakControl$StatementRunner.run(ThreadLeakControl.java:368)
	at com.carrotsearch.randomizedtesting.ThreadLeakControl.forkTimeoutingTask(ThreadLeakControl.java:817)
	at com.carrotsearch.randomizedtesting.ThreadLeakControl$3.evaluate(ThreadLeakControl.java:468)
	at com.carrotsearch.randomizedtesting.RandomizedRunner.runSingleTest(RandomizedRunner.java:943)
	at com.carrotsearch.randomizedtesting.RandomizedRunner$5.evaluate(RandomizedRunner.java:829)
	at com.carrotsearch.randomizedtesting.RandomizedRunner$6.evaluate(RandomizedRunner.java:879)
	at com.carrotsearch.randomizedtesting.RandomizedRunner$7.evaluate(RandomizedRunner.java:890)
	at com.carrotsearch.randomizedtesting.rules.StatementAdapter.evaluate(StatementAdapter.java:36)
	at com.carrotsearch.randomizedtesting.rules.SystemPropertiesRestoreRule$1.evaluate(SystemPropertiesRestoreRule.java:57)
	at org.apache.lucene.util.AbstractBeforeAfterRule$1.evaluate(AbstractBeforeAfterRule.java:45)
	at com.carrotsearch.randomizedtesting.rules.StatementAdapter.evaluate(StatementAdapter.java:36)
	at org.apache.lucene.util.TestRuleStoreClassName$1.evaluate(TestRuleStoreClassName.java:41)
	at com.carrotsearch.randomizedtesting.rules.NoShadowingOrOverridesOnMethodsRule$1.evaluate(NoShadowingOrOverridesOnMethodsRule.java:40)
	at com.carrotsearch.randomizedtesting.rules.NoShadowingOrOverridesOnMethodsRule$1.evaluate(NoShadowingOrOverridesOnMethodsRule.java:40)
	at com.carrotsearch.randomizedtesting.rules.StatementAdapter.evaluate(StatementAdapter.java:36)
	at com.carrotsearch.randomizedtesting.rules.StatementAdapter.evaluate(StatementAdapter.java:36)
	at org.apache.lucene.util.TestRuleAssertionsRequired$1.evaluate(TestRuleAssertionsRequired.java:53)
	at org.apache.lucene.util.TestRuleMarkFailure$1.evaluate(TestRuleMarkFailure.java:47)
	at org.apache.lucene.util.TestRuleIgnoreAfterMaxFailures$1.evaluate(TestRuleIgnoreAfterMaxFailures.java:64)
	at org.apache.lucene.util.TestRuleIgnoreTestSuites$1.evaluate(TestRuleIgnoreTestSuites.java:54)
	at com.carrotsearch.randomizedtesting.rules.StatementAdapter.evaluate(StatementAdapter.java:36)
	at com.carrotsearch.randomizedtesting.ThreadLeakControl$StatementRunner.run(ThreadLeakControl.java:368)
	at java.base/java.lang.Thread.run(Thread.java:844)


FAILED:  org.apache.solr.cloud.autoscaling.SearchRateTriggerIntegrationTest.testDeleteNode

Error Message:
unexpected DELETENODE status: {responseHeader={status=0,QTime=2},status={state=notfound,msg=Did not find [search_rate_trigger3/2b87180f4ef05T5j7ydpf14kbthq9xjsmuq70la/0] in any tasks queue}}

Stack Trace:
java.lang.AssertionError: unexpected DELETENODE status: {responseHeader={status=0,QTime=2},status={state=notfound,msg=Did not find [search_rate_trigger3/2b87180f4ef05T5j7ydpf14kbthq9xjsmuq70la/0] in any tasks queue}}
	at __randomizedtesting.SeedInfo.seed([69C528660A3DC88A:4B57E6E43DF747F7]:0)
	at org.junit.Assert.fail(Assert.java:93)
	at org.apache.solr.cloud.autoscaling.SearchRateTriggerIntegrationTest.lambda$testDeleteNode$6(SearchRateTriggerIntegrationTest.java:668)
	at java.base/java.util.ArrayList.forEach(ArrayList.java:1380)
	at org.apache.solr.cloud.autoscaling.SearchRateTriggerIntegrationTest.testDeleteNode(SearchRateTriggerIntegrationTest.java:660)
	at java.base/jdk.internal.reflect.NativeMethodAccessorImpl.invoke0(Native Method)
	at java.base/jdk.internal.reflect.NativeMethodAccessorImpl.invoke(NativeMethodAccessorImpl.java:62)
	at java.base/jdk.internal.reflect.DelegatingMethodAccessorImpl.invoke(DelegatingMethodAccessorImpl.java:43)
	at java.base/java.lang.reflect.Method.invoke(Method.java:564)
	at com.carrotsearch.randomizedtesting.RandomizedRunner.invoke(RandomizedRunner.java:1737)
	at com.carrotsearch.randomizedtesting.RandomizedRunner$8.evaluate(RandomizedRunner.java:934)
	at com.carrotsearch.randomizedtesting.RandomizedRunner$9.evaluate(RandomizedRunner.java:970)
	at com.carrotsearch.randomizedtesting.RandomizedRunner$10.evaluate(RandomizedRunner.java:984)
	at com.carrotsearch.randomizedtesting.rules.SystemPropertiesRestoreRule$1.evaluate(SystemPropertiesRestoreRule.java:57)
	at org.apache.lucene.util.TestRuleSetupTeardownChained$1.evaluate(TestRuleSetupTeardownChained.java:49)
	at org.apache.lucene.util.AbstractBeforeAfterRule$1.evaluate(AbstractBeforeAfterRule.java:45)
	at org.apache.lucene.util.TestRuleThreadAndTestName$1.evaluate(TestRuleThreadAndTestName.java:48)
	at org.apache.lucene.util.TestRuleIgnoreAfterMaxFailures$1.evaluate(TestRuleIgnoreAfterMaxFailures.java:64)
	at org.apache.lucene.util.TestRuleMarkFailure$1.evaluate(TestRuleMarkFailure.java:47)
	at com.carrotsearch.randomizedtesting.rules.StatementAdapter.evaluate(StatementAdapter.java:36)
	at com.carrotsearch.randomizedtesting.ThreadLeakControl$StatementRunner.run(ThreadLeakControl.java:368)
	at com.carrotsearch.randomizedtesting.ThreadLeakControl.forkTimeoutingTask(ThreadLeakControl.java:817)
	at com.carrotsearch.randomizedtesting.ThreadLeakControl$3.evaluate(ThreadLeakControl.java:468)
	at com.carrotsearch.randomizedtesting.RandomizedRunner.runSingleTest(RandomizedRunner.java:943)
	at com.carrotsearch.randomizedtesting.RandomizedRunner$5.evaluate(RandomizedRunner.java:829)
	at com.carrotsearch.randomizedtesting.RandomizedRunner$6.evaluate(RandomizedRunner.java:879)
	at com.carrotsearch.randomizedtesting.RandomizedRunner$7.evaluate(RandomizedRunner.java:890)
	at com.carrotsearch.randomizedtesting.rules.StatementAdapter.evaluate(StatementAdapter.java:36)
	at com.carrotsearch.randomizedtesting.rules.SystemPropertiesRestoreRule$1.evaluate(SystemPropertiesRestoreRule.java:57)
	at org.apache.lucene.util.AbstractBeforeAfterRule$1.evaluate(AbstractBeforeAfterRule.java:45)
	at com.carrotsearch.randomizedtesting.rules.StatementAdapter.evaluate(StatementAdapter.java:36)
	at org.apache.lucene.util.TestRuleStoreClassName$1.evaluate(TestRuleStoreClassName.java:41)
	at com.carrotsearch.randomizedtesting.rules.NoShadowingOrOverridesOnMethodsRule$1.evaluate(NoShadowingOrOverridesOnMethodsRule.java:40)
	at com.carrotsearch.randomizedtesting.rules.NoShadowingOrOverridesOnMethodsRule$1.evaluate(NoShadowingOrOverridesOnMethodsRule.java:40)
	at com.carrotsearch.randomizedtesting.rules.StatementAdapter.evaluate(StatementAdapter.java:36)
	at com.carrotsearch.randomizedtesting.rules.StatementAdapter.evaluate(StatementAdapter.java:36)
	at org.apache.lucene.util.TestRuleAssertionsRequired$1.evaluate(TestRuleAssertionsRequired.java:53)
	at org.apache.lucene.util.TestRuleMarkFailure$1.evaluate(TestRuleMarkFailure.java:47)
	at org.apache.lucene.util.TestRuleIgnoreAfterMaxFailures$1.evaluate(TestRuleIgnoreAfterMaxFailures.java:64)
	at org.apache.lucene.util.TestRuleIgnoreTestSuites$1.evaluate(TestRuleIgnoreTestSuites.java:54)
	at com.carrotsearch.randomizedtesting.rules.StatementAdapter.evaluate(StatementAdapter.java:36)
	at com.carrotsearch.randomizedtesting.ThreadLeakControl$StatementRunner.run(ThreadLeakControl.java:368)
	at java.base/java.lang.Thread.run(Thread.java:844)




Build Log:
[...truncated 1868 lines...]
   [junit4] JVM J1: stderr was not empty, see: /home/jenkins/workspace/Lucene-Solr-master-Linux/lucene/build/core/test/temp/junit4-J1-20180505_053122_8132389958870342095385.syserr
   [junit4] >>> JVM J1 emitted unexpected output (verbatim) ----
   [junit4] Java HotSpot(TM) 64-Bit Server VM warning: Option UseConcMarkSweepGC was deprecated in version 9.0 and will likely be removed in a future release.
   [junit4] <<< JVM J1: EOF ----

[...truncated 5 lines...]
   [junit4] JVM J0: stderr was not empty, see: /home/jenkins/workspace/Lucene-Solr-master-Linux/lucene/build/core/test/temp/junit4-J0-20180505_053122_8136209716866405345486.syserr
   [junit4] >>> JVM J0 emitted unexpected output (verbatim) ----
   [junit4] Java HotSpot(TM) 64-Bit Server VM warning: Option UseConcMarkSweepGC was deprecated in version 9.0 and will likely be removed in a future release.
   [junit4] <<< JVM J0: EOF ----

[...truncated 3 lines...]
   [junit4] JVM J2: stderr was not empty, see: /home/jenkins/workspace/Lucene-Solr-master-Linux/lucene/build/core/test/temp/junit4-J2-20180505_053122_8132878732790870598836.syserr
   [junit4] >>> JVM J2 emitted unexpected output (verbatim) ----
   [junit4] Java HotSpot(TM) 64-Bit Server VM warning: Option UseConcMarkSweepGC was deprecated in version 9.0 and will likely be removed in a future release.
   [junit4] <<< JVM J2: EOF ----

[...truncated 298 lines...]
   [junit4] JVM J2: stderr was not empty, see: /home/jenkins/workspace/Lucene-Solr-master-Linux/lucene/build/test-framework/test/temp/junit4-J2-20180505_053959_02118400778164191074628.syserr
   [junit4] >>> JVM J2 emitted unexpected output (verbatim) ----
   [junit4] Java HotSpot(TM) 64-Bit Server VM warning: Option UseConcMarkSweepGC was deprecated in version 9.0 and will likely be removed in a future release.
   [junit4] <<< JVM J2: EOF ----

   [junit4] JVM J0: stderr was not empty, see: /home/jenkins/workspace/Lucene-Solr-master-Linux/lucene/build/test-framework/test/temp/junit4-J0-20180505_053959_0216150967527449423194.syserr
   [junit4] >>> JVM J0 emitted unexpected output (verbatim) ----
   [junit4] Java HotSpot(TM) 64-Bit Server VM warning: Option UseConcMarkSweepGC was deprecated in version 9.0 and will likely be removed in a future release.
   [junit4] <<< JVM J0: EOF ----

[...truncated 3 lines...]
   [junit4] JVM J1: stderr was not empty, see: /home/jenkins/workspace/Lucene-Solr-master-Linux/lucene/build/test-framework/test/temp/junit4-J1-20180505_053959_0211859913726636583637.syserr
   [junit4] >>> JVM J1 emitted unexpected output (verbatim) ----
   [junit4] Java HotSpot(TM) 64-Bit Server VM warning: Option UseConcMarkSweepGC was deprecated in version 9.0 and will likely be removed in a future release.
   [junit4] <<< JVM J1: EOF ----

[...truncated 1065 lines...]
   [junit4] JVM J2: stderr was not empty, see: /home/jenkins/workspace/Lucene-Solr-master-Linux/lucene/build/analysis/common/test/temp/junit4-J2-20180505_054133_75112107371134479500247.syserr
   [junit4] >>> JVM J2 emitted unexpected output (verbatim) ----
   [junit4] Java HotSpot(TM) 64-Bit Server VM warning: Option UseConcMarkSweepGC was deprecated in version 9.0 and will likely be removed in a future release.
   [junit4] <<< JVM J2: EOF ----

[...truncated 3 lines...]
   [junit4] JVM J0: stderr was not empty, see: /home/jenkins/workspace/Lucene-Solr-master-Linux/lucene/build/analysis/common/test/temp/junit4-J0-20180505_054133_7423502774666402873566.syserr
   [junit4] >>> JVM J0 emitted unexpected output (verbatim) ----
   [junit4] Java HotSpot(TM) 64-Bit Server VM warning: Option UseConcMarkSweepGC was deprecated in version 9.0 and will likely be removed in a future release.
   [junit4] <<< JVM J0: EOF ----

[...truncated 3 lines...]
   [junit4] JVM J1: stderr was not empty, see: /home/jenkins/workspace/Lucene-Solr-master-Linux/lucene/build/analysis/common/test/temp/junit4-J1-20180505_054133_75015313515003488679605.syserr
   [junit4] >>> JVM J1 emitted unexpected output (verbatim) ----
   [junit4] Java HotSpot(TM) 64-Bit Server VM warning: Option UseConcMarkSweepGC was deprecated in version 9.0 and will likely be removed in a future release.
   [junit4] <<< JVM J1: EOF ----

[...truncated 256 lines...]
   [junit4] JVM J2: stderr was not empty, see: /home/jenkins/workspace/Lucene-Solr-master-Linux/lucene/build/analysis/icu/test/temp/junit4-J2-20180505_054318_6586559004265014152386.syserr
   [junit4] >>> JVM J2 emitted unexpected output (verbatim) ----
   [junit4] Java HotSpot(TM) 64-Bit Server VM warning: Option UseConcMarkSweepGC was deprecated in version 9.0 and will likely be removed in a future release.
   [junit4] <<< JVM J2: EOF ----

   [junit4] JVM J0: stderr was not empty, see: /home/jenkins/workspace/Lucene-Solr-master-Linux/lucene/build/analysis/icu/test/temp/junit4-J0-20180505_054318_65817400418527994856596.syserr
   [junit4] >>> JVM J0 emitted unexpected output (verbatim) ----
   [junit4] Java HotSpot(TM) 64-Bit Server VM warning: Option UseConcMarkSweepGC was deprecated in version 9.0 and will likely be removed in a future release.
   [junit4] <<< JVM J0: EOF ----

[...truncated 5 lines...]
   [junit4] JVM J1: stderr was not empty, see: /home/jenkins/workspace/Lucene-Solr-master-Linux/lucene/build/analysis/icu/test/temp/junit4-J1-20180505_054318_65818157768265306685576.syserr
   [junit4] >>> JVM J1 emitted unexpected output (verbatim) ----
   [junit4] Java HotSpot(TM) 64-Bit Server VM warning: Option UseConcMarkSweepGC was deprecated in version 9.0 and will likely be removed in a future release.
   [junit4] <<< JVM J1: EOF ----

[...truncated 244 lines...]
   [junit4] JVM J2: stderr was not empty, see: /home/jenkins/workspace/Lucene-Solr-master-Linux/lucene/build/analysis/kuromoji/test/temp/junit4-J2-20180505_054330_1473127763530790042200.syserr
   [junit4] >>> JVM J2 emitted unexpected output (verbatim) ----
   [junit4] Java HotSpot(TM) 64-Bit Server VM warning: Option UseConcMarkSweepGC was deprecated in version 9.0 and will likely be removed in a future release.
   [junit4] <<< JVM J2: EOF ----

[...truncated 3 lines...]
   [junit4] JVM J0: stderr was not empty, see: /home/jenkins/workspace/Lucene-Solr-master-Linux/lucene/build/analysis/kuromoji/test/temp/junit4-J0-20180505_054330_1472626794870438468366.syserr
   [junit4] >>> JVM J0 emitted unexpected output (verbatim) ----
   [junit4] Java HotSpot(TM) 64-Bit Server VM warning: Option UseConcMarkSweepGC was deprecated in version 9.0 and will likely be removed in a future release.
   [junit4] <<< JVM J0: EOF ----

[...truncated 12 lines...]
   [junit4] JVM J1: stderr was not empty, see: /home/jenkins/workspace/Lucene-Solr-master-Linux/lucene/build/analysis/kuromoji/test/temp/junit4-J1-20180505_054330_14713145728194396621962.syserr
   [junit4] >>> JVM J1 emitted unexpected output (verbatim) ----
   [junit4] Java HotSpot(TM) 64-Bit Server VM warning: Option UseConcMarkSweepGC was deprecated in version 9.0 and will likely be removed in a future release.
   [junit4] <<< JVM J1: EOF ----

[...truncated 162 lines...]
   [junit4] JVM J1: stderr was not empty, see: /home/jenkins/workspace/Lucene-Solr-master-Linux/lucene/build/analysis/morfologik/test/temp/junit4-J1-20180505_054354_76817875452497393864309.syserr
   [junit4] >>> JVM J1 emitted unexpected output (verbatim) ----
   [junit4] Java HotSpot(TM) 64-Bit Server VM warning: Option UseConcMarkSweepGC was deprecated in version 9.0 and will likely be removed in a future release.
   [junit4] <<< JVM J1: EOF ----

[...truncated 3 lines...]
   [junit4] JVM J0: stderr was not empty, see: /home/jenkins/workspace/Lucene-Solr-master-Linux/lucene/build/analysis/morfologik/test/temp/junit4-J0-20180505_054354_76818164273571220162862.syserr
   [junit4] >>> JVM J0 emitted unexpected output (verbatim) ----
   [junit4] Java HotSpot(TM) 64-Bit Server VM warning: Option UseConcMarkSweepGC was deprecated in version 9.0 and will likely be removed in a future release.
   [junit4] <<< JVM J0: EOF ----

[...truncated 3 lines...]
   [junit4] JVM J2: stderr was not empty, see: /home/jenkins/workspace/Lucene-Solr-master-Linux/lucene/build/analysis/morfologik/test/temp/junit4-J2-20180505_054354_7682524063810340590290.syserr
   [junit4] >>> JVM J2 emitted unexpected output (verbatim) ----
   [junit4] Java HotSpot(TM) 64-Bit Server VM warning: Option UseConcMarkSweepGC was deprecated in version 9.0 and will likely be removed in a future release.
   [junit4] <<< JVM J2: EOF ----

[...truncated 207 lines...]
   [junit4] JVM J2: stderr was not empty, see: /home/jenkins/workspace/Lucene-Solr-master-Linux/lucene/build/analysis/nori/test/temp/junit4-J2-20180505_054358_8751063634997876731218.syserr
   [junit4] >>> JVM J2 emitted unexpected output (verbatim) ----
   [junit4] Java HotSpot(TM) 64-Bit Server VM warning: Option UseConcMarkSweepGC was deprecated in version 9.0 and will likely be removed in a future release.
   [junit4] <<< JVM J2: EOF ----

[...truncated 3 lines...]
   [junit4] JVM J0: stderr was not empty, see: /home/jenkins/workspace/Lucene-Solr-master-Linux/lucene/build/analysis/nori/test/temp/junit4-J0-20180505_054358_8751269887460974325302.syserr
   [junit4] >>> JVM J0 emitted unexpected output (verbatim) ----
   [junit4] Java HotSpot(TM) 64-Bit Server VM warning: Option UseConcMarkSweepGC was deprecated in version 9.0 and will likely be removed in a future release.
   [junit4] <<< JVM J0: EOF ----

[...truncated 3 lines...]
   [junit4] JVM J1: stderr was not empty, see: /home/jenkins/workspace/Lucene-Solr-master-Linux/lucene/build/analysis/nori/test/temp/junit4-J1-20180505_054358_875430529193311319478.syserr
   [junit4] >>> JVM J1 emitted unexpected output (verbatim) ----
   [junit4] Java HotSpot(TM) 64-Bit Server VM warning: Option UseConcMarkSweepGC was deprecated in version 9.0 and will likely be removed in a future release.
   [junit4] <<< JVM J1: EOF ----

[...truncated 174 lines...]
   [junit4] JVM J1: stderr was not empty, see: /home/jenkins/workspace/Lucene-Solr-master-Linux/lucene/build/analysis/opennlp/test/temp/junit4-J1-20180505_054408_52915452036687401193566.syserr
   [junit4] >>> JVM J1 emitted unexpected output (verbatim) ----
   [junit4] Java HotSpot(TM) 64-Bit Server VM warning: Option UseConcMarkSweepGC was deprecated in version 9.0 and will likely be removed in a future release.
   [junit4] <<< JVM J1: EOF ----

   [junit4] JVM J2: stderr was not empty, see: /home/jenkins/workspace/Lucene-Solr-master-Linux/lucene/build/analysis/opennlp/test/temp/junit4-J2-20180505_054408_529892111223544094252.syserr
   [junit4] >>> JVM J2 emitted unexpected output (verbatim) ----
   [junit4] Java HotSpot(TM) 64-Bit Server VM warning: Option UseConcMarkSweepGC was deprecated in version 9.0 and will likely be removed in a future release.
   [junit4] <<< JVM J2: EOF ----

   [junit4] JVM J0: stderr was not empty, see: /home/jenkins/workspace/Lucene-Solr-master-Linux/lucene/build/analysis/opennlp/test/temp/junit4-J0-20180505_054408_5296957436875218291067.syserr
   [junit4] >>> JVM J0 emitted unexpected output (verbatim) ----
   [junit4] Java HotSpot(TM) 64-Bit Server VM warning: Option UseConcMarkSweepGC was deprecated in version 9.0 and will likely be removed in a future release.
   [junit4] <<< JVM J0: EOF ----

[...truncated 176 lines...]
   [junit4] JVM J0: stderr was not empty, see: /home/jenkins/workspace/Lucene-Solr-master-Linux/lucene/build/analysis/phonetic/test/temp/junit4-J0-20180505_054411_43817044732629828324308.syserr
   [junit4] >>> JVM J0 emitted unexpected output (verbatim) ----
   [junit4] Java HotSpot(TM) 64-Bit Server VM warning: Option UseConcMarkSweepGC was deprecated in version 9.0 and will likely be removed in a future release.
   [junit4] <<< JVM J0: EOF ----

[...truncated 3 lines...]
   [junit4] JVM J2: stderr was not empty, see: /home/jenkins/workspace/Lucene-Solr-master-Linux/lucene/build/analysis/phonetic/test/temp/junit4-J2-20180505_054411_4383940741996866122550.syserr
   [junit4] >>> JVM J2 emitted unexpected output (verbatim) ----
   [junit4] Java HotSpot(TM) 64-Bit Server VM warning: Option UseConcMarkSweepGC was deprecated in version 9.0 and will likely be removed in a future release.
   [junit4] <<< JVM J2: EOF ----

[...truncated 3 lines...]
   [junit4] JVM J1: stderr was not empty, see: /home/jenkins/workspace/Lucene-Solr-master-Linux/lucene/build/analysis/phonetic/test/temp/junit4-J1-20180505_054411_43814461132432987223565.syserr
   [junit4] >>> JVM J1 emitted unexpected output (verbatim) ----
   [junit4] Java HotSpot(TM) 64-Bit Server VM warning: Option UseConcMarkSweepGC was deprecated in version 9.0 and will likely be removed in a future release.
   [junit4] <<< JVM J1: EOF ----

[...truncated 161 lines...]
   [junit4] JVM J1: stderr was not empty, see: /home/jenkins/workspace/Lucene-Solr-master-Linux/lucene/build/analysis/smartcn/test/temp/junit4-J1-20180505_054419_99114306140265703947253.syserr
   [junit4] >>> JVM J1 emitted unexpected output (verbatim) ----
   [junit4] Java HotSpot(TM) 64-Bit Server VM warning: Option UseConcMarkSweepGC was deprecated in version 9.0 and will likely be removed in a future release.
   [junit4] <<< JVM J1: EOF ----

[...truncated 3 lines...]
   [junit4] JVM J0: stderr was not empty, see: /home/jenkins/workspace/Lucene-Solr-master-Linux/lucene/build/analysis/smartcn/test/temp/junit4-J0-20180505_054419_99116537736168604422321.syserr
   [junit4] >>> JVM J0 emitted unexpected output (verbatim) ----
   [junit4] Java HotSpot(TM) 64-Bit Server VM warning: Option UseConcMarkSweepGC was deprecated in version 9.0 and will likely be removed in a future release.
   [junit4] <<< JVM J0: EOF ----

[...truncated 162 lines...]
   [junit4] JVM J2: stderr was not empty, see: /home/jenkins/workspace/Lucene-Solr-master-Linux/lucene/build/analysis/stempel/test/temp/junit4-J2-20180505_054428_85417713186588234546902.syserr
   [junit4] >>> JVM J2 emitted unexpected output (verbatim) ----
   [junit4] Java HotSpot(TM) 64-Bit Server VM warning: Option UseConcMarkSweepGC was deprecated in version 9.0 and will likely be removed in a future release.
   [junit4] <<< JVM J2: EOF ----

[...truncated 6 lines...]
   [junit4] JVM J1: stderr was not empty, see: /home/jenkins/workspace/Lucene-Solr-master-Linux/lucene/build/analysis/stempel/test/temp/junit4-J1-20180505_054428_85416287137804105471049.syserr
   [junit4] >>> JVM J1 emitted unexpected output (verbatim) ----
   [junit4] Java HotSpot(TM) 64-Bit Server VM warning: Option UseConcMarkSweepGC was deprecated in version 9.0 and will likely be removed in a future release.
   [junit4] <<< JVM J1: EOF ----

   [junit4] JVM J0: stderr was not empty, see: /home/jenkins/workspace/Lucene-Solr-master-Linux/lucene/build/analysis/stempel/test/temp/junit4-J0-20180505_054428_8542849107921947973431.syserr
   [junit4] >>> JVM J0 emitted unexpected output (verbatim) ----
   [junit4] Java HotSpot(TM) 64-Bit Server VM warning: Option UseConcMarkSweepGC was deprecated in version 9.0 and will likely be removed in a future release.
   [junit4] <<< JVM J0: EOF ----

[...truncated 177 lines...]
   [junit4] JVM J0: stderr was not empty, see: /home/jenkins/workspace/Lucene-Solr-master-Linux/lucene/build/analysis/uima/test/temp/junit4-J0-20180505_054431_59035953793827624860.syserr
   [junit4] >>> JVM J0 emitted unexpected output (verbatim) ----
   [junit4] Java HotSpot(TM) 64-Bit Server VM warning: Option UseConcMarkSweepGC was deprecated in version 9.0 and will likely be removed in a future release.
   [junit4] <<< JVM J0: EOF ----

[...truncated 158 lines...]
   [junit4] JVM J1: stderr was not empty, see: /home/jenkins/workspace/Lucene-Solr-master-Linux/lucene/build/backward-codecs/test/temp/junit4-J1-20180505_054439_0835349308313869504512.syserr
   [junit4] >>> JVM J1 emitted unexpected output (verbatim) ----
   [junit4] Java HotSpot(TM) 64-Bit Server VM warning: Option UseConcMarkSweepGC was deprecated in version 9.0 and will likely be removed in a future release.
   [junit4] <<< JVM J1: EOF ----

   [junit4] JVM J0: stderr was not empty, see: /home/jenkins/workspace/Lucene-Solr-master-Linux/lucene/build/backward-codecs/test/temp/junit4-J0-20180505_054439_08314906090550083755132.syserr
   [junit4] >>> JVM J0 emitted unexpected output (verbatim) ----
   [junit4] Java HotSpot(TM) 64-Bit Server VM warning: Option UseConcMarkSweepGC was deprecated in version 9.0 and will likely be removed in a future release.
   [junit4] <<< JVM J0: EOF ----

[...truncated 19 lines...]
   [junit4] JVM J2: stderr was not empty, see: /home/jenkins/workspace/Lucene-Solr-master-Linux/lucene/build/backward-codecs/test/temp/junit4-J2-20180505_054439_08312043915712453292428.syserr
   [junit4] >>> JVM J2 emitted unexpected output (verbatim) ----
   [junit4] Java HotSpot(TM) 64-Bit Server VM warning: Option UseConcMarkSweepGC was deprecated in version 9.0 and will likely be removed in a future release.
   [junit4] <<< JVM J2: EOF ----

[...truncated 1391 lines...]
   [junit4] JVM J2: stderr was not empty, see: /home/jenkins/workspace/Lucene-Solr-master-Linux/lucene/build/benchmark/test/temp/junit4-J2-20180505_054503_16614244679782219296632.syserr
   [junit4] >>> JVM J2 emitted unexpected output (verbatim) ----
   [junit4] Java HotSpot(TM) 64-Bit Server VM warning: Option UseConcMarkSweepGC was deprecated in version 9.0 and will likely be removed in a future release.
   [junit4] <<< JVM J2: EOF ----

   [junit4] JVM J1: stderr was not empty, see: /home/jenkins/workspace/Lucene-Solr-master-Linux/lucene/build/benchmark/test/temp/junit4-J1-20180505_054503_1663206219927760093579.syserr
   [junit4] >>> JVM J1 emitted unexpected output (verbatim) ----
   [junit4] Java HotSpot(TM) 64-Bit Server VM warning: Option UseConcMarkSweepGC was deprecated in version 9.0 and will likely be removed in a future release.
   [junit4] <<< JVM J1: EOF ----

[...truncated 3 lines...]
   [junit4] JVM J0: stderr was not empty, see: /home/jenkins/workspace/Lucene-Solr-master-Linux/lucene/build/benchmark/test/temp/junit4-J0-20180505_054503_16612568699517965149955.syserr
   [junit4] >>> JVM J0 emitted unexpected output (verbatim) ----
   [junit4] Java HotSpot(TM) 64-Bit Server VM warning: Option UseConcMarkSweepGC was deprecated in version 9.0 and will likely be removed in a future release.
   [junit4] <<< JVM J0: EOF ----

[...truncated 250 lines...]
   [junit4] JVM J1: stderr was not empty, see: /home/jenkins/workspace/Lucene-Solr-master-Linux/lucene/build/classification/test/temp/junit4-J1-20180505_054511_6235568369299969110707.syserr
   [junit4] >>> JVM J1 emitted unexpected output (verbatim) ----
   [junit4] Java HotSpot(TM) 64-Bit Server VM warning: Option UseConcMarkSweepGC was deprecated in version 9.0 and will likely be removed in a future release.
   [junit4] <<< JVM J1: EOF ----

[...truncated 3 lines...]
   [junit4] JVM J2: stderr was not empty, see: /home/jenkins/workspace/Lucene-Solr-master-Linux/lucene/build/classification/test/temp/junit4-J2-20180505_054511_6238422902879153050048.syserr
   [junit4] >>> JVM J2 emitted unexpected output (verbatim) ----
   [junit4] Java HotSpot(TM) 64-Bit Server VM warning: Option UseConcMarkSweepGC was deprecated in version 9.0 and will likely be removed in a future release.
   [junit4] <<< JVM J2: EOF ----

[...truncated 3 lines...]
   [junit4] JVM J0: stderr was not empty, see: /home/jenkins/workspace/Lucene-Solr-master-Linux/lucene/build/classification/test/temp/junit4-J0-20180505_054511_6231445140895699092562.syserr
   [junit4] >>> JVM J0 emitted unexpected output (verbatim) ----
   [junit4] Java HotSpot(TM) 64-Bit Server VM warning: Option UseConcMarkSweepGC was deprecated in version 9.0 and will likely be removed in a future release.
   [junit4] <<< JVM J0: EOF ----

[...truncated 262 lines...]
   [junit4] JVM J1: stderr was not empty, see: /home/jenkins/workspace/Lucene-Solr-master-Linux/lucene/build/codecs/test/temp/junit4-J1-20180505_054524_9458378786567110778188.syserr
   [junit4] >>> JVM J1 emitted unexpected output (verbatim) ----
   [junit4] Java HotSpot(TM) 64-Bit Server VM warning: Option UseConcMarkSweepGC was deprecated in version 9.0 and will likely be removed in a future release.
   [junit4] <<< JVM J1: EOF ----

[...truncated 3 lines...]
   [junit4] JVM J2: stderr was not empty, see: /home/jenkins/workspace/Lucene-Solr-master-Linux/lucene/build/codecs/test/temp/junit4-J2-20180505_054524_9468640813510734884522.syserr
   [junit4] >>> JVM J2 emitted unexpected output (verbatim) ----
   [junit4] Java HotSpot(TM) 64-Bit Server VM warning: Option UseConcMarkSweepGC was deprecated in version 9.0 and will likely be removed in a future release.
   [junit4] <<< JVM J2: EOF ----

[...truncated 3 lines...]
   [junit4] JVM J0: stderr was not empty, see: /home/jenkins/workspace/Lucene-Solr-master-Linux/lucene/build/codecs/test/temp/junit4-J0-20180505_054524_94517476569611399322911.syserr
   [junit4] >>> JVM J0 emitted unexpected output (verbatim) ----
   [junit4] Java HotSpot(TM) 64-Bit Server VM warning: Option UseConcMarkSweepGC was deprecated in version 9.0 and will likely be removed in a future release.
   [junit4] <<< JVM J0: EOF ----

[...truncated 236 lines...]
   [junit4] JVM J1: stderr was not empty, see: /home/jenkins/workspace/Lucene-Solr-master-Linux/lucene/build/demo/test/temp/junit4-J1-20180505_054757_72311439599907397039351.syserr
   [junit4] >>> JVM J1 emitted unexpected output (verbatim) ----
   [junit4] Java HotSpot(TM) 64-Bit Server VM warning: Option UseConcMarkSweepGC was deprecated in version 9.0 and will likely be removed in a future release.
   [junit4] <<< JVM J1: EOF ----

   [junit4] JVM J2: stderr was not empty, see: /home/jenkins/workspace/Lucene-Solr-master-Linux/lucene/build/demo/test/temp/junit4-J2-20180505_054757_7238724136528845921781.syserr
   [junit4] >>> JVM J2 emitted unexpected output (verbatim) ----
   [junit4] Java HotSpot(TM) 64-Bit Server VM warning: Option UseConcMarkSweepGC was deprecated in version 9.0 and will likely be removed in a future release.
   [junit4] <<< JVM J2: EOF ----

   [junit4] JVM J0: stderr was not empty, see: /home/jenkins/workspace/Lucene-Solr-master-Linux/lucene/build/demo/test/temp/junit4-J0-20180505_054757_72316972304202090045854.syserr
   [junit4] >>> JVM J0 emitted unexpected output (verbatim) ----
   [junit4] Java HotSpot(TM) 64-Bit Server VM warning: Option UseConcMarkSweepGC was deprecated in version 9.0 and will likely be removed in a future release.
   [junit4] <<< JVM J0: EOF ----

[...truncated 173 lines...]
   [junit4] JVM J0: stderr was not empty, see: /home/jenkins/workspace/Lucene-Solr-master-Linux/lucene/build/expressions/test/temp/junit4-J0-20180505_054800_53215806613539306434486.syserr
   [junit4] >>> JVM J0 emitted unexpected output (verbatim) ----
   [junit4] Java HotSpot(TM) 64-Bit Server VM warning: Option UseConcMarkSweepGC was deprecated in version 9.0 and will likely be removed in a future release.
   [junit4] <<< JVM J0: EOF ----

[...truncated 3 lines...]
   [junit4] JVM J1: stderr was not empty, see: /home/jenkins/workspace/Lucene-Solr-master-Linux/lucene/build/expressions/test/temp/junit4-J1-20180505_054800_53217808083456419009483.syserr
   [junit4] >>> JVM J1 emitted unexpected output (verbatim) ----
   [junit4] Java HotSpot(TM) 64-Bit Server VM warning: Option UseConcMarkSweepGC was deprecated in version 9.0 and will likely be removed in a future release.
   [junit4] <<< JVM J1: EOF ----

[...truncated 3 lines...]
   [junit4] JVM J2: stderr was not empty, see: /home/jenkins/workspace/Lucene-Solr-master-Linux/lucene/build/expressions/test/temp/junit4-J2-20180505_054800_532115092853551671409.syserr
   [junit4] >>> JVM J2 emitted unexpected output (verbatim) ----
   [junit4] Java HotSpot(TM) 64-Bit Server VM warning: Option UseConcMarkSweepGC was deprecated in version 9.0 and will likely be removed in a future release.
   [junit4] <<< JVM J2: EOF ----

[...truncated 220 lines...]
   [junit4] JVM J2: stderr was not empty, see: /home/jenkins/workspace/Lucene-Solr-master-Linux/lucene/build/facet/test/temp/junit4-J2-20180505_054806_2752488065723828636135.syserr
   [junit4] >>> JVM J2 emitted unexpected output (verbatim) ----
   [junit4] Java HotSpot(TM) 64-Bit Server VM warning: Option UseConcMarkSweepGC was deprecated in version 9.0 and will likely be removed in a future release.
   [junit4] <<< JVM J2: EOF ----

[...truncated 3 lines...]
   [junit4] JVM J0: stderr was not empty, see: /home/jenkins/workspace/Lucene-Solr-master-Linux/lucene/build/facet/test/temp/junit4-J0-20180505_054806_275987171336945097399.syserr
   [junit4] >>> JVM J0 emitted unexpected output (verbatim) ----
   [junit4] Java HotSpot(TM) 64-Bit Server VM warning: Option UseConcMarkSweepGC was deprecated in version 9.0 and will likely be removed in a future release.
   [junit4] <<< JVM J0: EOF ----

[...truncated 15 lines...]
   [junit4] JVM J1: stderr was not empty, see: /home/jenkins/workspace/Lucene-Solr-master-Linux/lucene/build/facet/test/temp/junit4-J1-20180505_054806_2752021774201959491408.syserr
   [junit4] >>> JVM J1 emitted unexpected output (verbatim) ----
   [junit4] Java HotSpot(TM) 64-Bit Server VM warning: Option UseConcMarkSweepGC was deprecated in version 9.0 and will likely be removed in a future release.
   [junit4] <<< JVM J1: EOF ----

[...truncated 179 lines...]
   [junit4] JVM J2: stderr was not empty, see: /home/jenkins/workspace/Lucene-Solr-master-Linux/lucene/build/grouping/test/temp/junit4-J2-20180505_054853_1936946943171713189483.syserr
   [junit4] >>> JVM J2 emitted unexpected output (verbatim) ----
   [junit4] Java HotSpot(TM) 64-Bit Server VM warning: Option UseConcMarkSweepGC was deprecated in version 9.0 and will likely be removed in a future release.
   [junit4] <<< JVM J2: EOF ----

[...truncated 9 lines...]
   [junit4] JVM J1: stderr was not empty, see: /home/jenkins/workspace/Lucene-Solr-master-Linux/lucene/build/grouping/test/temp/junit4-J1-20180505_054853_19310663090768303293942.syserr
   [junit4] >>> JVM J1 emitted unexpected output (verbatim) ----
   [junit4] Java HotSpot(TM) 64-Bit Server VM warning: Option UseConcMarkSweepGC was deprecated in version 9.0 and will likely be removed in a future release.
   [junit4] <<< JVM J1: EOF ----

   [junit4] JVM J0: stderr was not empty, see: /home/jenkins/workspace/Lucene-Solr-master-Linux/lucene/build/grouping/test/temp/junit4-J0-20180505_054853_19314138596553826227042.syserr
   [junit4] >>> JVM J0 emitted unexpected output (verbatim) ----
   [junit4] Java HotSpot(TM) 64-Bit Server VM warning: Option UseConcMarkSweepGC was deprecated in version 9.0 and will likely be removed in a future release.
   [junit4] <<< JVM J0: EOF ----

[...truncated 252 lines...]
   [junit4] JVM J2: stderr was not empty, see: /home/jenkins/workspace/Lucene-Solr-master-Linux/lucene/build/highlighter/test/temp/junit4-J2-20180505_054905_47417891083065079839377.syserr
   [junit4] >>> JVM J2 emitted unexpected output (verbatim) ----
   [junit4] Java HotSpot(TM) 64-Bit Server VM warning: Option UseConcMarkSweepGC was deprecated in version 9.0 and will likely be removed in a future release.
   [junit4] <<< JVM J2: EOF ----

[...truncated 3 lines...]
   [junit4] JVM J1: stderr was not empty, see: /home/jenkins/workspace/Lucene-Solr-master-Linux/lucene/build/highlighter/test/temp/junit4-J1-20180505_054905_47417779768363471681268.syserr
   [junit4] >>> JVM J1 emitted unexpected output (verbatim) ----
   [junit4] Java HotSpot(TM) 64-Bit Server VM warning: Option UseConcMarkSweepGC was deprecated in version 9.0 and will likely be removed in a future release.
   [junit4] <<< JVM J1: EOF ----

[...truncated 6 lines...]
   [junit4] JVM J0: stderr was not empty, see: /home/jenkins/workspace/Lucene-Solr-master-Linux/lucene/build/highlighter/test/temp/junit4-J0-20180505_054905_47420002535728042456.syserr
   [junit4] >>> JVM J0 emitted unexpected output (verbatim) ----
   [junit4] Java HotSpot(TM) 64-Bit Server VM warning: Option UseConcMarkSweepGC was deprecated in version 9.0 and will likely be removed in a future release.
   [junit4] <<< JVM J0: EOF ----

[...truncated 163 lines...]
   [junit4] JVM J1: stderr was not empty, see: /home/jenkins/workspace/Lucene-Solr-master-Linux/lucene/build/join/test/temp/junit4-J1-20180505_054929_54213326917855214296063.syserr
   [junit4] >>> JVM J1 emitted unexpected output (verbatim) ----
   [junit4] Java HotSpot(TM) 64-Bit Server VM warning: Option UseConcMarkSweepGC was deprecated in version 9.0 and will likely be removed in a future release.
   [junit4] <<< JVM J1: EOF ----

[...truncated 6 lines...]
   [junit4] JVM J0: stderr was not empty, see: /home/jenkins/workspace/Lucene-Solr-master-Linux/lucene/build/join/test/temp/junit4-J0-20180505_054929_5427047577460075127720.syserr
   [junit4] >>> JVM J0 emitted unexpected output (verbatim) ----
   [junit4] Java HotSpot(TM) 64-Bit Server VM warning: Option UseConcMarkSweepGC was deprecated in version 9.0 and will likely be removed in a future release.
   [junit4] <<< JVM J0: EOF ----

[...truncated 3 lines...]
   [junit4] JVM J2: stderr was not empty, see: /home/jenkins/workspace/Lucene-Solr-master-Linux/lucene/build/join/test/temp/junit4-J2-20180505_054929_5427971571116911600124.syserr
   [junit4] >>> JVM J2 emitted unexpected output (verbatim) ----
   [junit4] Java HotSpot(TM) 64-Bit Server VM warning: Option UseConcMarkSweepGC was deprecated in version 9.0 and will likely be removed in a future release.
   [junit4] <<< JVM J2: EOF ----

[...truncated 155 lines...]
   [junit4] JVM J0: stderr was not empty, see: /home/jenkins/workspace/Lucene-Solr-master-Linux/lucene/build/memory/test/temp/junit4-J0-20180505_054956_3033874379316677584145.syserr
   [junit4] >>> JVM J0 emitted unexpected output (verbatim) ----
   [junit4] Java HotSpot(TM) 64-Bit Server VM warning: Option UseConcMarkSweepGC was deprecated in version 9.0 and will likely be removed in a future release.
   [junit4] <<< JVM J0: EOF ----

[...truncated 3 lines...]
   [junit4] JVM J1: stderr was not empty, see: /home/jenkins/workspace/Lucene-Solr-master-Linux/lucene/build/memory/test/temp/junit4-J1-20180505_054956_3037776701616119461355.syserr
   [junit4] >>> JVM J1 emitted unexpected output (verbatim) ----
   [junit4] Java HotSpot(TM) 64-Bit Server VM warning: Option UseConcMarkSweepGC was deprecated in version 9.0 and will likely be removed in a future release.
   [junit4] <<< JVM J1: EOF ----

[...truncated 181 lines...]
   [junit4] JVM J2: stderr was not empty, see: /home/jenkins/workspace/Lucene-Solr-master-Linux/lucene/build/misc/test/temp/junit4-J2-20180505_055006_1503204343140078528988.syserr
   [junit4] >>> JVM J2 emitted unexpected output (verbatim) ----
   [junit4] Java HotSpot(TM) 64-Bit Server VM warning: Option UseConcMarkSweepGC was deprecated in version 9.0 and will likely be removed in a future release.
   [junit4] <<< JVM J2: EOF ----

[...truncated 14 lines...]
   [junit4] JVM J0: stderr was not empty, see: /home/jenkins/workspace/Lucene-Solr-master-Linux/lucene/build/misc/test/temp/junit4-J0-20180505_055006_15015305823064219155499.syserr
   [junit4] >>> JVM J0 emitted unexpected output (verbatim) ----
   [junit4] Java HotSpot(TM) 64-Bit Server VM warning: Option UseConcMarkSweepGC was deprecated in version 9.0 and will likely be removed in a future release.
   [junit4] <<< JVM J0: EOF ----

   [junit4] JVM J1: stderr was not empty, see: /home/jenkins/workspace/Lucene-Solr-master-Linux/lucene/build/misc/test/temp/junit4-J1-20180505_055006_15015442714824158932194.syserr
   [junit4] >>> JVM J1 emitted unexpected output (verbatim) ----
   [junit4] Java HotSpot(TM) 64-Bit Server VM warning: Option UseConcMarkSweepGC was deprecated in version 9.0 and will likely be removed in a future release.
   [junit4] <<< JVM J1: EOF ----

[...truncated 307 lines...]
   [junit4] JVM J1: stderr was not empty, see: /home/jenkins/workspace/Lucene-Solr-master-Linux/lucene/build/queries/test/temp/junit4-J1-20180505_055025_7074069324811289526680.syserr
   [junit4] >>> JVM J1 emitted unexpected output (verbatim) ----
   [junit4] Java HotSpot(TM) 64-Bit Server VM warning: Option UseConcMarkSweepGC was deprecated in version 9.0 and will likely be removed in a future release.
   [junit4] <<< JVM J1: EOF ----

[...truncated 3 lines...]
   [junit4] JVM J2: stderr was not empty, see: /home/jenkins/workspace/Lucene-Solr-master-Linux/lucene/build/queries/test/temp/junit4-J2-20180505_055025_70714740384784669629772.syserr
   [junit4] >>> JVM J2 emitted unexpected output (verbatim) ----
   [junit4] Java HotSpot(TM) 64-Bit Server VM warning: Option UseConcMarkSweepGC was deprecated in version 9.0 and will likely be removed in a future release.
   [junit4] <<< JVM J2: EOF ----

   [junit4] JVM J0: stderr was not empty, see: /home/jenkins/workspace/Lucene-Solr-master-Linux/lucene/build/queries/test/temp/junit4-J0-20180505_055025_70717556394761124265829.syserr
   [junit4] >>> JVM J0 emitted unexpected output (verbatim) ----
   [junit4] Java HotSpot(TM) 64-Bit Server VM warning: Option UseConcMarkSweepGC was deprecated in version 9.0 and will likely be removed in a future release.
   [junit4] <<< JVM J0: EOF ----

[...truncated 232 lines...]
   [junit4] JVM J2: stderr was not empty, see: /home/jenkins/workspace/Lucene-Solr-master-Linux/lucene/build/queryparser/test/temp/junit4-J2-20180505_055032_9933727899845286847449.syserr
   [junit4] >>> JVM J2 emitted unexpected output (verbatim) ----
   [junit4] Java HotSpot(TM) 64-Bit Server VM warning: Option UseConcMarkSweepGC was deprecated in version 9.0 and will likely be removed in a future release.
   [junit4] <<< JVM J2: EOF ----

[...truncated 6 lines...]
   [junit4] JVM J0: stderr was not empty, see: /home/jenkins/workspace/Lucene-Solr-master-Linux/lucene/build/queryparser/test/temp/junit4-J0-20180505_055032_993394823787430922264.syserr
   [junit4] >>> JVM J0 emitted unexpected output (verbatim) ----
   [junit4] Java HotSpot(TM) 64-Bit Server VM warning: Option UseConcMarkSweepGC was deprecated in version 9.0 and will likely be removed in a future release.
   [junit4] <<< JVM J0: EOF ----

   [junit4] JVM J1: stderr was not empty, see: /home/jenkins/workspace/Lucene-Solr-master-Linux/lucene/build/queryparser/test/temp/junit4-J1-20180505_055032_9935046452505202807561.syserr
   [junit4] >>> JVM J1 emitted unexpected output (verbatim) ----
   [junit4] Java HotSpot(TM) 64-Bit Server VM warning: Option UseConcMarkSweepGC was deprecated in version 9.0 and will likely be removed in a future release.
   [junit4] <<< JVM J1: EOF ----

[...truncated 212 lines...]
   [junit4] JVM J1: stderr was not empty, see: /home/jenkins/workspace/Lucene-Solr-master-Linux/lucene/build/replicator/test/temp/junit4-J1-20180505_055040_9002193725535598477383.syserr
   [junit4] >>> JVM J1 emitted unexpected output (verbatim) ----
   [junit4] Java HotSpot(TM) 64-Bit Server VM warning: Option UseConcMarkSweepGC was deprecated in version 9.0 and will likely be removed in a future release.
   [junit4] <<< JVM J1: EOF ----

[...truncated 6 lines...]
   [junit4] JVM J0: stderr was not empty, see: /home/jenkins/workspace/Lucene-Solr-master-Linux/lucene/build/replicator/test/temp/junit4-J0-20180505_055040_9005460532248450699811.syserr
   [junit4] >>> JVM J0 emitted unexpected output (verbatim) ----
   [junit4] Java HotSpot(TM) 64-Bit Server VM warning: Option UseConcMarkSweepGC was deprecated in version 9.0 and will likely be removed in a future release.
   [junit4] <<< JVM J0: EOF ----

   [junit4] JVM J2: stderr was not empty, see: /home/jenkins/workspace/Lucene-Solr-master-Linux/lucene/build/replicator/test/temp/junit4-J2-20180505_055040_9003379985162559964098.syserr
   [junit4] >>> JVM J2 emitted unexpected output (verbatim) ----
   [junit4] Java HotSpot(TM) 64-Bit Server VM warning: Option UseConcMarkSweepGC was deprecated in version 9.0 and will likely be removed in a future release.
   [junit4] <<< JVM J2: EOF ----

[...truncated 228 lines...]
   [junit4] JVM J1: stderr was not empty, see: /home/jenkins/workspace/Lucene-Solr-master-Linux/lucene/build/sandbox/test/temp/junit4-J1-20180505_055052_883108921882774768077.syserr
   [junit4] >>> JVM J1 emitted unexpected output (verbatim) ----
   [junit4] Java HotSpot(TM) 64-Bit Server VM warning: Option UseConcMarkSweepGC was deprecated in version 9.0 and will likely be removed in a future release.
   [junit4] <<< JVM J1: EOF ----

[...truncated 6 lines...]
   [junit4] JVM J0: stderr was not empty, see: /home/jenkins/workspace/Lucene-Solr-master-Linux/lucene/build/sandbox/test/temp/junit4-J0-20180505_055052_88314179503144400560335.syserr
   [junit4] >>> JVM J0 emitted unexpected output (verbatim) ----
   [junit4] Java HotSpot(TM) 64-Bit Server VM warning: Option UseConcMarkSweepGC was deprecated in version 9.0 and will likely be removed in a future release.
   [junit4] <<< JVM J0: EOF ----

[...truncated 3 lines...]
   [junit4] JVM J2: stderr was not empty, see: /home/jenkins/workspace/Lucene-Solr-master-Linux/lucene/build/sandbox/test/temp/junit4-J2-20180505_055052_8839290309691693121394.syserr
   [junit4] >>> JVM J2 emitted unexpected output (verbatim) ----
   [junit4] Java HotSpot(TM) 64-Bit Server VM warning: Option UseConcMarkSweepGC was deprecated in version 9.0 and will likely be removed in a future release.
   [junit4] <<< JVM J2: EOF ----

[...truncated 323 lines...]
   [junit4] JVM J0: stderr was not empty, see: /home/jenkins/workspace/Lucene-Solr-master-Linux/lucene/build/spatial-extras/test/temp/junit4-J0-20180505_055156_1322555776870626057255.syserr
   [junit4] >>> JVM J0 emitted unexpected output (verbatim) ----
   [junit4] Java HotSpot(TM) 64-Bit Server VM warning: Option UseConcMarkSweepGC was deprecated in version 9.0 and will likely be removed in a future release.
   [junit4] <<< JVM J0: EOF ----

[...truncated 3 lines...]
   [junit4] JVM J2: stderr was not empty, see: /home/jenkins/workspace/Lucene-Solr-master-Linux/lucene/build/spatial-extras/test/temp/junit4-J2-20180505_055156_1325725598607089437814.syserr
   [junit4] >>> JVM J2 emitted unexpected output (verbatim) ----
   [junit4] Java HotSpot(TM) 64-Bit Server VM warning: Option UseConcMarkSweepGC was deprecated in version 9.0 and will likely be removed in a future release.
   [junit4] <<< JVM J2: EOF ----

   [junit4] JVM J1: stderr was not empty, see: /home/jenkins/workspace/Lucene-Solr-master-Linux/lucene/build/spatial-extras/test/temp/junit4-J1-20180505_055156_132764748407878372561.syserr
   [junit4] >>> JVM J1 emitted unexpected output (verbatim) ----
   [junit4] Java HotSpot(TM) 64-Bit Server VM warning: Option UseConcMarkSweepGC was deprecated in version 9.0 and will likely be removed in a future release.
   [junit4] <<< JVM J1: EOF ----

[...truncated 153 lines...]
   [junit4] JVM J0: stderr was not empty, see: /home/jenkins/workspace/Lucene-Solr-master-Linux/lucene/build/spatial/test/temp/junit4-J0-20180505_055214_908545134108711252216.syserr
   [junit4] >>> JVM J0 emitted unexpected output (verbatim) ----
   [junit4] Java HotSpot(TM) 64-Bit Server VM warning: Option UseConcMarkSweepGC was deprecated in version 9.0 and will likely be removed in a future release.
   [junit4] <<< JVM J0: EOF ----

[...truncated 181 lines...]
   [junit4] JVM J0: stderr was not empty, see: /home/jenkins/workspace/Lucene-Solr-master-Linux/lucene/build/spatial3d/test/temp/junit4-J0-20180505_055216_9407150774301797929459.syserr
   [junit4] >>> JVM J0 emitted unexpected output (verbatim) ----
   [junit4] Java HotSpot(TM) 64-Bit Server VM warning: Option UseConcMarkSweepGC was deprecated in version 9.0 and will likely be removed in a future release.
   [junit4] <<< JVM J0: EOF ----

[...truncated 3 lines...]
   [junit4] JVM J2: stderr was not empty, see: /home/jenkins/workspace/Lucene-Solr-master-Linux/lucene/build/spatial3d/test/temp/junit4-J2-20180505_055216_94012639394593136757192.syserr
   [junit4] >>> JVM J2 emitted unexpected output (verbatim) ----
   [junit4] Java HotSpot(TM) 64-Bit Server VM warning: Option UseConcMarkSweepGC was deprecated in version 9.0 and will likely be removed in a future release.
   [junit4] <<< JVM J2: EOF ----

[...truncated 8 lines...]
   [junit4] JVM J1: stderr was not empty, see: /home/jenkins/workspace/Lucene-Solr-master-Linux/lucene/build/spatial3d/test/temp/junit4-J1-20180505_055216_94015524988949132197910.syserr
   [junit4] >>> JVM J1 emitted unexpected output (verbatim) ----
   [junit4] Java HotSpot(TM) 64-Bit Server VM warning: Option UseConcMarkSweepGC was deprecated in version 9.0 and will likely be removed in a future release.
   [junit4] <<< JVM J1: EOF ----

[...truncated 258 lines...]
   [junit4] JVM J0: stderr was not empty, see: /home/jenkins/workspace/Lucene-Solr-master-Linux/lucene/build/suggest/test/temp/junit4-J0-20180505_055330_69510943371875362650392.syserr
   [junit4] >>> JVM J0 emitted unexpected output (verbatim) ----
   [junit4] Java HotSpot(TM) 64-Bit Server VM warning: Option UseConcMarkSweepGC was deprecated in version 9.0 and will likely be removed in a future release.
   [junit4] <<< JVM J0: EOF ----

[...truncated 3 lines...]
   [junit4] JVM J2: stderr was not empty, see: /home/jenkins/workspace/Lucene-Solr-master-Linux/lucene/build/suggest/test/temp/junit4-J2-20180505_055330_69514088955024873344450.syserr
   [junit4] >>> JVM J2 emitted unexpected output (verbatim) ----
   [junit4] Java HotSpot(TM) 64-Bit Server VM warning: Option UseConcMarkSweepGC was deprecated in version 9.0 and will likely be removed in a future release.
   [junit4] <<< JVM J2: EOF ----

[...truncated 9 lines...]
   [junit4] JVM J1: stderr was not empty, see: /home/jenkins/workspace/Lucene-Solr-master-Linux/lucene/build/suggest/test/temp/junit4-J1-20180505_055330_69510299743507121048988.syserr
   [junit4] >>> JVM J1 emitted unexpected output (verbatim) ----
   [junit4] Java HotSpot(TM) 64-Bit Server VM warning: Option UseConcMarkSweepGC was deprecated in version 9.0 and will likely be removed in a future release.
   [junit4] <<< JVM J1: EOF ----

[...truncated 1923 lines...]
   [junit4] Suite: org.apache.solr.cloud.autoscaling.SearchRateTriggerIntegrationTest
   [junit4]   2> 50211 INFO  (SUITE-SearchRateTriggerIntegrationTest-seed#[69C528660A3DC88A]-worker) [    ] o.a.s.SolrTestCaseJ4 SecureRandom sanity checks: test.solr.allowed.securerandom=null & java.security.egd=file:/dev/./urandom
   [junit4]   2> Creating dataDir: /home/jenkins/workspace/Lucene-Solr-master-Linux/solr/build/solr-core/test/J2/temp/solr.cloud.autoscaling.SearchRateTriggerIntegrationTest_69C528660A3DC88A-001/init-core-data-001
   [junit4]   2> 50213 INFO  (SUITE-SearchRateTriggerIntegrationTest-seed#[69C528660A3DC88A]-worker) [    ] o.a.s.SolrTestCaseJ4 Using PointFields (NUMERIC_POINTS_SYSPROP=true) w/NUMERIC_DOCVALUES_SYSPROP=false
   [junit4]   2> 50213 INFO  (SUITE-SearchRateTriggerIntegrationTest-seed#[69C528660A3DC88A]-worker) [    ] o.a.s.SolrTestCaseJ4 Randomized ssl (false) and clientAuth (false) via: @org.apache.solr.util.RandomizeSSL(reason="", value=0.0/0.0, ssl=0.0/0.0, clientAuth=0.0/0.0)
   [junit4]   2> 50214 INFO  (SUITE-SearchRateTriggerIntegrationTest-seed#[69C528660A3DC88A]-worker) [    ] o.a.s.c.MiniSolrCloudCluster Starting cluster of 5 servers in /home/jenkins/workspace/Lucene-Solr-master-Linux/solr/build/solr-core/test/J2/temp/solr.cloud.autoscaling.SearchRateTriggerIntegrationTest_69C528660A3DC88A-001/tempDir-001
   [junit4]   2> 50214 INFO  (SUITE-SearchRateTriggerIntegrationTest-seed#[69C528660A3DC88A]-worker) [    ] o.a.s.c.ZkTestServer STARTING ZK TEST SERVER
   [junit4]   2> 50216 INFO  (Thread-121) [    ] o.a.s.c.ZkTestServer client port:0.0.0.0/0.0.0.0:0
   [junit4]   2> 50216 INFO  (Thread-121) [    ] o.a.s.c.ZkTestServer Starting server
   [junit4]   2> 50256 ERROR (Thread-121) [    ] o.a.z.s.ZooKeeperServer ZKShutdownHandler is not registered, so ZooKeeper server won't take any action on ERROR or SHUTDOWN server state changes
   [junit4]   2> 50317 INFO  (SUITE-SearchRateTriggerIntegrationTest-seed#[69C528660A3DC88A]-worker) [    ] o.a.s.c.ZkTestServer start zk server on port:44919
   [junit4]   2> 50333 INFO  (zkConnectionManagerCallback-205-thread-1) [    ] o.a.s.c.c.ConnectionManager zkClient has connected
   [junit4]   2> 50338 INFO  (jetty-launcher-202-thread-1) [    ] o.e.j.s.Server jetty-9.4.8.v20171121, build timestamp: 2017-11-21T09:27:37-12:00, git hash: 82b8fb23f757335bb3329d540ce37a2a2615f0a8
   [junit4]   2> 50365 INFO  (jetty-launcher-202-thread-2) [    ] o.e.j.s.Server jetty-9.4.8.v20171121, build timestamp: 2017-11-21T09:27:37-12:00, git hash: 82b8fb23f757335bb3329d540ce37a2a2615f0a8
   [junit4]   2> 50373 INFO  (jetty-launcher-202-thread-4) [    ] o.e.j.s.Server jetty-9.4.8.v20171121, build timestamp: 2017-11-21T09:27:37-12:00, git hash: 82b8fb23f757335bb3329d540ce37a2a2615f0a8
   [junit4]   2> 50374 INFO  (jetty-launcher-202-thread-3) [    ] o.e.j.s.Server jetty-9.4.8.v20171121, build timestamp: 2017-11-21T09:27:37-12:00, git hash: 82b8fb23f757335bb3329d540ce37a2a2615f0a8
   [junit4]   2> 50374 INFO  (jetty-launcher-202-thread-5) [    ] o.e.j.s.Server jetty-9.4.8.v20171121, build timestamp: 2017-11-21T09:27:37-12:00, git hash: 82b8fb23f757335bb3329d540ce37a2a2615f0a8
   [junit4]   2> 50441 INFO  (jetty-launcher-202-thread-1) [    ] o.e.j.s.session DefaultSessionIdManager workerName=node0
   [junit4]   2> 50441 INFO  (jetty-launcher-202-thread-1) [    ] o.e.j.s.session No SessionScavenger set, using defaults
   [junit4]   2> 50441 INFO  (jetty-launcher-202-thread-1) [    ] o.e.j.s.session Scavenging every 660000ms
   [junit4]   2> 50475 INFO  (jetty-launcher-202-thread-2) [    ] o.e.j.s.session DefaultSessionIdManager workerName=node0
   [junit4]   2> 50475 INFO  (jetty-launcher-202-thread-2) [    ] o.e.j.s.session No SessionScavenger set, using defaults
   [junit4]   2> 50475 INFO  (jetty-launcher-202-thread-2) [    ] o.e.j.s.session Scavenging every 660000ms
   [junit4]   2> 50475 INFO  (jetty-launcher-202-thread-2) [    ] o.e.j.s.h.ContextHandler Started o.e.j.s.ServletContextHandler@3abf4ba8{/solr,null,AVAILABLE}
   [junit4]   2> 50477 INFO  (jetty-launcher-202-thread-2) [    ] o.e.j.s.AbstractConnector Started ServerConnector@d4083bc{HTTP/1.1,[http/1.1]}{127.0.0.1:44491}
   [junit4]   2> 50477 INFO  (jetty-launcher-202-thread-2) [    ] o.e.j.s.Server Started @50518ms
   [junit4]   2> 50477 INFO  (jetty-launcher-202-thread-2) [    ] o.a.s.c.s.e.JettySolrRunner Jetty properties: {hostContext=/solr, hostPort=44491}
   [junit4]   2> 50477 ERROR (jetty-launcher-202-thread-2) [    ] o.a.s.u.StartupLoggingUtils Missing Java Option solr.log.dir. Logging may be missing or incomplete.
   [junit4]   2> 50478 INFO  (jetty-launcher-202-thread-2) [    ] o.a.s.s.SolrDispatchFilter Using logger factory org.apache.logging.slf4j.Log4jLoggerFactory
   [junit4]   2> 50478 INFO  (jetty-launcher-202-thread-2) [    ] o.a.s.s.SolrDispatchFilter  ___      _       Welcome to Apache Solr? version 8.0.0
   [junit4]   2> 50478 INFO  (jetty-launcher-202-thread-2) [    ] o.a.s.s.SolrDispatchFilter / __| ___| |_ _   Starting in cloud mode on port null
   [junit4]   2> 50478 INFO  (jetty-launcher-202-thread-2) [    ] o.a.s.s.SolrDispatchFilter \__ \/ _ \ | '_|  Install dir: null
   [junit4]   2> 50478 INFO  (jetty-launcher-202-thread-2) [    ] o.a.s.s.SolrDispatchFilter |___/\___/_|_|    Start time: 2018-05-05T05:55:34.577277Z
   [junit4]   2> 50493 INFO  (jetty-launcher-202-thread-1) [    ] o.e.j.s.h.ContextHandler Started o.e.j.s.ServletContextHandler@9611555{/solr,null,AVAILABLE}
   [junit4]   2> 50494 INFO  (jetty-launcher-202-thread-1) [    ] o.e.j.s.AbstractConnector Started ServerConnector@1d78a6b7{HTTP/1.1,[http/1.1]}{127.0.0.1:39907}
   [junit4]   2> 50494 INFO  (jetty-launcher-202-thread-1) [    ] o.e.j.s.Server Started @50535ms
   [junit4]   2> 50494 INFO  (jetty-launcher-202-thread-1) [    ] o.a.s.c.s.e.JettySolrRunner Jetty properties: {hostContext=/solr, hostPort=39907}
   [junit4]   2> 50494 ERROR (jetty-launcher-202-thread-1) [    ] o.a.s.u.StartupLoggingUtils Missing Java Option solr.log.dir. Logging may be missing or incomplete.
   [junit4]   2> 50494 INFO  (jetty-launcher-202-thread-1) [    ] o.a.s.s.SolrDispatchFilter Using logger factory org.apache.logging.slf4j.Log4jLoggerFactory
   [junit4]   2> 50494 INFO  (jetty-launcher-202-thread-1) [    ] o.a.s.s.SolrDispatchFilter  ___      _       Welcome to Apache Solr? version 8.0.0
   [junit4]   2> 50494 INFO  (jetty-launcher-202-thread-1) [    ] o.a.s.s.SolrDispatchFilter / __| ___| |_ _   Starting in cloud mode on port null
   [junit4]   2> 50494 INFO  (jetty-launcher-202-thread-1) [    ] o.a.s.s.SolrDispatchFilter \__ \/ _ \ | '_|  Install dir: null
   [junit4]   2> 50494 INFO  (jetty-launcher-202-thread-1) [    ] o.a.s.s.SolrDispatchFilter |___/\___/_|_|    Start time: 2018-05-05T05:55:34.593810Z
   [junit4]   2> 50581 INFO  (jetty-launcher-202-thread-5) [    ] o.e.j.s.session DefaultSessionIdManager workerName=node0
   [junit4]   2> 50581 INFO  (jetty-launcher-202-thread-5) [    ] o.e.j.s.session No SessionScavenger set, using defaults
   [junit4]   2> 50581 INFO  (jetty-launcher-202-thread-5) [    ] o.e.j.s.session Scavenging every 660000ms
   [junit4]   2> 50601 INFO  (jetty-launcher-202-thread-5) [    ] o.e.j.s.h.ContextHandler Started o.e.j.s.ServletContextHandler@35c2a066{/solr,null,AVAILABLE}
   [junit4]   2> 50601 INFO  (jetty-launcher-202-thread-5) [    ] o.e.j.s.AbstractConnector Started ServerConnector@abed144{HTTP/1.1,[http/1.1]}{127.0.0.1:35957}
   [junit4]   2> 50602 INFO  (jetty-launcher-202-thread-5) [    ] o.e.j.s.Server Started @50643ms
   [junit4]   2> 50602 INFO  (jetty-launcher-202-thread-5) [    ] o.a.s.c.s.e.JettySolrRunner Jetty properties: {hostContext=/solr, hostPort=35957}
   [junit4]   2> 50602 ERROR (jetty-launcher-202-thread-5) [    ] o.a.s.u.StartupLoggingUtils Missing Java Option solr.log.dir. Logging may be missing or incomplete.
   [junit4]   2> 50602 INFO  (jetty-launcher-202-thread-5) [    ] o.a.s.s.SolrDispatchFilter Using logger factory org.apache.logging.slf4j.Log4jLoggerFactory
   [junit4]   2> 50602 INFO  (jetty-launcher-202-thread-5) [    ] o.a.s.s.SolrDispatchFilter  ___      _       Welcome to Apache Solr? version 8.0.0
   [junit4]   2> 50602 INFO  (jetty-launcher-202-thread-5) [    ] o.a.s.s.SolrDispatchFilter / __| ___| |_ _   Starting in cloud mode on port null
   [junit4]   2> 50602 INFO  (jetty-launcher-202-thread-5) [    ] o.a.s.s.SolrDispatchFilter \__ \/ _ \ | '_|  Install dir: null
   [junit4]   2> 50602 INFO  (jetty-launcher-202-thread-5) [    ] o.a.s.s.SolrDispatchFilter |___/\___/_|_|    Start time: 2018-05-05T05:55:34.701810Z
   [junit4]   2> 50673 INFO  (jetty-launcher-202-thread-3) [    ] o.e.j.s.session DefaultSessionIdManager workerName=node0
   [junit4]   2> 50673 INFO  (jetty-launcher-202-thread-3) [    ] o.e.j.s.session No SessionScavenger set, using defaults
   [junit4]   2> 50673 INFO  (jetty-launcher-202-thread-3) [    ] o.e.j.s.session Scavenging every 660000ms
   [junit4]   2> 50681 INFO  (jetty-launcher-202-thread-3) [    ] o.e.j.s.h.ContextHandler Started o.e.j.s.ServletContextHandler@6efd9ef0{/solr,null,AVAILABLE}
   [junit4]   2> 50682 INFO  (jetty-launcher-202-thread-3) [    ] o.e.j.s.AbstractConnector Started ServerConnector@433b82e2{HTTP/1.1,[http/1.1]}{127.0.0.1:33719}
   [junit4]   2> 50682 INFO  (jetty-launcher-202-thread-3) [    ] o.e.j.s.Server Started @50723ms
   [junit4]   2> 50682 INFO  (jetty-launcher-202-thread-3) [    ] o.a.s.c.s.e.JettySolrRunner Jetty properties: {hostContext=/solr, hostPort=33719}
   [junit4]   2> 50682 ERROR (jetty-launcher-202-thread-3) [    ] o.a.s.u.StartupLoggingUtils Missing Java Option solr.log.dir. Logging may be missing or incomplete.
   [junit4]   2> 50683 INFO  (jetty-launcher-202-thread-3) [    ] o.a.s.s.SolrDispatchFilter Using logger factory org.apache.logging.slf4j.Log4jLoggerFactory
   [junit4]   2> 50683 INFO  (jetty-launcher-202-thread-3) [    ] o.a.s.s.SolrDispatchFilter  ___      _       Welcome to Apache Solr? version 8.0.0
   [junit4]   2> 50683 INFO  (jetty-launcher-202-thread-3) [    ] o.a.s.s.SolrDispatchFilter / __| ___| |_ _   Starting in cloud mode on port null
   [junit4]   2> 50683 INFO  (jetty-launcher-202-thread-3) [    ] o.a.s.s.SolrDispatchFilter \__ \/ _ \ | '_|  Install dir: null
   [junit4]   2> 50683 INFO  (jetty-launcher-202-thread-3) [    ] o.a.s.s.SolrDispatchFilter |___/\___/_|_|    Start time: 2018-05-05T05:55:34.782249Z
   [junit4]   2> 50701 INFO  (zkConnectionManagerCallback-209-thread-1) [    ] o.a.s.c.c.ConnectionManager zkClient has connected
   [junit4]   2> 50702 INFO  (jetty-launcher-202-thread-1) [    ] o.a.s.s.SolrDispatchFilter solr.xml found in ZooKeeper. Loading...
   [junit4]   2> 50706 INFO  (zkConnectionManagerCallback-207-thread-1) [    ] o.a.s.c.c.ConnectionManager zkClient has connected
   [junit4]   2> 50707 INFO  (jetty-launcher-202-thread-2) [    ] o.a.s.s.SolrDispatchFilter solr.xml found in ZooKeeper. Loading...
   [junit4]   2> 50716 INFO  (jetty-launcher-202-thread-4) [    ] o.e.j.s.session DefaultSessionIdManager workerName=node0
   [junit4]   2> 50716 INFO  (jetty-launcher-202-thread-4) [    ] o.e.j.s.session No SessionScavenger set, using defaults
   [junit4]   2> 50716 INFO  (jetty-launcher-202-thread-4) [    ] o.e.j.s.session Scavenging every 600000ms
   [junit4]   2> 50734 INFO  (zkConnectionManagerCallback-211-thread-1) [    ] o.a.s.c.c.ConnectionManager zkClient has connected
   [junit4]   2> 50735 INFO  (jetty-launcher-202-thread-5) [    ] o.a.s.s.SolrDispatchFilter solr.xml found in ZooKeeper. Loading...
   [junit4]   2> 50737 INFO  (zkConnectionManagerCallback-213-thread-1) [    ] o.a.s.c.c.ConnectionManager zkClient has connected
   [junit4]   2> 50737 INFO  (jetty-launcher-202-thread-3) [    ] o.a.s.s.SolrDispatchFilter solr.xml found in ZooKeeper. Loading...
   [junit4]   2> 50739 INFO  (jetty-launcher-202-thread-4) [    ] o.e.j.s.h.ContextHandler Started o.e.j.s.ServletContextHandler@2f39344b{/solr,null,AVAILABLE}
   [junit4]   2> 50806 INFO  (jetty-launcher-202-thread-4) [    ] o.e.j.s.AbstractConnector Started ServerConnector@35838d53{HTTP/1.1,[http/1.1]}{127.0.0.1:45355}
   [junit4]   2> 50806 INFO  (jetty-launcher-202-thread-4) [    ] o.e.j.s.Server Started @50847ms
   [junit4]   2> 50806 INFO  (jetty-launcher-202-thread-4) [    ] o.a.s.c.s.e.JettySolrRunner Jetty properties: {hostContext=/solr, hostPort=45355}
   [junit4]   2> 50807 ERROR (jetty-launcher-202-thread-4) [    ] o.a.s.u.StartupLoggingUtils Missing Java Option solr.log.dir. Logging may be missing or incomplete.
   [junit4]   2> 50807 INFO  (jetty-launcher-202-thread-4) [    ] o.a.s.s.SolrDispatchFilter Using logger factory org.apache.logging.slf4j.Log4jLoggerFactory
   [junit4]   2> 50807 INFO  (jetty-launcher-202-thread-4) [    ] o.a.s.s.SolrDispatchFilter  ___      _       Welcome to Apache Solr? version 8.0.0
   [junit4]   2> 50807 INFO  (jetty-launcher-202-thread-4) [    ] o.a.s.s.SolrDispatchFilter / __| ___| |_ _   Starting in cloud mode on port null
   [junit4]   2> 50807 INFO  (jetty-launcher-202-thread-4) [    ] o.a.s.s.SolrDispatchFilter \__ \/ _ \ | '_|  Install dir: null
   [junit4]   2> 50807 INFO  (jetty-launcher-202-thread-4) [    ] o.a.s.s.SolrDispatchFilter |___/\___/_|_|    Start time: 2018-05-05T05:55:34.906896Z
   [junit4]   2> 50833 INFO  (zkConnectionManagerCallback-216-thread-1) [    ] o.a.s.c.c.ConnectionManager zkClient has connected
   [junit4]   2> 50833 INFO  (jetty-launcher-202-thread-4) [    ] o.a.s.s.SolrDispatchFilter solr.xml found in ZooKeeper. Loading...
   [junit4]   2> 50862 INFO  (jetty-launcher-202-thread-2) [    ] o.a.s.c.ZkContainer Zookeeper client=127.0.0.1:44919/solr
   [junit4]   2> 50873 INFO  (jetty-launcher-202-thread-1) [    ] o.a.s.c.ZkContainer Zookeeper client=127.0.0.1:44919/solr
   [junit4]   2> 50893 INFO  (zkConnectionManagerCallback-224-thread-1) [    ] o.a.s.c.c.ConnectionManager zkClient has connected
   [junit4]   2> 50937 INFO  (jetty-launcher-202-thread-5) [    ] o.a.s.c.ZkContainer Zookeeper client=127.0.0.1:44919/solr
   [junit4]   2> 50969 INFO  (jetty-launcher-202-thread-3) [    ] o.a.s.c.ZkContainer Zookeeper client=127.0.0.1:44919/solr
   [junit4]   2> 50978 INFO  (zkConnectionManagerCallback-229-thread-1) [    ] o.a.s.c.c.ConnectionManager zkClient has connected
   [junit4]   2> 50981 INFO  (zkConnectionManagerCallback-221-thread-1) [    ] o.a.s.c.c.ConnectionManager zkClient has connected
   [junit4]   2> 51012 INFO  (zkConnectionManagerCallback-226-thread-1) [    ] o.a.s.c.c.ConnectionManager zkClient has connected
   [junit4]   2> 51124 INFO  (jetty-launcher-202-thread-4) [    ] o.a.s.c.ZkContainer Zookeeper client=127.0.0.1:44919/solr
   [junit4]   2> 51131 INFO  (jetty-launcher-202-thread-1) [n:127.0.0.1:39907_solr    ] o.a.s.c.Overseer Overseer (id=null) closing
   [junit4]   2> 51132 INFO  (jetty-launcher-202-thread-1) [n:127.0.0.1:39907_solr    ] o.a.s.c.OverseerElectionContext I am going to be the leader 127.0.0.1:39907_solr
   [junit4]   2> 51133 INFO  (jetty-launcher-202-thread-1) [n:127.0.0.1:39907_solr    ] o.a.s.c.Overseer Overseer (id=72107776740229129-127.0.0.1:39907_solr-n_0000000000) starting
   [junit4]   2> 51155 INFO  (zkConnectionManagerCallback-233-thread-1) [    ] o.a.s.c.c.ConnectionManager zkClient has connected
   [junit4]   2> 51215 INFO  (zkConnectionManagerCallback-241-thread-1) [    ] o.a.s.c.c.ConnectionManager zkClient has connected
   [junit4]   2> 51273 INFO  (zkConnectionManagerCallback-235-thread-1) [    ] o.a.s.c.c.ConnectionManager zkClient has connected
   [junit4]   2> 51281 INFO  (jetty-launcher-202-thread-5) [n:127.0.0.1:35957_solr    ] o.a.s.c.Overseer Overseer (id=null) closing
   [junit4]   2> 51285 INFO  (jetty-launcher-202-thread-5) [n:127.0.0.1:35957_solr    ] o.a.s.c.ZkController Register node as live in ZooKeeper:/live_nodes/127.0.0.1:35957_solr
   [junit4]   2> 51333 INFO  (zkCallback-234-thread-1) [    ] o.a.s.c.c.ZkStateReader Updated live nodes from ZooKeeper... (0) -> (1)
   [junit4]   2> 51333 INFO  (zkConnectionManagerCallback-250-thread-1) [    ] o.a.s.c.c.ConnectionManager zkClient has connected
   [junit4]   2> 51335 INFO  (zkConnectionManagerCallback-243-thread-1) [    ] o.a.s.c.c.ConnectionManager zkClient has connected
   [junit4]   2> 51338 INFO  (jetty-launcher-202-thread-1) [n:127.0.0.1:39907_solr    ] o.a.s.c.c.ZkStateReader Updated live nodes from ZooKeeper... (0) -> (1)
   [junit4]   2> 51340 INFO  (jetty-launcher-202-thread-1) [n:127.0.0.1:39907_solr    ] o.a.s.c.s.i.ZkClientClusterStateProvider Cluster at 127.0.0.1:44919/solr ready
   [junit4]   2> 51355 DEBUG (OverseerAutoScalingTriggerThread-72107776740229129-127.0.0.1:39907_solr-n_0000000000) [    ] o.a.s.c.a.OverseerTriggerThread Adding .auto_add_replicas and .scheduled_maintenance triggers
   [junit4]   2> 51361 INFO  (zkConnectionManagerCallback-254-thread-1) [    ] o.a.s.c.c.ConnectionManager zkClient has connected
   [junit4]   2> 51361 DEBUG (OverseerAutoScalingTriggerThread-72107776740229129-127.0.0.1:39907_solr-n_0000000000) [    ] o.a.s.c.a.OverseerTriggerThread Refreshing /autoscaling.json with znode version 1
   [junit4]   2> 51362 DEBUG (OverseerAutoScalingTriggerThread-72107776740229129-127.0.0.1:39907_solr-n_0000000000) [    ] o.a.s.c.a.OverseerTriggerThread Current znodeVersion 1, lastZnodeVersion -1
   [junit4]   2> 51362 DEBUG (OverseerAutoScalingTriggerThread-72107776740229129-127.0.0.1:39907_solr-n_0000000000) [    ] o.a.s.c.a.OverseerTriggerThread Processed trigger updates upto znodeVersion 1
   [junit4]   2> 51367 INFO  (jetty-launcher-202-thread-1) [n:127.0.0.1:39907_solr    ] o.a.s.c.TransientSolrCoreCacheDefault Allocating transient cache for 2147483647 transient cores
   [junit4]   2> 51367 INFO  (jetty-launcher-202-thread-1) [n:127.0.0.1:39907_solr    ] o.a.s.c.ZkController Register node as live in ZooKeeper:/live_nodes/127.0.0.1:39907_solr
   [junit4]   2> 51369 INFO  (zkConnectionManagerCallback-245-thread-1) [    ] o.a.s.c.c.ConnectionManager zkClient has connected
   [junit4]   2> 51377 INFO  (zkCallback-225-thread-1) [    ] o.a.s.c.c.ZkStateReader Updated live nodes from ZooKeeper... (0) -> (1)
   [junit4]   2> 51385 INFO  (zkCallback-234-thread-1) [    ] o.a.s.c.c.ZkStateReader Updated live nodes from ZooKeeper... (1) -> (2)
   [junit4]   2> 51386 INFO  (jetty-launcher-202-thread-4) [n:127.0.0.1:45355_solr    ] o.a.s.c.c.ZkStateReader Updated live nodes from ZooKeeper... (0) -> (2)
   [junit4]   2> 51387 INFO  (OverseerStateUpdate-72107776740229129-127.0.0.1:39907_solr-n_0000000000) [    ] o.a.s.c.c.ZkStateReader Updated live nodes from ZooKeeper... (1) -> (2)
   [junit4]   2> 51403 INFO  (jetty-launcher-202-thread-4) [n:127.0.0.1:45355_solr    ] o.a.s.c.Overseer Overseer (id=null) closing
   [junit4]   2> 51433 DEBUG (OverseerAutoScalingTriggerThread-72107776740229129-127.0.0.1:39907_solr-n_0000000000) [    ] o.a.s.c.a.NodeLostTrigger NodeLostTrigger .auto_add_replicas - Initial livenodes: [127.0.0.1:35957_solr]
   [junit4]   2> 51433 INFO  (jetty-launcher-202-thread-4) [n:127.0.0.1:45355_solr    ] o.a.s.c.TransientSolrCoreCacheDefault Allocating transient cache for 2147483647 transient cores
   [junit4]   2> 51434 INFO  (jetty-launcher-202-thread-4) [n:127.0.0.1:45355_solr    ] o.a.s.c.ZkController Register node as live in ZooKeeper:/live_nodes/127.0.0.1:45355_solr
   [junit4]   2> 51437 DEBUG (OverseerAutoScalingTriggerThread-72107776740229129-127.0.0.1:39907_solr-n_0000000000) [    ] o.a.s.c.a.OverseerTriggerThread -- clean old nodeAdded markers
   [junit4]   2> 51445 DEBUG (OverseerAutoScalingTriggerThread-72107776740229129-127.0.0.1:39907_solr-n_0000000000) [    ] o.a.s.c.a.OverseerTriggerThread Current znodeVersion 1, lastZnodeVersion 1
   [junit4]   2> 51453 INFO  (zkCallback-234-thread-1) [    ] o.a.s.c.c.ZkStateReader Updated live nodes from ZooKeeper... (2) -> (3)
   [junit4]   2> 51453 INFO  (zkCallback-225-thread-2) [    ] o.a.s.c.c.ZkStateReader Updated live nodes from ZooKeeper... (2) -> (3)
   [junit4]   2> 51453 INFO  (jetty-launcher-202-thread-2) [n:127.0.0.1:44491_solr    ] o.a.s.c.c.ZkStateReader Updated live nodes from ZooKeeper... (0) -> (3)
   [junit4]   2> 51461 INFO  (jetty-launcher-202-thread-2) [n:127.0.0.1:44491_solr    ] o.a.s.c.Overseer Overseer (id=null) closing
   [junit4]   2> 51462 INFO  (jetty-launcher-202-thread-3) [n:127.0.0.1:33719_solr    ] o.a.s.c.c.ZkStateReader Updated live nodes from ZooKeeper... (0) -> (3)
   [junit4]   2> 51474 DEBUG (ScheduledTrigger-211-thread-2) [    ] o.a.s.c.a.NodeLostTrigger Running NodeLostTrigger: .auto_add_replicas with currently live nodes: 1
   [junit4]   2> 51480 INFO  (jetty-launcher-202-thread-2) [n:127.0.0.1:44491_solr    ] o.a.s.c.TransientSolrCoreCacheDefault Allocating transient cache for 2147483647 transient cores
   [junit4]   2> 51480 INFO  (jetty-launcher-202-thread-2) [n:127.0.0.1:44491_solr    ] o.a.s.c.ZkController Register node as live in ZooKeeper:/live_nodes/127.0.0.1:44491_solr
   [junit4]   2> 51480 INFO  (jetty-launcher-202-thread-3) [n:127.0.0.1:33719_solr    ] o.a.s.c.Overseer Overseer (id=null) closing
   [junit4]   2> 51482 INFO  (zkCallback-234-thread-1) [    ] o.a.s.c.c.ZkStateReader Updated live nodes from ZooKeeper... (3) -> (4)
   [junit4]   2> 51485 INFO  (zkCallback-225-thread-2) [    ] o.a.s.c.c.ZkStateReader Updated live nodes from ZooKeeper... (3) -> (4)
   [junit4]   2> 51500 INFO  (jetty-launcher-202-thread-5) [n:127.0.0.1:35957_solr    ] o.a.s.m.r.SolrJmxReporter JMX monitoring for 'solr_35957.solr.node' (registry 'solr.node') enabled at server: com.sun.jmx.mbeanserver.JmxMBeanServer@3913bdd0
   [junit4]   2> 51523 INFO  (zkCallback-249-thread-1) [    ] o.a.s.c.c.ZkStateReader Updated live nodes from ZooKeeper... (1) -> (3)
   [junit4]   2> 51523 INFO  (zkCallback-253-thread-1) [    ] o.a.s.c.c.ZkStateReader Updated live nodes from ZooKeeper... (2) -> (4)
   [junit4]   2> 51544 INFO  (jetty-launcher-202-thread-5) [n:127.0.0.1:35957_solr    ] o.a.s.m.r.SolrJmxReporter JMX monitoring for 'solr_35957.solr.jvm' (registry 'solr.jvm') enabled at server: com.sun.jmx.mbeanserver.JmxMBeanServer@3913bdd0
   [junit4]   2> 51544 INFO  (jetty-launcher-202-thread-5) [n:127.0.0.1:35957_solr    ] o.a.s.m.r.SolrJmx

[...truncated too long message...]

porter [org.apache.solr.metrics.reporters.SolrJmxReporter@4368d633: rootName = solr_44767, domain = solr.jvm, service url = null, agent id = null] for registry solr.jvm / com.codahale.metrics.MetricRegistry@1a717365
   [junit4]   2> 192290 INFO  (jetty-closer-142-thread-1) [    ] o.a.s.m.SolrMetricManager Closing metric reporters for registry=solr.jetty, tag=null
   [junit4]   2> 192290 INFO  (jetty-closer-142-thread-1) [    ] o.a.s.m.r.SolrJmxReporter Closing reporter [org.apache.solr.metrics.reporters.SolrJmxReporter@1419ad8c: rootName = solr_43945, domain = solr.jetty, service url = null, agent id = null] for registry solr.jetty / com.codahale.metrics.MetricRegistry@3288a125
   [junit4]   2> 192290 INFO  (jetty-closer-142-thread-2) [    ] o.a.s.m.SolrMetricManager Closing metric reporters for registry=solr.jetty, tag=null
   [junit4]   2> 192290 INFO  (jetty-closer-142-thread-2) [    ] o.a.s.m.r.SolrJmxReporter Closing reporter [org.apache.solr.metrics.reporters.SolrJmxReporter@145fd30c: rootName = solr_44767, domain = solr.jetty, service url = null, agent id = null] for registry solr.jetty / com.codahale.metrics.MetricRegistry@3288a125
   [junit4]   2> 192291 INFO  (jetty-closer-142-thread-1) [    ] o.a.s.c.ZkController Remove node as live in ZooKeeper:/live_nodes/127.0.0.1:43945_solr
   [junit4]   2> 192291 INFO  (jetty-closer-142-thread-2) [    ] o.a.s.c.ZkController Remove node as live in ZooKeeper:/live_nodes/127.0.0.1:44767_solr
   [junit4]   2> 192292 INFO  (jetty-closer-142-thread-2) [    ] o.a.s.m.SolrMetricManager Closing metric reporters for registry=solr.cluster, tag=null
   [junit4]   2> 192292 INFO  (jetty-closer-142-thread-2) [    ] o.a.s.c.TransientSolrCoreCacheDefault Allocating transient cache for 2147483647 transient cores
   [junit4]   2> 192292 INFO  (zkCallback-159-thread-1) [    ] o.a.s.c.c.ZkStateReader Updated live nodes from ZooKeeper... (2) -> (0)
   [junit4]   2> 192292 INFO  (jetty-closer-142-thread-1) [    ] o.a.s.m.SolrMetricManager Closing metric reporters for registry=solr.cluster, tag=null
   [junit4]   2> 192292 INFO  (zkCallback-157-thread-1) [    ] o.a.s.c.c.ZkStateReader Updated live nodes from ZooKeeper... (2) -> (0)
   [junit4]   2> 192294 INFO  (jetty-closer-142-thread-1) [    ] o.a.s.c.Overseer Overseer (id=72107952895754245-127.0.0.1:43945_solr-n_0000000000) closing
   [junit4]   2> 192294 INFO  (zkCallback-173-thread-1) [    ] o.a.s.c.c.ZkStateReader Updated live nodes from ZooKeeper... (2) -> (0)
   [junit4]   2> 192294 INFO  (OverseerStateUpdate-72107952895754245-127.0.0.1:43945_solr-n_0000000000) [    ] o.a.s.c.Overseer Overseer Loop exiting : 127.0.0.1:43945_solr
   [junit4]   2> 192294 INFO  (zkCallback-168-thread-1) [    ] o.a.s.c.c.ZkStateReader Updated live nodes from ZooKeeper... (2) -> (0)
   [junit4]   2> 192295 WARN  (OverseerAutoScalingTriggerThread-72107952895754245-127.0.0.1:43945_solr-n_0000000000) [    ] o.a.s.c.a.OverseerTriggerThread OverseerTriggerThread woken up but we are closed, exiting.
   [junit4]   2> 192295 DEBUG (jetty-closer-142-thread-1) [    ] o.a.s.c.a.ScheduledTriggers Shutting down scheduled thread pool executor now
   [junit4]   2> 192295 DEBUG (jetty-closer-142-thread-1) [    ] o.a.s.c.a.ScheduledTriggers Shutting down action executor now
   [junit4]   2> 192295 DEBUG (jetty-closer-142-thread-1) [    ] o.a.s.c.a.ScheduledTriggers Awaiting termination for action executor
   [junit4]   2> 192295 DEBUG (jetty-closer-142-thread-1) [    ] o.a.s.c.a.ScheduledTriggers Awaiting termination for scheduled thread pool executor
   [junit4]   2> 192295 DEBUG (jetty-closer-142-thread-1) [    ] o.a.s.c.a.ScheduledTriggers ScheduledTriggers closed completely
   [junit4]   2> 192296 DEBUG (jetty-closer-142-thread-1) [    ] o.a.s.c.a.OverseerTriggerThread OverseerTriggerThread has been closed explicitly
   [junit4]   2> 192296 WARN  (NIOServerCxn.Factory:0.0.0.0/0.0.0.0:0) [    ] o.a.z.s.NIOServerCnxn Unable to read additional data from client sessionid 0x1002dcd15d50007, likely client has closed socket
   [junit4]   2> 192297 INFO  (jetty-closer-142-thread-2) [    ] o.e.j.s.h.ContextHandler Stopped o.e.j.s.ServletContextHandler@687014d6{/solr,null,UNAVAILABLE}
   [junit4]   2> 192297 INFO  (jetty-closer-142-thread-2) [    ] o.e.j.s.session Stopped scavenging
   [junit4]   2> 192298 INFO  (jetty-closer-142-thread-1) [    ] o.e.j.s.h.ContextHandler Stopped o.e.j.s.ServletContextHandler@5e3cb7a8{/solr,null,UNAVAILABLE}
   [junit4]   2> 192298 INFO  (jetty-closer-142-thread-1) [    ] o.e.j.s.session Stopped scavenging
   [junit4]   2> 192298 ERROR (SUITE-IndexSizeTriggerTest-seed#[69C528660A3DC88A]-worker) [    ] o.a.z.s.ZooKeeperServer ZKShutdownHandler is not registered, so ZooKeeper server won't take any action on ERROR or SHUTDOWN server state changes
   [junit4]   2> 192298 INFO  (SUITE-IndexSizeTriggerTest-seed#[69C528660A3DC88A]-worker) [    ] o.a.s.c.ZkTestServer connecting to 127.0.0.1:44025 44025
   [junit4]   2> 193186 INFO  (Thread-86) [    ] o.a.s.c.ZkTestServer connecting to 127.0.0.1:44025 44025
   [junit4]   2> 193187 WARN  (Thread-86) [    ] o.a.s.c.ZkTestServer Watch limit violations: 
   [junit4]   2> Maximum concurrent create/delete watches above limit:
   [junit4]   2> 
   [junit4]   2> 	5	/solr/aliases.json
   [junit4]   2> 	2	/solr/security.json
   [junit4]   2> 
   [junit4]   2> Maximum concurrent data watches above limit:
   [junit4]   2> 
   [junit4]   2> 	5	/solr/clusterstate.json
   [junit4]   2> 	5	/solr/clusterprops.json
   [junit4]   2> 
   [junit4]   2> Maximum concurrent children watches above limit:
   [junit4]   2> 
   [junit4]   2> 	5	/solr/live_nodes
   [junit4]   2> 	5	/solr/collections
   [junit4]   2> 
   [junit4]   2> NOTE: leaving temporary files on disk at: /home/jenkins/workspace/Lucene-Solr-master-Linux/solr/build/solr-core/test/J2/temp/solr.cloud.autoscaling.IndexSizeTriggerTest_69C528660A3DC88A-002
   [junit4]   2> NOTE: test params are: codec=Asserting(Lucene70): {}, docValues:{}, maxPointsInLeafNode=1510, maxMBSortInHeap=6.152816501701442, sim=Asserting(org.apache.lucene.search.similarities.AssertingSimilarity@35a3f38), locale=sw, timezone=Etc/Greenwich
   [junit4]   2> NOTE: Linux 4.13.0-39-generic amd64/Oracle Corporation 9.0.4 (64-bit)/cpus=8,threads=1,free=363309600,total=518979584
   [junit4]   2> NOTE: All tests run in this JVM: [IndexSizeTriggerTest, SearchRateTriggerIntegrationTest, IndexSizeTriggerTest]
   [junit4] Completed [5/10 (2!)] on J2 in 4.07s, 4 tests, 1 failure <<< FAILURES!

[...truncated 23 lines...]
   [junit4] JVM J2: stderr was not empty, see: /home/jenkins/workspace/Lucene-Solr-master-Linux/solr/build/solr-core/test/temp/junit4-J2-20180505_063712_68013547561475884281153.syserr
   [junit4] >>> JVM J2 emitted unexpected output (verbatim) ----
   [junit4] Java HotSpot(TM) 64-Bit Server VM warning: Option UseConcMarkSweepGC was deprecated in version 9.0 and will likely be removed in a future release.
   [junit4] <<< JVM J2: EOF ----

[...truncated 9 lines...]
   [junit4] JVM J1: stderr was not empty, see: /home/jenkins/workspace/Lucene-Solr-master-Linux/solr/build/solr-core/test/temp/junit4-J1-20180505_063712_67710821019266457212114.syserr
   [junit4] >>> JVM J1 emitted unexpected output (verbatim) ----
   [junit4] Java HotSpot(TM) 64-Bit Server VM warning: Option UseConcMarkSweepGC was deprecated in version 9.0 and will likely be removed in a future release.
   [junit4] <<< JVM J1: EOF ----

[...truncated 6 lines...]
   [junit4] JVM J0: stderr was not empty, see: /home/jenkins/workspace/Lucene-Solr-master-Linux/solr/build/solr-core/test/temp/junit4-J0-20180505_063712_67518188160924857242245.syserr
   [junit4] >>> JVM J0 emitted unexpected output (verbatim) ----
   [junit4] Java HotSpot(TM) 64-Bit Server VM warning: Option UseConcMarkSweepGC was deprecated in version 9.0 and will likely be removed in a future release.
   [junit4] <<< JVM J0: EOF ----

[...truncated 11 lines...]
BUILD FAILED
/home/jenkins/workspace/Lucene-Solr-master-Linux/lucene/common-build.xml:1568: The following error occurred while executing this line:
/home/jenkins/workspace/Lucene-Solr-master-Linux/lucene/common-build.xml:1092: There were test failures: 10 suites, 35 tests, 1 error, 1 failure [seed: 69C528660A3DC88A]

Total time: 6 minutes 5 seconds

[repro] Setting last failure code to 256

[repro] Failures:
[repro]   0/5 failed: org.apache.solr.cloud.autoscaling.SearchRateTriggerIntegrationTest
[repro]   2/5 failed: org.apache.solr.cloud.autoscaling.IndexSizeTriggerTest
[repro] Exiting with code 256
+ mv lucene/build lucene/build.repro
+ mv solr/build solr/build.repro
+ mv lucene/build.orig lucene/build
+ mv solr/build.orig solr/build
Archiving artifacts
Setting ANT_1_8_2_HOME=/var/lib/jenkins/tools/hudson.tasks.Ant_AntInstallation/ANT_1.8.2
[WARNINGS] Parsing warnings in console log with parser Java Compiler (javac)
Setting ANT_1_8_2_HOME=/var/lib/jenkins/tools/hudson.tasks.Ant_AntInstallation/ANT_1.8.2
Setting ANT_1_8_2_HOME=/var/lib/jenkins/tools/hudson.tasks.Ant_AntInstallation/ANT_1.8.2
<Git Blamer> Using GitBlamer to create author and commit information for all warnings.
<Git Blamer> GIT_COMMIT=89fc02a3b04aedf2803a46782b3a8b8e9b5c9a7b, workspace=/var/lib/jenkins/workspace/Lucene-Solr-master-Linux
[WARNINGS] Computing warning deltas based on reference build #21958
Recording test results
Setting ANT_1_8_2_HOME=/var/lib/jenkins/tools/hudson.tasks.Ant_AntInstallation/ANT_1.8.2
Build step 'Publish JUnit test result report' changed build result to UNSTABLE
Email was triggered for: Unstable (Test Failures)
Sending email for trigger: Unstable (Test Failures)
Setting ANT_1_8_2_HOME=/var/lib/jenkins/tools/hudson.tasks.Ant_AntInstallation/ANT_1.8.2
Setting ANT_1_8_2_HOME=/var/lib/jenkins/tools/hudson.tasks.Ant_AntInstallation/ANT_1.8.2
Setting ANT_1_8_2_HOME=/var/lib/jenkins/tools/hudson.tasks.Ant_AntInstallation/ANT_1.8.2
Setting ANT_1_8_2_HOME=/var/lib/jenkins/tools/hudson.tasks.Ant_AntInstallation/ANT_1.8.2

Mime
View raw message