lucene-dev mailing list archives

Site index · List index
Message view « Date » · « Thread »
Top « Date » · « Thread »
From Policeman Jenkins Server <jenk...@thetaphi.de>
Subject [JENKINS] Lucene-Solr-7.x-Windows (32bit/jdk1.8.0_172) - Build # 613 - Still Unstable!
Date Fri, 25 May 2018 13:31:22 GMT
Build: https://jenkins.thetaphi.de/job/Lucene-Solr-7.x-Windows/613/
Java: 32bit/jdk1.8.0_172 -server -XX:+UseSerialGC

11 tests failed.
FAILED:  org.apache.solr.cloud.autoscaling.IndexSizeTriggerTest.testSplitIntegration

Error Message:
last state: DocCollection(testSplitIntegration_collection//clusterstate.json/52)={   "replicationFactor":"2",   "pullReplicas":"0",   "router":{"name":"compositeId"},   "maxShardsPerNode":"2",   "autoAddReplicas":"false",   "nrtReplicas":"2",   "tlogReplicas":"0",   "autoCreated":"true",   "shards":{     "shard2":{       "replicas":{         "core_node3":{           "core":"testSplitIntegration_collection_shard2_replica_n3",           "leader":"true",           "SEARCHER.searcher.maxDoc":11,           "SEARCHER.searcher.deletedDocs":0,           "INDEX.sizeInBytes":1,           "node_name":"127.0.0.1:10000_solr",           "state":"active",           "type":"NRT",           "SEARCHER.searcher.numDocs":11},         "core_node4":{           "core":"testSplitIntegration_collection_shard2_replica_n4",           "SEARCHER.searcher.maxDoc":11,           "SEARCHER.searcher.deletedDocs":0,           "INDEX.sizeInBytes":1,           "node_name":"127.0.0.1:10001_solr",           "state":"active",           "type":"NRT",           "SEARCHER.searcher.numDocs":11}},       "range":"0-7fffffff",       "state":"active"},     "shard1":{       "stateTimestamp":"1527255060543980000",       "replicas":{         "core_node1":{           "core":"testSplitIntegration_collection_shard1_replica_n1",           "leader":"true",           "SEARCHER.searcher.maxDoc":14,           "SEARCHER.searcher.deletedDocs":0,           "INDEX.sizeInBytes":1,           "node_name":"127.0.0.1:10000_solr",           "state":"active",           "type":"NRT",           "SEARCHER.searcher.numDocs":14},         "core_node2":{           "core":"testSplitIntegration_collection_shard1_replica_n2",           "SEARCHER.searcher.maxDoc":14,           "SEARCHER.searcher.deletedDocs":0,           "INDEX.sizeInBytes":1,           "node_name":"127.0.0.1:10001_solr",           "state":"active",           "type":"NRT",           "SEARCHER.searcher.numDocs":14}},       "range":"80000000-ffffffff",       "state":"inactive"},     "shard1_1":{       "parent":"shard1",       "stateTimestamp":"1527255060558100000",       "range":"c0000000-ffffffff",       "state":"active",       "replicas":{         "core_node10":{           "leader":"true",           "core":"testSplitIntegration_collection_shard1_1_replica1",           "SEARCHER.searcher.maxDoc":7,           "SEARCHER.searcher.deletedDocs":0,           "INDEX.sizeInBytes":1,           "node_name":"127.0.0.1:10000_solr",           "base_url":"http://127.0.0.1:10000/solr",           "state":"active",           "type":"NRT",           "SEARCHER.searcher.numDocs":7},         "core_node9":{           "core":"testSplitIntegration_collection_shard1_1_replica0",           "SEARCHER.searcher.maxDoc":7,           "SEARCHER.searcher.deletedDocs":0,           "INDEX.sizeInBytes":1,           "node_name":"127.0.0.1:10001_solr",           "base_url":"http://127.0.0.1:10001/solr",           "state":"active",           "type":"NRT",           "SEARCHER.searcher.numDocs":7}}},     "shard1_0":{       "parent":"shard1",       "stateTimestamp":"1527255060557870000",       "range":"80000000-bfffffff",       "state":"active",       "replicas":{         "core_node7":{           "leader":"true",           "core":"testSplitIntegration_collection_shard1_0_replica0",           "SEARCHER.searcher.maxDoc":7,           "SEARCHER.searcher.deletedDocs":0,           "INDEX.sizeInBytes":1,           "node_name":"127.0.0.1:10001_solr",           "base_url":"http://127.0.0.1:10001/solr",           "state":"active",           "type":"NRT",           "SEARCHER.searcher.numDocs":7},         "core_node8":{           "core":"testSplitIntegration_collection_shard1_0_replica1",           "SEARCHER.searcher.maxDoc":7,           "SEARCHER.searcher.deletedDocs":0,           "INDEX.sizeInBytes":1,           "node_name":"127.0.0.1:10000_solr",           "base_url":"http://127.0.0.1:10000/solr",           "state":"active",           "type":"NRT",           "SEARCHER.searcher.numDocs":7}}}}}

Stack Trace:
java.util.concurrent.TimeoutException: last state: DocCollection(testSplitIntegration_collection//clusterstate.json/52)={
  "replicationFactor":"2",
  "pullReplicas":"0",
  "router":{"name":"compositeId"},
  "maxShardsPerNode":"2",
  "autoAddReplicas":"false",
  "nrtReplicas":"2",
  "tlogReplicas":"0",
  "autoCreated":"true",
  "shards":{
    "shard2":{
      "replicas":{
        "core_node3":{
          "core":"testSplitIntegration_collection_shard2_replica_n3",
          "leader":"true",
          "SEARCHER.searcher.maxDoc":11,
          "SEARCHER.searcher.deletedDocs":0,
          "INDEX.sizeInBytes":1,
          "node_name":"127.0.0.1:10000_solr",
          "state":"active",
          "type":"NRT",
          "SEARCHER.searcher.numDocs":11},
        "core_node4":{
          "core":"testSplitIntegration_collection_shard2_replica_n4",
          "SEARCHER.searcher.maxDoc":11,
          "SEARCHER.searcher.deletedDocs":0,
          "INDEX.sizeInBytes":1,
          "node_name":"127.0.0.1:10001_solr",
          "state":"active",
          "type":"NRT",
          "SEARCHER.searcher.numDocs":11}},
      "range":"0-7fffffff",
      "state":"active"},
    "shard1":{
      "stateTimestamp":"1527255060543980000",
      "replicas":{
        "core_node1":{
          "core":"testSplitIntegration_collection_shard1_replica_n1",
          "leader":"true",
          "SEARCHER.searcher.maxDoc":14,
          "SEARCHER.searcher.deletedDocs":0,
          "INDEX.sizeInBytes":1,
          "node_name":"127.0.0.1:10000_solr",
          "state":"active",
          "type":"NRT",
          "SEARCHER.searcher.numDocs":14},
        "core_node2":{
          "core":"testSplitIntegration_collection_shard1_replica_n2",
          "SEARCHER.searcher.maxDoc":14,
          "SEARCHER.searcher.deletedDocs":0,
          "INDEX.sizeInBytes":1,
          "node_name":"127.0.0.1:10001_solr",
          "state":"active",
          "type":"NRT",
          "SEARCHER.searcher.numDocs":14}},
      "range":"80000000-ffffffff",
      "state":"inactive"},
    "shard1_1":{
      "parent":"shard1",
      "stateTimestamp":"1527255060558100000",
      "range":"c0000000-ffffffff",
      "state":"active",
      "replicas":{
        "core_node10":{
          "leader":"true",
          "core":"testSplitIntegration_collection_shard1_1_replica1",
          "SEARCHER.searcher.maxDoc":7,
          "SEARCHER.searcher.deletedDocs":0,
          "INDEX.sizeInBytes":1,
          "node_name":"127.0.0.1:10000_solr",
          "base_url":"http://127.0.0.1:10000/solr",
          "state":"active",
          "type":"NRT",
          "SEARCHER.searcher.numDocs":7},
        "core_node9":{
          "core":"testSplitIntegration_collection_shard1_1_replica0",
          "SEARCHER.searcher.maxDoc":7,
          "SEARCHER.searcher.deletedDocs":0,
          "INDEX.sizeInBytes":1,
          "node_name":"127.0.0.1:10001_solr",
          "base_url":"http://127.0.0.1:10001/solr",
          "state":"active",
          "type":"NRT",
          "SEARCHER.searcher.numDocs":7}}},
    "shard1_0":{
      "parent":"shard1",
      "stateTimestamp":"1527255060557870000",
      "range":"80000000-bfffffff",
      "state":"active",
      "replicas":{
        "core_node7":{
          "leader":"true",
          "core":"testSplitIntegration_collection_shard1_0_replica0",
          "SEARCHER.searcher.maxDoc":7,
          "SEARCHER.searcher.deletedDocs":0,
          "INDEX.sizeInBytes":1,
          "node_name":"127.0.0.1:10001_solr",
          "base_url":"http://127.0.0.1:10001/solr",
          "state":"active",
          "type":"NRT",
          "SEARCHER.searcher.numDocs":7},
        "core_node8":{
          "core":"testSplitIntegration_collection_shard1_0_replica1",
          "SEARCHER.searcher.maxDoc":7,
          "SEARCHER.searcher.deletedDocs":0,
          "INDEX.sizeInBytes":1,
          "node_name":"127.0.0.1:10000_solr",
          "base_url":"http://127.0.0.1:10000/solr",
          "state":"active",
          "type":"NRT",
          "SEARCHER.searcher.numDocs":7}}}}}
	at __randomizedtesting.SeedInfo.seed([229427976398B7AA:1B1A9ED74C677E54]:0)
	at org.apache.solr.cloud.CloudTestUtils.waitForState(CloudTestUtils.java:111)
	at org.apache.solr.cloud.autoscaling.IndexSizeTriggerTest.testSplitIntegration(IndexSizeTriggerTest.java:299)
	at sun.reflect.NativeMethodAccessorImpl.invoke0(Native Method)
	at sun.reflect.NativeMethodAccessorImpl.invoke(NativeMethodAccessorImpl.java:62)
	at sun.reflect.DelegatingMethodAccessorImpl.invoke(DelegatingMethodAccessorImpl.java:43)
	at java.lang.reflect.Method.invoke(Method.java:498)
	at com.carrotsearch.randomizedtesting.RandomizedRunner.invoke(RandomizedRunner.java:1737)
	at com.carrotsearch.randomizedtesting.RandomizedRunner$8.evaluate(RandomizedRunner.java:934)
	at com.carrotsearch.randomizedtesting.RandomizedRunner$9.evaluate(RandomizedRunner.java:970)
	at com.carrotsearch.randomizedtesting.RandomizedRunner$10.evaluate(RandomizedRunner.java:984)
	at com.carrotsearch.randomizedtesting.rules.SystemPropertiesRestoreRule$1.evaluate(SystemPropertiesRestoreRule.java:57)
	at org.apache.lucene.util.TestRuleSetupTeardownChained$1.evaluate(TestRuleSetupTeardownChained.java:49)
	at org.apache.lucene.util.AbstractBeforeAfterRule$1.evaluate(AbstractBeforeAfterRule.java:45)
	at org.apache.lucene.util.TestRuleThreadAndTestName$1.evaluate(TestRuleThreadAndTestName.java:48)
	at org.apache.lucene.util.TestRuleIgnoreAfterMaxFailures$1.evaluate(TestRuleIgnoreAfterMaxFailures.java:64)
	at org.apache.lucene.util.TestRuleMarkFailure$1.evaluate(TestRuleMarkFailure.java:47)
	at com.carrotsearch.randomizedtesting.rules.StatementAdapter.evaluate(StatementAdapter.java:36)
	at com.carrotsearch.randomizedtesting.ThreadLeakControl$StatementRunner.run(ThreadLeakControl.java:368)
	at com.carrotsearch.randomizedtesting.ThreadLeakControl.forkTimeoutingTask(ThreadLeakControl.java:817)
	at com.carrotsearch.randomizedtesting.ThreadLeakControl$3.evaluate(ThreadLeakControl.java:468)
	at com.carrotsearch.randomizedtesting.RandomizedRunner.runSingleTest(RandomizedRunner.java:943)
	at com.carrotsearch.randomizedtesting.RandomizedRunner$5.evaluate(RandomizedRunner.java:829)
	at com.carrotsearch.randomizedtesting.RandomizedRunner$6.evaluate(RandomizedRunner.java:879)
	at com.carrotsearch.randomizedtesting.RandomizedRunner$7.evaluate(RandomizedRunner.java:890)
	at com.carrotsearch.randomizedtesting.rules.StatementAdapter.evaluate(StatementAdapter.java:36)
	at com.carrotsearch.randomizedtesting.rules.SystemPropertiesRestoreRule$1.evaluate(SystemPropertiesRestoreRule.java:57)
	at org.apache.lucene.util.AbstractBeforeAfterRule$1.evaluate(AbstractBeforeAfterRule.java:45)
	at com.carrotsearch.randomizedtesting.rules.StatementAdapter.evaluate(StatementAdapter.java:36)
	at org.apache.lucene.util.TestRuleStoreClassName$1.evaluate(TestRuleStoreClassName.java:41)
	at com.carrotsearch.randomizedtesting.rules.NoShadowingOrOverridesOnMethodsRule$1.evaluate(NoShadowingOrOverridesOnMethodsRule.java:40)
	at com.carrotsearch.randomizedtesting.rules.NoShadowingOrOverridesOnMethodsRule$1.evaluate(NoShadowingOrOverridesOnMethodsRule.java:40)
	at com.carrotsearch.randomizedtesting.rules.StatementAdapter.evaluate(StatementAdapter.java:36)
	at com.carrotsearch.randomizedtesting.rules.StatementAdapter.evaluate(StatementAdapter.java:36)
	at com.carrotsearch.randomizedtesting.rules.StatementAdapter.evaluate(StatementAdapter.java:36)
	at org.apache.lucene.util.TestRuleAssertionsRequired$1.evaluate(TestRuleAssertionsRequired.java:53)
	at org.apache.lucene.util.TestRuleMarkFailure$1.evaluate(TestRuleMarkFailure.java:47)
	at org.apache.lucene.util.TestRuleIgnoreAfterMaxFailures$1.evaluate(TestRuleIgnoreAfterMaxFailures.java:64)
	at org.apache.lucene.util.TestRuleIgnoreTestSuites$1.evaluate(TestRuleIgnoreTestSuites.java:54)
	at com.carrotsearch.randomizedtesting.rules.StatementAdapter.evaluate(StatementAdapter.java:36)
	at com.carrotsearch.randomizedtesting.ThreadLeakControl$StatementRunner.run(ThreadLeakControl.java:368)
	at java.lang.Thread.run(Thread.java:748)


FAILED:  org.apache.solr.cloud.autoscaling.IndexSizeTriggerTest.testTrigger

Error Message:
number of ops expected:<2> but was:<1>

Stack Trace:
java.lang.AssertionError: number of ops expected:<2> but was:<1>
	at __randomizedtesting.SeedInfo.seed([229427976398B7AA:415F1115FA57C487]:0)
	at org.junit.Assert.fail(Assert.java:93)
	at org.junit.Assert.failNotEquals(Assert.java:647)
	at org.junit.Assert.assertEquals(Assert.java:128)
	at org.junit.Assert.assertEquals(Assert.java:472)
	at org.apache.solr.cloud.autoscaling.IndexSizeTriggerTest.testTrigger(IndexSizeTriggerTest.java:187)
	at sun.reflect.NativeMethodAccessorImpl.invoke0(Native Method)
	at sun.reflect.NativeMethodAccessorImpl.invoke(NativeMethodAccessorImpl.java:62)
	at sun.reflect.DelegatingMethodAccessorImpl.invoke(DelegatingMethodAccessorImpl.java:43)
	at java.lang.reflect.Method.invoke(Method.java:498)
	at com.carrotsearch.randomizedtesting.RandomizedRunner.invoke(RandomizedRunner.java:1737)
	at com.carrotsearch.randomizedtesting.RandomizedRunner$8.evaluate(RandomizedRunner.java:934)
	at com.carrotsearch.randomizedtesting.RandomizedRunner$9.evaluate(RandomizedRunner.java:970)
	at com.carrotsearch.randomizedtesting.RandomizedRunner$10.evaluate(RandomizedRunner.java:984)
	at com.carrotsearch.randomizedtesting.rules.SystemPropertiesRestoreRule$1.evaluate(SystemPropertiesRestoreRule.java:57)
	at org.apache.lucene.util.TestRuleSetupTeardownChained$1.evaluate(TestRuleSetupTeardownChained.java:49)
	at org.apache.lucene.util.AbstractBeforeAfterRule$1.evaluate(AbstractBeforeAfterRule.java:45)
	at org.apache.lucene.util.TestRuleThreadAndTestName$1.evaluate(TestRuleThreadAndTestName.java:48)
	at org.apache.lucene.util.TestRuleIgnoreAfterMaxFailures$1.evaluate(TestRuleIgnoreAfterMaxFailures.java:64)
	at org.apache.lucene.util.TestRuleMarkFailure$1.evaluate(TestRuleMarkFailure.java:47)
	at com.carrotsearch.randomizedtesting.rules.StatementAdapter.evaluate(StatementAdapter.java:36)
	at com.carrotsearch.randomizedtesting.ThreadLeakControl$StatementRunner.run(ThreadLeakControl.java:368)
	at com.carrotsearch.randomizedtesting.ThreadLeakControl.forkTimeoutingTask(ThreadLeakControl.java:817)
	at com.carrotsearch.randomizedtesting.ThreadLeakControl$3.evaluate(ThreadLeakControl.java:468)
	at com.carrotsearch.randomizedtesting.RandomizedRunner.runSingleTest(RandomizedRunner.java:943)
	at com.carrotsearch.randomizedtesting.RandomizedRunner$5.evaluate(RandomizedRunner.java:829)
	at com.carrotsearch.randomizedtesting.RandomizedRunner$6.evaluate(RandomizedRunner.java:879)
	at com.carrotsearch.randomizedtesting.RandomizedRunner$7.evaluate(RandomizedRunner.java:890)
	at com.carrotsearch.randomizedtesting.rules.StatementAdapter.evaluate(StatementAdapter.java:36)
	at com.carrotsearch.randomizedtesting.rules.SystemPropertiesRestoreRule$1.evaluate(SystemPropertiesRestoreRule.java:57)
	at org.apache.lucene.util.AbstractBeforeAfterRule$1.evaluate(AbstractBeforeAfterRule.java:45)
	at com.carrotsearch.randomizedtesting.rules.StatementAdapter.evaluate(StatementAdapter.java:36)
	at org.apache.lucene.util.TestRuleStoreClassName$1.evaluate(TestRuleStoreClassName.java:41)
	at com.carrotsearch.randomizedtesting.rules.NoShadowingOrOverridesOnMethodsRule$1.evaluate(NoShadowingOrOverridesOnMethodsRule.java:40)
	at com.carrotsearch.randomizedtesting.rules.NoShadowingOrOverridesOnMethodsRule$1.evaluate(NoShadowingOrOverridesOnMethodsRule.java:40)
	at com.carrotsearch.randomizedtesting.rules.StatementAdapter.evaluate(StatementAdapter.java:36)
	at com.carrotsearch.randomizedtesting.rules.StatementAdapter.evaluate(StatementAdapter.java:36)
	at com.carrotsearch.randomizedtesting.rules.StatementAdapter.evaluate(StatementAdapter.java:36)
	at org.apache.lucene.util.TestRuleAssertionsRequired$1.evaluate(TestRuleAssertionsRequired.java:53)
	at org.apache.lucene.util.TestRuleMarkFailure$1.evaluate(TestRuleMarkFailure.java:47)
	at org.apache.lucene.util.TestRuleIgnoreAfterMaxFailures$1.evaluate(TestRuleIgnoreAfterMaxFailures.java:64)
	at org.apache.lucene.util.TestRuleIgnoreTestSuites$1.evaluate(TestRuleIgnoreTestSuites.java:54)
	at com.carrotsearch.randomizedtesting.rules.StatementAdapter.evaluate(StatementAdapter.java:36)
	at com.carrotsearch.randomizedtesting.ThreadLeakControl$StatementRunner.run(ThreadLeakControl.java:368)
	at java.lang.Thread.run(Thread.java:748)


FAILED:  org.apache.solr.cloud.autoscaling.IndexSizeTriggerTest.testMergeIntegration

Error Message:
did not finish processing in time

Stack Trace:
java.lang.AssertionError: did not finish processing in time
	at __randomizedtesting.SeedInfo.seed([229427976398B7AA:712D652781892250]:0)
	at org.junit.Assert.fail(Assert.java:93)
	at org.junit.Assert.assertTrue(Assert.java:43)
	at org.apache.solr.cloud.autoscaling.IndexSizeTriggerTest.testMergeIntegration(IndexSizeTriggerTest.java:404)
	at sun.reflect.NativeMethodAccessorImpl.invoke0(Native Method)
	at sun.reflect.NativeMethodAccessorImpl.invoke(NativeMethodAccessorImpl.java:62)
	at sun.reflect.DelegatingMethodAccessorImpl.invoke(DelegatingMethodAccessorImpl.java:43)
	at java.lang.reflect.Method.invoke(Method.java:498)
	at com.carrotsearch.randomizedtesting.RandomizedRunner.invoke(RandomizedRunner.java:1737)
	at com.carrotsearch.randomizedtesting.RandomizedRunner$8.evaluate(RandomizedRunner.java:934)
	at com.carrotsearch.randomizedtesting.RandomizedRunner$9.evaluate(RandomizedRunner.java:970)
	at com.carrotsearch.randomizedtesting.RandomizedRunner$10.evaluate(RandomizedRunner.java:984)
	at com.carrotsearch.randomizedtesting.rules.SystemPropertiesRestoreRule$1.evaluate(SystemPropertiesRestoreRule.java:57)
	at org.apache.lucene.util.TestRuleSetupTeardownChained$1.evaluate(TestRuleSetupTeardownChained.java:49)
	at org.apache.lucene.util.AbstractBeforeAfterRule$1.evaluate(AbstractBeforeAfterRule.java:45)
	at org.apache.lucene.util.TestRuleThreadAndTestName$1.evaluate(TestRuleThreadAndTestName.java:48)
	at org.apache.lucene.util.TestRuleIgnoreAfterMaxFailures$1.evaluate(TestRuleIgnoreAfterMaxFailures.java:64)
	at org.apache.lucene.util.TestRuleMarkFailure$1.evaluate(TestRuleMarkFailure.java:47)
	at com.carrotsearch.randomizedtesting.rules.StatementAdapter.evaluate(StatementAdapter.java:36)
	at com.carrotsearch.randomizedtesting.ThreadLeakControl$StatementRunner.run(ThreadLeakControl.java:368)
	at com.carrotsearch.randomizedtesting.ThreadLeakControl.forkTimeoutingTask(ThreadLeakControl.java:817)
	at com.carrotsearch.randomizedtesting.ThreadLeakControl$3.evaluate(ThreadLeakControl.java:468)
	at com.carrotsearch.randomizedtesting.RandomizedRunner.runSingleTest(RandomizedRunner.java:943)
	at com.carrotsearch.randomizedtesting.RandomizedRunner$5.evaluate(RandomizedRunner.java:829)
	at com.carrotsearch.randomizedtesting.RandomizedRunner$6.evaluate(RandomizedRunner.java:879)
	at com.carrotsearch.randomizedtesting.RandomizedRunner$7.evaluate(RandomizedRunner.java:890)
	at com.carrotsearch.randomizedtesting.rules.StatementAdapter.evaluate(StatementAdapter.java:36)
	at com.carrotsearch.randomizedtesting.rules.SystemPropertiesRestoreRule$1.evaluate(SystemPropertiesRestoreRule.java:57)
	at org.apache.lucene.util.AbstractBeforeAfterRule$1.evaluate(AbstractBeforeAfterRule.java:45)
	at com.carrotsearch.randomizedtesting.rules.StatementAdapter.evaluate(StatementAdapter.java:36)
	at org.apache.lucene.util.TestRuleStoreClassName$1.evaluate(TestRuleStoreClassName.java:41)
	at com.carrotsearch.randomizedtesting.rules.NoShadowingOrOverridesOnMethodsRule$1.evaluate(NoShadowingOrOverridesOnMethodsRule.java:40)
	at com.carrotsearch.randomizedtesting.rules.NoShadowingOrOverridesOnMethodsRule$1.evaluate(NoShadowingOrOverridesOnMethodsRule.java:40)
	at com.carrotsearch.randomizedtesting.rules.StatementAdapter.evaluate(StatementAdapter.java:36)
	at com.carrotsearch.randomizedtesting.rules.StatementAdapter.evaluate(StatementAdapter.java:36)
	at com.carrotsearch.randomizedtesting.rules.StatementAdapter.evaluate(StatementAdapter.java:36)
	at org.apache.lucene.util.TestRuleAssertionsRequired$1.evaluate(TestRuleAssertionsRequired.java:53)
	at org.apache.lucene.util.TestRuleMarkFailure$1.evaluate(TestRuleMarkFailure.java:47)
	at org.apache.lucene.util.TestRuleIgnoreAfterMaxFailures$1.evaluate(TestRuleIgnoreAfterMaxFailures.java:64)
	at org.apache.lucene.util.TestRuleIgnoreTestSuites$1.evaluate(TestRuleIgnoreTestSuites.java:54)
	at com.carrotsearch.randomizedtesting.rules.StatementAdapter.evaluate(StatementAdapter.java:36)
	at com.carrotsearch.randomizedtesting.ThreadLeakControl$StatementRunner.run(ThreadLeakControl.java:368)
	at java.lang.Thread.run(Thread.java:748)


FAILED:  org.apache.solr.cloud.autoscaling.IndexSizeTriggerTest.testSplitIntegration

Error Message:
last state: DocCollection(testSplitIntegration_collection//clusterstate.json/52)={   "replicationFactor":"2",   "pullReplicas":"0",   "router":{"name":"compositeId"},   "maxShardsPerNode":"2",   "autoAddReplicas":"false",   "nrtReplicas":"2",   "tlogReplicas":"0",   "autoCreated":"true",   "shards":{     "shard2":{       "replicas":{         "core_node3":{           "core":"testSplitIntegration_collection_shard2_replica_n3",           "leader":"true",           "SEARCHER.searcher.maxDoc":11,           "SEARCHER.searcher.deletedDocs":0,           "INDEX.sizeInBytes":1,           "node_name":"127.0.0.1:10003_solr",           "state":"active",           "type":"NRT",           "SEARCHER.searcher.numDocs":11},         "core_node4":{           "core":"testSplitIntegration_collection_shard2_replica_n4",           "SEARCHER.searcher.maxDoc":11,           "SEARCHER.searcher.deletedDocs":0,           "INDEX.sizeInBytes":1,           "node_name":"127.0.0.1:10002_solr",           "state":"active",           "type":"NRT",           "SEARCHER.searcher.numDocs":11}},       "range":"0-7fffffff",       "state":"active"},     "shard1":{       "stateTimestamp":"1527255500913280000",       "replicas":{         "core_node1":{           "core":"testSplitIntegration_collection_shard1_replica_n1",           "leader":"true",           "SEARCHER.searcher.maxDoc":14,           "SEARCHER.searcher.deletedDocs":0,           "INDEX.sizeInBytes":1,           "node_name":"127.0.0.1:10003_solr",           "state":"active",           "type":"NRT",           "SEARCHER.searcher.numDocs":14},         "core_node2":{           "core":"testSplitIntegration_collection_shard1_replica_n2",           "SEARCHER.searcher.maxDoc":14,           "SEARCHER.searcher.deletedDocs":0,           "INDEX.sizeInBytes":1,           "node_name":"127.0.0.1:10002_solr",           "state":"active",           "type":"NRT",           "SEARCHER.searcher.numDocs":14}},       "range":"80000000-ffffffff",       "state":"inactive"},     "shard1_1":{       "parent":"shard1",       "stateTimestamp":"1527255500974550000",       "range":"c0000000-ffffffff",       "state":"active",       "replicas":{         "core_node10":{           "leader":"true",           "core":"testSplitIntegration_collection_shard1_1_replica1",           "SEARCHER.searcher.maxDoc":7,           "SEARCHER.searcher.deletedDocs":0,           "INDEX.sizeInBytes":1,           "node_name":"127.0.0.1:10002_solr",           "base_url":"http://127.0.0.1:10002/solr",           "state":"active",           "type":"NRT",           "SEARCHER.searcher.numDocs":7},         "core_node9":{           "core":"testSplitIntegration_collection_shard1_1_replica0",           "SEARCHER.searcher.maxDoc":7,           "SEARCHER.searcher.deletedDocs":0,           "INDEX.sizeInBytes":1,           "node_name":"127.0.0.1:10003_solr",           "base_url":"http://127.0.0.1:10003/solr",           "state":"active",           "type":"NRT",           "SEARCHER.searcher.numDocs":7}}},     "shard1_0":{       "parent":"shard1",       "stateTimestamp":"1527255500974205000",       "range":"80000000-bfffffff",       "state":"active",       "replicas":{         "core_node7":{           "leader":"true",           "core":"testSplitIntegration_collection_shard1_0_replica0",           "SEARCHER.searcher.maxDoc":7,           "SEARCHER.searcher.deletedDocs":0,           "INDEX.sizeInBytes":1,           "node_name":"127.0.0.1:10003_solr",           "base_url":"http://127.0.0.1:10003/solr",           "state":"active",           "type":"NRT",           "SEARCHER.searcher.numDocs":7},         "core_node8":{           "core":"testSplitIntegration_collection_shard1_0_replica1",           "SEARCHER.searcher.maxDoc":7,           "SEARCHER.searcher.deletedDocs":0,           "INDEX.sizeInBytes":1,           "node_name":"127.0.0.1:10002_solr",           "base_url":"http://127.0.0.1:10002/solr",           "state":"active",           "type":"NRT",           "SEARCHER.searcher.numDocs":7}}}}}

Stack Trace:
java.util.concurrent.TimeoutException: last state: DocCollection(testSplitIntegration_collection//clusterstate.json/52)={
  "replicationFactor":"2",
  "pullReplicas":"0",
  "router":{"name":"compositeId"},
  "maxShardsPerNode":"2",
  "autoAddReplicas":"false",
  "nrtReplicas":"2",
  "tlogReplicas":"0",
  "autoCreated":"true",
  "shards":{
    "shard2":{
      "replicas":{
        "core_node3":{
          "core":"testSplitIntegration_collection_shard2_replica_n3",
          "leader":"true",
          "SEARCHER.searcher.maxDoc":11,
          "SEARCHER.searcher.deletedDocs":0,
          "INDEX.sizeInBytes":1,
          "node_name":"127.0.0.1:10003_solr",
          "state":"active",
          "type":"NRT",
          "SEARCHER.searcher.numDocs":11},
        "core_node4":{
          "core":"testSplitIntegration_collection_shard2_replica_n4",
          "SEARCHER.searcher.maxDoc":11,
          "SEARCHER.searcher.deletedDocs":0,
          "INDEX.sizeInBytes":1,
          "node_name":"127.0.0.1:10002_solr",
          "state":"active",
          "type":"NRT",
          "SEARCHER.searcher.numDocs":11}},
      "range":"0-7fffffff",
      "state":"active"},
    "shard1":{
      "stateTimestamp":"1527255500913280000",
      "replicas":{
        "core_node1":{
          "core":"testSplitIntegration_collection_shard1_replica_n1",
          "leader":"true",
          "SEARCHER.searcher.maxDoc":14,
          "SEARCHER.searcher.deletedDocs":0,
          "INDEX.sizeInBytes":1,
          "node_name":"127.0.0.1:10003_solr",
          "state":"active",
          "type":"NRT",
          "SEARCHER.searcher.numDocs":14},
        "core_node2":{
          "core":"testSplitIntegration_collection_shard1_replica_n2",
          "SEARCHER.searcher.maxDoc":14,
          "SEARCHER.searcher.deletedDocs":0,
          "INDEX.sizeInBytes":1,
          "node_name":"127.0.0.1:10002_solr",
          "state":"active",
          "type":"NRT",
          "SEARCHER.searcher.numDocs":14}},
      "range":"80000000-ffffffff",
      "state":"inactive"},
    "shard1_1":{
      "parent":"shard1",
      "stateTimestamp":"1527255500974550000",
      "range":"c0000000-ffffffff",
      "state":"active",
      "replicas":{
        "core_node10":{
          "leader":"true",
          "core":"testSplitIntegration_collection_shard1_1_replica1",
          "SEARCHER.searcher.maxDoc":7,
          "SEARCHER.searcher.deletedDocs":0,
          "INDEX.sizeInBytes":1,
          "node_name":"127.0.0.1:10002_solr",
          "base_url":"http://127.0.0.1:10002/solr",
          "state":"active",
          "type":"NRT",
          "SEARCHER.searcher.numDocs":7},
        "core_node9":{
          "core":"testSplitIntegration_collection_shard1_1_replica0",
          "SEARCHER.searcher.maxDoc":7,
          "SEARCHER.searcher.deletedDocs":0,
          "INDEX.sizeInBytes":1,
          "node_name":"127.0.0.1:10003_solr",
          "base_url":"http://127.0.0.1:10003/solr",
          "state":"active",
          "type":"NRT",
          "SEARCHER.searcher.numDocs":7}}},
    "shard1_0":{
      "parent":"shard1",
      "stateTimestamp":"1527255500974205000",
      "range":"80000000-bfffffff",
      "state":"active",
      "replicas":{
        "core_node7":{
          "leader":"true",
          "core":"testSplitIntegration_collection_shard1_0_replica0",
          "SEARCHER.searcher.maxDoc":7,
          "SEARCHER.searcher.deletedDocs":0,
          "INDEX.sizeInBytes":1,
          "node_name":"127.0.0.1:10003_solr",
          "base_url":"http://127.0.0.1:10003/solr",
          "state":"active",
          "type":"NRT",
          "SEARCHER.searcher.numDocs":7},
        "core_node8":{
          "core":"testSplitIntegration_collection_shard1_0_replica1",
          "SEARCHER.searcher.maxDoc":7,
          "SEARCHER.searcher.deletedDocs":0,
          "INDEX.sizeInBytes":1,
          "node_name":"127.0.0.1:10002_solr",
          "base_url":"http://127.0.0.1:10002/solr",
          "state":"active",
          "type":"NRT",
          "SEARCHER.searcher.numDocs":7}}}}}
	at __randomizedtesting.SeedInfo.seed([229427976398B7AA:1B1A9ED74C677E54]:0)
	at org.apache.solr.cloud.CloudTestUtils.waitForState(CloudTestUtils.java:111)
	at org.apache.solr.cloud.autoscaling.IndexSizeTriggerTest.testSplitIntegration(IndexSizeTriggerTest.java:299)
	at sun.reflect.NativeMethodAccessorImpl.invoke0(Native Method)
	at sun.reflect.NativeMethodAccessorImpl.invoke(NativeMethodAccessorImpl.java:62)
	at sun.reflect.DelegatingMethodAccessorImpl.invoke(DelegatingMethodAccessorImpl.java:43)
	at java.lang.reflect.Method.invoke(Method.java:498)
	at com.carrotsearch.randomizedtesting.RandomizedRunner.invoke(RandomizedRunner.java:1737)
	at com.carrotsearch.randomizedtesting.RandomizedRunner$8.evaluate(RandomizedRunner.java:934)
	at com.carrotsearch.randomizedtesting.RandomizedRunner$9.evaluate(RandomizedRunner.java:970)
	at com.carrotsearch.randomizedtesting.RandomizedRunner$10.evaluate(RandomizedRunner.java:984)
	at com.carrotsearch.randomizedtesting.rules.SystemPropertiesRestoreRule$1.evaluate(SystemPropertiesRestoreRule.java:57)
	at org.apache.lucene.util.TestRuleSetupTeardownChained$1.evaluate(TestRuleSetupTeardownChained.java:49)
	at org.apache.lucene.util.AbstractBeforeAfterRule$1.evaluate(AbstractBeforeAfterRule.java:45)
	at org.apache.lucene.util.TestRuleThreadAndTestName$1.evaluate(TestRuleThreadAndTestName.java:48)
	at org.apache.lucene.util.TestRuleIgnoreAfterMaxFailures$1.evaluate(TestRuleIgnoreAfterMaxFailures.java:64)
	at org.apache.lucene.util.TestRuleMarkFailure$1.evaluate(TestRuleMarkFailure.java:47)
	at com.carrotsearch.randomizedtesting.rules.StatementAdapter.evaluate(StatementAdapter.java:36)
	at com.carrotsearch.randomizedtesting.ThreadLeakControl$StatementRunner.run(ThreadLeakControl.java:368)
	at com.carrotsearch.randomizedtesting.ThreadLeakControl.forkTimeoutingTask(ThreadLeakControl.java:817)
	at com.carrotsearch.randomizedtesting.ThreadLeakControl$3.evaluate(ThreadLeakControl.java:468)
	at com.carrotsearch.randomizedtesting.RandomizedRunner.runSingleTest(RandomizedRunner.java:943)
	at com.carrotsearch.randomizedtesting.RandomizedRunner$5.evaluate(RandomizedRunner.java:829)
	at com.carrotsearch.randomizedtesting.RandomizedRunner$6.evaluate(RandomizedRunner.java:879)
	at com.carrotsearch.randomizedtesting.RandomizedRunner$7.evaluate(RandomizedRunner.java:890)
	at com.carrotsearch.randomizedtesting.rules.StatementAdapter.evaluate(StatementAdapter.java:36)
	at com.carrotsearch.randomizedtesting.rules.SystemPropertiesRestoreRule$1.evaluate(SystemPropertiesRestoreRule.java:57)
	at org.apache.lucene.util.AbstractBeforeAfterRule$1.evaluate(AbstractBeforeAfterRule.java:45)
	at com.carrotsearch.randomizedtesting.rules.StatementAdapter.evaluate(StatementAdapter.java:36)
	at org.apache.lucene.util.TestRuleStoreClassName$1.evaluate(TestRuleStoreClassName.java:41)
	at com.carrotsearch.randomizedtesting.rules.NoShadowingOrOverridesOnMethodsRule$1.evaluate(NoShadowingOrOverridesOnMethodsRule.java:40)
	at com.carrotsearch.randomizedtesting.rules.NoShadowingOrOverridesOnMethodsRule$1.evaluate(NoShadowingOrOverridesOnMethodsRule.java:40)
	at com.carrotsearch.randomizedtesting.rules.StatementAdapter.evaluate(StatementAdapter.java:36)
	at com.carrotsearch.randomizedtesting.rules.StatementAdapter.evaluate(StatementAdapter.java:36)
	at com.carrotsearch.randomizedtesting.rules.StatementAdapter.evaluate(StatementAdapter.java:36)
	at org.apache.lucene.util.TestRuleAssertionsRequired$1.evaluate(TestRuleAssertionsRequired.java:53)
	at org.apache.lucene.util.TestRuleMarkFailure$1.evaluate(TestRuleMarkFailure.java:47)
	at org.apache.lucene.util.TestRuleIgnoreAfterMaxFailures$1.evaluate(TestRuleIgnoreAfterMaxFailures.java:64)
	at org.apache.lucene.util.TestRuleIgnoreTestSuites$1.evaluate(TestRuleIgnoreTestSuites.java:54)
	at com.carrotsearch.randomizedtesting.rules.StatementAdapter.evaluate(StatementAdapter.java:36)
	at com.carrotsearch.randomizedtesting.ThreadLeakControl$StatementRunner.run(ThreadLeakControl.java:368)
	at java.lang.Thread.run(Thread.java:748)


FAILED:  org.apache.solr.cloud.autoscaling.IndexSizeTriggerTest.testMergeIntegration

Error Message:
did not finish processing in time

Stack Trace:
java.lang.AssertionError: did not finish processing in time
	at __randomizedtesting.SeedInfo.seed([229427976398B7AA:712D652781892250]:0)
	at org.junit.Assert.fail(Assert.java:93)
	at org.junit.Assert.assertTrue(Assert.java:43)
	at org.apache.solr.cloud.autoscaling.IndexSizeTriggerTest.testMergeIntegration(IndexSizeTriggerTest.java:404)
	at sun.reflect.NativeMethodAccessorImpl.invoke0(Native Method)
	at sun.reflect.NativeMethodAccessorImpl.invoke(NativeMethodAccessorImpl.java:62)
	at sun.reflect.DelegatingMethodAccessorImpl.invoke(DelegatingMethodAccessorImpl.java:43)
	at java.lang.reflect.Method.invoke(Method.java:498)
	at com.carrotsearch.randomizedtesting.RandomizedRunner.invoke(RandomizedRunner.java:1737)
	at com.carrotsearch.randomizedtesting.RandomizedRunner$8.evaluate(RandomizedRunner.java:934)
	at com.carrotsearch.randomizedtesting.RandomizedRunner$9.evaluate(RandomizedRunner.java:970)
	at com.carrotsearch.randomizedtesting.RandomizedRunner$10.evaluate(RandomizedRunner.java:984)
	at com.carrotsearch.randomizedtesting.rules.SystemPropertiesRestoreRule$1.evaluate(SystemPropertiesRestoreRule.java:57)
	at org.apache.lucene.util.TestRuleSetupTeardownChained$1.evaluate(TestRuleSetupTeardownChained.java:49)
	at org.apache.lucene.util.AbstractBeforeAfterRule$1.evaluate(AbstractBeforeAfterRule.java:45)
	at org.apache.lucene.util.TestRuleThreadAndTestName$1.evaluate(TestRuleThreadAndTestName.java:48)
	at org.apache.lucene.util.TestRuleIgnoreAfterMaxFailures$1.evaluate(TestRuleIgnoreAfterMaxFailures.java:64)
	at org.apache.lucene.util.TestRuleMarkFailure$1.evaluate(TestRuleMarkFailure.java:47)
	at com.carrotsearch.randomizedtesting.rules.StatementAdapter.evaluate(StatementAdapter.java:36)
	at com.carrotsearch.randomizedtesting.ThreadLeakControl$StatementRunner.run(ThreadLeakControl.java:368)
	at com.carrotsearch.randomizedtesting.ThreadLeakControl.forkTimeoutingTask(ThreadLeakControl.java:817)
	at com.carrotsearch.randomizedtesting.ThreadLeakControl$3.evaluate(ThreadLeakControl.java:468)
	at com.carrotsearch.randomizedtesting.RandomizedRunner.runSingleTest(RandomizedRunner.java:943)
	at com.carrotsearch.randomizedtesting.RandomizedRunner$5.evaluate(RandomizedRunner.java:829)
	at com.carrotsearch.randomizedtesting.RandomizedRunner$6.evaluate(RandomizedRunner.java:879)
	at com.carrotsearch.randomizedtesting.RandomizedRunner$7.evaluate(RandomizedRunner.java:890)
	at com.carrotsearch.randomizedtesting.rules.StatementAdapter.evaluate(StatementAdapter.java:36)
	at com.carrotsearch.randomizedtesting.rules.SystemPropertiesRestoreRule$1.evaluate(SystemPropertiesRestoreRule.java:57)
	at org.apache.lucene.util.AbstractBeforeAfterRule$1.evaluate(AbstractBeforeAfterRule.java:45)
	at com.carrotsearch.randomizedtesting.rules.StatementAdapter.evaluate(StatementAdapter.java:36)
	at org.apache.lucene.util.TestRuleStoreClassName$1.evaluate(TestRuleStoreClassName.java:41)
	at com.carrotsearch.randomizedtesting.rules.NoShadowingOrOverridesOnMethodsRule$1.evaluate(NoShadowingOrOverridesOnMethodsRule.java:40)
	at com.carrotsearch.randomizedtesting.rules.NoShadowingOrOverridesOnMethodsRule$1.evaluate(NoShadowingOrOverridesOnMethodsRule.java:40)
	at com.carrotsearch.randomizedtesting.rules.StatementAdapter.evaluate(StatementAdapter.java:36)
	at com.carrotsearch.randomizedtesting.rules.StatementAdapter.evaluate(StatementAdapter.java:36)
	at com.carrotsearch.randomizedtesting.rules.StatementAdapter.evaluate(StatementAdapter.java:36)
	at org.apache.lucene.util.TestRuleAssertionsRequired$1.evaluate(TestRuleAssertionsRequired.java:53)
	at org.apache.lucene.util.TestRuleMarkFailure$1.evaluate(TestRuleMarkFailure.java:47)
	at org.apache.lucene.util.TestRuleIgnoreAfterMaxFailures$1.evaluate(TestRuleIgnoreAfterMaxFailures.java:64)
	at org.apache.lucene.util.TestRuleIgnoreTestSuites$1.evaluate(TestRuleIgnoreTestSuites.java:54)
	at com.carrotsearch.randomizedtesting.rules.StatementAdapter.evaluate(StatementAdapter.java:36)
	at com.carrotsearch.randomizedtesting.ThreadLeakControl$StatementRunner.run(ThreadLeakControl.java:368)
	at java.lang.Thread.run(Thread.java:748)


FAILED:  org.apache.solr.cloud.autoscaling.IndexSizeTriggerTest.testSplitIntegration

Error Message:
did not finish processing in time

Stack Trace:
java.lang.AssertionError: did not finish processing in time
	at __randomizedtesting.SeedInfo.seed([229427976398B7AA:1B1A9ED74C677E54]:0)
	at org.junit.Assert.fail(Assert.java:93)
	at org.junit.Assert.assertTrue(Assert.java:43)
	at org.apache.solr.cloud.autoscaling.IndexSizeTriggerTest.testSplitIntegration(IndexSizeTriggerTest.java:298)
	at sun.reflect.NativeMethodAccessorImpl.invoke0(Native Method)
	at sun.reflect.NativeMethodAccessorImpl.invoke(NativeMethodAccessorImpl.java:62)
	at sun.reflect.DelegatingMethodAccessorImpl.invoke(DelegatingMethodAccessorImpl.java:43)
	at java.lang.reflect.Method.invoke(Method.java:498)
	at com.carrotsearch.randomizedtesting.RandomizedRunner.invoke(RandomizedRunner.java:1737)
	at com.carrotsearch.randomizedtesting.RandomizedRunner$8.evaluate(RandomizedRunner.java:934)
	at com.carrotsearch.randomizedtesting.RandomizedRunner$9.evaluate(RandomizedRunner.java:970)
	at com.carrotsearch.randomizedtesting.RandomizedRunner$10.evaluate(RandomizedRunner.java:984)
	at com.carrotsearch.randomizedtesting.rules.SystemPropertiesRestoreRule$1.evaluate(SystemPropertiesRestoreRule.java:57)
	at org.apache.lucene.util.TestRuleSetupTeardownChained$1.evaluate(TestRuleSetupTeardownChained.java:49)
	at org.apache.lucene.util.AbstractBeforeAfterRule$1.evaluate(AbstractBeforeAfterRule.java:45)
	at org.apache.lucene.util.TestRuleThreadAndTestName$1.evaluate(TestRuleThreadAndTestName.java:48)
	at org.apache.lucene.util.TestRuleIgnoreAfterMaxFailures$1.evaluate(TestRuleIgnoreAfterMaxFailures.java:64)
	at org.apache.lucene.util.TestRuleMarkFailure$1.evaluate(TestRuleMarkFailure.java:47)
	at com.carrotsearch.randomizedtesting.rules.StatementAdapter.evaluate(StatementAdapter.java:36)
	at com.carrotsearch.randomizedtesting.ThreadLeakControl$StatementRunner.run(ThreadLeakControl.java:368)
	at com.carrotsearch.randomizedtesting.ThreadLeakControl.forkTimeoutingTask(ThreadLeakControl.java:817)
	at com.carrotsearch.randomizedtesting.ThreadLeakControl$3.evaluate(ThreadLeakControl.java:468)
	at com.carrotsearch.randomizedtesting.RandomizedRunner.runSingleTest(RandomizedRunner.java:943)
	at com.carrotsearch.randomizedtesting.RandomizedRunner$5.evaluate(RandomizedRunner.java:829)
	at com.carrotsearch.randomizedtesting.RandomizedRunner$6.evaluate(RandomizedRunner.java:879)
	at com.carrotsearch.randomizedtesting.RandomizedRunner$7.evaluate(RandomizedRunner.java:890)
	at com.carrotsearch.randomizedtesting.rules.StatementAdapter.evaluate(StatementAdapter.java:36)
	at com.carrotsearch.randomizedtesting.rules.SystemPropertiesRestoreRule$1.evaluate(SystemPropertiesRestoreRule.java:57)
	at org.apache.lucene.util.AbstractBeforeAfterRule$1.evaluate(AbstractBeforeAfterRule.java:45)
	at com.carrotsearch.randomizedtesting.rules.StatementAdapter.evaluate(StatementAdapter.java:36)
	at org.apache.lucene.util.TestRuleStoreClassName$1.evaluate(TestRuleStoreClassName.java:41)
	at com.carrotsearch.randomizedtesting.rules.NoShadowingOrOverridesOnMethodsRule$1.evaluate(NoShadowingOrOverridesOnMethodsRule.java:40)
	at com.carrotsearch.randomizedtesting.rules.NoShadowingOrOverridesOnMethodsRule$1.evaluate(NoShadowingOrOverridesOnMethodsRule.java:40)
	at com.carrotsearch.randomizedtesting.rules.StatementAdapter.evaluate(StatementAdapter.java:36)
	at com.carrotsearch.randomizedtesting.rules.StatementAdapter.evaluate(StatementAdapter.java:36)
	at com.carrotsearch.randomizedtesting.rules.StatementAdapter.evaluate(StatementAdapter.java:36)
	at org.apache.lucene.util.TestRuleAssertionsRequired$1.evaluate(TestRuleAssertionsRequired.java:53)
	at org.apache.lucene.util.TestRuleMarkFailure$1.evaluate(TestRuleMarkFailure.java:47)
	at org.apache.lucene.util.TestRuleIgnoreAfterMaxFailures$1.evaluate(TestRuleIgnoreAfterMaxFailures.java:64)
	at org.apache.lucene.util.TestRuleIgnoreTestSuites$1.evaluate(TestRuleIgnoreTestSuites.java:54)
	at com.carrotsearch.randomizedtesting.rules.StatementAdapter.evaluate(StatementAdapter.java:36)
	at com.carrotsearch.randomizedtesting.ThreadLeakControl$StatementRunner.run(ThreadLeakControl.java:368)
	at java.lang.Thread.run(Thread.java:748)


FAILED:  org.apache.solr.cloud.autoscaling.IndexSizeTriggerTest.testTrigger

Error Message:
should have fired an event

Stack Trace:
java.lang.AssertionError: should have fired an event
	at __randomizedtesting.SeedInfo.seed([229427976398B7AA:415F1115FA57C487]:0)
	at org.junit.Assert.fail(Assert.java:93)
	at org.junit.Assert.assertTrue(Assert.java:43)
	at org.junit.Assert.assertNotNull(Assert.java:526)
	at org.apache.solr.cloud.autoscaling.IndexSizeTriggerTest.testTrigger(IndexSizeTriggerTest.java:184)
	at sun.reflect.NativeMethodAccessorImpl.invoke0(Native Method)
	at sun.reflect.NativeMethodAccessorImpl.invoke(NativeMethodAccessorImpl.java:62)
	at sun.reflect.DelegatingMethodAccessorImpl.invoke(DelegatingMethodAccessorImpl.java:43)
	at java.lang.reflect.Method.invoke(Method.java:498)
	at com.carrotsearch.randomizedtesting.RandomizedRunner.invoke(RandomizedRunner.java:1737)
	at com.carrotsearch.randomizedtesting.RandomizedRunner$8.evaluate(RandomizedRunner.java:934)
	at com.carrotsearch.randomizedtesting.RandomizedRunner$9.evaluate(RandomizedRunner.java:970)
	at com.carrotsearch.randomizedtesting.RandomizedRunner$10.evaluate(RandomizedRunner.java:984)
	at com.carrotsearch.randomizedtesting.rules.SystemPropertiesRestoreRule$1.evaluate(SystemPropertiesRestoreRule.java:57)
	at org.apache.lucene.util.TestRuleSetupTeardownChained$1.evaluate(TestRuleSetupTeardownChained.java:49)
	at org.apache.lucene.util.AbstractBeforeAfterRule$1.evaluate(AbstractBeforeAfterRule.java:45)
	at org.apache.lucene.util.TestRuleThreadAndTestName$1.evaluate(TestRuleThreadAndTestName.java:48)
	at org.apache.lucene.util.TestRuleIgnoreAfterMaxFailures$1.evaluate(TestRuleIgnoreAfterMaxFailures.java:64)
	at org.apache.lucene.util.TestRuleMarkFailure$1.evaluate(TestRuleMarkFailure.java:47)
	at com.carrotsearch.randomizedtesting.rules.StatementAdapter.evaluate(StatementAdapter.java:36)
	at com.carrotsearch.randomizedtesting.ThreadLeakControl$StatementRunner.run(ThreadLeakControl.java:368)
	at com.carrotsearch.randomizedtesting.ThreadLeakControl.forkTimeoutingTask(ThreadLeakControl.java:817)
	at com.carrotsearch.randomizedtesting.ThreadLeakControl$3.evaluate(ThreadLeakControl.java:468)
	at com.carrotsearch.randomizedtesting.RandomizedRunner.runSingleTest(RandomizedRunner.java:943)
	at com.carrotsearch.randomizedtesting.RandomizedRunner$5.evaluate(RandomizedRunner.java:829)
	at com.carrotsearch.randomizedtesting.RandomizedRunner$6.evaluate(RandomizedRunner.java:879)
	at com.carrotsearch.randomizedtesting.RandomizedRunner$7.evaluate(RandomizedRunner.java:890)
	at com.carrotsearch.randomizedtesting.rules.StatementAdapter.evaluate(StatementAdapter.java:36)
	at com.carrotsearch.randomizedtesting.rules.SystemPropertiesRestoreRule$1.evaluate(SystemPropertiesRestoreRule.java:57)
	at org.apache.lucene.util.AbstractBeforeAfterRule$1.evaluate(AbstractBeforeAfterRule.java:45)
	at com.carrotsearch.randomizedtesting.rules.StatementAdapter.evaluate(StatementAdapter.java:36)
	at org.apache.lucene.util.TestRuleStoreClassName$1.evaluate(TestRuleStoreClassName.java:41)
	at com.carrotsearch.randomizedtesting.rules.NoShadowingOrOverridesOnMethodsRule$1.evaluate(NoShadowingOrOverridesOnMethodsRule.java:40)
	at com.carrotsearch.randomizedtesting.rules.NoShadowingOrOverridesOnMethodsRule$1.evaluate(NoShadowingOrOverridesOnMethodsRule.java:40)
	at com.carrotsearch.randomizedtesting.rules.StatementAdapter.evaluate(StatementAdapter.java:36)
	at com.carrotsearch.randomizedtesting.rules.StatementAdapter.evaluate(StatementAdapter.java:36)
	at com.carrotsearch.randomizedtesting.rules.StatementAdapter.evaluate(StatementAdapter.java:36)
	at org.apache.lucene.util.TestRuleAssertionsRequired$1.evaluate(TestRuleAssertionsRequired.java:53)
	at org.apache.lucene.util.TestRuleMarkFailure$1.evaluate(TestRuleMarkFailure.java:47)
	at org.apache.lucene.util.TestRuleIgnoreAfterMaxFailures$1.evaluate(TestRuleIgnoreAfterMaxFailures.java:64)
	at org.apache.lucene.util.TestRuleIgnoreTestSuites$1.evaluate(TestRuleIgnoreTestSuites.java:54)
	at com.carrotsearch.randomizedtesting.rules.StatementAdapter.evaluate(StatementAdapter.java:36)
	at com.carrotsearch.randomizedtesting.ThreadLeakControl$StatementRunner.run(ThreadLeakControl.java:368)
	at java.lang.Thread.run(Thread.java:748)


FAILED:  org.apache.solr.cloud.autoscaling.IndexSizeTriggerTest.testMergeIntegration

Error Message:
did not finish processing in time

Stack Trace:
java.lang.AssertionError: did not finish processing in time
	at __randomizedtesting.SeedInfo.seed([229427976398B7AA:712D652781892250]:0)
	at org.junit.Assert.fail(Assert.java:93)
	at org.junit.Assert.assertTrue(Assert.java:43)
	at org.apache.solr.cloud.autoscaling.IndexSizeTriggerTest.testMergeIntegration(IndexSizeTriggerTest.java:404)
	at sun.reflect.NativeMethodAccessorImpl.invoke0(Native Method)
	at sun.reflect.NativeMethodAccessorImpl.invoke(NativeMethodAccessorImpl.java:62)
	at sun.reflect.DelegatingMethodAccessorImpl.invoke(DelegatingMethodAccessorImpl.java:43)
	at java.lang.reflect.Method.invoke(Method.java:498)
	at com.carrotsearch.randomizedtesting.RandomizedRunner.invoke(RandomizedRunner.java:1737)
	at com.carrotsearch.randomizedtesting.RandomizedRunner$8.evaluate(RandomizedRunner.java:934)
	at com.carrotsearch.randomizedtesting.RandomizedRunner$9.evaluate(RandomizedRunner.java:970)
	at com.carrotsearch.randomizedtesting.RandomizedRunner$10.evaluate(RandomizedRunner.java:984)
	at com.carrotsearch.randomizedtesting.rules.SystemPropertiesRestoreRule$1.evaluate(SystemPropertiesRestoreRule.java:57)
	at org.apache.lucene.util.TestRuleSetupTeardownChained$1.evaluate(TestRuleSetupTeardownChained.java:49)
	at org.apache.lucene.util.AbstractBeforeAfterRule$1.evaluate(AbstractBeforeAfterRule.java:45)
	at org.apache.lucene.util.TestRuleThreadAndTestName$1.evaluate(TestRuleThreadAndTestName.java:48)
	at org.apache.lucene.util.TestRuleIgnoreAfterMaxFailures$1.evaluate(TestRuleIgnoreAfterMaxFailures.java:64)
	at org.apache.lucene.util.TestRuleMarkFailure$1.evaluate(TestRuleMarkFailure.java:47)
	at com.carrotsearch.randomizedtesting.rules.StatementAdapter.evaluate(StatementAdapter.java:36)
	at com.carrotsearch.randomizedtesting.ThreadLeakControl$StatementRunner.run(ThreadLeakControl.java:368)
	at com.carrotsearch.randomizedtesting.ThreadLeakControl.forkTimeoutingTask(ThreadLeakControl.java:817)
	at com.carrotsearch.randomizedtesting.ThreadLeakControl$3.evaluate(ThreadLeakControl.java:468)
	at com.carrotsearch.randomizedtesting.RandomizedRunner.runSingleTest(RandomizedRunner.java:943)
	at com.carrotsearch.randomizedtesting.RandomizedRunner$5.evaluate(RandomizedRunner.java:829)
	at com.carrotsearch.randomizedtesting.RandomizedRunner$6.evaluate(RandomizedRunner.java:879)
	at com.carrotsearch.randomizedtesting.RandomizedRunner$7.evaluate(RandomizedRunner.java:890)
	at com.carrotsearch.randomizedtesting.rules.StatementAdapter.evaluate(StatementAdapter.java:36)
	at com.carrotsearch.randomizedtesting.rules.SystemPropertiesRestoreRule$1.evaluate(SystemPropertiesRestoreRule.java:57)
	at org.apache.lucene.util.AbstractBeforeAfterRule$1.evaluate(AbstractBeforeAfterRule.java:45)
	at com.carrotsearch.randomizedtesting.rules.StatementAdapter.evaluate(StatementAdapter.java:36)
	at org.apache.lucene.util.TestRuleStoreClassName$1.evaluate(TestRuleStoreClassName.java:41)
	at com.carrotsearch.randomizedtesting.rules.NoShadowingOrOverridesOnMethodsRule$1.evaluate(NoShadowingOrOverridesOnMethodsRule.java:40)
	at com.carrotsearch.randomizedtesting.rules.NoShadowingOrOverridesOnMethodsRule$1.evaluate(NoShadowingOrOverridesOnMethodsRule.java:40)
	at com.carrotsearch.randomizedtesting.rules.StatementAdapter.evaluate(StatementAdapter.java:36)
	at com.carrotsearch.randomizedtesting.rules.StatementAdapter.evaluate(StatementAdapter.java:36)
	at com.carrotsearch.randomizedtesting.rules.StatementAdapter.evaluate(StatementAdapter.java:36)
	at org.apache.lucene.util.TestRuleAssertionsRequired$1.evaluate(TestRuleAssertionsRequired.java:53)
	at org.apache.lucene.util.TestRuleMarkFailure$1.evaluate(TestRuleMarkFailure.java:47)
	at org.apache.lucene.util.TestRuleIgnoreAfterMaxFailures$1.evaluate(TestRuleIgnoreAfterMaxFailures.java:64)
	at org.apache.lucene.util.TestRuleIgnoreTestSuites$1.evaluate(TestRuleIgnoreTestSuites.java:54)
	at com.carrotsearch.randomizedtesting.rules.StatementAdapter.evaluate(StatementAdapter.java:36)
	at com.carrotsearch.randomizedtesting.ThreadLeakControl$StatementRunner.run(ThreadLeakControl.java:368)
	at java.lang.Thread.run(Thread.java:748)


FAILED:  org.apache.solr.cloud.autoscaling.IndexSizeTriggerTest.testSplitIntegration

Error Message:
last state: DocCollection(testSplitIntegration_collection//clusterstate.json/51)={   "replicationFactor":"2",   "pullReplicas":"0",   "router":{"name":"compositeId"},   "maxShardsPerNode":"2",   "autoAddReplicas":"false",   "nrtReplicas":"2",   "tlogReplicas":"0",   "autoCreated":"true",   "shards":{     "shard2":{       "replicas":{         "core_node3":{           "core":"testSplitIntegration_collection_shard2_replica_n3",           "leader":"true",           "SEARCHER.searcher.maxDoc":11,           "SEARCHER.searcher.deletedDocs":0,           "INDEX.sizeInBytes":1,           "node_name":"127.0.0.1:10001_solr",           "state":"active",           "type":"NRT",           "SEARCHER.searcher.numDocs":11},         "core_node4":{           "core":"testSplitIntegration_collection_shard2_replica_n4",           "SEARCHER.searcher.maxDoc":11,           "SEARCHER.searcher.deletedDocs":0,           "INDEX.sizeInBytes":1,           "node_name":"127.0.0.1:10000_solr",           "state":"active",           "type":"NRT",           "SEARCHER.searcher.numDocs":11}},       "range":"0-7fffffff",       "state":"active"},     "shard1":{       "stateTimestamp":"1527250090599455000",       "replicas":{         "core_node1":{           "core":"testSplitIntegration_collection_shard1_replica_n1",           "leader":"true",           "SEARCHER.searcher.maxDoc":14,           "SEARCHER.searcher.deletedDocs":0,           "INDEX.sizeInBytes":1,           "node_name":"127.0.0.1:10001_solr",           "state":"active",           "type":"NRT",           "SEARCHER.searcher.numDocs":14},         "core_node2":{           "core":"testSplitIntegration_collection_shard1_replica_n2",           "SEARCHER.searcher.maxDoc":14,           "SEARCHER.searcher.deletedDocs":0,           "INDEX.sizeInBytes":1,           "node_name":"127.0.0.1:10000_solr",           "state":"active",           "type":"NRT",           "SEARCHER.searcher.numDocs":14}},       "range":"80000000-ffffffff",       "state":"inactive"},     "shard1_1":{       "parent":"shard1",       "stateTimestamp":"1527250090610380000",       "range":"c0000000-ffffffff",       "state":"active",       "replicas":{         "core_node10":{           "leader":"true",           "core":"testSplitIntegration_collection_shard1_1_replica1",           "SEARCHER.searcher.maxDoc":7,           "SEARCHER.searcher.deletedDocs":0,           "INDEX.sizeInBytes":1,           "node_name":"127.0.0.1:10000_solr",           "base_url":"http://127.0.0.1:10000/solr",           "state":"active",           "type":"NRT",           "SEARCHER.searcher.numDocs":7},         "core_node9":{           "core":"testSplitIntegration_collection_shard1_1_replica0",           "SEARCHER.searcher.maxDoc":7,           "SEARCHER.searcher.deletedDocs":0,           "INDEX.sizeInBytes":1,           "node_name":"127.0.0.1:10001_solr",           "base_url":"http://127.0.0.1:10001/solr",           "state":"active",           "type":"NRT",           "SEARCHER.searcher.numDocs":7}}},     "shard1_0":{       "parent":"shard1",       "stateTimestamp":"1527250090610220000",       "range":"80000000-bfffffff",       "state":"active",       "replicas":{         "core_node7":{           "leader":"true",           "core":"testSplitIntegration_collection_shard1_0_replica0",           "SEARCHER.searcher.maxDoc":7,           "SEARCHER.searcher.deletedDocs":0,           "INDEX.sizeInBytes":1,           "node_name":"127.0.0.1:10001_solr",           "base_url":"http://127.0.0.1:10001/solr",           "state":"active",           "type":"NRT",           "SEARCHER.searcher.numDocs":7},         "core_node8":{           "core":"testSplitIntegration_collection_shard1_0_replica1",           "SEARCHER.searcher.maxDoc":7,           "SEARCHER.searcher.deletedDocs":0,           "INDEX.sizeInBytes":1,           "node_name":"127.0.0.1:10000_solr",           "base_url":"http://127.0.0.1:10000/solr",           "state":"active",           "type":"NRT",           "SEARCHER.searcher.numDocs":7}}}}}

Stack Trace:
java.util.concurrent.TimeoutException: last state: DocCollection(testSplitIntegration_collection//clusterstate.json/51)={
  "replicationFactor":"2",
  "pullReplicas":"0",
  "router":{"name":"compositeId"},
  "maxShardsPerNode":"2",
  "autoAddReplicas":"false",
  "nrtReplicas":"2",
  "tlogReplicas":"0",
  "autoCreated":"true",
  "shards":{
    "shard2":{
      "replicas":{
        "core_node3":{
          "core":"testSplitIntegration_collection_shard2_replica_n3",
          "leader":"true",
          "SEARCHER.searcher.maxDoc":11,
          "SEARCHER.searcher.deletedDocs":0,
          "INDEX.sizeInBytes":1,
          "node_name":"127.0.0.1:10001_solr",
          "state":"active",
          "type":"NRT",
          "SEARCHER.searcher.numDocs":11},
        "core_node4":{
          "core":"testSplitIntegration_collection_shard2_replica_n4",
          "SEARCHER.searcher.maxDoc":11,
          "SEARCHER.searcher.deletedDocs":0,
          "INDEX.sizeInBytes":1,
          "node_name":"127.0.0.1:10000_solr",
          "state":"active",
          "type":"NRT",
          "SEARCHER.searcher.numDocs":11}},
      "range":"0-7fffffff",
      "state":"active"},
    "shard1":{
      "stateTimestamp":"1527250090599455000",
      "replicas":{
        "core_node1":{
          "core":"testSplitIntegration_collection_shard1_replica_n1",
          "leader":"true",
          "SEARCHER.searcher.maxDoc":14,
          "SEARCHER.searcher.deletedDocs":0,
          "INDEX.sizeInBytes":1,
          "node_name":"127.0.0.1:10001_solr",
          "state":"active",
          "type":"NRT",
          "SEARCHER.searcher.numDocs":14},
        "core_node2":{
          "core":"testSplitIntegration_collection_shard1_replica_n2",
          "SEARCHER.searcher.maxDoc":14,
          "SEARCHER.searcher.deletedDocs":0,
          "INDEX.sizeInBytes":1,
          "node_name":"127.0.0.1:10000_solr",
          "state":"active",
          "type":"NRT",
          "SEARCHER.searcher.numDocs":14}},
      "range":"80000000-ffffffff",
      "state":"inactive"},
    "shard1_1":{
      "parent":"shard1",
      "stateTimestamp":"1527250090610380000",
      "range":"c0000000-ffffffff",
      "state":"active",
      "replicas":{
        "core_node10":{
          "leader":"true",
          "core":"testSplitIntegration_collection_shard1_1_replica1",
          "SEARCHER.searcher.maxDoc":7,
          "SEARCHER.searcher.deletedDocs":0,
          "INDEX.sizeInBytes":1,
          "node_name":"127.0.0.1:10000_solr",
          "base_url":"http://127.0.0.1:10000/solr",
          "state":"active",
          "type":"NRT",
          "SEARCHER.searcher.numDocs":7},
        "core_node9":{
          "core":"testSplitIntegration_collection_shard1_1_replica0",
          "SEARCHER.searcher.maxDoc":7,
          "SEARCHER.searcher.deletedDocs":0,
          "INDEX.sizeInBytes":1,
          "node_name":"127.0.0.1:10001_solr",
          "base_url":"http://127.0.0.1:10001/solr",
          "state":"active",
          "type":"NRT",
          "SEARCHER.searcher.numDocs":7}}},
    "shard1_0":{
      "parent":"shard1",
      "stateTimestamp":"1527250090610220000",
      "range":"80000000-bfffffff",
      "state":"active",
      "replicas":{
        "core_node7":{
          "leader":"true",
          "core":"testSplitIntegration_collection_shard1_0_replica0",
          "SEARCHER.searcher.maxDoc":7,
          "SEARCHER.searcher.deletedDocs":0,
          "INDEX.sizeInBytes":1,
          "node_name":"127.0.0.1:10001_solr",
          "base_url":"http://127.0.0.1:10001/solr",
          "state":"active",
          "type":"NRT",
          "SEARCHER.searcher.numDocs":7},
        "core_node8":{
          "core":"testSplitIntegration_collection_shard1_0_replica1",
          "SEARCHER.searcher.maxDoc":7,
          "SEARCHER.searcher.deletedDocs":0,
          "INDEX.sizeInBytes":1,
          "node_name":"127.0.0.1:10000_solr",
          "base_url":"http://127.0.0.1:10000/solr",
          "state":"active",
          "type":"NRT",
          "SEARCHER.searcher.numDocs":7}}}}}
	at __randomizedtesting.SeedInfo.seed([229427976398B7AA:1B1A9ED74C677E54]:0)
	at org.apache.solr.cloud.CloudTestUtils.waitForState(CloudTestUtils.java:111)
	at org.apache.solr.cloud.autoscaling.IndexSizeTriggerTest.testSplitIntegration(IndexSizeTriggerTest.java:299)
	at sun.reflect.NativeMethodAccessorImpl.invoke0(Native Method)
	at sun.reflect.NativeMethodAccessorImpl.invoke(NativeMethodAccessorImpl.java:62)
	at sun.reflect.DelegatingMethodAccessorImpl.invoke(DelegatingMethodAccessorImpl.java:43)
	at java.lang.reflect.Method.invoke(Method.java:498)
	at com.carrotsearch.randomizedtesting.RandomizedRunner.invoke(RandomizedRunner.java:1737)
	at com.carrotsearch.randomizedtesting.RandomizedRunner$8.evaluate(RandomizedRunner.java:934)
	at com.carrotsearch.randomizedtesting.RandomizedRunner$9.evaluate(RandomizedRunner.java:970)
	at com.carrotsearch.randomizedtesting.RandomizedRunner$10.evaluate(RandomizedRunner.java:984)
	at com.carrotsearch.randomizedtesting.rules.SystemPropertiesRestoreRule$1.evaluate(SystemPropertiesRestoreRule.java:57)
	at org.apache.lucene.util.TestRuleSetupTeardownChained$1.evaluate(TestRuleSetupTeardownChained.java:49)
	at org.apache.lucene.util.AbstractBeforeAfterRule$1.evaluate(AbstractBeforeAfterRule.java:45)
	at org.apache.lucene.util.TestRuleThreadAndTestName$1.evaluate(TestRuleThreadAndTestName.java:48)
	at org.apache.lucene.util.TestRuleIgnoreAfterMaxFailures$1.evaluate(TestRuleIgnoreAfterMaxFailures.java:64)
	at org.apache.lucene.util.TestRuleMarkFailure$1.evaluate(TestRuleMarkFailure.java:47)
	at com.carrotsearch.randomizedtesting.rules.StatementAdapter.evaluate(StatementAdapter.java:36)
	at com.carrotsearch.randomizedtesting.ThreadLeakControl$StatementRunner.run(ThreadLeakControl.java:368)
	at com.carrotsearch.randomizedtesting.ThreadLeakControl.forkTimeoutingTask(ThreadLeakControl.java:817)
	at com.carrotsearch.randomizedtesting.ThreadLeakControl$3.evaluate(ThreadLeakControl.java:468)
	at com.carrotsearch.randomizedtesting.RandomizedRunner.runSingleTest(RandomizedRunner.java:943)
	at com.carrotsearch.randomizedtesting.RandomizedRunner$5.evaluate(RandomizedRunner.java:829)
	at com.carrotsearch.randomizedtesting.RandomizedRunner$6.evaluate(RandomizedRunner.java:879)
	at com.carrotsearch.randomizedtesting.RandomizedRunner$7.evaluate(RandomizedRunner.java:890)
	at com.carrotsearch.randomizedtesting.rules.StatementAdapter.evaluate(StatementAdapter.java:36)
	at com.carrotsearch.randomizedtesting.rules.SystemPropertiesRestoreRule$1.evaluate(SystemPropertiesRestoreRule.java:57)
	at org.apache.lucene.util.AbstractBeforeAfterRule$1.evaluate(AbstractBeforeAfterRule.java:45)
	at com.carrotsearch.randomizedtesting.rules.StatementAdapter.evaluate(StatementAdapter.java:36)
	at org.apache.lucene.util.TestRuleStoreClassName$1.evaluate(TestRuleStoreClassName.java:41)
	at com.carrotsearch.randomizedtesting.rules.NoShadowingOrOverridesOnMethodsRule$1.evaluate(NoShadowingOrOverridesOnMethodsRule.java:40)
	at com.carrotsearch.randomizedtesting.rules.NoShadowingOrOverridesOnMethodsRule$1.evaluate(NoShadowingOrOverridesOnMethodsRule.java:40)
	at com.carrotsearch.randomizedtesting.rules.StatementAdapter.evaluate(StatementAdapter.java:36)
	at com.carrotsearch.randomizedtesting.rules.StatementAdapter.evaluate(StatementAdapter.java:36)
	at com.carrotsearch.randomizedtesting.rules.StatementAdapter.evaluate(StatementAdapter.java:36)
	at org.apache.lucene.util.TestRuleAssertionsRequired$1.evaluate(TestRuleAssertionsRequired.java:53)
	at org.apache.lucene.util.TestRuleMarkFailure$1.evaluate(TestRuleMarkFailure.java:47)
	at org.apache.lucene.util.TestRuleIgnoreAfterMaxFailures$1.evaluate(TestRuleIgnoreAfterMaxFailures.java:64)
	at org.apache.lucene.util.TestRuleIgnoreTestSuites$1.evaluate(TestRuleIgnoreTestSuites.java:54)
	at com.carrotsearch.randomizedtesting.rules.StatementAdapter.evaluate(StatementAdapter.java:36)
	at com.carrotsearch.randomizedtesting.ThreadLeakControl$StatementRunner.run(ThreadLeakControl.java:368)
	at java.lang.Thread.run(Thread.java:748)


FAILED:  org.apache.solr.cloud.autoscaling.IndexSizeTriggerTest.testTrigger

Error Message:
should have fired an event

Stack Trace:
java.lang.AssertionError: should have fired an event
	at __randomizedtesting.SeedInfo.seed([229427976398B7AA:415F1115FA57C487]:0)
	at org.junit.Assert.fail(Assert.java:93)
	at org.junit.Assert.assertTrue(Assert.java:43)
	at org.junit.Assert.assertNotNull(Assert.java:526)
	at org.apache.solr.cloud.autoscaling.IndexSizeTriggerTest.testTrigger(IndexSizeTriggerTest.java:184)
	at sun.reflect.NativeMethodAccessorImpl.invoke0(Native Method)
	at sun.reflect.NativeMethodAccessorImpl.invoke(NativeMethodAccessorImpl.java:62)
	at sun.reflect.DelegatingMethodAccessorImpl.invoke(DelegatingMethodAccessorImpl.java:43)
	at java.lang.reflect.Method.invoke(Method.java:498)
	at com.carrotsearch.randomizedtesting.RandomizedRunner.invoke(RandomizedRunner.java:1737)
	at com.carrotsearch.randomizedtesting.RandomizedRunner$8.evaluate(RandomizedRunner.java:934)
	at com.carrotsearch.randomizedtesting.RandomizedRunner$9.evaluate(RandomizedRunner.java:970)
	at com.carrotsearch.randomizedtesting.RandomizedRunner$10.evaluate(RandomizedRunner.java:984)
	at com.carrotsearch.randomizedtesting.rules.SystemPropertiesRestoreRule$1.evaluate(SystemPropertiesRestoreRule.java:57)
	at org.apache.lucene.util.TestRuleSetupTeardownChained$1.evaluate(TestRuleSetupTeardownChained.java:49)
	at org.apache.lucene.util.AbstractBeforeAfterRule$1.evaluate(AbstractBeforeAfterRule.java:45)
	at org.apache.lucene.util.TestRuleThreadAndTestName$1.evaluate(TestRuleThreadAndTestName.java:48)
	at org.apache.lucene.util.TestRuleIgnoreAfterMaxFailures$1.evaluate(TestRuleIgnoreAfterMaxFailures.java:64)
	at org.apache.lucene.util.TestRuleMarkFailure$1.evaluate(TestRuleMarkFailure.java:47)
	at com.carrotsearch.randomizedtesting.rules.StatementAdapter.evaluate(StatementAdapter.java:36)
	at com.carrotsearch.randomizedtesting.ThreadLeakControl$StatementRunner.run(ThreadLeakControl.java:368)
	at com.carrotsearch.randomizedtesting.ThreadLeakControl.forkTimeoutingTask(ThreadLeakControl.java:817)
	at com.carrotsearch.randomizedtesting.ThreadLeakControl$3.evaluate(ThreadLeakControl.java:468)
	at com.carrotsearch.randomizedtesting.RandomizedRunner.runSingleTest(RandomizedRunner.java:943)
	at com.carrotsearch.randomizedtesting.RandomizedRunner$5.evaluate(RandomizedRunner.java:829)
	at com.carrotsearch.randomizedtesting.RandomizedRunner$6.evaluate(RandomizedRunner.java:879)
	at com.carrotsearch.randomizedtesting.RandomizedRunner$7.evaluate(RandomizedRunner.java:890)
	at com.carrotsearch.randomizedtesting.rules.StatementAdapter.evaluate(StatementAdapter.java:36)
	at com.carrotsearch.randomizedtesting.rules.SystemPropertiesRestoreRule$1.evaluate(SystemPropertiesRestoreRule.java:57)
	at org.apache.lucene.util.AbstractBeforeAfterRule$1.evaluate(AbstractBeforeAfterRule.java:45)
	at com.carrotsearch.randomizedtesting.rules.StatementAdapter.evaluate(StatementAdapter.java:36)
	at org.apache.lucene.util.TestRuleStoreClassName$1.evaluate(TestRuleStoreClassName.java:41)
	at com.carrotsearch.randomizedtesting.rules.NoShadowingOrOverridesOnMethodsRule$1.evaluate(NoShadowingOrOverridesOnMethodsRule.java:40)
	at com.carrotsearch.randomizedtesting.rules.NoShadowingOrOverridesOnMethodsRule$1.evaluate(NoShadowingOrOverridesOnMethodsRule.java:40)
	at com.carrotsearch.randomizedtesting.rules.StatementAdapter.evaluate(StatementAdapter.java:36)
	at com.carrotsearch.randomizedtesting.rules.StatementAdapter.evaluate(StatementAdapter.java:36)
	at com.carrotsearch.randomizedtesting.rules.StatementAdapter.evaluate(StatementAdapter.java:36)
	at org.apache.lucene.util.TestRuleAssertionsRequired$1.evaluate(TestRuleAssertionsRequired.java:53)
	at org.apache.lucene.util.TestRuleMarkFailure$1.evaluate(TestRuleMarkFailure.java:47)
	at org.apache.lucene.util.TestRuleIgnoreAfterMaxFailures$1.evaluate(TestRuleIgnoreAfterMaxFailures.java:64)
	at org.apache.lucene.util.TestRuleIgnoreTestSuites$1.evaluate(TestRuleIgnoreTestSuites.java:54)
	at com.carrotsearch.randomizedtesting.rules.StatementAdapter.evaluate(StatementAdapter.java:36)
	at com.carrotsearch.randomizedtesting.ThreadLeakControl$StatementRunner.run(ThreadLeakControl.java:368)
	at java.lang.Thread.run(Thread.java:748)


FAILED:  org.apache.solr.common.util.TestTimeSource.testEpochTime

Error Message:
SimTimeSource:50.0 time diff=33090000

Stack Trace:
java.lang.AssertionError: SimTimeSource:50.0 time diff=33090000
	at __randomizedtesting.SeedInfo.seed([D1679362FADFDA53:E90BE0476E0F7815]:0)
	at org.junit.Assert.fail(Assert.java:93)
	at org.junit.Assert.assertTrue(Assert.java:43)
	at org.apache.solr.common.util.TestTimeSource.doTestEpochTime(TestTimeSource.java:52)
	at org.apache.solr.common.util.TestTimeSource.testEpochTime(TestTimeSource.java:32)
	at sun.reflect.NativeMethodAccessorImpl.invoke0(Native Method)
	at sun.reflect.NativeMethodAccessorImpl.invoke(NativeMethodAccessorImpl.java:62)
	at sun.reflect.DelegatingMethodAccessorImpl.invoke(DelegatingMethodAccessorImpl.java:43)
	at java.lang.reflect.Method.invoke(Method.java:498)
	at com.carrotsearch.randomizedtesting.RandomizedRunner.invoke(RandomizedRunner.java:1737)
	at com.carrotsearch.randomizedtesting.RandomizedRunner$8.evaluate(RandomizedRunner.java:934)
	at com.carrotsearch.randomizedtesting.RandomizedRunner$9.evaluate(RandomizedRunner.java:970)
	at com.carrotsearch.randomizedtesting.RandomizedRunner$10.evaluate(RandomizedRunner.java:984)
	at com.carrotsearch.randomizedtesting.rules.SystemPropertiesRestoreRule$1.evaluate(SystemPropertiesRestoreRule.java:57)
	at org.apache.lucene.util.TestRuleSetupTeardownChained$1.evaluate(TestRuleSetupTeardownChained.java:49)
	at org.apache.lucene.util.AbstractBeforeAfterRule$1.evaluate(AbstractBeforeAfterRule.java:45)
	at org.apache.lucene.util.TestRuleThreadAndTestName$1.evaluate(TestRuleThreadAndTestName.java:48)
	at org.apache.lucene.util.TestRuleIgnoreAfterMaxFailures$1.evaluate(TestRuleIgnoreAfterMaxFailures.java:64)
	at org.apache.lucene.util.TestRuleMarkFailure$1.evaluate(TestRuleMarkFailure.java:47)
	at com.carrotsearch.randomizedtesting.rules.StatementAdapter.evaluate(StatementAdapter.java:36)
	at com.carrotsearch.randomizedtesting.ThreadLeakControl$StatementRunner.run(ThreadLeakControl.java:368)
	at com.carrotsearch.randomizedtesting.ThreadLeakControl.forkTimeoutingTask(ThreadLeakControl.java:817)
	at com.carrotsearch.randomizedtesting.ThreadLeakControl$3.evaluate(ThreadLeakControl.java:468)
	at com.carrotsearch.randomizedtesting.RandomizedRunner.runSingleTest(RandomizedRunner.java:943)
	at com.carrotsearch.randomizedtesting.RandomizedRunner$5.evaluate(RandomizedRunner.java:829)
	at com.carrotsearch.randomizedtesting.RandomizedRunner$6.evaluate(RandomizedRunner.java:879)
	at com.carrotsearch.randomizedtesting.RandomizedRunner$7.evaluate(RandomizedRunner.java:890)
	at com.carrotsearch.randomizedtesting.rules.StatementAdapter.evaluate(StatementAdapter.java:36)
	at com.carrotsearch.randomizedtesting.rules.SystemPropertiesRestoreRule$1.evaluate(SystemPropertiesRestoreRule.java:57)
	at org.apache.lucene.util.AbstractBeforeAfterRule$1.evaluate(AbstractBeforeAfterRule.java:45)
	at com.carrotsearch.randomizedtesting.rules.StatementAdapter.evaluate(StatementAdapter.java:36)
	at org.apache.lucene.util.TestRuleStoreClassName$1.evaluate(TestRuleStoreClassName.java:41)
	at com.carrotsearch.randomizedtesting.rules.NoShadowingOrOverridesOnMethodsRule$1.evaluate(NoShadowingOrOverridesOnMethodsRule.java:40)
	at com.carrotsearch.randomizedtesting.rules.NoShadowingOrOverridesOnMethodsRule$1.evaluate(NoShadowingOrOverridesOnMethodsRule.java:40)
	at com.carrotsearch.randomizedtesting.rules.StatementAdapter.evaluate(StatementAdapter.java:36)
	at com.carrotsearch.randomizedtesting.rules.StatementAdapter.evaluate(StatementAdapter.java:36)
	at com.carrotsearch.randomizedtesting.rules.StatementAdapter.evaluate(StatementAdapter.java:36)
	at org.apache.lucene.util.TestRuleAssertionsRequired$1.evaluate(TestRuleAssertionsRequired.java:53)
	at org.apache.lucene.util.TestRuleMarkFailure$1.evaluate(TestRuleMarkFailure.java:47)
	at org.apache.lucene.util.TestRuleIgnoreAfterMaxFailures$1.evaluate(TestRuleIgnoreAfterMaxFailures.java:64)
	at org.apache.lucene.util.TestRuleIgnoreTestSuites$1.evaluate(TestRuleIgnoreTestSuites.java:54)
	at com.carrotsearch.randomizedtesting.rules.StatementAdapter.evaluate(StatementAdapter.java:36)
	at com.carrotsearch.randomizedtesting.ThreadLeakControl$StatementRunner.run(ThreadLeakControl.java:368)
	at java.lang.Thread.run(Thread.java:748)




Build Log:
[...truncated 12501 lines...]
   [junit4] Suite: org.apache.solr.cloud.autoscaling.IndexSizeTriggerTest
   [junit4]   2> Creating dataDir: C:\Users\jenkins\workspace\Lucene-Solr-7.x-Windows\solr\build\solr-core\test\J0\temp\solr.cloud.autoscaling.IndexSizeTriggerTest_229427976398B7AA-001\init-core-data-001
   [junit4]   2> 120448 WARN  (SUITE-IndexSizeTriggerTest-seed#[229427976398B7AA]-worker) [    ] o.a.s.SolrTestCaseJ4 startTrackingSearchers: numOpens=1 numCloses=1
   [junit4]   2> 120448 INFO  (SUITE-IndexSizeTriggerTest-seed#[229427976398B7AA]-worker) [    ] o.a.s.SolrTestCaseJ4 Using TrieFields (NUMERIC_POINTS_SYSPROP=false) w/NUMERIC_DOCVALUES_SYSPROP=true
   [junit4]   2> 120452 INFO  (SUITE-IndexSizeTriggerTest-seed#[229427976398B7AA]-worker) [    ] o.a.s.SolrTestCaseJ4 Randomized ssl (false) and clientAuth (false) via: @org.apache.solr.util.RandomizeSSL(reason=, value=NaN, ssl=NaN, clientAuth=NaN)
   [junit4]   2> 120452 INFO  (SUITE-IndexSizeTriggerTest-seed#[229427976398B7AA]-worker) [    ] o.a.s.SolrTestCaseJ4 SecureRandom sanity checks: test.solr.allowed.securerandom=null & java.security.egd=file:/dev/./urandom
   [junit4]   2> 120453 INFO  (SUITE-IndexSizeTriggerTest-seed#[229427976398B7AA]-worker) [    ] o.a.s.c.MiniSolrCloudCluster Starting cluster of 2 servers in C:\Users\jenkins\workspace\Lucene-Solr-7.x-Windows\solr\build\solr-core\test\J0\temp\solr.cloud.autoscaling.IndexSizeTriggerTest_229427976398B7AA-001\tempDir-001
   [junit4]   2> 120454 INFO  (SUITE-IndexSizeTriggerTest-seed#[229427976398B7AA]-worker) [    ] o.a.s.c.ZkTestServer STARTING ZK TEST SERVER
   [junit4]   2> 120454 INFO  (Thread-173) [    ] o.a.s.c.ZkTestServer client port:0.0.0.0/0.0.0.0:0
   [junit4]   2> 120454 INFO  (Thread-173) [    ] o.a.s.c.ZkTestServer Starting server
   [junit4]   2> 120458 ERROR (Thread-173) [    ] o.a.z.s.ZooKeeperServer ZKShutdownHandler is not registered, so ZooKeeper server won't take any action on ERROR or SHUTDOWN server state changes
   [junit4]   2> 120554 INFO  (SUITE-IndexSizeTriggerTest-seed#[229427976398B7AA]-worker) [    ] o.a.s.c.ZkTestServer start zk server on port:53242
   [junit4]   2> 120559 INFO  (zkConnectionManagerCallback-234-thread-1) [    ] o.a.s.c.c.ConnectionManager zkClient has connected
   [junit4]   2> 120563 INFO  (jetty-launcher-231-thread-2) [    ] o.e.j.s.Server jetty-9.4.10.v20180503; built: 2018-05-03T15:56:21.710Z; git: daa59876e6f384329b122929e70a80934569428c; jvm 1.8.0_172-b11
   [junit4]   2> 120563 INFO  (jetty-launcher-231-thread-1) [    ] o.e.j.s.Server jetty-9.4.10.v20180503; built: 2018-05-03T15:56:21.710Z; git: daa59876e6f384329b122929e70a80934569428c; jvm 1.8.0_172-b11
   [junit4]   2> 120564 INFO  (jetty-launcher-231-thread-1) [    ] o.e.j.s.session DefaultSessionIdManager workerName=node0
   [junit4]   2> 120564 INFO  (jetty-launcher-231-thread-1) [    ] o.e.j.s.session No SessionScavenger set, using defaults
   [junit4]   2> 120564 INFO  (jetty-launcher-231-thread-1) [    ] o.e.j.s.session node0 Scavenging every 600000ms
   [junit4]   2> 120564 INFO  (jetty-launcher-231-thread-2) [    ] o.e.j.s.session DefaultSessionIdManager workerName=node0
   [junit4]   2> 120564 INFO  (jetty-launcher-231-thread-2) [    ] o.e.j.s.session No SessionScavenger set, using defaults
   [junit4]   2> 120564 INFO  (jetty-launcher-231-thread-2) [    ] o.e.j.s.session node0 Scavenging every 600000ms
   [junit4]   2> 120564 INFO  (jetty-launcher-231-thread-1) [    ] o.e.j.s.h.ContextHandler Started o.e.j.s.ServletContextHandler@239dde{/solr,null,AVAILABLE}
   [junit4]   2> 120565 INFO  (jetty-launcher-231-thread-2) [    ] o.e.j.s.h.ContextHandler Started o.e.j.s.ServletContextHandler@76d3e0{/solr,null,AVAILABLE}
   [junit4]   2> 120568 INFO  (jetty-launcher-231-thread-2) [    ] o.e.j.s.AbstractConnector Started ServerConnector@148b94e{HTTP/1.1,[http/1.1]}{127.0.0.1:53247}
   [junit4]   2> 120568 INFO  (jetty-launcher-231-thread-2) [    ] o.e.j.s.Server Started @120604ms
   [junit4]   2> 120568 INFO  (jetty-launcher-231-thread-1) [    ] o.e.j.s.AbstractConnector Started ServerConnector@78c638{HTTP/1.1,[http/1.1]}{127.0.0.1:53246}
   [junit4]   2> 120568 INFO  (jetty-launcher-231-thread-2) [    ] o.a.s.c.s.e.JettySolrRunner Jetty properties: {hostContext=/solr, hostPort=53247}
   [junit4]   2> 120568 ERROR (jetty-launcher-231-thread-2) [    ] o.a.s.u.StartupLoggingUtils Missing Java Option solr.log.dir. Logging may be missing or incomplete.
   [junit4]   2> 120568 INFO  (jetty-launcher-231-thread-1) [    ] o.e.j.s.Server Started @120605ms
   [junit4]   2> 120568 INFO  (jetty-launcher-231-thread-2) [    ] o.a.s.s.SolrDispatchFilter Using logger factory org.apache.logging.slf4j.Log4jLoggerFactory
   [junit4]   2> 120568 INFO  (jetty-launcher-231-thread-1) [    ] o.a.s.c.s.e.JettySolrRunner Jetty properties: {hostContext=/solr, hostPort=53246}
   [junit4]   2> 120568 INFO  (jetty-launcher-231-thread-2) [    ] o.a.s.s.SolrDispatchFilter  ___      _       Welcome to Apache Solr™ version 7.4.0
   [junit4]   2> 120568 INFO  (jetty-launcher-231-thread-2) [    ] o.a.s.s.SolrDispatchFilter / __| ___| |_ _   Starting in cloud mode on port null
   [junit4]   2> 120568 INFO  (jetty-launcher-231-thread-2) [    ] o.a.s.s.SolrDispatchFilter \__ \/ _ \ | '_|  Install dir: null
   [junit4]   2> 120568 INFO  (jetty-launcher-231-thread-2) [    ] o.a.s.s.SolrDispatchFilter |___/\___/_|_|    Start time: 2018-05-25T12:07:19.089Z
   [junit4]   2> 120568 ERROR (jetty-launcher-231-thread-1) [    ] o.a.s.u.StartupLoggingUtils Missing Java Option solr.log.dir. Logging may be missing or incomplete.
   [junit4]   2> 120568 INFO  (jetty-launcher-231-thread-1) [    ] o.a.s.s.SolrDispatchFilter Using logger factory org.apache.logging.slf4j.Log4jLoggerFactory
   [junit4]   2> 120568 INFO  (jetty-launcher-231-thread-1) [    ] o.a.s.s.SolrDispatchFilter  ___      _       Welcome to Apache Solr™ version 7.4.0
   [junit4]   2> 120568 INFO  (jetty-launcher-231-thread-1) [    ] o.a.s.s.SolrDispatchFilter / __| ___| |_ _   Starting in cloud mode on port null
   [junit4]   2> 120568 INFO  (jetty-launcher-231-thread-1) [    ] o.a.s.s.SolrDispatchFilter \__ \/ _ \ | '_|  Install dir: null
   [junit4]   2> 120568 INFO  (jetty-launcher-231-thread-1) [    ] o.a.s.s.SolrDispatchFilter |___/\___/_|_|    Start time: 2018-05-25T12:07:19.089Z
   [junit4]   2> 120572 INFO  (zkConnectionManagerCallback-236-thread-1) [    ] o.a.s.c.c.ConnectionManager zkClient has connected
   [junit4]   2> 120572 INFO  (jetty-launcher-231-thread-2) [    ] o.a.s.s.SolrDispatchFilter solr.xml found in ZooKeeper. Loading...
   [junit4]   2> 120572 INFO  (zkConnectionManagerCallback-238-thread-1) [    ] o.a.s.c.c.ConnectionManager zkClient has connected
   [junit4]   2> 120573 INFO  (jetty-launcher-231-thread-1) [    ] o.a.s.s.SolrDispatchFilter solr.xml found in ZooKeeper. Loading...
   [junit4]   2> 120587 INFO  (jetty-launcher-231-thread-1) [    ] o.a.s.c.ZkContainer Zookeeper client=127.0.0.1:53242/solr
   [junit4]   2> 120591 INFO  (jetty-launcher-231-thread-2) [    ] o.a.s.c.ZkContainer Zookeeper client=127.0.0.1:53242/solr
   [junit4]   2> 120592 INFO  (zkConnectionManagerCallback-242-thread-1) [    ] o.a.s.c.c.ConnectionManager zkClient has connected
   [junit4]   2> 120594 WARN  (NIOServerCxn.Factory:0.0.0.0/0.0.0.0:0) [    ] o.a.z.s.NIOServerCnxn Unable to read additional data from client sessionid 0x100194539e50003, likely client has closed socket
   [junit4]   2> 120594 INFO  (zkConnectionManagerCallback-246-thread-1) [    ] o.a.s.c.c.ConnectionManager zkClient has connected
   [junit4]   2> 120597 INFO  (zkConnectionManagerCallback-248-thread-1) [    ] o.a.s.c.c.ConnectionManager zkClient has connected
   [junit4]   2> 120600 INFO  (zkConnectionManagerCallback-250-thread-1) [    ] o.a.s.c.c.ConnectionManager zkClient has connected
   [junit4]   2> 120683 INFO  (jetty-launcher-231-thread-2) [n:127.0.0.1:53247_solr    ] o.a.s.c.Overseer Overseer (id=null) closing
   [junit4]   2> 120683 INFO  (jetty-launcher-231-thread-1) [n:127.0.0.1:53246_solr    ] o.a.s.c.Overseer Overseer (id=null) closing
   [junit4]   2> 120684 INFO  (jetty-launcher-231-thread-1) [n:127.0.0.1:53246_solr    ] o.a.s.c.OverseerElectionContext I am going to be the leader 127.0.0.1:53246_solr
   [junit4]   2> 120684 INFO  (jetty-launcher-231-thread-2) [n:127.0.0.1:53247_solr    ] o.a.s.c.ZkController Register node as live in ZooKeeper:/live_nodes/127.0.0.1:53247_solr
   [junit4]   2> 120684 INFO  (jetty-launcher-231-thread-1) [n:127.0.0.1:53246_solr    ] o.a.s.c.Overseer Overseer (id=72085379152674821-127.0.0.1:53246_solr-n_0000000000) starting
   [junit4]   2> 120688 INFO  (zkCallback-249-thread-1) [    ] o.a.s.c.c.ZkStateReader Updated live nodes from ZooKeeper... (0) -> (1)
   [junit4]   2> 120688 INFO  (zkCallback-247-thread-1) [    ] o.a.s.c.c.ZkStateReader Updated live nodes from ZooKeeper... (0) -> (1)
   [junit4]   2> 120698 INFO  (zkConnectionManagerCallback-259-thread-1) [    ] o.a.s.c.c.ConnectionManager zkClient has connected
   [junit4]   2> 120699 INFO  (jetty-launcher-231-thread-1) [n:127.0.0.1:53246_solr    ] o.a.s.c.c.ZkStateReader Updated live nodes from ZooKeeper... (0) -> (1)
   [junit4]   2> 120700 INFO  (jetty-launcher-231-thread-1) [n:127.0.0.1:53246_solr    ] o.a.s.c.s.i.ZkClientClusterStateProvider Cluster at 127.0.0.1:53242/solr ready
   [junit4]   2> 120702 DEBUG (OverseerAutoScalingTriggerThread-72085379152674821-127.0.0.1:53246_solr-n_0000000000) [    ] o.a.s.c.a.OverseerTriggerThread Adding .auto_add_replicas and .scheduled_maintenance triggers
   [junit4]   2> 120704 DEBUG (OverseerAutoScalingTriggerThread-72085379152674821-127.0.0.1:53246_solr-n_0000000000) [    ] o.a.s.c.a.OverseerTriggerThread Refreshing /autoscaling.json with znode version 1
   [junit4]   2> 120705 DEBUG (OverseerAutoScalingTriggerThread-72085379152674821-127.0.0.1:53246_solr-n_0000000000) [    ] o.a.s.c.a.OverseerTriggerThread Current znodeVersion 1, lastZnodeVersion -1
   [junit4]   2> 120705 DEBUG (OverseerAutoScalingTriggerThread-72085379152674821-127.0.0.1:53246_solr-n_0000000000) [    ] o.a.s.c.a.OverseerTriggerThread Processed trigger updates upto znodeVersion 1
   [junit4]   2> 120705 INFO  (jetty-launcher-231-thread-1) [n:127.0.0.1:53246_solr    ] o.a.s.c.TransientSolrCoreCacheDefault Allocating transient cache for 2147483647 transient cores
   [junit4]   2> 120706 INFO  (jetty-launcher-231-thread-1) [n:127.0.0.1:53246_solr    ] o.a.s.c.ZkController Register node as live in ZooKeeper:/live_nodes/127.0.0.1:53246_solr
   [junit4]   2> 120712 INFO  (zkCallback-249-thread-1) [    ] o.a.s.c.c.ZkStateReader Updated live nodes from ZooKeeper... (1) -> (2)
   [junit4]   2> 120713 INFO  (zkCallback-247-thread-1) [    ] o.a.s.c.c.ZkStateReader Updated live nodes from ZooKeeper... (1) -> (2)
   [junit4]   2> 120715 DEBUG (OverseerAutoScalingTriggerThread-72085379152674821-127.0.0.1:53246_solr-n_0000000000) [    ] o.a.s.c.a.NodeLostTrigger NodeLostTrigger .auto_add_replicas - Initial livenodes: [127.0.0.1:53247_solr]
   [junit4]   2> 120715 DEBUG (OverseerAutoScalingTriggerThread-72085379152674821-127.0.0.1:53246_solr-n_0000000000) [    ] o.a.s.c.a.OverseerTriggerThread -- clean old nodeAdded markers
   [junit4]   2> 120715 DEBUG (OverseerAutoScalingTriggerThread-72085379152674821-127.0.0.1:53246_solr-n_0000000000) [    ] o.a.s.c.a.OverseerTriggerThread Current znodeVersion 1, lastZnodeVersion 1
   [junit4]   2> 120717 INFO  (zkCallback-258-thread-1) [    ] o.a.s.c.c.ZkStateReader Updated live nodes from ZooKeeper... (1) -> (2)
   [junit4]   2> 120718 DEBUG (ScheduledTrigger-383-thread-1) [    ] o.a.s.c.a.NodeLostTrigger Running NodeLostTrigger: .auto_add_replicas with currently live nodes: 2
   [junit4]   2> 121335 INFO  (jetty-launcher-231-thread-2) [n:127.0.0.1:53247_solr    ] o.a.s.m.r.SolrJmxReporter JMX monitoring for 'solr_53247.solr.node' (registry 'solr.node') enabled at server: com.sun.jmx.mbeanserver.JmxMBeanServer@1bdb1f3
   [junit4]   2> 121340 INFO  (jetty-launcher-231-thread-2) [n:127.0.0.1:53247_solr    ] o.a.s.m.r.SolrJmxReporter JMX monitoring for 'solr_53247.solr.jvm' (registry 'solr.jvm') enabled at server: com.sun.jmx.mbeanserver.JmxMBeanServer@1bdb1f3
   [junit4]   2> 121341 INFO  (jetty-launcher-231-thread-2) [n:127.0.0.1:53247_solr    ] o.a.s.m.r.SolrJmxReporter JMX monitoring for 'solr_53247.solr.jetty' (registry 'solr.jetty') enabled at server: com.sun.jmx.mbeanserver.JmxMBeanServer@1bdb1f3
   [junit4]   2> 121342 INFO  (jetty-launcher-231-thread-2) [n:127.0.0.1:53247_solr    ] o.a.s.c.CorePropertiesLocator Found 0 core definitions underneath C:\Users\jenkins\workspace\Lucene-Solr-7.x-Windows\solr\build\solr-core\test\J0\temp\solr.cloud.autoscaling.IndexSizeTriggerTest_229427976398B7AA-001\tempDir-001\node2\.
   [junit4]   2> 121347 INFO  (zkConnectionManagerCallback-264-thread-1) [    ] o.a.s.c.c.ConnectionManager zkClient has connected
   [junit4]   2> 121349 INFO  (jetty-launcher-231-thread-2) [n:127.0.0.1:53247_solr    ] o.a.s.c.c.ZkStateReader Updated live nodes from ZooKeeper... (0) -> (2)
   [junit4]   2> 121350 INFO  (jetty-launcher-231-thread-2) [n:127.0.0.1:53247_solr    ] o.a.s.c.s.i.ZkClientClusterStateProvider Cluster at 127.0.0.1:53242/solr ready
   [junit4]   2> 121720 DEBUG (ScheduledTrigger-383-thread-1) [    ] o.a.s.c.a.NodeLostTrigger Running NodeLostTrigger: .auto_add_replicas with currently live nodes: 2
   [junit4]   2> 121911 INFO  (jetty-launcher-231-thread-1) [n:127.0.0.1:53246_solr    ] o.a.s.m.r.SolrJmxReporter JMX monitoring for 'solr_53246.solr.node' (registry 'solr.node') enabled at server: com.sun.jmx.mbeanserver.JmxMBeanServer@1bdb1f3
   [junit4]   2> 121916 INFO  (jetty-launcher-231-thread-1) [n:127.0.0.1:53246_solr    ] o.a.s.m.r.SolrJmxReporter JMX monitoring for 'solr_53246.solr.jvm' (registry 'solr.jvm') enabled at server: com.sun.jmx.mbeanserver.JmxMBeanServer@1bdb1f3
   [junit4]   2> 121916 INFO  (jetty-launcher-231-thread-1) [n:127.0.0.1:53246_solr    ] o.a.s.m.r.SolrJmxReporter JMX monitoring for 'solr_53246.solr.jetty' (registry 'solr.jetty') enabled at server: com.sun.jmx.mbeanserver.JmxMBeanServer@1bdb1f3
   [junit4]   2> 121917 INFO  (jetty-launcher-231-thread-1) [n:127.0.0.1:53246_solr    ] o.a.s.c.CorePropertiesLocator Found 0 core definitions underneath C:\Users\jenkins\workspace\Lucene-Solr-7.x-Windows\solr\build\solr-core\test\J0\temp\solr.cloud.autoscaling.IndexSizeTriggerTest_229427976398B7AA-001\tempDir-001\node1\.
   [junit4]   2> 121945 INFO  (zkConnectionManagerCallback-266-thread-1) [    ] o.a.s.c.c.ConnectionManager zkClient has connected
   [junit4]   2> 121954 INFO  (zkConnectionManagerCallback-271-thread-1) [    ] o.a.s.c.c.ConnectionManager zkClient has connected
   [junit4]   2> 121955 INFO  (SUITE-IndexSizeTriggerTest-seed#[229427976398B7AA]-worker) [    ] o.a.s.c.c.ZkStateReader Updated live nodes from ZooKeeper... (0) -> (2)
   [junit4]   2> 121956 INFO  (SUITE-IndexSizeTriggerTest-seed#[229427976398B7AA]-worker) [    ] o.a.s.c.s.i.ZkClientClusterStateProvider Cluster at 127.0.0.1:53242/solr ready
   [junit4]   2> 121982 DEBUG (Simulated OverseerAutoScalingTriggerThread) [    ] o.a.s.c.a.OverseerTriggerThread Adding .auto_add_replicas and .scheduled_maintenance triggers
   [junit4]   2> 121982 DEBUG (Simulated OverseerAutoScalingTriggerThread) [    ] o.a.s.c.a.OverseerTriggerThread Refreshing /autoscaling.json with znode version 0
   [junit4]   2> 121983 DEBUG (Simulated OverseerAutoScalingTriggerThread) [    ] o.a.s.c.a.OverseerTriggerThread Current znodeVersion 0, lastZnodeVersion -1
   [junit4]   2> 121983 DEBUG (Simulated OverseerAutoScalingTriggerThread) [    ] o.a.s.c.a.OverseerTriggerThread Processed trigger updates upto znodeVersion 0
   [junit4]   2> 121985 DEBUG (Simulated OverseerAutoScalingTriggerThread) [    ] o.a.s.c.a.NodeLostTrigger NodeLostTrigger .auto_add_replicas - Initial livenodes: [127.0.0.1:10001_solr, 127.0.0.1:10000_solr]
   [junit4]   2> 121986 DEBUG (Simulated OverseerAutoScalingTriggerThread) [    ] o.a.s.c.a.OverseerTriggerThread -- clean old nodeAdded markers
   [junit4]   2> 121986 DEBUG (Simulated OverseerAutoScalingTriggerThread) [    ] o.a.s.c.a.OverseerTriggerThread Current znodeVersion 0, lastZnodeVersion 0
   [junit4]   2> 121986 DEBUG (ScheduledTrigger-392-thread-2) [    ] o.a.s.c.a.NodeLostTrigger Running NodeLostTrigger: .auto_add_replicas with currently live nodes: 2
   [junit4]   2> 122008 DEBUG (ScheduledTrigger-392-thread-2) [    ] o.a.s.c.a.NodeLostTrigger Running NodeLostTrigger: .auto_add_replicas with currently live nodes: 2
   [junit4]   2> 122029 DEBUG (ScheduledTrigger-392-thread-2) [    ] o.a.s.c.a.NodeLostTrigger Running NodeLostTrigger: .auto_add_replicas with currently live nodes: 2
   [junit4]   2> 122050 DEBUG (ScheduledTrigger-392-thread-2) [    ] o.a.s.c.a.NodeLostTrigger Running NodeLostTrigger: .auto_add_replicas with currently live nodes: 2
   [junit4]   2> 122070 DEBUG (ScheduledTrigger-392-thread-2) [    ] o.a.s.c.a.NodeLostTrigger Running NodeLostTrigger: .auto_add_replicas with currently live nodes: 2
   [junit4]   2> 122091 DEBUG (ScheduledTrigger-392-thread-1) [    ] o.a.s.c.a.NodeLostTrigger Running NodeLostTrigger: .auto_add_replicas with currently live nodes: 2
   [junit4]   2> 122112 DEBUG (ScheduledTrigger-392-thread-2) [    ] o.a.s.c.a.NodeLostTrigger Running NodeLostTrigger: .auto_add_replicas with currently live nodes: 2
   [junit4]   2> 122133 DEBUG (ScheduledTrigger-392-thread-1) [    ] o.a.s.c.a.NodeLostTrigger Running NodeLostTrigger: .auto_add_replicas with currently live nodes: 2
   [junit4]   2> 122153 DEBUG (ScheduledTrigger-392-thread-3) [    ] o.a.s.c.a.NodeLostTrigger Running NodeLostTrigger: .auto_add_replicas with currently live nodes: 2
   [junit4]   2> 122175 DEBUG (ScheduledTrigger-392-thread-2) [    ] o.a.s.c.a.NodeLostTrigger Running NodeLostTrigger: .auto_add_replicas with currently live nodes: 2
   [junit4]   2> 122197 DEBUG (ScheduledTrigger-392-thread-3) [    ] o.a.s.c.a.NodeLostTrigger Running NodeLostTrigger: .auto_add_replicas with currently live nodes: 2
   [junit4]   2> 122199 INFO  (TEST-IndexSizeTriggerTest.testMergeIntegration-seed#[229427976398B7AA]) [    ] o.a.s.SolrTestCaseJ4 ###Starting testMergeIntegration
   [junit4]   2> 122218 DEBUG (ScheduledTrigger-392-thread-4) [    ] o.a.s.c.a.NodeLostTrigger Running NodeLostTrigger: .auto_add_replicas with currently live nodes: 2
   [junit4]   2> 122238 DEBUG (ScheduledTrigger-392-thread-4) [    ] o.a.s.c.a.NodeLostTrigger Running NodeLostTrigger: .auto_add_replicas with currently live nodes: 2
   [junit4]   2> 122259 DEBUG (ScheduledTrigger-392-thread-4) [    ] o.a.s.c.a.NodeLostTrigger Running NodeLostTrigger: .auto_add_replicas with currently live nodes: 2
   [junit4]   2> 122264 DEBUG (simCloudManagerPool-391-thread-7) [    ] o.a.s.c.a.s.SimClusterStateProvider -- elect

[...truncated too long message...]

ode as live in ZooKeeper:/live_nodes/127.0.0.1:55801_solr
   [junit4]   2> 34212 INFO  (jetty-closer-84-thread-1) [    ] o.a.s.m.SolrMetricManager Closing metric reporters for registry=solr.cluster, tag=null
   [junit4]   2> 34214 INFO  (jetty-closer-84-thread-1) [    ] o.a.s.c.TransientSolrCoreCacheDefault Allocating transient cache for 2147483647 transient cores
   [junit4]   2> 34214 INFO  (jetty-closer-84-thread-1) [    ] o.a.s.c.Overseer Overseer (id=72085704471478277-127.0.0.1:55801_solr-n_0000000000) closing
   [junit4]   2> 34214 INFO  (jetty-closer-84-thread-2) [    ] o.a.s.c.ZkController Remove node as live in ZooKeeper:/live_nodes/127.0.0.1:55800_solr
   [junit4]   2> 34214 INFO  (zkCallback-99-thread-1) [    ] o.a.s.c.c.ZkStateReader Updated live nodes from ZooKeeper... (2) -> (1)
   [junit4]   2> 34214 INFO  (zkCallback-110-thread-1) [    ] o.a.s.c.c.ZkStateReader Updated live nodes from ZooKeeper... (2) -> (1)
   [junit4]   2> 34214 INFO  (zkCallback-101-thread-1) [    ] o.a.s.c.c.ZkStateReader Updated live nodes from ZooKeeper... (2) -> (1)
   [junit4]   2> 34214 INFO  (OverseerStateUpdate-72085704471478277-127.0.0.1:55801_solr-n_0000000000) [    ] o.a.s.c.Overseer Overseer Loop exiting : 127.0.0.1:55801_solr
   [junit4]   2> 34215 WARN  (OverseerAutoScalingTriggerThread-72085704471478277-127.0.0.1:55801_solr-n_0000000000) [    ] o.a.s.c.a.OverseerTriggerThread OverseerTriggerThread woken up but we are closed, exiting.
   [junit4]   2> 34216 DEBUG (jetty-closer-84-thread-1) [    ] o.a.s.c.a.ScheduledTriggers Shutting down scheduled thread pool executor now
   [junit4]   2> 34216 DEBUG (jetty-closer-84-thread-1) [    ] o.a.s.c.a.ScheduledTriggers Shutting down action executor now
   [junit4]   2> 34216 DEBUG (jetty-closer-84-thread-1) [    ] o.a.s.c.a.ScheduledTriggers Awaiting termination for action executor
   [junit4]   2> 34216 DEBUG (jetty-closer-84-thread-1) [    ] o.a.s.c.a.ScheduledTriggers Awaiting termination for scheduled thread pool executor
   [junit4]   2> 34218 INFO  (zkCallback-115-thread-1) [    ] o.a.s.c.c.ZkStateReader Updated live nodes from ZooKeeper... (2) -> (1)
   [junit4]   2> 34218 DEBUG (jetty-closer-84-thread-1) [    ] o.a.s.c.a.ScheduledTriggers ScheduledTriggers closed completely
   [junit4]   2> 34218 DEBUG (jetty-closer-84-thread-1) [    ] o.a.s.c.a.OverseerTriggerThread OverseerTriggerThread has been closed explicitly
   [junit4]   2> 34219 INFO  (jetty-closer-84-thread-2) [    ] o.a.s.m.SolrMetricManager Closing metric reporters for registry=solr.cluster, tag=null
   [junit4]   2> 34219 INFO  (jetty-closer-84-thread-2) [    ] o.a.s.c.TransientSolrCoreCacheDefault Allocating transient cache for 2147483647 transient cores
   [junit4]   2> 34222 INFO  (zkCallback-101-thread-2) [    ] o.a.s.c.c.ZkStateReader Updated live nodes from ZooKeeper... (1) -> (0)
   [junit4]   2> 34222 INFO  (zkCallback-115-thread-1) [    ] o.a.s.c.c.ZkStateReader Updated live nodes from ZooKeeper... (1) -> (0)
   [junit4]   2> 34222 INFO  (zkCallback-99-thread-2) [    ] o.a.s.c.c.ZkStateReader Updated live nodes from ZooKeeper... (1) -> (0)
   [junit4]   2> 34223 WARN  (NIOServerCxn.Factory:0.0.0.0/0.0.0.0:0) [    ] o.a.z.s.NIOServerCnxn Unable to read additional data from client sessionid 0x1001990f8680006, likely client has closed socket
   [junit4]   2> 34224 INFO  (jetty-closer-84-thread-2) [    ] o.e.j.s.h.ContextHandler Stopped o.e.j.s.ServletContextHandler@1185e17{/solr,null,UNAVAILABLE}
   [junit4]   2> 34224 INFO  (jetty-closer-84-thread-2) [    ] o.e.j.s.session node0 Stopped scavenging
   [junit4]   2> 35724 WARN  (zkCallback-110-thread-1) [    ] o.a.s.c.c.ZkStateReader ZooKeeper watch triggered, but Solr cannot talk to ZK: [KeeperErrorCode = Session expired for /live_nodes]
   [junit4]   2> 35726 INFO  (jetty-closer-84-thread-1) [    ] o.e.j.s.h.ContextHandler Stopped o.e.j.s.ServletContextHandler@43ed1{/solr,null,UNAVAILABLE}
   [junit4]   2> 35726 INFO  (jetty-closer-84-thread-1) [    ] o.e.j.s.session node0 Stopped scavenging
   [junit4]   2> 35727 ERROR (SUITE-IndexSizeTriggerTest-seed#[229427976398B7AA]-worker) [    ] o.a.z.s.ZooKeeperServer ZKShutdownHandler is not registered, so ZooKeeper server won't take any action on ERROR or SHUTDOWN server state changes
   [junit4]   2> 35727 INFO  (SUITE-IndexSizeTriggerTest-seed#[229427976398B7AA]-worker) [    ] o.a.s.c.ZkTestServer connecting to 127.0.0.1:55796 55796
   [junit4]   2> 35729 INFO  (Thread-42) [    ] o.a.s.c.ZkTestServer connecting to 127.0.0.1:55796 55796
   [junit4]   2> 35730 WARN  (Thread-42) [    ] o.a.s.c.ZkTestServer Watch limit violations: 
   [junit4]   2> Maximum concurrent create/delete watches above limit:
   [junit4]   2> 
   [junit4]   2> 	5	/solr/aliases.json
   [junit4]   2> 	5	/solr/clusterprops.json
   [junit4]   2> 	2	/solr/security.json
   [junit4]   2> 
   [junit4]   2> Maximum concurrent data watches above limit:
   [junit4]   2> 
   [junit4]   2> 	5	/solr/clusterstate.json
   [junit4]   2> 
   [junit4]   2> Maximum concurrent children watches above limit:
   [junit4]   2> 
   [junit4]   2> 	5	/solr/live_nodes
   [junit4]   2> 	5	/solr/collections
   [junit4]   2> 
   [junit4]   2> NOTE: leaving temporary files on disk at: C:\Users\jenkins\workspace\Lucene-Solr-7.x-Windows\solr\build\solr-core\test\J1\temp\solr.cloud.autoscaling.IndexSizeTriggerTest_229427976398B7AA-003
   [junit4]   2> May 25, 2018 1:30:07 PM com.carrotsearch.randomizedtesting.ThreadLeakControl checkThreadLeaks
   [junit4]   2> WARNING: Will linger awaiting termination of 2 leaked thread(s).
   [junit4]   2> NOTE: test params are: codec=Asserting(Lucene70): {}, docValues:{}, maxPointsInLeafNode=746, maxMBSortInHeap=7.254353552066426, sim=RandomSimilarity(queryNorm=false): {}, locale=uk, timezone=Australia/Canberra
   [junit4]   2> NOTE: Windows 10 10.0 x86/Oracle Corporation 1.8.0_172 (32-bit)/cpus=3,threads=1,free=39141512,total=65077248
   [junit4]   2> NOTE: All tests run in this JVM: [IndexSizeTriggerTest, IndexSizeTriggerTest, IndexSizeTriggerTest]
   [junit4] Completed [5/5 (5!)] on J1 in 4.89s, 4 tests, 1 failure, 3 skipped <<< FAILURES!
   [junit4] 
   [junit4] 
   [junit4] Tests with failures [seed: 229427976398B7AA]:
   [junit4]   - org.apache.solr.cloud.autoscaling.IndexSizeTriggerTest.testSplitIntegration
   [junit4]   - org.apache.solr.cloud.autoscaling.IndexSizeTriggerTest.testSplitIntegration
   [junit4]   - org.apache.solr.cloud.autoscaling.IndexSizeTriggerTest.testTrigger
   [junit4]   - org.apache.solr.cloud.autoscaling.IndexSizeTriggerTest.testTrigger
   [junit4]   - org.apache.solr.cloud.autoscaling.IndexSizeTriggerTest.testMergeIntegration
   [junit4]   - org.apache.solr.cloud.autoscaling.IndexSizeTriggerTest.testMergeIntegration
   [junit4]   - org.apache.solr.cloud.autoscaling.IndexSizeTriggerTest.testSplitIntegration
   [junit4]   - org.apache.solr.cloud.autoscaling.IndexSizeTriggerTest.testSplitIntegration
   [junit4]   - org.apache.solr.cloud.autoscaling.IndexSizeTriggerTest.testTrigger
   [junit4]   - org.apache.solr.cloud.autoscaling.IndexSizeTriggerTest.testMergeIntegration
   [junit4] 
   [junit4] 
   [junit4] JVM J0:     0.67 ..    32.77 =    32.09s
   [junit4] JVM J1:     0.68 ..    36.56 =    35.88s
   [junit4] Execution time total: 36 seconds
   [junit4] Tests summary: 5 suites, 20 tests, 2 errors, 8 failures, 3 ignored (3 assumptions)

BUILD FAILED
C:\Users\jenkins\workspace\Lucene-Solr-7.x-Windows\lucene\common-build.xml:1568: The following error occurred while executing this line:
C:\Users\jenkins\workspace\Lucene-Solr-7.x-Windows\lucene\common-build.xml:1092: There were test failures: 5 suites, 20 tests, 2 errors, 8 failures, 3 ignored (3 assumptions) [seed: 229427976398B7AA]

Total time: 38 seconds

[repro] Setting last failure code to 1

[repro] Failures:
[repro]   1/5 failed: org.apache.solr.common.util.TestTimeSource
[repro]   5/5 failed: org.apache.solr.cloud.autoscaling.IndexSizeTriggerTest
[repro] Exiting with code 1

C:\Users\jenkins\workspace\Lucene-Solr-7.x-Windows>IF EXIST lucene\build move /y lucene\build lucene\build.repro 
        1 dir(s) moved.

C:\Users\jenkins\workspace\Lucene-Solr-7.x-Windows>IF EXIST solr\build move /y solr\build solr\build.repro 
        1 dir(s) moved.

C:\Users\jenkins\workspace\Lucene-Solr-7.x-Windows>IF EXIST lucene\build.orig move /y lucene\build.orig lucene\build 
        1 dir(s) moved.

C:\Users\jenkins\workspace\Lucene-Solr-7.x-Windows>IF EXIST solr\build.orig move /y solr\build.orig solr\build 
        1 dir(s) moved.

C:\Users\jenkins\workspace\Lucene-Solr-7.x-Windows>exit 0 
Archiving artifacts
Setting ANT_1_8_2_HOME=C:\Users\jenkins\tools\hudson.tasks.Ant_AntInstallation\ANT_1.8.2
[WARNINGS] Parsing warnings in console log with parser Java Compiler (javac)
Setting ANT_1_8_2_HOME=C:\Users\jenkins\tools\hudson.tasks.Ant_AntInstallation\ANT_1.8.2
Setting ANT_1_8_2_HOME=C:\Users\jenkins\tools\hudson.tasks.Ant_AntInstallation\ANT_1.8.2
<Git Blamer> Using GitBlamer to create author and commit information for all warnings.
<Git Blamer> GIT_COMMIT=300ab00b4c75810a591750c785d47fcba2d65ebb, workspace=C:\Users\jenkins\workspace\Lucene-Solr-7.x-Windows
[WARNINGS] Computing warning deltas based on reference build #612
Recording test results
Setting ANT_1_8_2_HOME=C:\Users\jenkins\tools\hudson.tasks.Ant_AntInstallation\ANT_1.8.2
Build step 'Publish JUnit test result report' changed build result to UNSTABLE
Email was triggered for: Unstable (Test Failures)
Sending email for trigger: Unstable (Test Failures)
Setting ANT_1_8_2_HOME=C:\Users\jenkins\tools\hudson.tasks.Ant_AntInstallation\ANT_1.8.2
Setting ANT_1_8_2_HOME=C:\Users\jenkins\tools\hudson.tasks.Ant_AntInstallation\ANT_1.8.2
Setting ANT_1_8_2_HOME=C:\Users\jenkins\tools\hudson.tasks.Ant_AntInstallation\ANT_1.8.2
Setting ANT_1_8_2_HOME=C:\Users\jenkins\tools\hudson.tasks.Ant_AntInstallation\ANT_1.8.2

Mime
View raw message