lucene-dev mailing list archives

Site index · List index
Message view « Date » · « Thread »
Top « Date » · « Thread »
From Policeman Jenkins Server <jenk...@thetaphi.de>
Subject [JENKINS] Lucene-Solr-master-Windows (64bit/jdk-10) - Build # 7319 - Still Unstable!
Date Thu, 17 May 2018 02:43:35 GMT
Build: https://jenkins.thetaphi.de/job/Lucene-Solr-master-Windows/7319/
Java: 64bit/jdk-10 -XX:+UseCompressedOops -XX:+UseParallelGC

2 tests failed.
FAILED:  junit.framework.TestSuite.org.apache.solr.core.TestInfoStreamLogging

Error Message:
Could not remove the following files (in the order of attempts):    C:\Users\jenkins\workspace\Lucene-Solr-master-Windows\solr\build\solr-core\test\J0\temp\solr.core.TestInfoStreamLogging_7A6C652359C9E7BA-001\init-core-data-001: java.nio.file.NoSuchFileException: C:\Users\jenkins\workspace\Lucene-Solr-master-Windows\solr\build\solr-core\test\J0\temp\solr.core.TestInfoStreamLogging_7A6C652359C9E7BA-001\init-core-data-001 

Stack Trace:
java.io.IOException: Could not remove the following files (in the order of attempts):
   C:\Users\jenkins\workspace\Lucene-Solr-master-Windows\solr\build\solr-core\test\J0\temp\solr.core.TestInfoStreamLogging_7A6C652359C9E7BA-001\init-core-data-001: java.nio.file.NoSuchFileException: C:\Users\jenkins\workspace\Lucene-Solr-master-Windows\solr\build\solr-core\test\J0\temp\solr.core.TestInfoStreamLogging_7A6C652359C9E7BA-001\init-core-data-001

	at __randomizedtesting.SeedInfo.seed([7A6C652359C9E7BA]:0)
	at org.apache.lucene.util.IOUtils.rm(IOUtils.java:318)
	at org.apache.lucene.util.TestRuleTemporaryFilesCleanup.afterAlways(TestRuleTemporaryFilesCleanup.java:216)
	at com.carrotsearch.randomizedtesting.rules.TestRuleAdapter$1.afterAlways(TestRuleAdapter.java:31)
	at com.carrotsearch.randomizedtesting.rules.StatementAdapter.evaluate(StatementAdapter.java:43)
	at com.carrotsearch.randomizedtesting.rules.StatementAdapter.evaluate(StatementAdapter.java:36)
	at org.apache.lucene.util.TestRuleAssertionsRequired$1.evaluate(TestRuleAssertionsRequired.java:53)
	at org.apache.lucene.util.TestRuleMarkFailure$1.evaluate(TestRuleMarkFailure.java:47)
	at org.apache.lucene.util.TestRuleIgnoreAfterMaxFailures$1.evaluate(TestRuleIgnoreAfterMaxFailures.java:64)
	at org.apache.lucene.util.TestRuleIgnoreTestSuites$1.evaluate(TestRuleIgnoreTestSuites.java:54)
	at com.carrotsearch.randomizedtesting.rules.StatementAdapter.evaluate(StatementAdapter.java:36)
	at com.carrotsearch.randomizedtesting.ThreadLeakControl$StatementRunner.run(ThreadLeakControl.java:368)
	at java.base/java.lang.Thread.run(Thread.java:844)


FAILED:  junit.framework.TestSuite.org.apache.solr.servlet.DirectSolrConnectionTest

Error Message:
Could not remove the following files (in the order of attempts):    C:\Users\jenkins\workspace\Lucene-Solr-master-Windows\solr\build\solr-core\test\J0\temp\solr.servlet.DirectSolrConnectionTest_7A6C652359C9E7BA-001\init-core-data-001: java.nio.file.NoSuchFileException: C:\Users\jenkins\workspace\Lucene-Solr-master-Windows\solr\build\solr-core\test\J0\temp\solr.servlet.DirectSolrConnectionTest_7A6C652359C9E7BA-001\init-core-data-001 

Stack Trace:
java.io.IOException: Could not remove the following files (in the order of attempts):
   C:\Users\jenkins\workspace\Lucene-Solr-master-Windows\solr\build\solr-core\test\J0\temp\solr.servlet.DirectSolrConnectionTest_7A6C652359C9E7BA-001\init-core-data-001: java.nio.file.NoSuchFileException: C:\Users\jenkins\workspace\Lucene-Solr-master-Windows\solr\build\solr-core\test\J0\temp\solr.servlet.DirectSolrConnectionTest_7A6C652359C9E7BA-001\init-core-data-001

	at __randomizedtesting.SeedInfo.seed([7A6C652359C9E7BA]:0)
	at org.apache.lucene.util.IOUtils.rm(IOUtils.java:318)
	at org.apache.lucene.util.TestRuleTemporaryFilesCleanup.afterAlways(TestRuleTemporaryFilesCleanup.java:216)
	at com.carrotsearch.randomizedtesting.rules.TestRuleAdapter$1.afterAlways(TestRuleAdapter.java:31)
	at com.carrotsearch.randomizedtesting.rules.StatementAdapter.evaluate(StatementAdapter.java:43)
	at com.carrotsearch.randomizedtesting.rules.StatementAdapter.evaluate(StatementAdapter.java:36)
	at org.apache.lucene.util.TestRuleAssertionsRequired$1.evaluate(TestRuleAssertionsRequired.java:53)
	at org.apache.lucene.util.TestRuleMarkFailure$1.evaluate(TestRuleMarkFailure.java:47)
	at org.apache.lucene.util.TestRuleIgnoreAfterMaxFailures$1.evaluate(TestRuleIgnoreAfterMaxFailures.java:64)
	at org.apache.lucene.util.TestRuleIgnoreTestSuites$1.evaluate(TestRuleIgnoreTestSuites.java:54)
	at com.carrotsearch.randomizedtesting.rules.StatementAdapter.evaluate(StatementAdapter.java:36)
	at com.carrotsearch.randomizedtesting.ThreadLeakControl$StatementRunner.run(ThreadLeakControl.java:368)
	at java.base/java.lang.Thread.run(Thread.java:844)




Build Log:
[...truncated 12751 lines...]
   [junit4] Suite: org.apache.solr.servlet.DirectSolrConnectionTest
   [junit4]   2> 415658 INFO  (SUITE-DirectSolrConnectionTest-seed#[7A6C652359C9E7BA]-worker) [    ] o.a.s.SolrTestCaseJ4 SecureRandom sanity checks: test.solr.allowed.securerandom=null & java.security.egd=file:/dev/./urandom
   [junit4]   2> Creating dataDir: C:\Users\jenkins\workspace\Lucene-Solr-master-Windows\solr\build\solr-core\test\J0\temp\solr.servlet.DirectSolrConnectionTest_7A6C652359C9E7BA-001\init-core-data-001
   [junit4]   2> 415658 WARN  (SUITE-DirectSolrConnectionTest-seed#[7A6C652359C9E7BA]-worker) [    ] o.a.s.SolrTestCaseJ4 startTrackingSearchers: numOpens=22 numCloses=22
   [junit4]   2> 415658 INFO  (SUITE-DirectSolrConnectionTest-seed#[7A6C652359C9E7BA]-worker) [    ] o.a.s.SolrTestCaseJ4 Using PointFields (NUMERIC_POINTS_SYSPROP=true) w/NUMERIC_DOCVALUES_SYSPROP=false
   [junit4]   2> 415661 INFO  (SUITE-DirectSolrConnectionTest-seed#[7A6C652359C9E7BA]-worker) [    ] o.a.s.SolrTestCaseJ4 Randomized ssl (false) and clientAuth (false) via: @org.apache.solr.util.RandomizeSSL(reason="", value=0.0/0.0, ssl=0.0/0.0, clientAuth=0.0/0.0)
   [junit4]   2> 415662 INFO  (SUITE-DirectSolrConnectionTest-seed#[7A6C652359C9E7BA]-worker) [    ] o.a.s.SolrTestCaseJ4 ####initCore
   [junit4]   2> 415663 INFO  (SUITE-DirectSolrConnectionTest-seed#[7A6C652359C9E7BA]-worker) [    ] o.a.s.c.SolrResourceLoader [null] Added 2 libs to classloader, from paths: [/C:/Users/jenkins/workspace/Lucene-Solr-master-Windows/solr/core/src/test-files/solr/collection1/lib, /C:/Users/jenkins/workspace/Lucene-Solr-master-Windows/solr/core/src/test-files/solr/collection1/lib/classes]
   [junit4]   2> 415685 INFO  (SUITE-DirectSolrConnectionTest-seed#[7A6C652359C9E7BA]-worker) [    ] o.a.s.c.SolrConfig Using Lucene MatchVersion: 8.0.0
   [junit4]   2> 415703 INFO  (SUITE-DirectSolrConnectionTest-seed#[7A6C652359C9E7BA]-worker) [    ] o.a.s.s.IndexSchema [null] Schema name=test
   [junit4]   2> 415706 INFO  (SUITE-DirectSolrConnectionTest-seed#[7A6C652359C9E7BA]-worker) [    ] o.a.s.s.IndexSchema Loaded schema test/1.0 with uniqueid field id
   [junit4]   2> 415766 INFO  (SUITE-DirectSolrConnectionTest-seed#[7A6C652359C9E7BA]-worker) [    ] o.a.s.m.r.SolrJmxReporter JMX monitoring for 'solr.node' (registry 'solr.node') enabled at server: com.sun.jmx.mbeanserver.JmxMBeanServer@5373143a
   [junit4]   2> 415774 INFO  (SUITE-DirectSolrConnectionTest-seed#[7A6C652359C9E7BA]-worker) [    ] o.a.s.m.r.SolrJmxReporter JMX monitoring for 'solr.jvm' (registry 'solr.jvm') enabled at server: com.sun.jmx.mbeanserver.JmxMBeanServer@5373143a
   [junit4]   2> 415774 INFO  (SUITE-DirectSolrConnectionTest-seed#[7A6C652359C9E7BA]-worker) [    ] o.a.s.m.r.SolrJmxReporter JMX monitoring for 'solr.jetty' (registry 'solr.jetty') enabled at server: com.sun.jmx.mbeanserver.JmxMBeanServer@5373143a
   [junit4]   2> 415775 INFO  (coreLoadExecutor-2606-thread-1) [    ] o.a.s.c.TransientSolrCoreCacheDefault Allocating transient cache for 2147483647 transient cores
   [junit4]   2> 415790 INFO  (coreLoadExecutor-2606-thread-1) [    x:collection1] o.a.s.c.SolrResourceLoader [null] Added 2 libs to classloader, from paths: [/C:/Users/jenkins/workspace/Lucene-Solr-master-Windows/solr/core/src/test-files/solr/collection1/lib, /C:/Users/jenkins/workspace/Lucene-Solr-master-Windows/solr/core/src/test-files/solr/collection1/lib/classes]
   [junit4]   2> 415823 INFO  (coreLoadExecutor-2606-thread-1) [    x:collection1] o.a.s.c.SolrConfig Using Lucene MatchVersion: 8.0.0
   [junit4]   2> 415846 INFO  (coreLoadExecutor-2606-thread-1) [    x:collection1] o.a.s.s.IndexSchema [collection1] Schema name=test
   [junit4]   2> 415848 INFO  (coreLoadExecutor-2606-thread-1) [    x:collection1] o.a.s.s.IndexSchema Loaded schema test/1.0 with uniqueid field id
   [junit4]   2> 415848 INFO  (coreLoadExecutor-2606-thread-1) [    x:collection1] o.a.s.c.CoreContainer Creating SolrCore 'collection1' using configuration from instancedir C:\Users\jenkins\workspace\Lucene-Solr-master-Windows\solr\core\src\test-files\solr\collection1, trusted=true
   [junit4]   2> 415849 INFO  (coreLoadExecutor-2606-thread-1) [    x:collection1] o.a.s.m.r.SolrJmxReporter JMX monitoring for 'solr.core.collection1' (registry 'solr.core.collection1') enabled at server: com.sun.jmx.mbeanserver.JmxMBeanServer@5373143a
   [junit4]   2> 415849 INFO  (coreLoadExecutor-2606-thread-1) [    x:collection1] o.a.s.c.SolrCore solr.RecoveryStrategy.Builder
   [junit4]   2> 415849 INFO  (coreLoadExecutor-2606-thread-1) [    x:collection1] o.a.s.c.SolrCore [[collection1] ] Opening new SolrCore at [C:\Users\jenkins\workspace\Lucene-Solr-master-Windows\solr\core\src\test-files\solr\collection1], dataDir=[C:\Users\jenkins\workspace\Lucene-Solr-master-Windows\solr\build\solr-core\test\J0\temp\solr.servlet.DirectSolrConnectionTest_7A6C652359C9E7BA-001\init-core-data-001\]
   [junit4]   2> 415858 INFO  (coreLoadExecutor-2606-thread-1) [    x:collection1] o.a.s.u.RandomMergePolicy RandomMergePolicy wrapping class org.apache.lucene.index.AlcoholicMergePolicy: [AlcoholicMergePolicy: minMergeSize=0, mergeFactor=10, maxMergeSize=1475871163, maxMergeSizeForForcedMerge=9223372036854775807, calibrateSizeByDeletes=true, maxMergeDocs=2147483647, maxCFSSegmentSizeMB=8.796093022207999E12, noCFSRatio=0.1]
   [junit4]   2> 415985 INFO  (coreLoadExecutor-2606-thread-1) [    x:collection1] o.a.s.r.XSLTResponseWriter xsltCacheLifetimeSeconds=60
   [junit4]   2> 416080 INFO  (coreLoadExecutor-2606-thread-1) [    x:collection1] o.a.s.u.CommitTracker Hard AutoCommit: disabled
   [junit4]   2> 416080 INFO  (coreLoadExecutor-2606-thread-1) [    x:collection1] o.a.s.u.CommitTracker Soft AutoCommit: disabled
   [junit4]   2> 416085 INFO  (coreLoadExecutor-2606-thread-1) [    x:collection1] o.a.s.u.RandomMergePolicy RandomMergePolicy wrapping class org.apache.lucene.index.LogByteSizeMergePolicy: [LogByteSizeMergePolicy: minMergeSize=1677721, mergeFactor=13, maxMergeSize=2147483648, maxMergeSizeForForcedMerge=9223372036854775807, calibrateSizeByDeletes=false, maxMergeDocs=2147483647, maxCFSSegmentSizeMB=8.796093022207999E12, noCFSRatio=0.0]
   [junit4]   2> 416093 INFO  (coreLoadExecutor-2606-thread-1) [    x:collection1] o.a.s.s.SolrIndexSearcher Opening [Searcher@951422e[collection1] main]
   [junit4]   2> 416093 WARN  (coreLoadExecutor-2606-thread-1) [    x:collection1] o.a.s.r.ManagedResourceStorage Cannot write to config directory C:\Users\jenkins\workspace\Lucene-Solr-master-Windows\solr\core\src\test-files\solr\collection1\conf; switching to use InMemory storage instead.
   [junit4]   2> 416093 INFO  (coreLoadExecutor-2606-thread-1) [    x:collection1] o.a.s.h.ReplicationHandler Commits will be reserved for 10000ms.
   [junit4]   2> 416093 INFO  (searcherExecutor-2607-thread-1-processing-x:collection1) [    x:collection1] o.a.s.c.SolrCore [collection1] Registered new searcher Searcher@951422e[collection1] main{ExitableDirectoryReader(UninvertingDirectoryReader())}
   [junit4]   2> 416096 INFO  (SUITE-DirectSolrConnectionTest-seed#[7A6C652359C9E7BA]-worker) [    ] o.a.s.SolrTestCaseJ4 ####initCore end
   [junit4]   2> 416101 INFO  (TEST-DirectSolrConnectionTest.testSimpleRequest-seed#[7A6C652359C9E7BA]) [    ] o.a.s.SolrTestCaseJ4 ###Starting testSimpleRequest
   [junit4]   2> 416101 INFO  (TEST-DirectSolrConnectionTest.testSimpleRequest-seed#[7A6C652359C9E7BA]) [    ] o.a.s.c.S.Request [collection1]  webapp=null path=null params={q=*:*&echoParams=explicit&wt=xml&version=2.2} hits=0 status=0 QTime=0
   [junit4]   2> 416101 INFO  (TEST-DirectSolrConnectionTest.testSimpleRequest-seed#[7A6C652359C9E7BA]) [    ] o.a.s.SolrTestCaseJ4 ###Ending testSimpleRequest
   [junit4]   2> 416101 INFO  (TEST-DirectSolrConnectionTest.testInsertThenSelect-seed#[7A6C652359C9E7BA]) [    ] o.a.s.SolrTestCaseJ4 ###Starting testInsertThenSelect
   [junit4]   2> 416101 INFO  (TEST-DirectSolrConnectionTest.testInsertThenSelect-seed#[7A6C652359C9E7BA]) [    ] o.a.s.u.p.LogUpdateProcessorFactory [collection1]  webapp=null path=null params={stream.body=<delete><id>42</id></delete>}{delete=[42]} 0 0
   [junit4]   2> 416101 INFO  (TEST-DirectSolrConnectionTest.testInsertThenSelect-seed#[7A6C652359C9E7BA]) [    ] o.a.s.u.p.LogUpdateProcessorFactory [collection1]  webapp=null path=null params={stream.body=<add><doc><field+name%3D"id">42</field><field+name%3D"subject">Kittens!!!+€</field></doc></add>}{add=[42]} 0 0
   [junit4]   2> 416132 INFO  (TEST-DirectSolrConnectionTest.testInsertThenSelect-seed#[7A6C652359C9E7BA]) [    ] o.a.s.u.DirectUpdateHandler2 start commit{,optimize=false,openSearcher=true,waitSearcher=true,expungeDeletes=false,softCommit=false,prepareCommit=false}
   [junit4]   2> 416132 INFO  (TEST-DirectSolrConnectionTest.testInsertThenSelect-seed#[7A6C652359C9E7BA]) [    ] o.a.s.u.SolrIndexWriter Calling setCommitData with IW:org.apache.solr.update.SolrIndexWriter@2d7844bc commitCommandVersion:0
   [junit4]   2> 416283 INFO  (TEST-DirectSolrConnectionTest.testInsertThenSelect-seed#[7A6C652359C9E7BA]) [    ] o.a.s.s.SolrIndexSearcher Opening [Searcher@3a2d60a3[collection1] main]
   [junit4]   2> 416285 INFO  (searcherExecutor-2607-thread-1) [    ] o.a.s.c.SolrCore [collection1] Registered new searcher Searcher@3a2d60a3[collection1] main{ExitableDirectoryReader(UninvertingDirectoryReader(Uninverting(_0(8.0.0):c1)))}
   [junit4]   2> 416285 INFO  (TEST-DirectSolrConnectionTest.testInsertThenSelect-seed#[7A6C652359C9E7BA]) [    ] o.a.s.u.DirectUpdateHandler2 end_commit_flush
   [junit4]   2> 416285 INFO  (TEST-DirectSolrConnectionTest.testInsertThenSelect-seed#[7A6C652359C9E7BA]) [    ] o.a.s.u.p.LogUpdateProcessorFactory [collection1]  webapp=null path=null params={stream.body=<commit/>}{commit=} 0 151
   [junit4]   2> 416285 INFO  (TEST-DirectSolrConnectionTest.testInsertThenSelect-seed#[7A6C652359C9E7BA]) [    ] o.a.s.c.S.Request [collection1]  webapp=null path=null params={q=id:42&wt=xml} hits=1 status=0 QTime=0
   [junit4]   2> 416285 INFO  (TEST-DirectSolrConnectionTest.testInsertThenSelect-seed#[7A6C652359C9E7BA]) [    ] o.a.s.u.p.LogUpdateProcessorFactory [collection1]  webapp=null path=null params={}{delete=[42]} 0 0
   [junit4]   2> 416285 INFO  (TEST-DirectSolrConnectionTest.testInsertThenSelect-seed#[7A6C652359C9E7BA]) [    ] o.a.s.u.p.LogUpdateProcessorFactory [collection1]  webapp=null path=null params={}{add=[42]} 0 0
   [junit4]   2> 416285 INFO  (TEST-DirectSolrConnectionTest.testInsertThenSelect-seed#[7A6C652359C9E7BA]) [    ] o.a.s.u.DirectUpdateHandler2 start commit{,optimize=false,openSearcher=true,waitSearcher=true,expungeDeletes=false,softCommit=false,prepareCommit=false}
   [junit4]   2> 416285 INFO  (TEST-DirectSolrConnectionTest.testInsertThenSelect-seed#[7A6C652359C9E7BA]) [    ] o.a.s.u.SolrIndexWriter Calling setCommitData with IW:org.apache.solr.update.SolrIndexWriter@2d7844bc commitCommandVersion:0
   [junit4]   2> 416399 INFO  (TEST-DirectSolrConnectionTest.testInsertThenSelect-seed#[7A6C652359C9E7BA]) [    ] o.a.s.s.SolrIndexSearcher Opening [Searcher@68f76ecc[collection1] main]
   [junit4]   2> 416402 INFO  (searcherExecutor-2607-thread-1) [    ] o.a.s.c.SolrCore [collection1] Registered new searcher Searcher@68f76ecc[collection1] main{ExitableDirectoryReader(UninvertingDirectoryReader(Uninverting(_1(8.0.0):c1)))}
   [junit4]   2> 416411 INFO  (TEST-DirectSolrConnectionTest.testInsertThenSelect-seed#[7A6C652359C9E7BA]) [    ] o.a.s.u.DirectUpdateHandler2 end_commit_flush
   [junit4]   2> 416413 INFO  (TEST-DirectSolrConnectionTest.testInsertThenSelect-seed#[7A6C652359C9E7BA]) [    ] o.a.s.u.p.LogUpdateProcessorFactory [collection1]  webapp=null path=null params={}{commit=} 0 127
   [junit4]   2> 416413 INFO  (TEST-DirectSolrConnectionTest.testInsertThenSelect-seed#[7A6C652359C9E7BA]) [    ] o.a.s.c.S.Request [collection1]  webapp=null path=null params={q=id:42&wt=xml} hits=1 status=0 QTime=0
   [junit4]   2> 416413 INFO  (TEST-DirectSolrConnectionTest.testInsertThenSelect-seed#[7A6C652359C9E7BA]) [    ] o.a.s.SolrTestCaseJ4 ###Ending testInsertThenSelect
   [junit4]   2> 416413 INFO  (SUITE-DirectSolrConnectionTest-seed#[7A6C652359C9E7BA]-worker) [    ] o.a.s.SolrTestCaseJ4 ###deleteCore
   [junit4]   2> 416413 INFO  (SUITE-DirectSolrConnectionTest-seed#[7A6C652359C9E7BA]-worker) [    ] o.a.s.c.CoreContainer Shutting down CoreContainer instance=560780260
   [junit4]   2> 416413 INFO  (SUITE-DirectSolrConnectionTest-seed#[7A6C652359C9E7BA]-worker) [    ] o.a.s.m.SolrMetricManager Closing metric reporters for registry=solr.node, tag=null
   [junit4]   2> 416413 INFO  (SUITE-DirectSolrConnectionTest-seed#[7A6C652359C9E7BA]-worker) [    ] o.a.s.m.r.SolrJmxReporter Closing reporter [org.apache.solr.metrics.reporters.SolrJmxReporter@34ee6612: rootName = null, domain = solr.node, service url = null, agent id = null] for registry solr.node / com.codahale.metrics.MetricRegistry@7b79afa1
   [junit4]   2> 416424 INFO  (SUITE-DirectSolrConnectionTest-seed#[7A6C652359C9E7BA]-worker) [    ] o.a.s.m.SolrMetricManager Closing metric reporters for registry=solr.jvm, tag=null
   [junit4]   2> 416424 INFO  (SUITE-DirectSolrConnectionTest-seed#[7A6C652359C9E7BA]-worker) [    ] o.a.s.m.r.SolrJmxReporter Closing reporter [org.apache.solr.metrics.reporters.SolrJmxReporter@1fca46c1: rootName = null, domain = solr.jvm, service url = null, agent id = null] for registry solr.jvm / com.codahale.metrics.MetricRegistry@7b111fc
   [junit4]   2> 416424 INFO  (SUITE-DirectSolrConnectionTest-seed#[7A6C652359C9E7BA]-worker) [    ] o.a.s.m.SolrMetricManager Closing metric reporters for registry=solr.jetty, tag=null
   [junit4]   2> 416424 INFO  (SUITE-DirectSolrConnectionTest-seed#[7A6C652359C9E7BA]-worker) [    ] o.a.s.m.r.SolrJmxReporter Closing reporter [org.apache.solr.metrics.reporters.SolrJmxReporter@79b5676f: rootName = null, domain = solr.jetty, service url = null, agent id = null] for registry solr.jetty / com.codahale.metrics.MetricRegistry@4cfe851e
   [junit4]   2> 416494 INFO  (coreCloseExecutor-2611-thread-1) [    x:collection1] o.a.s.c.SolrCore [collection1]  CLOSING SolrCore org.apache.solr.core.SolrCore@2a35841e
   [junit4]   2> 416494 INFO  (coreCloseExecutor-2611-thread-1) [    x:collection1] o.a.s.m.SolrMetricManager Closing metric reporters for registry=solr.core.collection1, tag=2a35841e
   [junit4]   2> 416494 INFO  (coreCloseExecutor-2611-thread-1) [    x:collection1] o.a.s.m.r.SolrJmxReporter Closing reporter [org.apache.solr.metrics.reporters.SolrJmxReporter@3064db69: rootName = null, domain = solr.core.collection1, service url = null, agent id = null] for registry solr.core.collection1 / com.codahale.metrics.MetricRegistry@3e0f7610
   [junit4]   2> 416527 INFO  (SUITE-DirectSolrConnectionTest-seed#[7A6C652359C9E7BA]-worker) [    ] o.a.s.SolrTestCaseJ4 ------------------------------------------------------- Done waiting for tracked resources to be released
   [junit4]   2> NOTE: test params are: codec=CheapBastard, sim=Asserting(org.apache.lucene.search.similarities.AssertingSimilarity@4a6c93b), locale=sn, timezone=Atlantic/Azores
   [junit4]   2> NOTE: Windows 10 10.0 amd64/Oracle Corporation 10 (64-bit)/cpus=3,threads=1,free=114021616,total=349175808
   [junit4]   2> NOTE: All tests run in this JVM: [DateMathParserTest, InfoHandlerTest, TestHdfsBackupRestoreCore, TestSubQueryTransformerCrossCore, TestConfigSetsAPIZkFailure, OutputWriterTest, ClassificationUpdateProcessorIntegrationTest, TestLuceneIndexBackCompat, TestSearcherReuse, CheckHdfsIndexTest, BigEndianAscendingWordSerializerTest, TestSSLRandomization, TestFieldTypeResource, DirectUpdateHandlerOptimizeTest, ChaosMonkeySafeLeaderWithPullReplicasTest, LeaderElectionTest, DeleteShardTest, TestNestedDocsSort, CoreAdminCreateDiscoverTest, HLLSerializationTest, SolrCoreTest, TestSolrJ, OpenCloseCoreStressTest, TestLegacyNumericRangeQueryBuilder, AnalysisAfterCoreReloadTest, TestPayloadCheckQParserPlugin, TestComplexPhraseLeadingWildcard, TestFieldCacheReopen, DistributedExpandComponentTest, SolrIndexConfigTest, TestScoreJoinQPScore, DirectoryFactoryTest, RecoveryZkTest, TestJettySolrRunner, TestExactStatsCache, TestSolrConfigHandler, SOLR749Test, TestIndexSearcher, FileUtilsTest, TestSolrDeletionPolicy1, TestManagedSynonymFilterFactory, TestBulkSchemaConcurrent, TestPolicyCloud, MissingSegmentRecoveryTest, AddSchemaFieldsUpdateProcessorFactoryTest, TestZkAclsWithHadoopAuth, TestIntervalFaceting, LIROnShardRestartTest, TermVectorComponentDistributedTest, GraphQueryTest, TestConfigSets, DateFieldTest, TestDistribStateManager, TestPullReplica, PluginInfoTest, HdfsUnloadDistributedZkTest, StressHdfsTest, FacetPivotSmallTest, TestBlendedInfixSuggestions, CdcrBidirectionalTest, HdfsRecoverLeaseTest, ReplicaListTransformerTest, TestStressLiveNodes, SolrSlf4jReporterTest, TestFaceting, CopyFieldTest, TestCloudJSONFacetJoinDomain, RAMDirectoryFactoryTest, SolrJmxReporterCloudTest, TestOmitPositions, ScheduledTriggerTest, TestSolrCloudWithKerberosAlt, SolrCloudExampleTest, TestPolicyCloud, HttpPartitionOnCommitTest, TolerantUpdateProcessorTest, DirectSolrConnectionTest]
   [junit4]   2> NOTE: reproduce with: ant test  -Dtestcase=DirectSolrConnectionTest -Dtests.seed=7A6C652359C9E7BA -Dtests.slow=true -Dtests.locale=sn -Dtests.timezone=Atlantic/Azores -Dtests.asserts=true -Dtests.file.encoding=Cp1252
   [junit4] ERROR   0.00s J0 | DirectSolrConnectionTest (suite) <<<
   [junit4]    > Throwable #1: java.io.IOException: Could not remove the following files (in the order of attempts):
   [junit4]    >    C:\Users\jenkins\workspace\Lucene-Solr-master-Windows\solr\build\solr-core\test\J0\temp\solr.servlet.DirectSolrConnectionTest_7A6C652359C9E7BA-001\init-core-data-001: java.nio.file.NoSuchFileException: C:\Users\jenkins\workspace\Lucene-Solr-master-Windows\solr\build\solr-core\test\J0\temp\solr.servlet.DirectSolrConnectionTest_7A6C652359C9E7BA-001\init-core-data-001
   [junit4]    > 	at __randomizedtesting.SeedInfo.seed([7A6C652359C9E7BA]:0)
   [junit4]    > 	at org.apache.lucene.util.IOUtils.rm(IOUtils.java:318)
   [junit4]    > 	at java.base/java.lang.Thread.run(Thread.java:844)
   [junit4] Completed [110/806 (1!)] on J0 in 1.10s, 2 tests, 1 error <<< FAILURES!

[...truncated 531 lines...]
   [junit4] Suite: org.apache.solr.core.TestInfoStreamLogging
   [junit4]   2> 1128710 INFO  (SUITE-TestInfoStreamLogging-seed#[7A6C652359C9E7BA]-worker) [    ] o.a.s.SolrTestCaseJ4 SecureRandom sanity checks: test.solr.allowed.securerandom=null & java.security.egd=file:/dev/./urandom
   [junit4]   2> Creating dataDir: C:\Users\jenkins\workspace\Lucene-Solr-master-Windows\solr\build\solr-core\test\J0\temp\solr.core.TestInfoStreamLogging_7A6C652359C9E7BA-001\init-core-data-001
   [junit4]   2> 1128712 WARN  (SUITE-TestInfoStreamLogging-seed#[7A6C652359C9E7BA]-worker) [    ] o.a.s.SolrTestCaseJ4 startTrackingSearchers: numOpens=1 numCloses=1
   [junit4]   2> 1128722 INFO  (SUITE-TestInfoStreamLogging-seed#[7A6C652359C9E7BA]-worker) [    ] o.a.s.SolrTestCaseJ4 Using PointFields (NUMERIC_POINTS_SYSPROP=true) w/NUMERIC_DOCVALUES_SYSPROP=true
   [junit4]   2> 1128724 INFO  (SUITE-TestInfoStreamLogging-seed#[7A6C652359C9E7BA]-worker) [    ] o.a.s.SolrTestCaseJ4 Randomized ssl (false) and clientAuth (true) via: @org.apache.solr.util.RandomizeSSL(reason="", value=0.0/0.0, ssl=0.0/0.0, clientAuth=0.0/0.0)
   [junit4]   2> 1128725 INFO  (SUITE-TestInfoStreamLogging-seed#[7A6C652359C9E7BA]-worker) [    ] o.a.s.SolrTestCaseJ4 ####initCore
   [junit4]   2> 1128726 INFO  (SUITE-TestInfoStreamLogging-seed#[7A6C652359C9E7BA]-worker) [    ] o.a.s.c.SolrResourceLoader [null] Added 2 libs to classloader, from paths: [/C:/Users/jenkins/workspace/Lucene-Solr-master-Windows/solr/core/src/test-files/solr/collection1/lib, /C:/Users/jenkins/workspace/Lucene-Solr-master-Windows/solr/core/src/test-files/solr/collection1/lib/classes]
   [junit4]   2> 1128752 INFO  (SUITE-TestInfoStreamLogging-seed#[7A6C652359C9E7BA]-worker) [    ] o.a.s.u.SolrIndexConfig IndexWriter infoStream solr logging is enabled
   [junit4]   2> 1128781 INFO  (SUITE-TestInfoStreamLogging-seed#[7A6C652359C9E7BA]-worker) [    ] o.a.s.c.SolrConfig Using Lucene MatchVersion: 8.0.0
   [junit4]   2> 1128793 INFO  (SUITE-TestInfoStreamLogging-seed#[7A6C652359C9E7BA]-worker) [    ] o.a.s.s.IndexSchema [null] Schema name=test
   [junit4]   2> 1128913 INFO  (SUITE-TestInfoStreamLogging-seed#[7A6C652359C9E7BA]-worker) [    ] o.a.s.s.IndexSchema Loaded schema test/1.0 with uniqueid field id
   [junit4]   2> 1129112 INFO  (SUITE-TestInfoStreamLogging-seed#[7A6C652359C9E7BA]-worker) [    ] o.a.s.m.r.SolrJmxReporter JMX monitoring for 'solr.node' (registry 'solr.node') enabled at server: com.sun.jmx.mbeanserver.JmxMBeanServer@5373143a
   [junit4]   2> 1129145 INFO  (SUITE-TestInfoStreamLogging-seed#[7A6C652359C9E7BA]-worker) [    ] o.a.s.m.r.SolrJmxReporter JMX monitoring for 'solr.jvm' (registry 'solr.jvm') enabled at server: com.sun.jmx.mbeanserver.JmxMBeanServer@5373143a
   [junit4]   2> 1129145 INFO  (SUITE-TestInfoStreamLogging-seed#[7A6C652359C9E7BA]-worker) [    ] o.a.s.m.r.SolrJmxReporter JMX monitoring for 'solr.jetty' (registry 'solr.jetty') enabled at server: com.sun.jmx.mbeanserver.JmxMBeanServer@5373143a
   [junit4]   2> 1129171 INFO  (coreLoadExecutor-5844-thread-1) [    ] o.a.s.c.TransientSolrCoreCacheDefault Allocating transient cache for 2147483647 transient cores
   [junit4]   2> 1129174 INFO  (coreLoadExecutor-5844-thread-1) [    x:collection1] o.a.s.c.SolrResourceLoader [null] Added 2 libs to classloader, from paths: [/C:/Users/jenkins/workspace/Lucene-Solr-master-Windows/solr/core/src/test-files/solr/collection1/lib, /C:/Users/jenkins/workspace/Lucene-Solr-master-Windows/solr/core/src/test-files/solr/collection1/lib/classes]
   [junit4]   2> 1129196 INFO  (coreLoadExecutor-5844-thread-1) [    x:collection1] o.a.s.u.SolrIndexConfig IndexWriter infoStream solr logging is enabled
   [junit4]   2> 1129212 INFO  (coreLoadExecutor-5844-thread-1) [    x:collection1] o.a.s.c.SolrConfig Using Lucene MatchVersion: 8.0.0
   [junit4]   2> 1129219 INFO  (coreLoadExecutor-5844-thread-1) [    x:collection1] o.a.s.s.IndexSchema [collection1] Schema name=test
   [junit4]   2> 1129373 INFO  (coreLoadExecutor-5844-thread-1) [    x:collection1] o.a.s.s.IndexSchema Loaded schema test/1.0 with uniqueid field id
   [junit4]   2> 1129403 INFO  (coreLoadExecutor-5844-thread-1) [    x:collection1] o.a.s.c.CoreContainer Creating SolrCore 'collection1' using configuration from instancedir C:\Users\jenkins\workspace\Lucene-Solr-master-Windows\solr\core\src\test-files\solr\collection1, trusted=true
   [junit4]   2> 1129403 INFO  (coreLoadExecutor-5844-thread-1) [    x:collection1] o.a.s.m.r.SolrJmxReporter JMX monitoring for 'solr.core.collection1' (registry 'solr.core.collection1') enabled at server: com.sun.jmx.mbeanserver.JmxMBeanServer@5373143a
   [junit4]   2> 1129403 INFO  (coreLoadExecutor-5844-thread-1) [    x:collection1] o.a.s.c.SolrCore solr.RecoveryStrategy.Builder
   [junit4]   2> 1129403 INFO  (coreLoadExecutor-5844-thread-1) [    x:collection1] o.a.s.c.SolrCore [[collection1] ] Opening new SolrCore at [C:\Users\jenkins\workspace\Lucene-Solr-master-Windows\solr\core\src\test-files\solr\collection1], dataDir=[C:\Users\jenkins\workspace\Lucene-Solr-master-Windows\solr\build\solr-core\test\J0\temp\solr.core.TestInfoStreamLogging_7A6C652359C9E7BA-001\init-core-data-001\]
   [junit4]   2> 1129488 INFO  (coreLoadExecutor-5844-thread-1) [    x:collection1] o.a.s.u.LoggingInfoStream [IFD][coreLoadExecutor-5844-thread-1]: init: current segments file is "segments"; deletionPolicy=org.apache.solr.core.IndexDeletionPolicyWrapper@46db9937
   [junit4]   2> 1129488 INFO  (coreLoadExecutor-5844-thread-1) [    x:collection1] o.a.s.u.LoggingInfoStream [IFD][coreLoadExecutor-5844-thread-1]: now checkpoint "" [0 segments ; isCommit = false]
   [junit4]   2> 1129488 INFO  (coreLoadExecutor-5844-thread-1) [    x:collection1] o.a.s.u.LoggingInfoStream [IFD][coreLoadExecutor-5844-thread-1]: 0 msec to checkpoint
   [junit4]   2> 1129488 INFO  (coreLoadExecutor-5844-thread-1) [    x:collection1] o.a.s.u.LoggingInfoStream [IW][coreLoadExecutor-5844-thread-1]: init: create=true reader=null
   [junit4]   2> 1129488 INFO  (coreLoadExecutor-5844-thread-1) [    x:collection1] o.a.s.u.LoggingInfoStream [IW][coreLoadExecutor-5844-thread-1]: 
   [junit4]   2> dir=NRTCachingDirectory(MMapDirectory@C:\Users\jenkins\workspace\Lucene-Solr-master-Windows\solr\build\solr-core\test\J0\temp\solr.core.TestInfoStreamLogging_7A6C652359C9E7BA-001\init-core-data-001\index lockFactory=org.apache.lucene.store.NativeFSLockFactory@7f1ac6c1; maxCacheMB=48.0 maxMergeSizeMB=4.0)
   [junit4]   2> index=
   [junit4]   2> version=8.0.0
   [junit4]   2> analyzer=org.apache.solr.update.SolrIndexConfig$DelayedSchemaAnalyzer
   [junit4]   2> ramBufferSizeMB=100.0
   [junit4]   2> maxBufferedDocs=-1
   [junit4]   2> mergedSegmentWarmer=null
   [junit4]   2> delPolicy=org.apache.solr.core.IndexDeletionPolicyWrapper
   [junit4]   2> commit=null
   [junit4]   2> openMode=CREATE
   [junit4]   2> similarity=org.apache.solr.search.similarities.MockConfigurableSimilarity
   [junit4]   2> mergeScheduler=ConcurrentMergeScheduler: maxThreadCount=-1, maxMergeCount=-1, ioThrottle=true
   [junit4]   2> codec=CheapBastard
   [junit4]   2> infoStream=org.apache.solr.update.LoggingInfoStream
   [junit4]   2> mergePolicy=[TieredMergePolicy: maxMergeAtOnce=10, maxMergeAtOnceExplicit=30, maxMergedSegmentMB=5120.0, floorSegmentMB=2.0, forceMergeDeletesPctAllowed=10.0, segmentsPerTier=10.0, maxCFSSegmentSizeMB=8.796093022207999E12, noCFSRatio=0.1
   [junit4]   2> indexerThreadPool=org.apache.lucene.index.DocumentsWriterPerThreadPool@7b3b2a27
   [junit4]   2> readerPooling=true
   [junit4]   2> perThreadHardLimitMB=1945
   [junit4]   2> useCompoundFile=false
   [junit4]   2> commitOnClose=true
   [junit4]   2> indexSort=null
   [junit4]   2> checkPendingFlushOnUpdate=true
   [junit4]   2> softDeletesField=null
   [junit4]   2> writer=org.apache.solr.update.SolrIndexWriter@33971ba0
   [junit4]   2> 
   [junit4]   2> 1129488 INFO  (coreLoadExecutor-5844-thread-1) [    x:collection1] o.a.s.u.LoggingInfoStream [IW][coreLoadExecutor-5844-thread-1]: MMapDirectory.UNMAP_SUPPORTED=true
   [junit4]   2> 1129488 INFO  (coreLoadExecutor-5844-thread-1) [    x:collection1] o.a.s.u.LoggingInfoStream [IW][coreLoadExecutor-5844-thread-1]: now flush at close
   [junit4]   2> 1129488 INFO  (coreLoadExecutor-5844-thread-1) [    x:collection1] o.a.s.u.LoggingInfoStream [IW][coreLoadExecutor-5844-thread-1]:   start flush: applyAllDeletes=true
   [junit4]   2> 1129488 INFO  (coreLoadExecutor-5844-thread-1) [    x:collection1] o.a.s.u.LoggingInfoStream [IW][coreLoadExecutor-5844-thread-1]:   index before flush 
   [junit4]   2> 1129488 INFO  (coreLoadExecutor-5844-thread-1) [    x:collection1] o.a.s.u.LoggingInfoStream [DW][coreLoadExecutor-5844-thread-1]: startFullFlush
   [junit4]   2> 1129488 INFO  (coreLoadExecutor-5844-thread-1) [    x:collection1] o.a.s.u.LoggingInfoStream [DW][coreLoadExecutor-5844-thread-1]: coreLoadExecutor-5844-thread-1 finishFullFlush success=true
   [junit4]   2> 1129488 INFO  (coreLoadExecutor-5844-thread-1) [    x:collection1] o.a.s.u.LoggingInfoStream [IW][coreLoadExecutor-5844-thread-1]: now apply all deletes for all segments buffered updates bytesUsed=0 reader pool bytesUsed=0
   [junit4]   2> 1129488 INFO  (coreLoadExecutor-5844-thread-1) [    x:collection1] o.a.s.u.LoggingInfoStream [BD][coreLoadExecutor-5844-thread-1]: waitApply: no deletes to apply
   [junit4]   2> 1129496 INFO  (coreLoadExecutor-5844-thread-1) [    x:collection1] o.a.s.u.LoggingInfoStream [MS][coreLoadExecutor-5844-thread-1]: initDynamicDefaults spins=true maxThreadCount=1 maxMergeCount=6
   [junit4]   2> 1129496 INFO  (coreLoadExecutor-5844-thread-1) [    x:collection1] o.a.s.u.LoggingInfoStream [MS][coreLoadExecutor-5844-thread-1]: updateMergeThreads ioThrottle=true targetMBPerSec=10240.0 MB/sec
   [junit4]   2> 1129496 INFO  (coreLoadExecutor-5844-thread-1) [    x:collection1] o.a.s.u.LoggingInfoStream [MS][coreLoadExecutor-5844-thread-1]: now merge
   [junit4]   2> 1129496 INFO  (coreLoadExecutor-5844-thread-1) [    x:collection1] o.a.s.u.LoggingInfoStream [MS][coreLoadExecutor-5844-thread-1]:   index: 
   [junit4]   2> 1129496 INFO  (coreLoadExecutor-5844-thread-1) [    x:collection1] o.a.s.u.LoggingInfoStream [MS][coreLoadExecutor-5844-thread-1]:   no more merges pending; now return
   [junit4]   2> 1129496 INFO  (coreLoadExecutor-5844-thread-1) [    x:collection1] o.a.s.u.LoggingInfoStream [IW][coreLoadExecutor-5844-thread-1]: waitForMerges
   [junit4]   2> 1129496 INFO  (coreLoadExecutor-5844-thread-1) [    x:collection1] o.a.s.u.LoggingInfoStream [IW][coreLoadExecutor-5844-thread-1]: waitForMerges done
   [junit4]   2> 1129496 INFO  (coreLoadExecutor-5844-thread-1) [    x:collection1] o.a.s.u.LoggingInfoStream [IW][coreLoadExecutor-5844-thread-1]: commit: start
   [junit4]   2> 1129496 INFO  (coreLoadExecutor-5844-thread-1) [    x:collection1] o.a.s.u.LoggingInfoStream [IW][coreLoadExecutor-5844-thread-1]: commit: enter lock
   [junit4]   2> 1129496 INFO  (coreLoadExecutor-5844-thread-1) [    x:collection1] o.a.s.u.LoggingInfoStream [IW][coreLoadExecutor-5844-thread-1]: commit: now prepare
   [junit4]   2> 1129496 INFO  (coreLoadExecutor-5844-thread-1) [    x:collection1] o.a.s.u.LoggingInfoStream [IW][coreLoadExecutor-5844-thread-1]: prepareCommit: flush
   [junit4]   2> 1129496 INFO  (coreLoadExecutor-5844-thread-1) [    x:collection1] o.a.s.u.LoggingInfoStream [IW][coreLoadExecutor-5844-thread-1]:   index before flush 
   [junit4]   2> 1129496 INFO  (coreLoadExecutor-5844-thread-1) [    x:collection1] o.a.s.u.LoggingInfoStream [DW][coreLoadExecutor-5844-thread-1]: startFullFlush
   [junit4]   2> 1129496 INFO  (coreLoadExecutor-5844-thread-1) [    x:collection1] o.a.s.u.LoggingInfoStream [IW][coreLoadExecutor-5844-thread-1]: now apply all deletes for all segments buffered updates bytesUsed=0 reader pool bytesUsed=0
   [junit4]   2> 1129496 INFO  (coreLoadExecutor-5844-thread-1) [    x:collection1] o.a.s.u.LoggingInfoStream [BD][coreLoadExecutor-5844-thread-1]: waitApply: no deletes to apply
   [junit4]   2> 1129496 INFO  (coreLoadExecutor-5844-thread-1) [    x:collection1] o.a.s.u.LoggingInfoStream [DW][coreLoadExecutor-5844-thread-1]: coreLoadExecutor-5844-thread-1 finishFullFlush success=true
   [junit4]   2> 1129496 INFO  (coreLoadExecutor-5844-thread-1) [    x:collection1] o.a.s.u.LoggingInfoStream [IW][coreLoadExecutor-5844-thread-1]: startCommit(): start
   [junit4]   2> 1129496 INFO  (coreLoadExecutor-5844-thread-1) [    x:collection1] o.a.s.u.LoggingInfoStream [IW][coreLoadExecutor-5844-thread-1]: startCommit index= changeCount=2
   [junit4]   2> 1129584 INFO  (coreLoadExecutor-5844-thread-1) [    x:collection1] o.a.s.u.LoggingInfoStream [IW][coreLoadExecutor-5844-thread-1]: startCommit: wrote pending segments file "pending_segments_1"
   [junit4]   2> 1129584 INFO  (coreLoadExecutor-5844-thread-1) [    x:collection1] o.a.s.u.LoggingInfoStream [IW][coreLoadExecutor-5844-thread-1]: done all syncs: []
   [junit4]   2> 1129584 INFO  (coreLoadExecutor-5844-thread-1) [    x:collection1] o.a.s.u.LoggingInfoStream [IW][coreLoadExecutor-5844-thread-1]: commit: pendingCommit != null
   [junit4]   2> 1129585 INFO  (coreLoadExecutor-5844-thread-1) [    x:collection1] o.a.s.u.LoggingInfoStream [IW][coreLoadExecutor-5844-thread-1]: commit: done writing segments file "segments_1"
   [junit4]   2> 1129585 INFO  (coreLoadExecutor-5844-thread-1) [    x:collection1] o.a.s.u.LoggingInfoStream [IFD][coreLoadExecutor-5844-thread-1]: now checkpoint "" [0 segments ; isCommit = true]
   [junit4]   2> 1129585 INFO  (coreLoadExecutor-5844-thread-1) [    x:collection1] o.a.s.u.LoggingInfoStream [IFD][coreLoadExecutor-5844-thread-1]: 0 msec to checkpoint
   [junit4]   2> 1129585 INFO  (coreLoadExecutor-5844-thread-1) [    x:collection1] o.a.s.u.LoggingInfoStream [IW][coreLoadExecutor-5844-thread-1]: commit: took 88.3 msec
   [junit4]   2> 1129585 INFO  (coreLoadExecutor-5844-thread-1) [    x:collection1] o.a.s.u.LoggingInfoStream [IW][coreLoadExecutor-5844-thread-1]: commit: done
   [junit4]   2> 1129585 INFO  (coreLoadExecutor-5844-thread-1) [    x:collection1] o.a.s.u.LoggingInfoStream [IW][coreLoadExecutor-5844-thread-1]: rollback
   [junit4]   2> 1129585 INFO  (coreLoadExecutor-5844-thread-1) [    x:collection1] o.a.s.u.LoggingInfoStream [IW][coreLoadExecutor-5844-thread-1]: all running merges have aborted
   [junit4]   2> 1129585 INFO  (coreLoadExecutor-5844-thread-1) [    x:collection1] o.a.s.u.LoggingInfoStream [IW][coreLoadExecutor-5844-thread-1]: rollback: done finish merges
   [junit4]   2> 1129585 INFO  (coreLoadExecutor-5844-thread-1) [    x:collection1] o.a.s.u.LoggingInfoStream [DW][coreLoadExecutor-5844-thread-1]: abort
   [junit4]   2> 1129585 INFO  (coreLoadExecutor-5844-thread-1) [    x:collection1] o.a.s.u.LoggingInfoStream [DW][coreLoadExecutor-5844-thread-1]: done abort success=true
   [junit4]   2> 1129585 INFO  (coreLoadExecutor-5844-thread-1) [    x:collection1] o.a.s.u.LoggingInfoStream [IW][coreLoadExecutor-5844-thread-1]: rollback: infos=
   [junit4]   2> 1129585 INFO  (coreLoadExecutor-5844-thread-1) [    x:collection1] o.a.s.u.LoggingInfoStream [IFD][coreLoadExecutor-5844-thread-1]: now checkpoint "" [0 segments ; isCommit = false]
   [junit4]   2> 1129585 INFO  (coreLoadExecutor-5844-thread-1) [    x:collection1] o.a.s.u.LoggingInfoStream [IFD][coreLoadExecutor-5844-thread-1]: 0 msec to checkpoint
   [junit4]   2> 1129761 WARN  (coreLoadExecutor-5844-thread-1) [    x:collection1] o.a.s.c.RequestHandlers no default request handler is registered (either '/select' or 'standard')
   [junit4]   2> 1129762 INFO  (coreLoadExecutor-5844-thread-1) [    x:collection1] o.a.s.u.CommitTracker Hard AutoCommit: disabled
   [junit4]   2> 1129762 INFO  (coreLoadExecutor-5844-thread-1) [    x:collection1] o.a.s.u.CommitTracker Soft AutoCommit: disabled
   [junit4]   2> 1129767 INFO  (coreLoadExecutor-5844-thread-1) [    x:collection1] o.a.s.u.LoggingInfoStream [IFD][coreLoadExecutor-5844-thread-1]: init: current segments file is "segments_1"; deletionPolicy=org.apache.solr.core.IndexDeletionPolicyWrapper@46db9937
   [junit4]   2> 1129767 INFO  (coreLoadExecutor-5844-thread-1) [    x:collection1] o.a.s.u.LoggingInfoStream [IFD][coreLoadExecutor-5844-thread-1]: init: load commit "segments_1"
   [junit4]   2> 1129767 INFO  (coreLoadExecutor-5844-thread-1) [    x:collection1] o.a.s.u.LoggingInfoStream [IFD][coreLoadExecutor-5844-thread-1]: now checkpoint "" [0 segments ; isCommit = false]
   [junit4]   2> 1129767 INFO  (coreLoadExecutor-5844-thread-1) [    x:collection1] o.a.s.u.LoggingInfoStream [IFD][coreLoadExecutor-5844-thread-1]: 0 msec to checkpoint
   [junit4]   2> 1129767 INFO  (coreLoadExecutor-5844-thread-1) [    x:collection1] o.a.s.u.LoggingInfoStream [IW][coreLoadExecutor-5844-thread-1]: init: create=false reader=null
   [junit4]   2> 1129767 INFO  (coreLoadExecutor-5844-thread-1) [    x:collection1] o.a.s.u.LoggingInfoStream [IW][coreLoadExecutor-5844-thread-1]: 
   [junit4]   2> dir=NRTCachingDirectory(MMapDirectory@C:\Users\jenkins\workspace\Lucene-Solr-master-Windows\solr\build\solr-core\test\J0\temp\solr.core.TestInfoStreamLogging_7A6C652359C9E7BA-001\init-core-data-001\index lockFactory=org.apache.lucene.store.NativeFSLockFactory@7f1ac6c1; maxCacheMB=48.0 maxMergeSizeMB=4.0)
   [junit4]   2> index=
   [junit4]   2> version=8.0.0
   [junit4]   2> analyzer=org.apache.solr.update.SolrIndexConfig$DelayedSchemaAnalyzer
   [junit4]   2> ramBufferSizeMB=100.0
   [junit4]   2> maxBufferedDocs=-1
   [junit4]   2> mergedSegmentWarmer=null
   [junit4]   2> delPolicy=org.apache.solr.core.IndexDeletionPolicyWrapper
   [junit4]   2> commit=null
   [junit4]   2> openMode=APPEND
   [junit4]   2> similarity=org.apache.solr.search.similarities.MockConfigurableSimilarity
   [junit4]   2> mergeScheduler=ConcurrentMergeScheduler: maxThreadCount=-1, maxMergeCount=-1, ioThrottle=true
   [junit4]   2> codec=CheapBastard
   [junit4]   2> infoStream=org.apache.solr.update.LoggingInfoStream
   [junit4]   2> mergePolicy=[TieredMergePolicy: maxMergeAtOnce=10, maxMergeAtOnceExplicit=30, maxMergedSegmentMB=5120.0, floorSegmentMB=2.0, forceMergeDeletesPctAllowed=10.0, segmentsPerTier=10.0, maxCFSSegmentSizeMB=8.796093022207999E12, noCFSRatio=0.1
   [junit4]   2> indexerThreadPool=org.apache.lucene.index.DocumentsWriterPerThreadPool@12d11699
   [junit4]   2> readerPooling=true
   [junit4]   2> perThreadHardLimitMB=1945
   [junit4]   2> useCompoundFile=false
   [junit4]   2> commitOnClose=true
   [junit4]   2> indexSort=null
   [junit4]   2> checkPendingFlushOnUpdate=true
   [junit4]   2> softDeletesField=null
   [junit4]   2> writer=org.apache.solr.update.SolrIndexWriter@651aeb54
   [junit4]   2> 
   [junit4]   2> 1129773 INFO  (coreLoadExecutor-5844-thread-1) [    x:collection1] o.a.s.u.LoggingInfoStream [IW][coreLoadExecutor-5844-thread-1]: MMapDirectory.UNMAP_SUPPORTED=true
   [junit4]   2> 1129773 INFO  (coreLoadExecutor-5844-thread-1) [    x:collection1] o.a.s.u.LoggingInfoStream [IW][coreLoadExecutor-5844-thread-1]: flush at getReader
   [junit4]   2> 1129773 INFO  (coreLoadExecutor-5844-thread-1) [    x:collection1] o.a.s.u.LoggingInfoStream [DW][coreLoadExecutor-5844-thread-1]: startFullFlush
   [junit4]   2> 1129773 INFO  (coreLoadExecutor-5844-thread-1) [    x:collection1] o.a.s.u.LoggingInfoStream [IW][coreLoadExecutor-5844-thread-1]: now apply all deletes for all segments buffered updates bytesUsed=0 reader pool bytesUsed=0
   [junit4]   2> 1129773 INFO  (coreLoadExecutor-5844-thread-1) [    x:collection1] o.a.s.u.LoggingInfoStream [BD][coreLoadExecutor-5844-thread-1]: waitApply: no deletes to apply
   [junit4]   2> 1129773 INFO  (coreLoadExecutor-5844-thread-1) [    x:collection1] o.a.s.u.LoggingInfoStream [IW][coreLoadExecutor-5844-thread-1]: incRefDeleter for NRT reader version=2 segments=
   [junit4]   2> 1129773 INFO  (coreLoadExecutor-5844-thread-1) [    x:collection1] o.a.s.u.LoggingInfoStream [IW][coreLoadExecutor-5844-thread-1]: return reader version=2 reader=StandardDirectoryReader(segments_1:2:nrt)
   [junit4]   2> 1129773 INFO  (coreLoadExecutor-5844-thread-1) [    x:collection1] o.a.s.u.LoggingInfoStream [DW][coreLoadExecutor-5844-thread-1]: coreLoadExecutor-5844-thread-1 finishFullFlush success=true
   [junit4]   2> 1129773 INFO  (coreLoadExecutor-5844-thread-1) [    x:collection1] o.a.s.u.LoggingInfoStream [IW][coreLoadExecutor-5844-thread-1]: getReader took 0 msec
   [junit4]   2> 1129773 INFO  (coreLoadExecutor-5844-thread-1) [    x:collection1] o.a.s.s.SolrIndexSearcher Opening [Searcher@562db3fb[collection1] main]
   [junit4]   2> 1129773 WARN  (coreLoadExecutor-5844-thread-1) [    x:collection1] o.a.s.r.ManagedResourceStorage Cannot write to config directory C:\Users\jenkins\workspace\Lucene-Solr-master-Windows\solr\core\src\test-files\solr\collection1\conf; switching to use InMemory storage instead.
   [junit4]   2> 1129774 INFO  (coreLoadExecutor-5844-thread-1) [    x:collection1] o.a.s.h.ReplicationHandler Commits will be reserved for 10000ms.
   [junit4]   2> 1129774 INFO  (searcherExecutor-5845-thread-1-processing-x:collection1) [    x:collection1] o.a.s.c.SolrCore [collection1] Registered new searcher Searcher@562db3fb[collection1] main{ExitableDirectoryReader(UninvertingDirectoryReader())}
   [junit4]   2> 1129775 INFO  (SUITE-TestInfoStreamLogging-seed#[7A6C652359C9E7BA]-worker) [    ] o.a.s.SolrTestCaseJ4 ####initCore end
   [junit4]   2> 1129775 INFO  (TEST-TestInfoStreamLogging.testIndexConfig-seed#[7A6C652359C9E7BA]) [    ] o.a.s.SolrTestCaseJ4 ###Starting testIndexConfig
   [junit4]   2> 1129775 INFO  (TEST-TestInfoStreamLogging.testIndexConfig-seed#[7A6C652359C9E7BA]) [    ] o.a.s.SolrTestCaseJ4 ###Ending testIndexConfig
   [junit4]   2> 1129775 INFO  (SUITE-TestInfoStreamLogging-seed#[7A6C652359C9E7BA]-worker) [    ] o.a.s.SolrTestCaseJ4 ###deleteCore
   [junit4]   2> 1129775 INFO  (SUITE-TestInfoStreamLogging-seed#[7A6C652359C9E7BA]-worker) [    ] o.a.s.c.CoreContainer Shutting down CoreContainer instance=1591227753
   [junit4]   2> 1129775 INFO  (SUITE-TestInfoStreamLogging-seed#[7A6C652359C9E7BA]-worker) [    ] o.a.s.m.SolrMetricManager Closing metric reporters for registry=solr.node, tag=null
   [junit4]   2> 1129775 INFO  (SUITE-TestInfoStreamLogging-seed#[7A6C652359C9E7BA]-worker) [    ] o.a.s.m.r.SolrJmxReporter Closing reporter [org.apache.solr.metrics.reporters.SolrJmxReporter@3dadaa09: rootName = null, domain = solr.node, service url = null, agent id = null] for registry solr.node / com.codahale.metrics.MetricRegistry@22719aa2
   [junit4]   2> 1129775 INFO  (SUITE-TestInfoStreamLogging-seed#[7A6C652359C9E7BA]-worker) [    ] o.a.s.m.SolrMetricManager Closing metric reporters for registry=solr.jvm, tag=null
   [junit4]   2> 1129775 INFO  (SUITE-TestInfoStreamLogging-seed#[7A6C652359C9E7BA]-worker) [    ] o.a.s.m.r.SolrJmxReporter Closing reporter [org.apache.solr.metrics.reporters.SolrJmxReporter@1f8d3f8a: rootName = null, domain = solr.jvm, service url = null, agent id = null] for registry solr.jvm / com.codahale.metrics.MetricRegistry@7b111fc
   [junit4]   2> 1129785 INFO  (SUITE-TestInfoStreamLogging-seed#[7A6C652359C9E7BA]-worker) [    ] o.a.s.m.SolrMetricManager Closing metric reporters for registry=solr.jetty, tag=null
   [junit4]   2> 1129785 INFO  (SUITE-TestInfoStreamLogging-seed#[7A6C652359C9E7BA]-worker) [    ] o.a.s.m.r.SolrJmxReporter Closing reporter [org.apache.solr.metrics.reporters.SolrJmxReporter@609ad075: rootName = null, domain = solr.jetty, service url = null, agent id = null] for registry solr.jetty / com.codahale.metrics.MetricRegistry@4cfe851e
   [junit4]   2> 1129787 INFO  (coreCloseExecutor-5849-thread-1) [    x:collection1] o.a.s.c.SolrCore [collection1]  CLOSING SolrCore org.apache.solr.core.SolrCore@fc6b2b
   [junit4]   2> 1129787 INFO  (coreCloseExecutor-5849-thread-1) [    x:collection1] o.a.s.m.SolrMetricManager Closing metric reporters for registry=solr.core.collection1, tag=fc6b2b
   [junit4]   2> 1129787 INFO  (coreCloseExecutor-5849-thread-1) [    x:collection1] o.a.s.m.r.SolrJmxReporter Closing reporter [org.apache.solr.metrics.reporters.SolrJmxReporter@22797ba1: rootName = null, domain = solr.core.collection1, service url = null, agent id = null] for registry solr.core.collection1 / com.codahale.metrics.MetricRegistry@6de17b55
   [junit4]   2> 1129787 INFO  (coreCloseExecutor-5849-thread-1) [    x:collection1] o.a.s.u.LoggingInfoStream [IW][coreCloseExecutor-5849-thread-1]: now flush at close
   [junit4]   2> 1129787 INFO  (coreCloseExecutor-5849-thread-1) [    x:collection1] o.a.s.u.LoggingInfoStream [IW][coreCloseExecutor-5849-thread-1]:   start flush: applyAllDeletes=true
   [junit4]   2> 1129787 INFO  (coreCloseExecutor-5849-thread-1) [    x:collection1] o.a.s.u.LoggingInfoStream [IW][coreCloseExecutor-5849-thread-1]:   index before flush 
   [junit4]   2> 1129787 INFO  (coreCloseExecutor-5849-thread-1) [    x:collection1] o.a.s.u.LoggingInfoStream [DW][coreCloseExecutor-5849-thread-1]: startFullFlush
   [junit4]   2> 1129787 INFO  (coreCloseExecutor-5849-thread-1) [    x:collection1] o.a.s.u.LoggingInfoStream [DW][coreCloseExecutor-5849-thread-1]: coreCloseExecutor-5849-thread-1 finishFullFlush success=true
   [junit4]   2> 1129787 INFO  (coreCloseExecutor-5849-thread-1) [    x:collection1] o.a.s.u.LoggingInfoStream [IW][coreCloseExecutor-5849-thread-1]: now apply all deletes for all segments buffered updates bytesUsed=0 reader pool bytesUsed=0
   [junit4]   2> 1129787 INFO  (coreCloseExecutor-5849-thread-1) [    x:collection1] o.a.s.u.LoggingInfoStream [BD][coreCloseExecutor-5849-thread-1]: waitApply: no deletes to apply
   [junit4]   2> 1129787 INFO  (coreCloseExecutor-5849-thread-1) [    x:collection1] o.a.s.u.LoggingInfoStream [MS][coreCloseExecutor-5849-thread-1]: initDynamicDefaults spins=true maxThreadCount=1 maxMergeCount=6
   [junit4]   2> 1129787 INFO  (coreCloseExecutor-5849-thread-1) [    x:collection1] o.a.s.u.LoggingInfoStream [MS][coreCloseExecutor-5849-thread-1]: updateMergeThreads ioThrottle=true targetMBPerSec=10240.0 MB/sec
   [junit4]   2> 1129787 INFO  (coreCloseExecutor-5849-thread-1) [    x:collection1] o.a.s.u.LoggingInfoStream [MS][coreCloseExecutor-5849-thread-1]: now merge
   [junit4]   2> 1129787 INFO  (coreCloseExecutor-5849-thread-1) [    x:collection1] o.a.s.u.LoggingInfoStream [MS][coreCloseExecutor-5849-thread-1]:   index: 
   [junit4]   2> 1129787 INFO  (coreCloseExecutor-5849-thread-1) [    x:collection1] o.a.s.u.LoggingInfoStream [MS][coreCloseExecutor-5849-thread-1]:   no more merges pending; now return
   [junit4]   2> 1129787 INFO  (coreCloseExecutor-5849-thread-1) [    x:collection1] o.a.s.u.LoggingInfoStream [IW][coreCloseExecutor-5849-thread-1]: waitForMerges
   [junit4]   2> 1129787 INFO  (coreCloseExecutor-5849-thread-1) [    x:collection1] o.a.s.u.LoggingInfoStream [IW][coreCloseExecutor-5849-thread-1]: waitForMerges done
   [junit4]   2> 1129787 INFO  (coreCloseExecutor-5849-thread-1) [    x:collection1] o.a.s.u.LoggingInfoStream [IW][coreCloseExecutor-5849-thread-1]: commit: start
   [junit4]   2> 1129787 INFO  (coreCloseExecutor-5849-thread-1) [    x:collection1] o.a.s.u.LoggingInfoStream [IW][coreCloseExecutor-5849-thread-1]: commit: enter lock
   [junit4]   2> 1129787 INFO  (coreCloseExecutor-5849-thread-1) [    x:collection1] o.a.s.u.LoggingInfoStream [IW][coreCloseExecutor-5849-thread-1]: commit: now prepare
   [junit4]   2> 1129787 INFO  (coreCloseExecutor-5849-thread-1) [    x:collection1] o.a.s.u.LoggingInfoStream [IW][coreCloseExecutor-5849-thread-1]: prepareCommit: flush
   [junit4]   2> 1129787 INFO  (coreCloseExecutor-5849-thread-1) [    x:collection1] o.a.s.u.LoggingInfoStream [IW][coreCloseExecutor-5849-thread-1]:   index before flush 
   [junit4]   2> 1129787 INFO  (coreCloseExecutor-5849-thread-1) [    x:collection1] o.a.s.u.LoggingInfoStream [DW][coreCloseExecutor-5849-thread-1]: startFullFlush
   [junit4]   2> 1129787 INFO  (coreCloseExecutor-5849-thread-1) [    x:collection1] o.a.s.u.LoggingInfoStream [IW][coreCloseExecutor-5849-thread-1]: now apply all deletes for all segments buffered updates bytesUsed=0 reader pool bytesUsed=0
   [junit4]   2> 1129787 INFO  (coreCloseExecutor-5849-thread-1) [    x:collection1] o.a.s.u.LoggingInfoStream [BD][coreCloseExecutor-5849-thread-1]: waitApply: no deletes to apply
   [junit4]   2> 1129787 INFO  (coreCloseExecutor-5849-thread-1) [    x:collection1] o.a.s.u.LoggingInfoStream [DW][coreCloseExecutor-5849-thread-1]: coreCloseExecutor-5849-thread-1 finishFullFlush success=true
   [junit4]   2> 1129787 INFO  (coreCloseExecutor-5849-thread-1) [    x:collection1] o.a.s.u.LoggingInfoStream [IW][coreCloseExecutor-5849-thread-1]: startCommit(): start
   [junit4]   2> 1129787 INFO  (coreCloseExecutor-5849-thread-1) [    x:collection1] o.a.s.u.LoggingInfoStream [IW][coreCloseExecutor-5849-thread-1]:   skip startCommit(): no changes pending
   [junit4]   2> 1129787 INFO  (coreCloseExecutor-5849-thread-1) [    x:collection1] o.a.s.u.LoggingInfoStream [IW][coreCloseExecutor-5849-thread-1]: commit: pendingCommit == null; skip
   [junit4]   2> 1129787 INFO  (coreCloseExecutor-5849-thread-1) [    x:collection1] o.a.s.u.LoggingInfoStream [IW][coreCloseExecutor-5849-thread-1]: commit: took 0.4 msec
   [junit4]   2> 1129787 INFO  (coreCloseExecutor-5849-thread-1) [    x:collection1] o.a.s.u.LoggingInfoStream [IW][coreCloseExecutor-5849-thread-1]: commit: done
   [junit4]   2> 1129787 INFO  (coreCloseExecutor-5849-thread-1) [    x:collection1] o.a.s.u.LoggingInfoStream [IW][coreCloseExecutor-5849-thread-1]: rollback
   [junit4]   2> 1129787 INFO  (coreCloseExecutor-5849-thread-1) [    x:collection1] o.a.s.u.LoggingInfoStream [IW][coreCloseExecutor-5849-thread-1]: all running merges have aborted
   [junit4]   2> 1129787 INFO  (coreCloseExecutor-5849-thread-1) [    x:collection1] o.a.s.u.LoggingInfoStream [IW][coreCloseExecutor-5849-thread-1]: rollback: done finish merges
   [junit4]   2> 1129787 INFO  (coreCloseExecutor-5849-thread-1) [    x:collection1] o.a.s.u.LoggingInfoStream [DW][coreCloseExecutor-5849-thread-1]: abort
   [junit4]   2> 1129787 INFO  (coreCloseExecutor-5849-thread-1) [    x:collection1] o.a.s.u.LoggingInfoStream [DW][coreCloseExecutor-5849-thread-1]: done abort success=true
   [junit4]   2> 1129787 INFO  (coreCloseExecutor-5849-thread-1) [    x:collection1] o.a.s.u.LoggingInfoStream [IW][coreCloseExecutor-5849-thread-1]: rollback: infos=
   [junit4]   2> 1129787 INFO  (coreCloseExecutor-5849-thread-1) [    x:collection1] o.a.s.u.LoggingInfoStream [IFD][coreCloseExecutor-5849-thread-1]: now checkpoint "" [0 segments ; isCommit = false]
   [junit4]   2> 1129787 INFO  (coreCloseExecutor-5849-thread-1) [    x:collection1] o.a.s.u.LoggingInfoStream [IFD][coreCloseExecutor-5849-thread-1]: 0 msec to checkpoint
   [junit4]   2> 1129867 INFO  (SUITE-TestInfoStreamLogging-seed#[7A6C652359C9E7BA]-worker) [    ] o.a.s.SolrTestCaseJ4 ------------------------------------------------------- Done waiting for tracked resources to be released
   [junit4]   2> NOTE: test params are: codec=CheapBastard, sim=Asserting(org.apache.lucene.search.similarities.AssertingSimilarity@6717d3b6), locale=si-LK, timezone=America/Mendoza
   [junit4]   2> NOTE: Windows 10 10.0 amd64/Oracle Corporation 10 (64-bit)/cpus=3,threads=1,free=227981424,total=443547648
   [junit4]   2> NOTE: All tests run in this JVM: [DateMathParserTest, InfoHandlerTest, TestHdfsBackupRestoreCore, TestSubQueryTransformerCrossCore, TestConfigSetsAPIZkFailure, OutputWriterTest, ClassificationUpdateProcessorIntegrationTest, TestLuceneIndexBackCompat, TestSearcherReuse, CheckHdfsIndexTest, BigEndianAscendingWordSerializerTest, TestSSLRandomization, TestFieldTypeResource, DirectUpdateHandlerOptimizeTest, ChaosMonkeySafeLeaderWithPullReplicasTest, LeaderElectionTest, DeleteShardTest, TestNestedDocsSort, CoreAdminCreateDiscoverTest, HLLSerializationTest, SolrCoreTest, TestSolrJ, OpenCloseCoreStressTest, TestLegacyNumericRangeQueryBuilder, AnalysisAfterCoreReloadTest, TestPayloadCheckQParserPlugin, TestComplexPhraseLeadingWildcard, TestFieldCacheReopen, DistributedExpandComponentTest, SolrIndexConfigTest, TestScoreJoinQPScore, DirectoryFactoryTest, RecoveryZkTest, TestJettySolrRunner, TestExactStatsCache, TestSolrConfigHandler, SOLR749Test, TestIndexSearcher, FileUtilsTest, TestSolrDeletionPolicy1, TestManagedSynonymFilterFactory, TestBulkSchemaConcurrent, TestPolicyCloud, MissingSegmentRecoveryTest, AddSchemaFieldsUpdateProcessorFactoryTest, TestZkAclsWithHadoopAuth, TestIntervalFaceting, LIROnShardRestartTest, TermVectorComponentDistributedTest, GraphQueryTest, TestConfigSets, DateFieldTest, TestDistribStateManager, TestPullReplica, PluginInfoTest, HdfsUnloadDistributedZkTest, StressHdfsTest, FacetPivotSmallTest, TestBlendedInfixSuggestions, CdcrBidirectionalTest, HdfsRecoverLeaseTest, ReplicaListTransformerTest, TestStressLiveNodes, SolrSlf4jReporterTest, TestFaceting, CopyFieldTest, TestCloudJSONFacetJoinDomain, RAMDirectoryFactoryTest, SolrJmxReporterCloudTest, TestOmitPositions, ScheduledTriggerTest, TestSolrCloudWithKerberosAlt, SolrCloudExampleTest, TestPolicyCloud, HttpPartitionOnCommitTest, TolerantUpdateProcessorTest, DirectSolrConnectionTest, XmlUpdateRequestHandlerTest, HdfsDirectoryFactoryTest, SpellingQueryConverterTest, TestLegacyTerms, TestCursorMarkWithoutUniqueKey, IgnoreCommitOptimizeUpdateProcessorFactoryTest, HdfsBasicDistributedZkTest, HighlighterTest, TestReplicaProperties, LeaderFailureAfterFreshStartTest, TestDeleteCollectionOnDownNodes, RankQueryTest, DistributedQueryComponentOptimizationTest, HdfsThreadLeakTest, TestPointFields, UpdateLogTest, TestUniqueKeyFieldResource, CloudMLTQParserTest, CdcrRequestHandlerTest, SolrShardReporterTest, TestCopyFieldCollectionResource, TestEmbeddedSolrServerConstructors, TestSchemalessBufferedUpdates, TestMacros, RequestLoggingTest, ParsingFieldUpdateProcessorsTest, TestNRTOpen, TestRangeQuery, CleanupOldIndexTest, QueryEqualityTest, SharedFSAutoReplicaFailoverTest, HttpTriggerListenerTest, TestSmileRequest, TestReplicationHandler, TestPostingsSolrHighlighter, TestChildDocTransformer, ExecutePlanActionTest, AssignTest, TestDynamicLoading, TestNumericRangeQuery32, TestHighlightDedupGrouping, SolrPluginUtilsTest, SparseHLLTest, DistribJoinFromCollectionTest, BlockCacheTest, ConvertedLegacyTest, TestClassicSimilarityFactory, TestConfigReload, ZkCLITest, TestBinaryField, DistributedFacetPivotWhiteBoxTest, DistributedFacetPivotLargeTest, TestGeoJSONResponseWriter, TestCloudSearcherWarming, MBeansHandlerTest, CustomHighlightComponentTest, TestFieldCacheSortRandom, AutoAddReplicasIntegrationTest, ImplicitSnitchTest, SolrMetricReporterTest, UniqFieldsUpdateProcessorFactoryTest, RemoteQueryErrorTest, DistribCursorPagingTest, LegacyCloudClusterPropTest, TestFunctionQuery, TestFiltering, TestSchemaResource, TestReload, BufferStoreTest, TestLeaderElectionZkExpiry, MoreLikeThisHandlerTest, TestSuggestSpellingConverter, SolrCoreMetricManagerTest, TestAuthenticationFramework, TestLazyCores, MultiTermTest, TestRetrieveFieldsOptimizer, TestPerFieldSimilarity, BadCopyFieldTest, TestCollectionAPI, ResourceLoaderTest, TestTolerantSearch, LeaderElectionIntegrationTest, ChangedSchemaMergeTest, TestRecoveryHdfs, MultiSolrCloudTestCaseTest, PeerSyncWithIndexFingerprintCachingTest, TriLevelCompositeIdRoutingTest, DeleteInactiveReplicaTest, BasicZkTest, TestBM25SimilarityFactory, BinaryUpdateRequestHandlerTest, TestInfoStreamLogging]
   [junit4]   2> NOTE: reproduce with: ant test  -Dtestcase=TestInfoStreamLogging -Dtests.seed=7A6C652359C9E7BA -Dtests.slow=true -Dtests.locale=si-LK -Dtests.timezone=America/Mendoza -Dtests.asserts=true -Dtests.file.encoding=Cp1252
   [junit4] ERROR   0.00s J0 | TestInfoStreamLogging (suite) <<<
   [junit4]    > Throwable #1: java.io.IOException: Could not remove the following files (in the order of attempts):
   [junit4]    >    C:\Users\jenkins\workspace\Lucene-Solr-master-Windows\solr\build\solr-core\test\J0\temp\solr.core.TestInfoStreamLogging_7A6C652359C9E7BA-001\init-core-data-001: java.nio.file.NoSuchFileException: C:\Users\jenkins\workspace\Lucene-Solr-master-Windows\solr\build\solr-core\test\J0\temp\solr.core.TestInfoStreamLogging_7A6C652359C9E7BA-001\init-core-data-001
   [junit4]    > 	at __randomizedtesting.SeedInfo.seed([7A6C652359C9E7BA]:0)
   [junit4]    > 	at org.apache.lucene.util.IOUtils.rm(IOUtils.java:318)
   [junit4]    > 	at java.base/java.lang.Thread.run(Thread.java:844)
   [junit4] Completed [249/806 (2!)] on J0 in 1.45s, 1 test, 1 error <<< FAILURES!

[...truncated 45721 lines...]
[repro] Jenkins log URL: https://jenkins.thetaphi.de/job/Lucene-Solr-master-Windows/7319/consoleText

[repro] Revision: 0c3628920afdc27bbaf1c057bf6519319ea78e51

[repro] Ant options: "-Dargs=-XX:+UseCompressedOops -XX:+UseParallelGC"

[repro] ant clean

[...truncated 6 lines...]
[repro] Test suites by module:
[repro]    solr\core
[repro]       DirectSolrConnectionTest
[repro]       TestInfoStreamLogging
[repro] ant compile-test

[...truncated 3324 lines...]
[repro] ant test-nocompile -Dtests.dups=5 -Dtests.maxfailures=10 -Dtests.class="*.DirectSolrConnectionTest|*.TestInfoStreamLogging" -Dtests.showOutput=onerror "-Dargs=-XX:+UseCompressedOops -XX:+UseParallelGC" -Dtests.seed=7A6C652359C9E7BA -Dtests.slow=true -Dtests.locale=sn -Dtests.timezone=Atlantic/Azores -Dtests.asserts=true -Dtests.file.encoding=Cp1252

[...truncated 100 lines...]
[repro] Failures:
[repro]   0/5 failed: org.apache.solr.core.TestInfoStreamLogging
[repro]   0/5 failed: org.apache.solr.servlet.DirectSolrConnectionTest
[repro] Exiting with code 0

[...truncated 75 lines...]

Mime
View raw message