lucene-dev mailing list archives

Site index · List index
Message view « Date » · « Thread »
Top « Date » · « Thread »
From Policeman Jenkins Server <jenk...@thetaphi.de>
Subject [JENKINS] Lucene-Solr-BadApples-master-Linux (64bit/jdk-10.0.1) - Build # 42 - Still Unstable!
Date Sat, 26 May 2018 04:48:02 GMT
Build: https://jenkins.thetaphi.de/job/Lucene-Solr-BadApples-master-Linux/42/
Java: 64bit/jdk-10.0.1 -XX:+UseCompressedOops -XX:+UseConcMarkSweepGC

4 tests failed.
FAILED:  org.apache.solr.TestDistributedSearch.test

Error Message:
IOException occured when talking to server at: http://127.0.0.1:36969/iqu/collection1

Stack Trace:
org.apache.solr.client.solrj.SolrServerException: IOException occured when talking to server at: http://127.0.0.1:36969/iqu/collection1
	at __randomizedtesting.SeedInfo.seed([3CAFFCB092CF514D:B4FBC36A3C333CB5]:0)
	at org.apache.solr.client.solrj.impl.HttpSolrClient.executeMethod(HttpSolrClient.java:657)
	at org.apache.solr.client.solrj.impl.HttpSolrClient.request(HttpSolrClient.java:255)
	at org.apache.solr.client.solrj.impl.HttpSolrClient.request(HttpSolrClient.java:244)
	at org.apache.solr.client.solrj.SolrRequest.process(SolrRequest.java:194)
	at org.apache.solr.client.solrj.SolrClient.deleteByQuery(SolrClient.java:895)
	at org.apache.solr.client.solrj.SolrClient.deleteByQuery(SolrClient.java:858)
	at org.apache.solr.client.solrj.SolrClient.deleteByQuery(SolrClient.java:873)
	at org.apache.solr.BaseDistributedSearchTestCase.del(BaseDistributedSearchTestCase.java:542)
	at org.apache.solr.TestDistributedSearch.test(TestDistributedSearch.java:1035)
	at java.base/jdk.internal.reflect.NativeMethodAccessorImpl.invoke0(Native Method)
	at java.base/jdk.internal.reflect.NativeMethodAccessorImpl.invoke(NativeMethodAccessorImpl.java:62)
	at java.base/jdk.internal.reflect.DelegatingMethodAccessorImpl.invoke(DelegatingMethodAccessorImpl.java:43)
	at java.base/java.lang.reflect.Method.invoke(Method.java:564)
	at com.carrotsearch.randomizedtesting.RandomizedRunner.invoke(RandomizedRunner.java:1737)
	at com.carrotsearch.randomizedtesting.RandomizedRunner$8.evaluate(RandomizedRunner.java:934)
	at com.carrotsearch.randomizedtesting.RandomizedRunner$9.evaluate(RandomizedRunner.java:970)
	at com.carrotsearch.randomizedtesting.RandomizedRunner$10.evaluate(RandomizedRunner.java:984)
	at org.apache.solr.BaseDistributedSearchTestCase$ShardsRepeatRule$ShardsRepeatStatement.callStatement(BaseDistributedSearchTestCase.java:1019)
	at org.apache.solr.BaseDistributedSearchTestCase$ShardsRepeatRule$ShardsStatement.evaluate(BaseDistributedSearchTestCase.java:968)
	at com.carrotsearch.randomizedtesting.rules.SystemPropertiesRestoreRule$1.evaluate(SystemPropertiesRestoreRule.java:57)
	at org.apache.lucene.util.TestRuleSetupTeardownChained$1.evaluate(TestRuleSetupTeardownChained.java:49)
	at org.apache.lucene.util.AbstractBeforeAfterRule$1.evaluate(AbstractBeforeAfterRule.java:45)
	at org.apache.lucene.util.TestRuleThreadAndTestName$1.evaluate(TestRuleThreadAndTestName.java:48)
	at org.apache.lucene.util.TestRuleIgnoreAfterMaxFailures$1.evaluate(TestRuleIgnoreAfterMaxFailures.java:64)
	at org.apache.lucene.util.TestRuleMarkFailure$1.evaluate(TestRuleMarkFailure.java:47)
	at com.carrotsearch.randomizedtesting.rules.StatementAdapter.evaluate(StatementAdapter.java:36)
	at com.carrotsearch.randomizedtesting.ThreadLeakControl$StatementRunner.run(ThreadLeakControl.java:368)
	at com.carrotsearch.randomizedtesting.ThreadLeakControl.forkTimeoutingTask(ThreadLeakControl.java:817)
	at com.carrotsearch.randomizedtesting.ThreadLeakControl$3.evaluate(ThreadLeakControl.java:468)
	at com.carrotsearch.randomizedtesting.RandomizedRunner.runSingleTest(RandomizedRunner.java:943)
	at com.carrotsearch.randomizedtesting.RandomizedRunner$5.evaluate(RandomizedRunner.java:829)
	at com.carrotsearch.randomizedtesting.RandomizedRunner$6.evaluate(RandomizedRunner.java:879)
	at com.carrotsearch.randomizedtesting.RandomizedRunner$7.evaluate(RandomizedRunner.java:890)
	at com.carrotsearch.randomizedtesting.rules.StatementAdapter.evaluate(StatementAdapter.java:36)
	at com.carrotsearch.randomizedtesting.rules.SystemPropertiesRestoreRule$1.evaluate(SystemPropertiesRestoreRule.java:57)
	at org.apache.lucene.util.AbstractBeforeAfterRule$1.evaluate(AbstractBeforeAfterRule.java:45)
	at com.carrotsearch.randomizedtesting.rules.StatementAdapter.evaluate(StatementAdapter.java:36)
	at org.apache.lucene.util.TestRuleStoreClassName$1.evaluate(TestRuleStoreClassName.java:41)
	at com.carrotsearch.randomizedtesting.rules.NoShadowingOrOverridesOnMethodsRule$1.evaluate(NoShadowingOrOverridesOnMethodsRule.java:40)
	at com.carrotsearch.randomizedtesting.rules.NoShadowingOrOverridesOnMethodsRule$1.evaluate(NoShadowingOrOverridesOnMethodsRule.java:40)
	at com.carrotsearch.randomizedtesting.rules.StatementAdapter.evaluate(StatementAdapter.java:36)
	at com.carrotsearch.randomizedtesting.rules.StatementAdapter.evaluate(StatementAdapter.java:36)
	at org.apache.lucene.util.TestRuleAssertionsRequired$1.evaluate(TestRuleAssertionsRequired.java:53)
	at org.apache.lucene.util.TestRuleMarkFailure$1.evaluate(TestRuleMarkFailure.java:47)
	at org.apache.lucene.util.TestRuleIgnoreAfterMaxFailures$1.evaluate(TestRuleIgnoreAfterMaxFailures.java:64)
	at org.apache.lucene.util.TestRuleIgnoreTestSuites$1.evaluate(TestRuleIgnoreTestSuites.java:54)
	at com.carrotsearch.randomizedtesting.rules.StatementAdapter.evaluate(StatementAdapter.java:36)
	at com.carrotsearch.randomizedtesting.ThreadLeakControl$StatementRunner.run(ThreadLeakControl.java:368)
	at java.base/java.lang.Thread.run(Thread.java:844)
Caused by: org.apache.http.NoHttpResponseException: 127.0.0.1:36969 failed to respond
	at org.apache.http.impl.conn.DefaultHttpResponseParser.parseHead(DefaultHttpResponseParser.java:141)
	at org.apache.http.impl.conn.DefaultHttpResponseParser.parseHead(DefaultHttpResponseParser.java:56)
	at org.apache.http.impl.io.AbstractMessageParser.parse(AbstractMessageParser.java:259)
	at org.apache.http.impl.DefaultBHttpClientConnection.receiveResponseHeader(DefaultBHttpClientConnection.java:163)
	at org.apache.http.impl.conn.CPoolProxy.receiveResponseHeader(CPoolProxy.java:165)
	at org.apache.http.protocol.HttpRequestExecutor.doReceiveResponse(HttpRequestExecutor.java:273)
	at org.apache.http.protocol.HttpRequestExecutor.execute(HttpRequestExecutor.java:125)
	at org.apache.http.impl.execchain.MainClientExec.execute(MainClientExec.java:272)
	at org.apache.http.impl.execchain.ProtocolExec.execute(ProtocolExec.java:185)
	at org.apache.http.impl.execchain.RetryExec.execute(RetryExec.java:89)
	at org.apache.http.impl.execchain.RedirectExec.execute(RedirectExec.java:111)
	at org.apache.http.impl.client.InternalHttpClient.doExecute(InternalHttpClient.java:185)
	at org.apache.http.impl.client.CloseableHttpClient.execute(CloseableHttpClient.java:83)
	at org.apache.http.impl.client.CloseableHttpClient.execute(CloseableHttpClient.java:56)
	at org.apache.solr.client.solrj.impl.HttpSolrClient.executeMethod(HttpSolrClient.java:542)
	... 48 more


FAILED:  org.apache.solr.cloud.autoscaling.sim.TestPolicyCloud.testCreateCollectionAddShardUsingPolicy

Error Message:
Timeout waiting for collection to become active Live Nodes: null Last available state: null

Stack Trace:
java.lang.AssertionError: Timeout waiting for collection to become active
Live Nodes: null
Last available state: null
	at __randomizedtesting.SeedInfo.seed([3CAFFCB092CF514D:FD33CE1953F7AC8E]:0)
	at org.apache.solr.cloud.CloudTestUtils.waitForState(CloudTestUtils.java:69)
	at org.apache.solr.cloud.autoscaling.sim.TestPolicyCloud.testCreateCollectionAddShardUsingPolicy(TestPolicyCloud.java:312)
	at java.base/jdk.internal.reflect.NativeMethodAccessorImpl.invoke0(Native Method)
	at java.base/jdk.internal.reflect.NativeMethodAccessorImpl.invoke(NativeMethodAccessorImpl.java:62)
	at java.base/jdk.internal.reflect.DelegatingMethodAccessorImpl.invoke(DelegatingMethodAccessorImpl.java:43)
	at java.base/java.lang.reflect.Method.invoke(Method.java:564)
	at com.carrotsearch.randomizedtesting.RandomizedRunner.invoke(RandomizedRunner.java:1737)
	at com.carrotsearch.randomizedtesting.RandomizedRunner$8.evaluate(RandomizedRunner.java:934)
	at com.carrotsearch.randomizedtesting.RandomizedRunner$9.evaluate(RandomizedRunner.java:970)
	at com.carrotsearch.randomizedtesting.RandomizedRunner$10.evaluate(RandomizedRunner.java:984)
	at org.junit.rules.ExpectedException$ExpectedExceptionStatement.evaluate(ExpectedException.java:110)
	at com.carrotsearch.randomizedtesting.rules.SystemPropertiesRestoreRule$1.evaluate(SystemPropertiesRestoreRule.java:57)
	at org.apache.lucene.util.TestRuleSetupTeardownChained$1.evaluate(TestRuleSetupTeardownChained.java:49)
	at org.apache.lucene.util.AbstractBeforeAfterRule$1.evaluate(AbstractBeforeAfterRule.java:45)
	at org.apache.lucene.util.TestRuleThreadAndTestName$1.evaluate(TestRuleThreadAndTestName.java:48)
	at org.apache.lucene.util.TestRuleIgnoreAfterMaxFailures$1.evaluate(TestRuleIgnoreAfterMaxFailures.java:64)
	at org.apache.lucene.util.TestRuleMarkFailure$1.evaluate(TestRuleMarkFailure.java:47)
	at com.carrotsearch.randomizedtesting.rules.StatementAdapter.evaluate(StatementAdapter.java:36)
	at com.carrotsearch.randomizedtesting.ThreadLeakControl$StatementRunner.run(ThreadLeakControl.java:368)
	at com.carrotsearch.randomizedtesting.ThreadLeakControl.forkTimeoutingTask(ThreadLeakControl.java:817)
	at com.carrotsearch.randomizedtesting.ThreadLeakControl$3.evaluate(ThreadLeakControl.java:468)
	at com.carrotsearch.randomizedtesting.RandomizedRunner.runSingleTest(RandomizedRunner.java:943)
	at com.carrotsearch.randomizedtesting.RandomizedRunner$5.evaluate(RandomizedRunner.java:829)
	at com.carrotsearch.randomizedtesting.RandomizedRunner$6.evaluate(RandomizedRunner.java:879)
	at com.carrotsearch.randomizedtesting.RandomizedRunner$7.evaluate(RandomizedRunner.java:890)
	at com.carrotsearch.randomizedtesting.rules.StatementAdapter.evaluate(StatementAdapter.java:36)
	at com.carrotsearch.randomizedtesting.rules.SystemPropertiesRestoreRule$1.evaluate(SystemPropertiesRestoreRule.java:57)
	at org.apache.lucene.util.AbstractBeforeAfterRule$1.evaluate(AbstractBeforeAfterRule.java:45)
	at com.carrotsearch.randomizedtesting.rules.StatementAdapter.evaluate(StatementAdapter.java:36)
	at org.apache.lucene.util.TestRuleStoreClassName$1.evaluate(TestRuleStoreClassName.java:41)
	at com.carrotsearch.randomizedtesting.rules.NoShadowingOrOverridesOnMethodsRule$1.evaluate(NoShadowingOrOverridesOnMethodsRule.java:40)
	at com.carrotsearch.randomizedtesting.rules.NoShadowingOrOverridesOnMethodsRule$1.evaluate(NoShadowingOrOverridesOnMethodsRule.java:40)
	at com.carrotsearch.randomizedtesting.rules.StatementAdapter.evaluate(StatementAdapter.java:36)
	at com.carrotsearch.randomizedtesting.rules.StatementAdapter.evaluate(StatementAdapter.java:36)
	at org.apache.lucene.util.TestRuleAssertionsRequired$1.evaluate(TestRuleAssertionsRequired.java:53)
	at org.apache.lucene.util.TestRuleMarkFailure$1.evaluate(TestRuleMarkFailure.java:47)
	at org.apache.lucene.util.TestRuleIgnoreAfterMaxFailures$1.evaluate(TestRuleIgnoreAfterMaxFailures.java:64)
	at org.apache.lucene.util.TestRuleIgnoreTestSuites$1.evaluate(TestRuleIgnoreTestSuites.java:54)
	at com.carrotsearch.randomizedtesting.rules.StatementAdapter.evaluate(StatementAdapter.java:36)
	at com.carrotsearch.randomizedtesting.ThreadLeakControl$StatementRunner.run(ThreadLeakControl.java:368)
	at java.base/java.lang.Thread.run(Thread.java:844)
Caused by: java.lang.NullPointerException
	at org.apache.solr.cloud.autoscaling.sim.SimClusterStateProvider.lambda$getCollectionStates$52(SimClusterStateProvider.java:1432)
	at java.base/java.util.ArrayList.forEach(ArrayList.java:1378)
	at org.apache.solr.cloud.autoscaling.sim.SimClusterStateProvider.lambda$getCollectionStates$53(SimClusterStateProvider.java:1424)
	at java.base/java.util.concurrent.ConcurrentHashMap.forEach(ConcurrentHashMap.java:1617)
	at org.apache.solr.cloud.autoscaling.sim.SimClusterStateProvider.getCollectionStates(SimClusterStateProvider.java:1423)
	at org.apache.solr.cloud.autoscaling.sim.SimClusterStateProvider.getClusterState(SimClusterStateProvider.java:1403)
	at org.apache.solr.cloud.CloudTestUtils.waitForState(CloudTestUtils.java:94)
	at org.apache.solr.cloud.CloudTestUtils.waitForState(CloudTestUtils.java:63)
	... 40 more


FAILED:  org.apache.solr.cloud.SSLMigrationTest.test

Error Message:
Replica didn't have the proper urlScheme in the ClusterState

Stack Trace:
java.lang.AssertionError: Replica didn't have the proper urlScheme in the ClusterState
	at __randomizedtesting.SeedInfo.seed([3CAFFCB092CF514D:B4FBC36A3C333CB5]:0)
	at org.junit.Assert.fail(Assert.java:93)
	at org.junit.Assert.assertTrue(Assert.java:43)
	at org.apache.solr.cloud.SSLMigrationTest.assertReplicaInformation(SSLMigrationTest.java:104)
	at org.apache.solr.cloud.SSLMigrationTest.testMigrateSSL(SSLMigrationTest.java:97)
	at org.apache.solr.cloud.SSLMigrationTest.test(SSLMigrationTest.java:61)
	at java.base/jdk.internal.reflect.NativeMethodAccessorImpl.invoke0(Native Method)
	at java.base/jdk.internal.reflect.NativeMethodAccessorImpl.invoke(NativeMethodAccessorImpl.java:62)
	at java.base/jdk.internal.reflect.DelegatingMethodAccessorImpl.invoke(DelegatingMethodAccessorImpl.java:43)
	at java.base/java.lang.reflect.Method.invoke(Method.java:564)
	at com.carrotsearch.randomizedtesting.RandomizedRunner.invoke(RandomizedRunner.java:1737)
	at com.carrotsearch.randomizedtesting.RandomizedRunner$8.evaluate(RandomizedRunner.java:934)
	at com.carrotsearch.randomizedtesting.RandomizedRunner$9.evaluate(RandomizedRunner.java:970)
	at com.carrotsearch.randomizedtesting.RandomizedRunner$10.evaluate(RandomizedRunner.java:984)
	at org.apache.solr.BaseDistributedSearchTestCase$ShardsRepeatRule$ShardsFixedStatement.callStatement(BaseDistributedSearchTestCase.java:993)
	at org.apache.solr.BaseDistributedSearchTestCase$ShardsRepeatRule$ShardsStatement.evaluate(BaseDistributedSearchTestCase.java:968)
	at com.carrotsearch.randomizedtesting.rules.SystemPropertiesRestoreRule$1.evaluate(SystemPropertiesRestoreRule.java:57)
	at org.apache.lucene.util.TestRuleSetupTeardownChained$1.evaluate(TestRuleSetupTeardownChained.java:49)
	at org.apache.lucene.util.AbstractBeforeAfterRule$1.evaluate(AbstractBeforeAfterRule.java:45)
	at org.apache.lucene.util.TestRuleThreadAndTestName$1.evaluate(TestRuleThreadAndTestName.java:48)
	at org.apache.lucene.util.TestRuleIgnoreAfterMaxFailures$1.evaluate(TestRuleIgnoreAfterMaxFailures.java:64)
	at org.apache.lucene.util.TestRuleMarkFailure$1.evaluate(TestRuleMarkFailure.java:47)
	at com.carrotsearch.randomizedtesting.rules.StatementAdapter.evaluate(StatementAdapter.java:36)
	at com.carrotsearch.randomizedtesting.ThreadLeakControl$StatementRunner.run(ThreadLeakControl.java:368)
	at com.carrotsearch.randomizedtesting.ThreadLeakControl.forkTimeoutingTask(ThreadLeakControl.java:817)
	at com.carrotsearch.randomizedtesting.ThreadLeakControl$3.evaluate(ThreadLeakControl.java:468)
	at com.carrotsearch.randomizedtesting.RandomizedRunner.runSingleTest(RandomizedRunner.java:943)
	at com.carrotsearch.randomizedtesting.RandomizedRunner$5.evaluate(RandomizedRunner.java:829)
	at com.carrotsearch.randomizedtesting.RandomizedRunner$6.evaluate(RandomizedRunner.java:879)
	at com.carrotsearch.randomizedtesting.RandomizedRunner$7.evaluate(RandomizedRunner.java:890)
	at com.carrotsearch.randomizedtesting.rules.StatementAdapter.evaluate(StatementAdapter.java:36)
	at com.carrotsearch.randomizedtesting.rules.SystemPropertiesRestoreRule$1.evaluate(SystemPropertiesRestoreRule.java:57)
	at org.apache.lucene.util.AbstractBeforeAfterRule$1.evaluate(AbstractBeforeAfterRule.java:45)
	at com.carrotsearch.randomizedtesting.rules.StatementAdapter.evaluate(StatementAdapter.java:36)
	at org.apache.lucene.util.TestRuleStoreClassName$1.evaluate(TestRuleStoreClassName.java:41)
	at com.carrotsearch.randomizedtesting.rules.NoShadowingOrOverridesOnMethodsRule$1.evaluate(NoShadowingOrOverridesOnMethodsRule.java:40)
	at com.carrotsearch.randomizedtesting.rules.NoShadowingOrOverridesOnMethodsRule$1.evaluate(NoShadowingOrOverridesOnMethodsRule.java:40)
	at com.carrotsearch.randomizedtesting.rules.StatementAdapter.evaluate(StatementAdapter.java:36)
	at com.carrotsearch.randomizedtesting.rules.StatementAdapter.evaluate(StatementAdapter.java:36)
	at org.apache.lucene.util.TestRuleAssertionsRequired$1.evaluate(TestRuleAssertionsRequired.java:53)
	at org.apache.lucene.util.TestRuleMarkFailure$1.evaluate(TestRuleMarkFailure.java:47)
	at org.apache.lucene.util.TestRuleIgnoreAfterMaxFailures$1.evaluate(TestRuleIgnoreAfterMaxFailures.java:64)
	at org.apache.lucene.util.TestRuleIgnoreTestSuites$1.evaluate(TestRuleIgnoreTestSuites.java:54)
	at com.carrotsearch.randomizedtesting.rules.StatementAdapter.evaluate(StatementAdapter.java:36)
	at com.carrotsearch.randomizedtesting.ThreadLeakControl$StatementRunner.run(ThreadLeakControl.java:368)
	at java.base/java.lang.Thread.run(Thread.java:844)


FAILED:  org.apache.solr.cloud.SSLMigrationTest.test

Error Message:
Replica didn't have the proper urlScheme in the ClusterState

Stack Trace:
java.lang.AssertionError: Replica didn't have the proper urlScheme in the ClusterState
	at __randomizedtesting.SeedInfo.seed([3CAFFCB092CF514D:B4FBC36A3C333CB5]:0)
	at org.junit.Assert.fail(Assert.java:93)
	at org.junit.Assert.assertTrue(Assert.java:43)
	at org.apache.solr.cloud.SSLMigrationTest.assertReplicaInformation(SSLMigrationTest.java:104)
	at org.apache.solr.cloud.SSLMigrationTest.testMigrateSSL(SSLMigrationTest.java:97)
	at org.apache.solr.cloud.SSLMigrationTest.test(SSLMigrationTest.java:61)
	at java.base/jdk.internal.reflect.NativeMethodAccessorImpl.invoke0(Native Method)
	at java.base/jdk.internal.reflect.NativeMethodAccessorImpl.invoke(NativeMethodAccessorImpl.java:62)
	at java.base/jdk.internal.reflect.DelegatingMethodAccessorImpl.invoke(DelegatingMethodAccessorImpl.java:43)
	at java.base/java.lang.reflect.Method.invoke(Method.java:564)
	at com.carrotsearch.randomizedtesting.RandomizedRunner.invoke(RandomizedRunner.java:1737)
	at com.carrotsearch.randomizedtesting.RandomizedRunner$8.evaluate(RandomizedRunner.java:934)
	at com.carrotsearch.randomizedtesting.RandomizedRunner$9.evaluate(RandomizedRunner.java:970)
	at com.carrotsearch.randomizedtesting.RandomizedRunner$10.evaluate(RandomizedRunner.java:984)
	at org.apache.solr.BaseDistributedSearchTestCase$ShardsRepeatRule$ShardsFixedStatement.callStatement(BaseDistributedSearchTestCase.java:993)
	at org.apache.solr.BaseDistributedSearchTestCase$ShardsRepeatRule$ShardsStatement.evaluate(BaseDistributedSearchTestCase.java:968)
	at com.carrotsearch.randomizedtesting.rules.SystemPropertiesRestoreRule$1.evaluate(SystemPropertiesRestoreRule.java:57)
	at org.apache.lucene.util.TestRuleSetupTeardownChained$1.evaluate(TestRuleSetupTeardownChained.java:49)
	at org.apache.lucene.util.AbstractBeforeAfterRule$1.evaluate(AbstractBeforeAfterRule.java:45)
	at org.apache.lucene.util.TestRuleThreadAndTestName$1.evaluate(TestRuleThreadAndTestName.java:48)
	at org.apache.lucene.util.TestRuleIgnoreAfterMaxFailures$1.evaluate(TestRuleIgnoreAfterMaxFailures.java:64)
	at org.apache.lucene.util.TestRuleMarkFailure$1.evaluate(TestRuleMarkFailure.java:47)
	at com.carrotsearch.randomizedtesting.rules.StatementAdapter.evaluate(StatementAdapter.java:36)
	at com.carrotsearch.randomizedtesting.ThreadLeakControl$StatementRunner.run(ThreadLeakControl.java:368)
	at com.carrotsearch.randomizedtesting.ThreadLeakControl.forkTimeoutingTask(ThreadLeakControl.java:817)
	at com.carrotsearch.randomizedtesting.ThreadLeakControl$3.evaluate(ThreadLeakControl.java:468)
	at com.carrotsearch.randomizedtesting.RandomizedRunner.runSingleTest(RandomizedRunner.java:943)
	at com.carrotsearch.randomizedtesting.RandomizedRunner$5.evaluate(RandomizedRunner.java:829)
	at com.carrotsearch.randomizedtesting.RandomizedRunner$6.evaluate(RandomizedRunner.java:879)
	at com.carrotsearch.randomizedtesting.RandomizedRunner$7.evaluate(RandomizedRunner.java:890)
	at com.carrotsearch.randomizedtesting.rules.StatementAdapter.evaluate(StatementAdapter.java:36)
	at com.carrotsearch.randomizedtesting.rules.SystemPropertiesRestoreRule$1.evaluate(SystemPropertiesRestoreRule.java:57)
	at org.apache.lucene.util.AbstractBeforeAfterRule$1.evaluate(AbstractBeforeAfterRule.java:45)
	at com.carrotsearch.randomizedtesting.rules.StatementAdapter.evaluate(StatementAdapter.java:36)
	at org.apache.lucene.util.TestRuleStoreClassName$1.evaluate(TestRuleStoreClassName.java:41)
	at com.carrotsearch.randomizedtesting.rules.NoShadowingOrOverridesOnMethodsRule$1.evaluate(NoShadowingOrOverridesOnMethodsRule.java:40)
	at com.carrotsearch.randomizedtesting.rules.NoShadowingOrOverridesOnMethodsRule$1.evaluate(NoShadowingOrOverridesOnMethodsRule.java:40)
	at com.carrotsearch.randomizedtesting.rules.StatementAdapter.evaluate(StatementAdapter.java:36)
	at com.carrotsearch.randomizedtesting.rules.StatementAdapter.evaluate(StatementAdapter.java:36)
	at org.apache.lucene.util.TestRuleAssertionsRequired$1.evaluate(TestRuleAssertionsRequired.java:53)
	at org.apache.lucene.util.TestRuleMarkFailure$1.evaluate(TestRuleMarkFailure.java:47)
	at org.apache.lucene.util.TestRuleIgnoreAfterMaxFailures$1.evaluate(TestRuleIgnoreAfterMaxFailures.java:64)
	at org.apache.lucene.util.TestRuleIgnoreTestSuites$1.evaluate(TestRuleIgnoreTestSuites.java:54)
	at com.carrotsearch.randomizedtesting.rules.StatementAdapter.evaluate(StatementAdapter.java:36)
	at com.carrotsearch.randomizedtesting.ThreadLeakControl$StatementRunner.run(ThreadLeakControl.java:368)
	at java.base/java.lang.Thread.run(Thread.java:844)




Build Log:
[...truncated 1868 lines...]
   [junit4] JVM J2: stderr was not empty, see: /home/jenkins/workspace/Lucene-Solr-BadApples-master-Linux/lucene/build/core/test/temp/junit4-J2-20180526_032633_32317479691785632923242.syserr
   [junit4] >>> JVM J2 emitted unexpected output (verbatim) ----
   [junit4] OpenJDK 64-Bit Server VM warning: Option UseConcMarkSweepGC was deprecated in version 9.0 and will likely be removed in a future release.
   [junit4] <<< JVM J2: EOF ----

[...truncated 3 lines...]
   [junit4] JVM J0: stderr was not empty, see: /home/jenkins/workspace/Lucene-Solr-BadApples-master-Linux/lucene/build/core/test/temp/junit4-J0-20180526_032633_31712193600680666046564.syserr
   [junit4] >>> JVM J0 emitted unexpected output (verbatim) ----
   [junit4] OpenJDK 64-Bit Server VM warning: Option UseConcMarkSweepGC was deprecated in version 9.0 and will likely be removed in a future release.
   [junit4] <<< JVM J0: EOF ----

[...truncated 3 lines...]
   [junit4] JVM J1: stderr was not empty, see: /home/jenkins/workspace/Lucene-Solr-BadApples-master-Linux/lucene/build/core/test/temp/junit4-J1-20180526_032633_31712421618827137039990.syserr
   [junit4] >>> JVM J1 emitted unexpected output (verbatim) ----
   [junit4] OpenJDK 64-Bit Server VM warning: Option UseConcMarkSweepGC was deprecated in version 9.0 and will likely be removed in a future release.
   [junit4] <<< JVM J1: EOF ----

[...truncated 283 lines...]
   [junit4] JVM J0: stderr was not empty, see: /home/jenkins/workspace/Lucene-Solr-BadApples-master-Linux/lucene/build/test-framework/test/temp/junit4-J0-20180526_033556_6465288404572661155455.syserr
   [junit4] >>> JVM J0 emitted unexpected output (verbatim) ----
   [junit4] OpenJDK 64-Bit Server VM warning: Option UseConcMarkSweepGC was deprecated in version 9.0 and will likely be removed in a future release.
   [junit4] <<< JVM J0: EOF ----

[...truncated 3 lines...]
   [junit4] JVM J1: stderr was not empty, see: /home/jenkins/workspace/Lucene-Solr-BadApples-master-Linux/lucene/build/test-framework/test/temp/junit4-J1-20180526_033556_64615860148746408195231.syserr
   [junit4] >>> JVM J1 emitted unexpected output (verbatim) ----
   [junit4] OpenJDK 64-Bit Server VM warning: Option UseConcMarkSweepGC was deprecated in version 9.0 and will likely be removed in a future release.
   [junit4] <<< JVM J1: EOF ----

[...truncated 15 lines...]
   [junit4] JVM J2: stderr was not empty, see: /home/jenkins/workspace/Lucene-Solr-BadApples-master-Linux/lucene/build/test-framework/test/temp/junit4-J2-20180526_033556_64613900535774338781434.syserr
   [junit4] >>> JVM J2 emitted unexpected output (verbatim) ----
   [junit4] OpenJDK 64-Bit Server VM warning: Option UseConcMarkSweepGC was deprecated in version 9.0 and will likely be removed in a future release.
   [junit4] <<< JVM J2: EOF ----

[...truncated 1077 lines...]
   [junit4] JVM J2: stderr was not empty, see: /home/jenkins/workspace/Lucene-Solr-BadApples-master-Linux/lucene/build/analysis/common/test/temp/junit4-J2-20180526_033739_00416486115455608213214.syserr
   [junit4] >>> JVM J2 emitted unexpected output (verbatim) ----
   [junit4] OpenJDK 64-Bit Server VM warning: Option UseConcMarkSweepGC was deprecated in version 9.0 and will likely be removed in a future release.
   [junit4] <<< JVM J2: EOF ----

   [junit4] JVM J1: stderr was not empty, see: /home/jenkins/workspace/Lucene-Solr-BadApples-master-Linux/lucene/build/analysis/common/test/temp/junit4-J1-20180526_033739_0043271441987158520384.syserr
   [junit4] >>> JVM J1 emitted unexpected output (verbatim) ----
   [junit4] OpenJDK 64-Bit Server VM warning: Option UseConcMarkSweepGC was deprecated in version 9.0 and will likely be removed in a future release.
   [junit4] <<< JVM J1: EOF ----

[...truncated 3 lines...]
   [junit4] JVM J0: stderr was not empty, see: /home/jenkins/workspace/Lucene-Solr-BadApples-master-Linux/lucene/build/analysis/common/test/temp/junit4-J0-20180526_033739_004101003121508091924.syserr
   [junit4] >>> JVM J0 emitted unexpected output (verbatim) ----
   [junit4] OpenJDK 64-Bit Server VM warning: Option UseConcMarkSweepGC was deprecated in version 9.0 and will likely be removed in a future release.
   [junit4] <<< JVM J0: EOF ----

[...truncated 255 lines...]
   [junit4] JVM J2: stderr was not empty, see: /home/jenkins/workspace/Lucene-Solr-BadApples-master-Linux/lucene/build/analysis/icu/test/temp/junit4-J2-20180526_033940_97817673652179165786261.syserr
   [junit4] >>> JVM J2 emitted unexpected output (verbatim) ----
   [junit4] OpenJDK 64-Bit Server VM warning: Option UseConcMarkSweepGC was deprecated in version 9.0 and will likely be removed in a future release.
   [junit4] <<< JVM J2: EOF ----

[...truncated 6 lines...]
   [junit4] JVM J1: stderr was not empty, see: /home/jenkins/workspace/Lucene-Solr-BadApples-master-Linux/lucene/build/analysis/icu/test/temp/junit4-J1-20180526_033940_9788972524385486495240.syserr
   [junit4] >>> JVM J1 emitted unexpected output (verbatim) ----
   [junit4] OpenJDK 64-Bit Server VM warning: Option UseConcMarkSweepGC was deprecated in version 9.0 and will likely be removed in a future release.
   [junit4] <<< JVM J1: EOF ----

   [junit4] JVM J0: stderr was not empty, see: /home/jenkins/workspace/Lucene-Solr-BadApples-master-Linux/lucene/build/analysis/icu/test/temp/junit4-J0-20180526_033940_9784521641452090733863.syserr
   [junit4] >>> JVM J0 emitted unexpected output (verbatim) ----
   [junit4] OpenJDK 64-Bit Server VM warning: Option UseConcMarkSweepGC was deprecated in version 9.0 and will likely be removed in a future release.
   [junit4] <<< JVM J0: EOF ----

[...truncated 253 lines...]
   [junit4] JVM J2: stderr was not empty, see: /home/jenkins/workspace/Lucene-Solr-BadApples-master-Linux/lucene/build/analysis/kuromoji/test/temp/junit4-J2-20180526_033956_96215781989310117005490.syserr
   [junit4] >>> JVM J2 emitted unexpected output (verbatim) ----
   [junit4] OpenJDK 64-Bit Server VM warning: Option UseConcMarkSweepGC was deprecated in version 9.0 and will likely be removed in a future release.
   [junit4] <<< JVM J2: EOF ----

   [junit4] JVM J0: stderr was not empty, see: /home/jenkins/workspace/Lucene-Solr-BadApples-master-Linux/lucene/build/analysis/kuromoji/test/temp/junit4-J0-20180526_033956_96210385883440651513055.syserr
   [junit4] >>> JVM J0 emitted unexpected output (verbatim) ----
   [junit4] OpenJDK 64-Bit Server VM warning: Option UseConcMarkSweepGC was deprecated in version 9.0 and will likely be removed in a future release.
   [junit4] <<< JVM J0: EOF ----

[...truncated 6 lines...]
   [junit4] JVM J1: stderr was not empty, see: /home/jenkins/workspace/Lucene-Solr-BadApples-master-Linux/lucene/build/analysis/kuromoji/test/temp/junit4-J1-20180526_033956_96217483057385280855986.syserr
   [junit4] >>> JVM J1 emitted unexpected output (verbatim) ----
   [junit4] OpenJDK 64-Bit Server VM warning: Option UseConcMarkSweepGC was deprecated in version 9.0 and will likely be removed in a future release.
   [junit4] <<< JVM J1: EOF ----

[...truncated 162 lines...]
   [junit4] JVM J1: stderr was not empty, see: /home/jenkins/workspace/Lucene-Solr-BadApples-master-Linux/lucene/build/analysis/morfologik/test/temp/junit4-J1-20180526_034025_51622492665486634676.syserr
   [junit4] >>> JVM J1 emitted unexpected output (verbatim) ----
   [junit4] OpenJDK 64-Bit Server VM warning: Option UseConcMarkSweepGC was deprecated in version 9.0 and will likely be removed in a future release.
   [junit4] <<< JVM J1: EOF ----

[...truncated 3 lines...]
   [junit4] JVM J2: stderr was not empty, see: /home/jenkins/workspace/Lucene-Solr-BadApples-master-Linux/lucene/build/analysis/morfologik/test/temp/junit4-J2-20180526_034025_5166222013364733779872.syserr
   [junit4] >>> JVM J2 emitted unexpected output (verbatim) ----
   [junit4] OpenJDK 64-Bit Server VM warning: Option UseConcMarkSweepGC was deprecated in version 9.0 and will likely be removed in a future release.
   [junit4] <<< JVM J2: EOF ----

[...truncated 3 lines...]
   [junit4] JVM J0: stderr was not empty, see: /home/jenkins/workspace/Lucene-Solr-BadApples-master-Linux/lucene/build/analysis/morfologik/test/temp/junit4-J0-20180526_034025_516911494574185412737.syserr
   [junit4] >>> JVM J0 emitted unexpected output (verbatim) ----
   [junit4] OpenJDK 64-Bit Server VM warning: Option UseConcMarkSweepGC was deprecated in version 9.0 and will likely be removed in a future release.
   [junit4] <<< JVM J0: EOF ----

[...truncated 204 lines...]
   [junit4] JVM J0: stderr was not empty, see: /home/jenkins/workspace/Lucene-Solr-BadApples-master-Linux/lucene/build/analysis/nori/test/temp/junit4-J0-20180526_034030_39913281341901736829633.syserr
   [junit4] >>> JVM J0 emitted unexpected output (verbatim) ----
   [junit4] OpenJDK 64-Bit Server VM warning: Option UseConcMarkSweepGC was deprecated in version 9.0 and will likely be removed in a future release.
   [junit4] <<< JVM J0: EOF ----

[...truncated 3 lines...]
   [junit4] JVM J2: stderr was not empty, see: /home/jenkins/workspace/Lucene-Solr-BadApples-master-Linux/lucene/build/analysis/nori/test/temp/junit4-J2-20180526_034030_39916864611179399264278.syserr
   [junit4] >>> JVM J2 emitted unexpected output (verbatim) ----
   [junit4] OpenJDK 64-Bit Server VM warning: Option UseConcMarkSweepGC was deprecated in version 9.0 and will likely be removed in a future release.
   [junit4] <<< JVM J2: EOF ----

[...truncated 6 lines...]
   [junit4] JVM J1: stderr was not empty, see: /home/jenkins/workspace/Lucene-Solr-BadApples-master-Linux/lucene/build/analysis/nori/test/temp/junit4-J1-20180526_034030_3992867517573464136897.syserr
   [junit4] >>> JVM J1 emitted unexpected output (verbatim) ----
   [junit4] OpenJDK 64-Bit Server VM warning: Option UseConcMarkSweepGC was deprecated in version 9.0 and will likely be removed in a future release.
   [junit4] <<< JVM J1: EOF ----

[...truncated 168 lines...]
   [junit4] JVM J2: stderr was not empty, see: /home/jenkins/workspace/Lucene-Solr-BadApples-master-Linux/lucene/build/analysis/opennlp/test/temp/junit4-J2-20180526_034041_75416049952127400917224.syserr
   [junit4] >>> JVM J2 emitted unexpected output (verbatim) ----
   [junit4] OpenJDK 64-Bit Server VM warning: Option UseConcMarkSweepGC was deprecated in version 9.0 and will likely be removed in a future release.
   [junit4] <<< JVM J2: EOF ----

[...truncated 6 lines...]
   [junit4] JVM J0: stderr was not empty, see: /home/jenkins/workspace/Lucene-Solr-BadApples-master-Linux/lucene/build/analysis/opennlp/test/temp/junit4-J0-20180526_034041_7544676754127829802373.syserr
   [junit4] >>> JVM J0 emitted unexpected output (verbatim) ----
   [junit4] OpenJDK 64-Bit Server VM warning: Option UseConcMarkSweepGC was deprecated in version 9.0 and will likely be removed in a future release.
   [junit4] <<< JVM J0: EOF ----

   [junit4] JVM J1: stderr was not empty, see: /home/jenkins/workspace/Lucene-Solr-BadApples-master-Linux/lucene/build/analysis/opennlp/test/temp/junit4-J1-20180526_034041_7542565841757895215754.syserr
   [junit4] >>> JVM J1 emitted unexpected output (verbatim) ----
   [junit4] OpenJDK 64-Bit Server VM warning: Option UseConcMarkSweepGC was deprecated in version 9.0 and will likely be removed in a future release.
   [junit4] <<< JVM J1: EOF ----

[...truncated 176 lines...]
   [junit4] JVM J2: stderr was not empty, see: /home/jenkins/workspace/Lucene-Solr-BadApples-master-Linux/lucene/build/analysis/phonetic/test/temp/junit4-J2-20180526_034045_39410589083918149984300.syserr
   [junit4] >>> JVM J2 emitted unexpected output (verbatim) ----
   [junit4] OpenJDK 64-Bit Server VM warning: Option UseConcMarkSweepGC was deprecated in version 9.0 and will likely be removed in a future release.
   [junit4] <<< JVM J2: EOF ----

[...truncated 3 lines...]
   [junit4] JVM J0: stderr was not empty, see: /home/jenkins/workspace/Lucene-Solr-BadApples-master-Linux/lucene/build/analysis/phonetic/test/temp/junit4-J0-20180526_034045_3946785825185146252454.syserr
   [junit4] >>> JVM J0 emitted unexpected output (verbatim) ----
   [junit4] OpenJDK 64-Bit Server VM warning: Option UseConcMarkSweepGC was deprecated in version 9.0 and will likely be removed in a future release.
   [junit4] <<< JVM J0: EOF ----

[...truncated 3 lines...]
   [junit4] JVM J1: stderr was not empty, see: /home/jenkins/workspace/Lucene-Solr-BadApples-master-Linux/lucene/build/analysis/phonetic/test/temp/junit4-J1-20180526_034045_39417722462508608451269.syserr
   [junit4] >>> JVM J1 emitted unexpected output (verbatim) ----
   [junit4] OpenJDK 64-Bit Server VM warning: Option UseConcMarkSweepGC was deprecated in version 9.0 and will likely be removed in a future release.
   [junit4] <<< JVM J1: EOF ----

[...truncated 161 lines...]
   [junit4] JVM J0: stderr was not empty, see: /home/jenkins/workspace/Lucene-Solr-BadApples-master-Linux/lucene/build/analysis/smartcn/test/temp/junit4-J0-20180526_034058_53615670125660417388771.syserr
   [junit4] >>> JVM J0 emitted unexpected output (verbatim) ----
   [junit4] OpenJDK 64-Bit Server VM warning: Option UseConcMarkSweepGC was deprecated in version 9.0 and will likely be removed in a future release.
   [junit4] <<< JVM J0: EOF ----

[...truncated 3 lines...]
   [junit4] JVM J1: stderr was not empty, see: /home/jenkins/workspace/Lucene-Solr-BadApples-master-Linux/lucene/build/analysis/smartcn/test/temp/junit4-J1-20180526_034058_5369360292493888222948.syserr
   [junit4] >>> JVM J1 emitted unexpected output (verbatim) ----
   [junit4] OpenJDK 64-Bit Server VM warning: Option UseConcMarkSweepGC was deprecated in version 9.0 and will likely be removed in a future release.
   [junit4] <<< JVM J1: EOF ----

[...truncated 165 lines...]
   [junit4] JVM J1: stderr was not empty, see: /home/jenkins/workspace/Lucene-Solr-BadApples-master-Linux/lucene/build/analysis/stempel/test/temp/junit4-J1-20180526_034110_02813090908059529911902.syserr
   [junit4] >>> JVM J1 emitted unexpected output (verbatim) ----
   [junit4] OpenJDK 64-Bit Server VM warning: Option UseConcMarkSweepGC was deprecated in version 9.0 and will likely be removed in a future release.
   [junit4] <<< JVM J1: EOF ----

   [junit4] JVM J2: stderr was not empty, see: /home/jenkins/workspace/Lucene-Solr-BadApples-master-Linux/lucene/build/analysis/stempel/test/temp/junit4-J2-20180526_034110_02812427133921841621975.syserr
   [junit4] >>> JVM J2 emitted unexpected output (verbatim) ----
   [junit4] OpenJDK 64-Bit Server VM warning: Option UseConcMarkSweepGC was deprecated in version 9.0 and will likely be removed in a future release.
   [junit4] <<< JVM J2: EOF ----

[...truncated 3 lines...]
   [junit4] JVM J0: stderr was not empty, see: /home/jenkins/workspace/Lucene-Solr-BadApples-master-Linux/lucene/build/analysis/stempel/test/temp/junit4-J0-20180526_034110_02317541121687231012064.syserr
   [junit4] >>> JVM J0 emitted unexpected output (verbatim) ----
   [junit4] OpenJDK 64-Bit Server VM warning: Option UseConcMarkSweepGC was deprecated in version 9.0 and will likely be removed in a future release.
   [junit4] <<< JVM J0: EOF ----

[...truncated 177 lines...]
   [junit4] JVM J0: stderr was not empty, see: /home/jenkins/workspace/Lucene-Solr-BadApples-master-Linux/lucene/build/analysis/uima/test/temp/junit4-J0-20180526_034114_53414503376063020057066.syserr
   [junit4] >>> JVM J0 emitted unexpected output (verbatim) ----
   [junit4] OpenJDK 64-Bit Server VM warning: Option UseConcMarkSweepGC was deprecated in version 9.0 and will likely be removed in a future release.
   [junit4] <<< JVM J0: EOF ----

[...truncated 158 lines...]
   [junit4] JVM J1: stderr was not empty, see: /home/jenkins/workspace/Lucene-Solr-BadApples-master-Linux/lucene/build/backward-codecs/test/temp/junit4-J1-20180526_034124_37311492177829993270428.syserr
   [junit4] >>> JVM J1 emitted unexpected output (verbatim) ----
   [junit4] JVM J2: stderr was not empty, see: /home/jenkins/workspace/Lucene-Solr-BadApples-master-Linux/lucene/build/backward-codecs/test/temp/junit4-J2-20180526_034124_3732066677636483341038.syserr
   [junit4] OpenJDK 64-Bit Server VM warning: Option UseConcMarkSweepGC was deprecated in version 9.0 and will likely be removed in a future release.
   [junit4] <<< JVM J1: EOF ----

[...truncated 22 lines...]
   [junit4] JVM J0: stderr was not empty, see: /home/jenkins/workspace/Lucene-Solr-BadApples-master-Linux/lucene/build/backward-codecs/test/temp/junit4-J0-20180526_034124_37318050100510768501317.syserr
   [junit4] >>> JVM J0 emitted unexpected output (verbatim) ----
   [junit4] OpenJDK 64-Bit Server VM warning: Option UseConcMarkSweepGC was deprecated in version 9.0 and will likely be removed in a future release.
   [junit4] <<< JVM J0: EOF ----

[...truncated 1391 lines...]
   [junit4] JVM J2: stderr was not empty, see: /home/jenkins/workspace/Lucene-Solr-BadApples-master-Linux/lucene/build/benchmark/test/temp/junit4-J2-20180526_034155_1471113095853679025211.syserr
   [junit4] >>> JVM J2 emitted unexpected output (verbatim) ----
   [junit4] OpenJDK 64-Bit Server VM warning: Option UseConcMarkSweepGC was deprecated in version 9.0 and will likely be removed in a future release.
   [junit4] <<< JVM J2: EOF ----

   [junit4] JVM J1: stderr was not empty, see: /home/jenkins/workspace/Lucene-Solr-BadApples-master-Linux/lucene/build/benchmark/test/temp/junit4-J1-20180526_034155_14718081536145572178380.syserr
   [junit4] >>> JVM J1 emitted unexpected output (verbatim) ----
   [junit4] OpenJDK 64-Bit Server VM warning: Option UseConcMarkSweepGC was deprecated in version 9.0 and will likely be removed in a future release.
   [junit4] <<< JVM J1: EOF ----

[...truncated 3 lines...]
   [junit4] JVM J0: stderr was not empty, see: /home/jenkins/workspace/Lucene-Solr-BadApples-master-Linux/lucene/build/benchmark/test/temp/junit4-J0-20180526_034155_14715060041343689198434.syserr
   [junit4] >>> JVM J0 emitted unexpected output (verbatim) ----
   [junit4] OpenJDK 64-Bit Server VM warning: Option UseConcMarkSweepGC was deprecated in version 9.0 and will likely be removed in a future release.
   [junit4] <<< JVM J0: EOF ----

[...truncated 250 lines...]
   [junit4] JVM J1: stderr was not empty, see: /home/jenkins/workspace/Lucene-Solr-BadApples-master-Linux/lucene/build/classification/test/temp/junit4-J1-20180526_034204_69013436984532074753165.syserr
   [junit4] >>> JVM J1 emitted unexpected output (verbatim) ----
   [junit4] OpenJDK 64-Bit Server VM warning: Option UseConcMarkSweepGC was deprecated in version 9.0 and will likely be removed in a future release.
   [junit4] <<< JVM J1: EOF ----

[...truncated 6 lines...]
   [junit4] JVM J0: stderr was not empty, see: /home/jenkins/workspace/Lucene-Solr-BadApples-master-Linux/lucene/build/classification/test/temp/junit4-J0-20180526_034204_6903609218930452451279.syserr
   [junit4] >>> JVM J0 emitted unexpected output (verbatim) ----
   [junit4] OpenJDK 64-Bit Server VM warning: Option UseConcMarkSweepGC was deprecated in version 9.0 and will likely be removed in a future release.
   [junit4] <<< JVM J0: EOF ----

   [junit4] JVM J2: stderr was not empty, see: /home/jenkins/workspace/Lucene-Solr-BadApples-master-Linux/lucene/build/classification/test/temp/junit4-J2-20180526_034204_69014866868631900651999.syserr
   [junit4] >>> JVM J2 emitted unexpected output (verbatim) ----
   [junit4] OpenJDK 64-Bit Server VM warning: Option UseConcMarkSweepGC was deprecated in version 9.0 and will likely be removed in a future release.
   [junit4] <<< JVM J2: EOF ----

[...truncated 252 lines...]
   [junit4] JVM J0: stderr was not empty, see: /home/jenkins/workspace/Lucene-Solr-BadApples-master-Linux/lucene/build/codecs/test/temp/junit4-J0-20180526_034216_49711786462112301601347.syserr
   [junit4] >>> JVM J0 emitted unexpected output (verbatim) ----
   [junit4] OpenJDK 64-Bit Server VM warning: Option UseConcMarkSweepGC was deprecated in version 9.0 and will likely be removed in a future release.
   [junit4] <<< JVM J0: EOF ----

[...truncated 9 lines...]
   [junit4] JVM J1: stderr was not empty, see: /home/jenkins/workspace/Lucene-Solr-BadApples-master-Linux/lucene/build/codecs/test/temp/junit4-J1-20180526_034216_49714177804641378039593.syserr
   [junit4] >>> JVM J1 emitted unexpected output (verbatim) ----
   [junit4] OpenJDK 64-Bit Server VM warning: Option UseConcMarkSweepGC was deprecated in version 9.0 and will likely be removed in a future release.
   [junit4] <<< JVM J1: EOF ----

[...truncated 7 lines...]
   [junit4] JVM J2: stderr was not empty, see: /home/jenkins/workspace/Lucene-Solr-BadApples-master-Linux/lucene/build/codecs/test/temp/junit4-J2-20180526_034216_49712618357214032318497.syserr
   [junit4] >>> JVM J2 emitted unexpected output (verbatim) ----
   [junit4] OpenJDK 64-Bit Server VM warning: Option UseConcMarkSweepGC was deprecated in version 9.0 and will likely be removed in a future release.
   [junit4] <<< JVM J2: EOF ----

[...truncated 234 lines...]
   [junit4] JVM J2: stderr was not empty, see: /home/jenkins/workspace/Lucene-Solr-BadApples-master-Linux/lucene/build/demo/test/temp/junit4-J2-20180526_034513_53318210633272338911113.syserr
   [junit4] >>> JVM J2 emitted unexpected output (verbatim) ----
   [junit4] OpenJDK 64-Bit Server VM warning: Option UseConcMarkSweepGC was deprecated in version 9.0 and will likely be removed in a future release.
   [junit4] <<< JVM J2: EOF ----

   [junit4] JVM J1: stderr was not empty, see: /home/jenkins/workspace/Lucene-Solr-BadApples-master-Linux/lucene/build/demo/test/temp/junit4-J1-20180526_034513_53212026678986118036802.syserr
   [junit4] >>> JVM J1 emitted unexpected output (verbatim) ----
   [junit4] OpenJDK 64-Bit Server VM warning: Option UseConcMarkSweepGC was deprecated in version 9.0 and will likely be removed in a future release.
   [junit4] <<< JVM J1: EOF ----

   [junit4] JVM J0: stderr was not empty, see: /home/jenkins/workspace/Lucene-Solr-BadApples-master-Linux/lucene/build/demo/test/temp/junit4-J0-20180526_034513_52816180420318335117101.syserr
   [junit4] >>> JVM J0 emitted unexpected output (verbatim) ----
   [junit4] OpenJDK 64-Bit Server VM warning: Option UseConcMarkSweepGC was deprecated in version 9.0 and will likely be removed in a future release.
   [junit4] <<< JVM J0: EOF ----

[...truncated 173 lines...]
   [junit4] JVM J0: stderr was not empty, see: /home/jenkins/workspace/Lucene-Solr-BadApples-master-Linux/lucene/build/expressions/test/temp/junit4-J0-20180526_034517_15011258770139159740483.syserr
   [junit4] >>> JVM J0 emitted unexpected output (verbatim) ----
   [junit4] OpenJDK 64-Bit Server VM warning: Option UseConcMarkSweepGC was deprecated in version 9.0 and will likely be removed in a future release.
   [junit4] <<< JVM J0: EOF ----

[...truncated 3 lines...]
   [junit4] JVM J2: stderr was not empty, see: /home/jenkins/workspace/Lucene-Solr-BadApples-master-Linux/lucene/build/expressions/test/temp/junit4-J2-20180526_034517_1509026324765608368918.syserr
   [junit4] >>> JVM J2 emitted unexpected output (verbatim) ----
   [junit4] OpenJDK 64-Bit Server VM warning: Option UseConcMarkSweepGC was deprecated in version 9.0 and will likely be removed in a future release.
   [junit4] <<< JVM J2: EOF ----

[...truncated 3 lines...]
   [junit4] JVM J1: stderr was not empty, see: /home/jenkins/workspace/Lucene-Solr-BadApples-master-Linux/lucene/build/expressions/test/temp/junit4-J1-20180526_034517_15013795502859507099199.syserr
   [junit4] >>> JVM J1 emitted unexpected output (verbatim) ----
   [junit4] OpenJDK 64-Bit Server VM warning: Option UseConcMarkSweepGC was deprecated in version 9.0 and will likely be removed in a future release.
   [junit4] <<< JVM J1: EOF ----

[...truncated 232 lines...]
   [junit4] JVM J2: stderr was not empty, see: /home/jenkins/workspace/Lucene-Solr-BadApples-master-Linux/lucene/build/facet/test/temp/junit4-J2-20180526_034526_08713569874432434143968.syserr
   [junit4] >>> JVM J2 emitted unexpected output (verbatim) ----
   [junit4] OpenJDK 64-Bit Server VM warning: Option UseConcMarkSweepGC was deprecated in version 9.0 and will likely be removed in a future release.
   [junit4] <<< JVM J2: EOF ----

[...truncated 3 lines...]
   [junit4] JVM J1: stderr was not empty, see: /home/jenkins/workspace/Lucene-Solr-BadApples-master-Linux/lucene/build/facet/test/temp/junit4-J1-20180526_034526_08715922666754061540490.syserr
   [junit4] >>> JVM J1 emitted unexpected output (verbatim) ----
   [junit4] OpenJDK 64-Bit Server VM warning: Option UseConcMarkSweepGC was deprecated in version 9.0 and will likely be removed in a future release.
   [junit4] <<< JVM J1: EOF ----

[...truncated 3 lines...]
   [junit4] JVM J0: stderr was not empty, see: /home/jenkins/workspace/Lucene-Solr-BadApples-master-Linux/lucene/build/facet/test/temp/junit4-J0-20180526_034526_0874587134077281914659.syserr
   [junit4] >>> JVM J0 emitted unexpected output (verbatim) ----
   [junit4] OpenJDK 64-Bit Server VM warning: Option UseConcMarkSweepGC was deprecated in version 9.0 and will likely be removed in a future release.
   [junit4] <<< JVM J0: EOF ----

[...truncated 182 lines...]
   [junit4] JVM J1: stderr was not empty, see: /home/jenkins/workspace/Lucene-Solr-BadApples-master-Linux/lucene/build/grouping/test/temp/junit4-J1-20180526_034609_6061252935465239436010.syserr
   [junit4] >>> JVM J1 emitted unexpected output (verbatim) ----
   [junit4] OpenJDK 64-Bit Server VM warning: Option UseConcMarkSweepGC was deprecated in version 9.0 and will likely be removed in a future release.
   [junit4] <<< JVM J1: EOF ----

[...truncated 3 lines...]
   [junit4] JVM J0: stderr was not empty, see: /home/jenkins/workspace/Lucene-Solr-BadApples-master-Linux/lucene/build/grouping/test/temp/junit4-J0-20180526_034609_60617627448116228838612.syserr
   [junit4] >>> JVM J0 emitted unexpected output (verbatim) ----
   [junit4] OpenJDK 64-Bit Server VM warning: Option UseConcMarkSweepGC was deprecated in version 9.0 and will likely be removed in a future release.
   [junit4] <<< JVM J0: EOF ----

[...truncated 3 lines...]
   [junit4] JVM J2: stderr was not empty, see: /home/jenkins/workspace/Lucene-Solr-BadApples-master-Linux/lucene/build/grouping/test/temp/junit4-J2-20180526_034609_6075664191613418295786.syserr
   [junit4] >>> JVM J2 emitted unexpected output (verbatim) ----
   [junit4] OpenJDK 64-Bit Server VM warning: Option UseConcMarkSweepGC was deprecated in version 9.0 and will likely be removed in a future release.
   [junit4] <<< JVM J2: EOF ----

[...truncated 255 lines...]
   [junit4] JVM J1: stderr was not empty, see: /home/jenkins/workspace/Lucene-Solr-BadApples-master-Linux/lucene/build/highlighter/test/temp/junit4-J1-20180526_034621_92115320015970415539472.syserr
   [junit4] >>> JVM J1 emitted unexpected output (verbatim) ----
   [junit4] OpenJDK 64-Bit Server VM warning: Option UseConcMarkSweepGC was deprecated in version 9.0 and will likely be removed in a future release.
   [junit4] <<< JVM J1: EOF ----

[...truncated 3 lines...]
   [junit4] JVM J2: stderr was not empty, see: /home/jenkins/workspace/Lucene-Solr-BadApples-master-Linux/lucene/build/highlighter/test/temp/junit4-J2-20180526_034621_9219283310484055010065.syserr
   [junit4] >>> JVM J2 emitted unexpected output (verbatim) ----
   [junit4] OpenJDK 64-Bit Server VM warning: Option UseConcMarkSweepGC was deprecated in version 9.0 and will likely be removed in a future release.
   [junit4] <<< JVM J2: EOF ----

[...truncated 3 lines...]
   [junit4] JVM J0: stderr was not empty, see: /home/jenkins/workspace/Lucene-Solr-BadApples-master-Linux/lucene/build/highlighter/test/temp/junit4-J0-20180526_034621_92113571209744927167025.syserr
   [junit4] >>> JVM J0 emitted unexpected output (verbatim) ----
   [junit4] OpenJDK 64-Bit Server VM warning: Option UseConcMarkSweepGC was deprecated in version 9.0 and will likely be removed in a future release.
   [junit4] <<< JVM J0: EOF ----

[...truncated 163 lines...]
   [junit4] JVM J2: stderr was not empty, see: /home/jenkins/workspace/Lucene-Solr-BadApples-master-Linux/lucene/build/join/test/temp/junit4-J2-20180526_034650_0887767457552860755887.syserr
   [junit4] >>> JVM J2 emitted unexpected output (verbatim) ----
   [junit4] OpenJDK 64-Bit Server VM warning: Option UseConcMarkSweepGC was deprecated in version 9.0 and will likely be removed in a future release.
   [junit4] <<< JVM J2: EOF ----

[...truncated 3 lines...]
   [junit4] JVM J0: stderr was not empty, see: /home/jenkins/workspace/Lucene-Solr-BadApples-master-Linux/lucene/build/join/test/temp/junit4-J0-20180526_034650_0883554850014398728497.syserr
   [junit4] >>> JVM J0 emitted unexpected output (verbatim) ----
   [junit4] OpenJDK 64-Bit Server VM warning: Option UseConcMarkSweepGC was deprecated in version 9.0 and will likely be removed in a future release.
   [junit4] <<< JVM J0: EOF ----

[...truncated 6 lines...]
   [junit4] JVM J1: stderr was not empty, see: /home/jenkins/workspace/Lucene-Solr-BadApples-master-Linux/lucene/build/join/test/temp/junit4-J1-20180526_034650_08816152439017148846177.syserr
   [junit4] >>> JVM J1 emitted unexpected output (verbatim) ----
   [junit4] OpenJDK 64-Bit Server VM warning: Option UseConcMarkSweepGC was deprecated in version 9.0 and will likely be removed in a future release.
   [junit4] <<< JVM J1: EOF ----

[...truncated 155 lines...]
   [junit4] JVM J0: stderr was not empty, see: /home/jenkins/workspace/Lucene-Solr-BadApples-master-Linux/lucene/build/memory/test/temp/junit4-J0-20180526_034718_8218302899931983555733.syserr
   [junit4] >>> JVM J0 emitted unexpected output (verbatim) ----
   [junit4] OpenJDK 64-Bit Server VM warning: Option UseConcMarkSweepGC was deprecated in version 9.0 and will likely be removed in a future release.
   [junit4] <<< JVM J0: EOF ----

[...truncated 3 lines...]
   [junit4] JVM J1: stderr was not empty, see: /home/jenkins/workspace/Lucene-Solr-BadApples-master-Linux/lucene/build/memory/test/temp/junit4-J1-20180526_034718_8216807040860714747760.syserr
   [junit4] >>> JVM J1 emitted unexpected output (verbatim) ----
   [junit4] OpenJDK 64-Bit Server VM warning: Option UseConcMarkSweepGC was deprecated in version 9.0 and will likely be removed in a future release.
   [junit4] <<< JVM J1: EOF ----

[...truncated 184 lines...]
   [junit4] JVM J1: stderr was not empty, see: /home/jenkins/workspace/Lucene-Solr-BadApples-master-Linux/lucene/build/misc/test/temp/junit4-J1-20180526_034732_8584197461124155523479.syserr
   [junit4] >>> JVM J1 emitted unexpected output (verbatim) ----
   [junit4] OpenJDK 64-Bit Server VM warning: Option UseConcMarkSweepGC was deprecated in version 9.0 and will likely be removed in a future release.
   [junit4] <<< JVM J1: EOF ----

[...truncated 5 lines...]
   [junit4] JVM J2: stderr was not empty, see: /home/jenkins/workspace/Lucene-Solr-BadApples-master-Linux/lucene/build/misc/test/temp/junit4-J2-20180526_034732_85811785105947726091103.syserr
   [junit4] >>> JVM J2 emitted unexpected output (verbatim) ----
   [junit4] OpenJDK 64-Bit Server VM warning: Option UseConcMarkSweepGC was deprecated in version 9.0 and will likely be removed in a future release.
   [junit4] <<< JVM J2: EOF ----

[...truncated 6 lines...]
   [junit4] JVM J0: stderr was not empty, see: /home/jenkins/workspace/Lucene-Solr-BadApples-master-Linux/lucene/build/misc/test/temp/junit4-J0-20180526_034732_8586624353110590025869.syserr
   [junit4] >>> JVM J0 emitted unexpected output (verbatim) ----
   [junit4] OpenJDK 64-Bit Server VM warning: Option UseConcMarkSweepGC was deprecated in version 9.0 and will likely be removed in a future release.
   [junit4] <<< JVM J0: EOF ----

[...truncated 310 lines...]
   [junit4] JVM J0: stderr was not empty, see: /home/jenkins/workspace/Lucene-Solr-BadApples-master-Linux/lucene/build/queries/test/temp/junit4-J0-20180526_034753_92816770050428611878312.syserr
   [junit4] >>> JVM J0 emitted unexpected output (verbatim) ----
   [junit4] OpenJDK 64-Bit Server VM warning: Option UseConcMarkSweepGC was deprecated in version 9.0 and will likely be removed in a future release.
   [junit4] <<< JVM J0: EOF ----

   [junit4] JVM J1: stderr was not empty, see: /home/jenkins/workspace/Lucene-Solr-BadApples-master-Linux/lucene/build/queries/test/temp/junit4-J1-20180526_034753_9283059341288540555720.syserr
   [junit4] >>> JVM J1 emitted unexpected output (verbatim) ----
   [junit4] OpenJDK 64-Bit Server VM warning: Option UseConcMarkSweepGC was deprecated in version 9.0 and will likely be removed in a future release.
   [junit4] <<< JVM J1: EOF ----

   [junit4] JVM J2: stderr was not empty, see: /home/jenkins/workspace/Lucene-Solr-BadApples-master-Linux/lucene/build/queries/test/temp/junit4-J2-20180526_034753_92816191698076751913587.syserr
   [junit4] >>> JVM J2 emitted unexpected output (verbatim) ----
   [junit4] OpenJDK 64-Bit Server VM warning: Option UseConcMarkSweepGC was deprecated in version 9.0 and will likely be removed in a future release.
   [junit4] <<< JVM J2: EOF ----

[...truncated 232 lines...]
   [junit4] JVM J1: stderr was not empty, see: /home/jenkins/workspace/Lucene-Solr-BadApples-master-Linux/lucene/build/queryparser/test/temp/junit4-J1-20180526_034803_3155187820109095580378.syserr
   [junit4] >>> JVM J1 emitted unexpected output (verbatim) ----
   [junit4] OpenJDK 64-Bit Server VM warning: Option UseConcMarkSweepGC was deprecated in version 9.0 and will likely be removed in a future release.
   [junit4] <<< JVM J1: EOF ----

   [junit4] JVM J2: stderr was not empty, see: /home/jenkins/workspace/Lucene-Solr-BadApples-master-Linux/lucene/build/queryparser/test/temp/junit4-J2-20180526_034803_3159314367797408434397.syserr
   [junit4] >>> JVM J2 emitted unexpected output (verbatim) ----
   [junit4] OpenJDK 64-Bit Server VM warning: Option UseConcMarkSweepGC was deprecated in version 9.0 and will likely be removed in a future release.
   [junit4] <<< JVM J2: EOF ----

[...truncated 3 lines...]
   [junit4] JVM J0: stderr was not empty, see: /home/jenkins/workspace/Lucene-Solr-BadApples-master-Linux/lucene/build/queryparser/test/temp/junit4-J0-20180526_034803_3157115576709633427806.syserr
   [junit4] >>> JVM J0 emitted unexpected output (verbatim) ----
   [junit4] OpenJDK 64-Bit Server VM warning: Option UseConcMarkSweepGC was deprecated in version 9.0 and will likely be removed in a future release.
   [junit4] <<< JVM J0: EOF ----

[...truncated 212 lines...]
   [junit4] JVM J1: stderr was not empty, see: /home/jenkins/workspace/Lucene-Solr-BadApples-master-Linux/lucene/build/replicator/test/temp/junit4-J1-20180526_034812_7853745038631350557832.syserr
   [junit4] >>> JVM J1 emitted unexpected output (verbatim) ----
   [junit4] OpenJDK 64-Bit Server VM warning: Option UseConcMarkSweepGC was deprecated in version 9.0 and will likely be removed in a future release.
   [junit4] <<< JVM J1: EOF ----

[...truncated 3 lines...]
   [junit4] JVM J0: stderr was not empty, see: /home/jenkins/workspace/Lucene-Solr-BadApples-master-Linux/lucene/build/replicator/test/temp/junit4-J0-20180526_034812_7858199458902209521023.syserr
   [junit4] >>> JVM J0 emitted unexpected output (verbatim) ----
   [junit4] OpenJDK 64-Bit Server VM warning: Option UseConcMarkSweepGC was deprecated in version 9.0 and will likely be removed in a future release.
   [junit4] <<< JVM J0: EOF ----

[...truncated 3 lines...]
   [junit4] JVM J2: stderr was not empty, see: /home/jenkins/workspace/Lucene-Solr-BadApples-master-Linux/lucene/build/replicator/test/temp/junit4-J2-20180526_034812_7853526591994755977088.syserr
   [junit4] >>> JVM J2 emitted unexpected output (verbatim) ----
   [junit4] OpenJDK 64-Bit Server VM warning: Option UseConcMarkSweepGC was deprecated in version 9.0 and will likely be removed in a future release.
   [junit4] <<< JVM J2: EOF ----

[...truncated 227 lines...]
   [junit4] JVM J0: stderr was not empty, see: /home/jenkins/workspace/Lucene-Solr-BadApples-master-Linux/lucene/build/sandbox/test/temp/junit4-J0-20180526_034825_50314467900065396126500.syserr
   [junit4] >>> JVM J0 emitted unexpected output (verbatim) ----
   [junit4] OpenJDK 64-Bit Server VM warning: Option UseConcMarkSweepGC was deprecated in version 9.0 and will likely be removed in a future release.
   [junit4] <<< JVM J0: EOF ----

[...truncated 3 lines...]
   [junit4] JVM J1: stderr was not empty, see: /home/jenkins/workspace/Lucene-Solr-BadApples-master-Linux/lucene/build/sandbox/test/temp/junit4-J1-20180526_034825_50316339677771555912536.syserr
   [junit4] >>> JVM J1 emitted unexpected output (verbatim) ----
   [junit4] OpenJDK 64-Bit Server VM warning: Option UseConcMarkSweepGC was deprecated in version 9.0 and will likely be removed in a future release.
   [junit4] <<< JVM J1: EOF ----

[...truncated 7 lines...]
   [junit4] JVM J2: stderr was not empty, see: /home/jenkins/workspace/Lucene-Solr-BadApples-master-Linux/lucene/build/sandbox/test/temp/junit4-J2-20180526_034825_5033460901674645415028.syserr
   [junit4] >>> JVM J2 emitted unexpected output (verbatim) ----
   [junit4] OpenJDK 64-Bit Server VM warning: Option UseConcMarkSweepGC was deprecated in version 9.0 and will likely be removed in a future release.
   [junit4] <<< JVM J2: EOF ----

[...truncated 320 lines...]
   [junit4] JVM J1: stderr was not empty, see: /home/jenkins/workspace/Lucene-Solr-BadApples-master-Linux/lucene/build/spatial-extras/test/temp/junit4-J1-20180526_034933_5471894718067322685174.syserr
   [junit4] >>> JVM J1 emitted unexpected output (verbatim) ----
   [junit4] OpenJDK 64-Bit Server VM warning: Option UseConcMarkSweepGC was deprecated in version 9.0 and will likely be removed in a future release.
   [junit4] <<< JVM J1: EOF ----

[...truncated 3 lines...]
   [junit4] JVM J0: stderr was not empty, see: /home/jenkins/workspace/Lucene-Solr-BadApples-master-Linux/lucene/build/spatial-extras/test/temp/junit4-J0-20180526_034933_54710249558668667221991.syserr
   [junit4] >>> JVM J0 emitted unexpected output (verbatim) ----
   [junit4] OpenJDK 64-Bit Server VM warning: Option UseConcMarkSweepGC was deprecated in version 9.0 and will likely be removed in a future release.
   [junit4] <<< JVM J0: EOF ----

[...truncated 3 lines...]
   [junit4] JVM J2: stderr was not empty, see: /home/jenkins/workspace/Lucene-Solr-BadApples-master-Linux/lucene/build/spatial-extras/test/temp/junit4-J2-20180526_034933_54717407117873298968092.syserr
   [junit4] >>> JVM J2 emitted unexpected output (verbatim) ----
   [junit4] OpenJDK 64-Bit Server VM warning: Option UseConcMarkSweepGC was deprecated in version 9.0 and will likely be removed in a future release.
   [junit4] <<< JVM J2: EOF ----

[...truncated 153 lines...]
   [junit4] JVM J0: stderr was not empty, see: /home/jenkins/workspace/Lucene-Solr-BadApples-master-Linux/lucene/build/spatial/test/temp/junit4-J0-20180526_035003_5969236039795680228332.syserr
   [junit4] >>> JVM J0 emitted unexpected output (verbatim) ----
   [junit4] OpenJDK 64-Bit Server VM warning: Option UseConcMarkSweepGC was deprecated in version 9.0 and will likely be removed in a future release.
   [junit4] <<< JVM J0: EOF ----

[...truncated 184 lines...]
   [junit4] JVM J0: stderr was not empty, see: /home/jenkins/workspace/Lucene-Solr-BadApples-master-Linux/lucene/build/spatial3d/test/temp/junit4-J0-20180526_035005_5607876388251525209407.syserr
   [junit4] >>> JVM J0 emitted unexpected output (verbatim) ----
   [junit4] OpenJDK 64-Bit Server VM warning: Option UseConcMarkSweepGC was deprecated in version 9.0 and will likely be removed in a future release.
   [junit4] <<< JVM J0: EOF ----

[...truncated 3 lines...]
   [junit4] JVM J2: stderr was not empty, see: /home/jenkins/workspace/Lucene-Solr-BadApples-master-Linux/lucene/build/spatial3d/test/temp/junit4-J2-20180526_035005_5606876802347203642314.syserr
   [junit4] >>> JVM J2 emitted unexpected output (verbatim) ----
   [junit4] OpenJDK 64-Bit Server VM warning: Option UseConcMarkSweepGC was deprecated in version 9.0 and will likely be removed in a future release.
   [junit4] <<< JVM J2: EOF ----

[...truncated 5 lines...]
   [junit4] JVM J1: stderr was not empty, see: /home/jenkins/workspace/Lucene-Solr-BadApples-master-Linux/lucene/build/spatial3d/test/temp/junit4-J1-20180526_035005_56013429045628568221926.syserr
   [junit4] >>> JVM J1 emitted unexpected output (verbatim) ----
   [junit4] OpenJDK 64-Bit Server VM warning: Option UseConcMarkSweepGC was deprecated in version 9.0 and will likely be removed in a future release.
   [junit4] <<< JVM J1: EOF ----

[...truncated 249 lines...]
   [junit4] JVM J2: stderr was not empty, see: /home/jenkins/workspace/Lucene-Solr-BadApples-master-Linux/lucene/build/suggest/test/temp/junit4-J2-20180526_035125_7907611387812315230719.syserr
   [junit4] >>> JVM J2 emitted unexpected output (verbatim) ----
   [junit4] OpenJDK 64-Bit Server VM warning: Option UseConcMarkSweepGC was deprecated in version 9.0 and will likely be removed in a future release.
   [junit4] <<< JVM J2: EOF ----

[...truncated 9 lines...]
   [junit4] JVM J0: stderr was not empty, see: /home/jenkins/workspace/Lucene-Solr-BadApples-master-Linux/lucene/build/suggest/test/temp/junit4-J0-20180526_035125_7901498013841151271895.syserr
   [junit4] >>> JVM J0 emitted unexpected output (verbatim) ----
   [junit4] OpenJDK 64-Bit Server VM warning: Option UseConcMarkSweepGC was deprecated in version 9.0 and will likely be removed in a future release.
   [junit4] <<< JVM J0: EOF ----

[...truncated 12 lines...]
   [junit4] JVM J1: stderr was not empty, see: /home/jenkins/workspace/Lucene-Solr-BadApples-master-Linux/lucene/build/suggest/test/temp/junit4-J1-20180526_035125_79016845215943313653401.syserr
   [junit4] >>> JVM J1 emitted unexpected output (verbatim) ----
   [junit4] OpenJDK 64-Bit Server VM warning: Option UseConcMarkSweepGC was deprecated in version 9.0 and will likely be removed in a future release.
   [junit4] <<< JVM J1: EOF ----

[...truncated 2091 lines...]
   [junit4] Suite: org.apache.solr.cloud.SSLMigrationTest
   [junit4]   2> 480514 INFO  (SUITE-SSLMigrationTest-seed#[3CAFFCB092CF514D]-worker) [    ] o.a.s.SolrTestCaseJ4 SecureRandom sanity checks: test.solr.allowed.securerandom=null & java.security.egd=file:/dev/./urandom
   [junit4]   2> Creating dataDir: /home/jenkins/workspace/Lucene-Solr-BadApples-master-Linux/solr/build/solr-core/test/J0/temp/solr.cloud.SSLMigrationTest_3CAFFCB092CF514D-001/init-core-data-001
   [junit4]   2> 480515 INFO  (SUITE-SSLMigrationTest-seed#[3CAFFCB092CF514D]-worker) [    ] o.a.s.SolrTestCaseJ4 Using PointFields (NUMERIC_POINTS_SYSPROP=true) w/NUMERIC_DOCVALUES_SYSPROP=false
   [junit4]   2> 480515 INFO  (SUITE-SSLMigrationTest-seed#[3CAFFCB092CF514D]-worker) [    ] o.a.s.SolrTestCaseJ4 Randomized ssl (false) and clientAuth (false) via: @org.apache.solr.SolrTestCaseJ4$SuppressSSL(bugUrl="None")
   [junit4]   2> 480515 INFO  (SUITE-SSLMigrationTest-seed#[3CAFFCB092CF514D]-worker) [    ] o.a.s.BaseDistributedSearchTestCase Setting hostContext system property: /
   [junit4]   2> 480516 INFO  (TEST-SSLMigrationTest.test-seed#[3CAFFCB092CF514D]) [    ] o.a.s.c.ZkTestServer STARTING ZK TEST SERVER
   [junit4]   2> 480517 INFO  (Thread-1022) [    ] o.a.s.c.ZkTestServer client port:0.0.0.0/0.0.0.0:0
   [junit4]   2> 480517 INFO  (Thread-1022) [    ] o.a.s.c.ZkTestServer Starting server
   [junit4]   2> 480518 ERROR (Thread-1022) [    ] o.a.z.s.ZooKeeperServer ZKShutdownHandler is not registered, so ZooKeeper server won't take any action on ERROR or SHUTDOWN server state changes
   [junit4]   2> 480617 INFO  (TEST-SSLMigrationTest.test-seed#[3CAFFCB092CF514D]) [    ] o.a.s.c.ZkTestServer start zk server on port:40695
   [junit4]   2> 480618 INFO  (zkConnectionManagerCallback-1271-thread-1) [    ] o.a.s.c.c.ConnectionManager zkClient has connected
   [junit4]   2> 480621 INFO  (zkConnectionManagerCallback-1273-thread-1) [    ] o.a.s.c.c.ConnectionManager zkClient has connected
   [junit4]   2> 480623 INFO  (TEST-SSLMigrationTest.test-seed#[3CAFFCB092CF514D]) [    ] o.a.s.c.AbstractZkTestCase put /home/jenkins/workspace/Lucene-Solr-BadApples-master-Linux/solr/core/src/test-files/solr/collection1/conf/solrconfig-tlog.xml to /configs/conf1/solrconfig.xml
   [junit4]   2> 480624 INFO  (TEST-SSLMigrationTest.test-seed#[3CAFFCB092CF514D]) [    ] o.a.s.c.AbstractZkTestCase put /home/jenkins/workspace/Lucene-Solr-BadApples-master-Linux/solr/core/src/test-files/solr/collection1/conf/schema.xml to /configs/conf1/schema.xml
   [junit4]   2> 480625 INFO  (TEST-SSLMigrationTest.test-seed#[3CAFFCB092CF514D]) [    ] o.a.s.c.AbstractZkTestCase put /home/jenkins/workspace/Lucene-Solr-BadApples-master-Linux/solr/core/src/test-files/solr/collection1/conf/solrconfig.snippet.randomindexconfig.xml to /configs/conf1/solrconfig.snippet.randomindexconfig.xml
   [junit4]   2> 480625 INFO  (TEST-SSLMigrationTest.test-seed#[3CAFFCB092CF514D]) [    ] o.a.s.c.AbstractZkTestCase put /home/jenkins/workspace/Lucene-Solr-BadApples-master-Linux/solr/core/src/test-files/solr/collection1/conf/stopwords.txt to /configs/conf1/stopwords.txt
   [junit4]   2> 480626 INFO  (TEST-SSLMigrationTest.test-seed#[3CAFFCB092CF514D]) [    ] o.a.s.c.AbstractZkTestCase put /home/jenkins/workspace/Lucene-Solr-BadApples-master-Linux/solr/core/src/test-files/solr/collection1/conf/protwords.txt to /configs/conf1/protwords.txt
   [junit4]   2> 480626 INFO  (TEST-SSLMigrationTest.test-seed#[3CAFFCB092CF514D]) [    ] o.a.s.c.AbstractZkTestCase put /home/jenkins/workspace/Lucene-Solr-BadApples-master-Linux/solr/core/src/test-files/solr/collection1/conf/currency.xml to /configs/conf1/currency.xml
   [junit4]   2> 480627 INFO  (TEST-SSLMigrationTest.test-seed#[3CAFFCB092CF514D]) [    ] o.a.s.c.AbstractZkTestCase put /home/jenkins/workspace/Lucene-Solr-BadApples-master-Linux/solr/core/src/test-files/solr/collection1/conf/enumsConfig.xml to /configs/conf1/enumsConfig.xml
   [junit4]   2> 480627 INFO  (TEST-SSLMigrationTest.test-seed#[3CAFFCB092CF514D]) [    ] o.a.s.c.AbstractZkTestCase put /home/jenkins/workspace/Lucene-Solr-BadApples-master-Linux/solr/core/src/test-files/solr/collection1/conf/open-exchange-rates.json to /configs/conf1/open-exchange-rates.json
   [junit4]   2> 480628 INFO  (TEST-SSLMigrationTest.test-seed#[3CAFFCB092CF514D]) [    ] o.a.s.c.AbstractZkTestCase put /home/jenkins/workspace/Lucene-Solr-BadApples-master-Linux/solr/core/src/test-files/solr/collection1/conf/mapping-ISOLatin1Accent.txt to /configs/conf1/mapping-ISOLatin1Accent.txt
   [junit4]   2> 480628 INFO  (TEST-SSLMigrationTest.test-seed#[3CAFFCB092CF514D]) [    ] o.a.s.c.AbstractZkTestCase put /home/jenkins/workspace/Lucene-Solr-BadApples-master-Linux/solr/core/src/test-files/solr/collection1/conf/old_synonyms.txt to /configs/conf1/old_synonyms.txt
   [junit4]   2> 480629 INFO  (TEST-SSLMigrationTest.test-seed#[3CAFFCB092CF514D]) [    ] o.a.s.c.AbstractZkTestCase put /home/jenkins/workspace/Lucene-Solr-BadApples-master-Linux/solr/core/src/test-files/solr/collection1/conf/synonyms.txt to /configs/conf1/synonyms.txt
   [junit4]   2> 480629 INFO  (TEST-SSLMigrationTest.test-seed#[3CAFFCB092CF514D]) [    ] o.a.s.c.AbstractFullDistribZkTestBase Will use NRT replicas unless explicitly asked otherwise
   [junit4]   2> 480693 INFO  (TEST-SSLMigrationTest.test-seed#[3CAFFCB092CF514D]) [    ] o.e.j.s.Server jetty-9.4.10.v20180503; built: 2018-05-03T15:56:21.710Z; git: daa59876e6f384329b122929e70a80934569428c; jvm 10.0.1+10
   [junit4]   2> 480693 INFO  (TEST-SSLMigrationTest.test-seed#[3CAFFCB092CF514D]) [    ] o.e.j.s.session DefaultSessionIdManager workerName=node0
   [junit4]   2> 480693 INFO  (TEST-SSLMigrationTest.test-seed#[3CAFFCB092CF514D]) [    ] o.e.j.s.session No SessionScavenger set, using defaults
   [junit4]   2> 480693 INFO  (TEST-SSLMigrationTest.test-seed#[3CAFFCB092CF514D]) [    ] o.e.j.s.session node0 Scavenging every 600000ms
   [junit4]   2> 480693 INFO  (TEST-SSLMigrationTest.test-seed#[3CAFFCB092CF514D]) [    ] o.e.j.s.h.ContextHandler Started o.e.j.s.ServletContextHandler@2d0ad739{/,null,AVAILABLE}
   [junit4]   2> 480695 INFO  (TEST-SSLMigrationTest.test-seed#[3CAFFCB092CF514D]) [    ] o.e.j.s.AbstractConnector Started ServerConnector@3bea5f8d{HTTP/1.1,[http/1.1]}{127.0.0.1:45751}
   [junit4]   2> 480695 INFO  (TEST-SSLMigrationTest.test-seed#[3CAFFCB092CF514D]) [    ] o.e.j.s.Server Started @480719ms
   [junit4]   2> 480695 INFO  (TEST-SSLMigrationTest.test-seed#[3CAFFCB092CF514D]) [    ] o.a.s.c.s.e.JettySolrRunner Jetty properties: {hostContext=/, solr.data.dir=/home/jenkins/workspace/Lucene-Solr-BadApples-master-Linux/solr/build/solr-core/test/J0/temp/solr.cloud.SSLMigrationTest_3CAFFCB092CF514D-001/tempDir-001/control/data, hostPort=45751, coreRootDirectory=/home/jenkins/workspace/Lucene-Solr-BadApples-master-Linux/solr/build/solr-core/test/J0/temp/solr.cloud.SSLMigrationTest_3CAFFCB092CF514D-001/control-001/cores}
   [junit4]   2> 480695 ERROR (TEST-SSLMigrationTest.test-seed#[3CAFFCB092CF514D]) [    ] o.a.s.u.StartupLoggingUtils Missing Java Option solr.log.dir. Logging may be missing or incomplete.
   [junit4]   2> 480695 INFO  (TEST-SSLMigrationTest.test-seed#[3CAFFCB092CF514D]) [    ] o.a.s.s.SolrDispatchFilter Using logger factory org.apache.logging.slf4j.Log4jLoggerFactory
   [junit4]   2> 480695 INFO  (TEST-SSLMigrationTest.test-seed#[3CAFFCB092CF514D]) [    ] o.a.s.s.SolrDispatchFilter  ___      _       Welcome to Apache Solr? version 8.0.0
   [junit4]   2> 480695 INFO  (TEST-SSLMigrationTest.test-seed#[3CAFFCB092CF514D]) [    ] o.a.s.s.SolrDispatchFilter / __| ___| |_ _   Starting in cloud mode on port null
   [junit4]   2> 480695 INFO  (TEST-SSLMigrationTest.test-seed#[3CAFFCB092CF514D]) [    ] o.a.s.s.SolrDispatchFilter \__ \/ _ \ | '_|  Install dir: null
   [junit4]   2> 480695 INFO  (TEST-SSLMigrationTest.test-seed#[3CAFFCB092CF514D]) [    ] o.a.s.s.SolrDispatchFilter |___/\___/_|_|    Start time: 2018-05-26T04:00:39.597531Z
   [junit4]   2> 480696 INFO  (zkConnectionManagerCallback-1275-thread-1) [    ] o.a.s.c.c.ConnectionManager zkClient has connected
   [junit4]   2> 480697 INFO  (TEST-SSLMigrationTest.test-seed#[3CAFFCB092CF514D]) [    ] o.a.s.s.SolrDispatchFilter Loading solr.xml from SolrHome (not found in ZooKeeper)
   [junit4]   2> 480697 INFO  (TEST-SSLMigrationTest.test-seed#[3CAFFCB092CF514D]) [    ] o.a.s.c.SolrXmlConfig Loading container configuration from /home/jenkins/workspace/Lucene-Solr-BadApples-master-Linux/solr/build/solr-core/test/J0/temp/solr.cloud.SSLMigrationTest_3CAFFCB092CF514D-001/control-001/solr.xml
   [junit4]   2> 480698 INFO  (TEST-SSLMigrationTest.test-seed#[3CAFFCB092CF514D]) [    ] o.a.s.c.SolrXmlConfig Configuration parameter autoReplicaFailoverWorkLoopDelay is ignored
   [junit4]   2> 480698 INFO  (TEST-SSLMigrationTest.test-seed#[3CAFFCB092CF514D]) [    ] o.a.s.c.SolrXmlConfig Configuration parameter autoReplicaFailoverBadNodeExpiration is ignored
   [junit4]   2> 480699 INFO  (TEST-SSLMigrationTest.test-seed#[3CAFFCB092CF514D]) [    ] o.a.s.c.SolrXmlConfig MBean server found: com.sun.jmx.mbeanserver.JmxMBeanServer@12517a43, but no JMX reporters were configured - adding default JMX reporter.
   [junit4]   2> 480702 INFO  (TEST-SSLMigrationTest.test-seed#[3CAFFCB092CF514D]) [    ] o.a.s.c.ZkContainer Zookeeper client=127.0.0.1:40695/solr
   [junit4]   2> 480704 INFO  (zkConnectionManagerCallback-1279-thread-1) [    ] o.a.s.c.c.ConnectionManager zkClient has connected
   [junit4]   2> 480705 INFO  (zkConnectionManagerCallback-1281-thread-1) [    ] o.a.s.c.c.ConnectionManager zkClient has connected
   [junit4]   2> 480746 INFO  (TEST-SSLMigrationTest.test-seed#[3CAFFCB092CF514D]) [n:127.0.0.1:45751_    ] o.a.s.c.Overseer Overseer (id=null) closing
   [junit4]   2> 480746 INFO  (TEST-SSLMigrationTest.test-seed#[3CAFFCB092CF514D]) [n:127.0.0.1:45751_    ] o.a.s.c.OverseerElectionContext I am going to be the leader 127.0.0.1:45751_
   [junit4]   2> 480747 INFO  (TEST-SSLMigrationTest.test-seed#[3CAFFCB092CF514D]) [n:127.0.0.1:45751_    ] o.a.s.c.Overseer Overseer (id=72089598615879684-127.0.0.1:45751_-n_0000000000) starting
   [junit4]   2> 480750 INFO  (zkConnectionManagerCallback-1288-thread-1) [    ] o.a.s.c.c.ConnectionManager zkClient has connected
   [junit4]   2> 480751 INFO  (TEST-SSLMigrationTest.test-seed#[3CAFFCB092CF514D]) [n:127.0.0.1:45751_    ] o.a.s.c.s.i.ZkClientClusterStateProvider Cluster at 127.0.0.1:40695/solr ready
   [junit4]   2> 480751 INFO  (TEST-SSLMigrationTest.test-seed#[3CAFFCB092CF514D]) [n:127.0.0.1:45751_    ] o.a.s.c.ZkController Register node as live in ZooKeeper:/live_nodes/127.0.0.1:45751_
   [junit4]   2> 480754 INFO  (zkCallback-1287-thread-1) [    ] o.a.s.c.c.ZkStateReader Updated live nodes from ZooKeeper... (0) -> (1)
   [junit4]   2> 480754 INFO  (zkCallback-1280-thread-1) [    ] o.a.s.c.c.ZkStateReader Updated live nodes from ZooKeeper... (0) -> (1)
   [junit4]   2> 480881 INFO  (TEST-SSLMigrationTest.test-seed#[3CAFFCB092CF514D]) [n:127.0.0.1:45751_    ] o.a.s.m.r.SolrJmxReporter JMX monitoring for 'solr.node' (registry 'solr.node') enabled at server: com.sun.jmx.mbeanserver.JmxMBeanServer@12517a43
   [junit4]   2> 480886 INFO  (TEST-SSLMigrationTest.test-seed#[3CAFFCB092CF514D]) [n:127.0.0.1:45751_    ] o.a.s.m.r.SolrJmxReporter JMX monitoring for 'solr.jvm' (registry 'solr.jvm') enabled at server: com.sun.jmx.mbeanserver.JmxMBeanServer@12517a43
   [junit4]   2> 480886 INFO  (TEST-SSLMigrationTest.test-seed#[3CAFFCB092CF514D]) [n:127.0.0.1:45751_    ] o.a.s.m.r.SolrJmxReporter JMX monitoring for 'solr.jetty' (registry 'solr.jetty') enabled at server: com.sun.jmx.mbeanserver.JmxMBeanServer@12517a43
   [junit4]   2> 480887 INFO  (TEST-SSLMigrationTest.test-seed#[3CAFFCB092CF514D]) [n:127.0.0.1:45751_    ] o.a.s.c.CorePropertiesLocator Found 0 core definitions underneath /home/jenkins/workspace/Lucene-Solr-BadApples-master-Linux/solr/build/solr-core/test/J0/temp/solr.cloud.SSLMigrationTest_3CAFFCB092CF514D-001/control-001/cores
   [junit4]   2> 480898 INFO  (zkConnectionManagerCallback-1293-thread-1) [    ] o.a.s.c.c.ConnectionManager zkClient has connected
   [junit4]   2> 480898 INFO  (TEST-SSLMigrationTest.test-seed#[3CAFFCB092CF514D]) [    ] o.a.s.c.c.ZkStateReader Updated live nodes from ZooKeeper... (0) -> (1)
   [junit4]   2> 480899 INFO  (TEST-SSLMigrationTest.test-seed#[3CAFFCB092CF514D]) [    ] o.a.s.c.s.i.ZkClientClusterStateProvider Cluster at 127.0.0.1:40695/solr ready
   [junit4]   2> 480900 INFO  (qtp2047567685-4767) [n:127.0.0.1:45751_    ] o.a.s.h.a.CollectionsHandler Invoked Collection Action :create with params replicationFactor=1&collection.configName=conf1&name=control_collection&nrtReplicas=1&action=CREATE&numShards=1&createNodeSet=127.0.0.1:45751_&wt=javabin&version=2 and sendToOCPQueue=true
   [junit4]   2> 480901 INFO  (OverseerThreadFactory-1820-thread-1) [    ] o.a.s.c.a.c.CreateCollectionCmd Create collection control_collection
   [junit4]   2> 481005 INFO  (qtp2047567685-4762) [n:127.0.0.1:45751_    x:control_collection_shard1_replica_n1] o.a.s.h.a.CoreAdminOperation core create command qt=/admin/cores&collection.configName=conf1&newCollection=true&name=control_collection_shard1_replica_n1&action=CREATE&numShards=1&collection=control_collection&shard=shard1&wt=javabin&version=2&replicaType=NRT
   [junit4]   2> 481005 INFO  (qtp2047567685-4762) [n:127.0.0.1:45751_    x:control_collection_shard1_replica_n1] o.a.s.c.TransientSolrCoreCacheDefault Allocating transient cache for 4 transient cores
   [junit4]   2> 482031 INFO  (qtp2047567685-4762) [n:127.0.0.1:45751_ c:control_collection s:shard1  x:control_collection_shard1_replica_n1] o.a.s.c.SolrConfig Using Lucene MatchVersion: 8.0.0
   [junit4]   2> 482038 INFO  (qtp2047567685-4762) [n:127.0.0.1:45751_ c:control_collection s:shard1  x:control_collection_shard1_replica_n1] o.a.s.s.IndexSchema [control_collection_shard1_replica_n1] Schema name=test
   [junit4]   2> 482083 INFO  (qtp2047567685-4762) [n:127.0.0.1:45751_ c:control_collection s:shard1  x:control_collection_shard1_replica_n1] o.a.s.s.IndexSchema Loaded schema test/1.0 with uniqueid field id
   [junit4]   2> 482089 INFO  (qtp2047567685-4762) [n:127.0.0.1:45751_ c:control_collection s:shard1  x:control_collection_shard1_replica_n1] o.a.s.c.CoreContainer Creating SolrCore 'control_collection_shard1_replica_n1' using configuration from collection control_collection, trusted=true
   [junit4]   2> 482090 INFO  (qtp2047567685-4762) [n:127.0.0.1:45751_ c:control_collection s:shard1  x:control_collection_shard1_replica_n1] o.a.s.m.r.SolrJmxReporter JMX monitoring for 'solr.core.control_collection.shard1.replica_n1' (registry 'solr.core.control_collection.shard1.replica_n1') enabled at server: com.sun.jmx.mbeanserver.JmxMBeanServer@12517a43
   [junit4]   2> 482090 INFO  (qtp2047567685-4762) [n:127.0.0.1:45751_ c:control_collection s:shard1  x:control_collection_shard1_replica_n1] o.a.s.c.SolrCore solr.RecoveryStrategy.Builder
   [junit4]   2> 482090 INFO  (qtp2047567685-4762) [n:127.0.0.1:45751_ c:control_collection s:shard1  x:control_collection_shard1_replica_n1] o.a.s.c.SolrCore [[control_collection_shard1_replica_n1] ] Opening new SolrCore at [/home/jenkins/workspace/Lucene-Solr-BadApples-master-Linux/solr/build/solr-core/test/J0/temp/solr.cloud.SSLMigrationTest_3CAFFCB092CF514D-001/control-001/cores/control_collection_shard1_replica_n1], dataDir=[/home/jenkins/workspace/Lucene-Solr-BadApples-master-Linux/solr/build/solr-core/test/J0/temp/solr.cloud.SSLMigrationTest_3CAFFCB092CF514D-001/control-001/cores/control_collection_shard1_replica_n1/data/]
   [junit4]   2> 482092 INFO  (qtp2047567685-4762) [n:127.0.0.1:45751_ c:control_collection s:shard1  x:control_collection_shard1_replica_n1] o.a.s.u.RandomMergePolicy RandomMergePolicy wrapping class org.apache.lucene.index.LogDocMergePolicy: [LogDocMergePolicy: minMergeSize=1000, mergeFactor=33, maxMergeSize=9223372036854775807, maxMergeSizeForForcedMerge=9223372036854775807, calibrateSizeByDeletes=false, maxMergeDocs=2147483647, maxCFSSegmentSizeMB=8.796093022207999E12, noCFSRatio=0.0]
   [junit4]   2> 482093 WARN  (qtp2047567685-4762) [n:127.0.0.1:45751_ c:control_collection s:shard1  x:control_collection_shard1_replica_n1] o.a.s.c.RequestHandlers INVALID paramSet a in requestHandler {type = requestHandler,name = /dump,class = DumpRequestHandler,attributes = {initParams=a, name=/dump, class=DumpRequestHandler},args = {defaults={a=A,b=B}}}
   [junit4]   2> 482125 INFO  (qtp2047567685-4762) [n:127.0.0.1:45751_ c:control_collection s:shard1  x:control_collection_shard1_replica_n1] o.a.s.u.UpdateHandler Using UpdateLog implementation: org.apache.solr.update.UpdateLog
   [junit4]   2> 482125 INFO  (qtp2047567685-4762) [n:127.0.0.1:45751_ c:control_collection s:shard1  x:control_collection_shard1_replica_n1] o.a.s.u.UpdateLog Initializing UpdateLog: dataDir= defaultSyncLevel=FLUSH numRecordsToKeep=100 maxNumLogsToKeep=10 numVersionBuckets=65536
   [junit4]   2> 482126 INFO  (qtp2047567685-4762) [n:127.0.0.1:45751_ c:control_collection s:shard1  x:control_collection_shard1_replica_n1] o.a.s.u.CommitTracker Hard AutoCommit: disabled
   [junit4]   2> 482126 INFO  (qtp2047567685-4762) [n:127.0.0.1:45751_ c:control_collection s:shard1  x:control_collection_shard1_replica_n1] o.a.s.u.CommitTracker Soft AutoCommit: disabled
   [junit4]   2> 482126 INFO  (qtp2047567685-4762) [n:127.0.0.1:45751_ c:control_collection s:shard1  x:control_collection_shard1_replica_n1] o.a.s.u.RandomMergePolicy RandomMergePolicy wrapping class org.apache.lucene.index.LogDocMergePolicy: [LogDocMergePolicy: minMergeSize=1000, mergeFactor=32, maxMergeSize=9223372036854775807, maxMergeSizeForForcedMerge=9223372036854775807, calibrateSizeByDeletes=true, maxMergeDocs=2147483647, maxCFSSegmentSizeMB=8.796093022207999E12, noCFSRatio=0.25323208568235983]
   [junit4]   2> 482126 INFO  (qtp2047567685-4762) [n:127.0.0.1:45751_ c:control_collection s:shard1  x:control_collection_shard1_replica_n1] o.a.s.s.SolrIndexSearcher Opening [Searcher@1721c1af[control_collection_shard1_replica_n1] main]
   [junit4]   2> 482127 INFO  (qtp2047567685-4762) [n:127.0.0.1:45751_ c:control_collection s:shard1  x:control_collection_shard1_replica_n1] o.a.s.r.ManagedResourceStorage Configured ZooKeeperStorageIO with znodeBase: /configs/conf1
   [junit4]   2> 482127 INFO  (qtp2047567685-4762) [n:127.0.0.1:45751_ c:control_collection s:shard1  x:control_collection_shard1_replica_n1] o.a.s.r.ManagedResourceStorage Loaded null at path _rest_managed.json using ZooKeeperStorageIO:path=/configs/conf1
   [junit4]   2> 482128 INFO  (qtp2047567685-4762) [n:127.0.0.1:45751_ c:control_collection s:shard1  x:control_collection_shard1_replica_n1] o.a.s.h.ReplicationHandler Commits will be reserved for 10000ms.
   [junit4]   2> 482128 INFO  (searcherExecutor-1823-thread-1-processing-n:127.0.0.1:45751_ x:control_collection_shard1_replica_n1 c:control_collection s:shard1) [n:127.0.0.1:45751_ c:control_collection s:shard1  x:control_collection_shard1_replica_n1] o.a.s.c.SolrCore [control_collection_shard1_replica_n1] Registered new searcher Searcher@1721c1af[control_collection_shard1_replica_n1] main{ExitableDirectoryReader(UninvertingDirectoryReader())}
   [junit4]   2> 482128 INFO  (qtp2047567685-4762) [n:127.0.0.1:45751_ c:control_collection s:shard1  x:control_collection_shard1_replica_n1] o.a.s.u.UpdateLog Could not find max version in index or recent updates, using new clock 1601497717570273280
   [junit4]   2> 482132 INFO  (qtp2047567685-4762) [n:127.0.0.1:45751_ c:control_collection s:shard1  x:control_collection_shard1_replica_n1] o.a.s.c.ZkShardTerms Successful update of terms at /collections/control_collection/terms/shard1 to Terms{values={core_node2=0}, version=0}
   [junit4]   2> 482133 INFO  (qtp2047567685-4762) [n:127.0.0.1:45751_ c:control_collection s:shard1  x:control_collection_shard1_replica_n1] o.a.s.c.ShardLeaderElectionContext Enough replicas found to continue.
   [junit4]   2> 482133 INFO  (qtp2047567685-4762) [n:127.0.0.1:45751_ c:control_collection s:shard1  x:control_collection_shard1_replica_n1] o.a.s.c.ShardLeaderElectionContext I may be the new leader - try and sync
   [junit4]   2> 482133 INFO  (qtp2047567685-4762) [n:127.0.0.1:45751_ c:control_collection s:shard1  x:control_collection_shard1_replica_n1] o.a.s.c.SyncStrategy Sync replicas to http://127.0.0.1:45751/control_collection_shard1_replica_n1/
   [junit4]   2> 482133 INFO  (qtp2047567685-4762) [n:127.0.0.1:45751_ c:control_collection s:shard1  x:control_collection_shard1_replica_n1] o.a.s.c.SyncStrategy Sync Success - now sync replicas to me
   [junit4]   2> 482133 INFO  (qtp2047567685-4762) [n:127.0.0.1:45751_ c:control_collection s:shard1  x:control_collection_shard1_replica_n1] o.a.s.c.SyncStrategy http://127.0.0.1:45751/control_collection_shard1_replica_n1/ has no replicas
   [junit4]   2> 482133 INFO  (qtp2047567685-4762) [n:127.0.0.1:45751_ c:control_collection s:shard1  x:control_collection_shard1_replica_n1] o.a.s.c.ShardLeaderElectionContext Found all replicas participating in election, clear LIR
   [junit4]   2> 482135 INFO  (qtp2047567685-4762) [n:127.0.0.1:45751_ c:control_collection s:shard1  x:control_collection_shard1_replica_n1] o.a.s.c.ShardLeaderElectionContext I am the new leader: http://127.0.0.1:45751/control_collection_shard1_replica_n1/ shard1
   [junit4]   2> 482237 INFO  (qtp2047567685-4762) [n:127.0.0.1:45751_ c:control_collection s:shard1  x:control_collection_shard1_replica_n1] o.a.s.c.ZkController I am the leader, no recovery necessary
   [junit4]   2> 482239 INFO  (qtp2047567685-4762) [n:127.0.0.1:45751_ c:control_collection s:shard1  x:control_collection_shard1_replica_n1] o.a.s.s.HttpSolrCall [admin] webapp=null path=/admin/cores params={qt=/admin/cores&collection.configName=conf1&newCollection=true&name=control_collection_shard1_replica_n1&action=CREATE&numShards=1&collection=control_collection&shard=shard1&wt=javabin&version=2&replicaType=NRT} status=0 QTime=1233
   [junit4]   2> 482241 INFO  (qtp2047567685-4767) [n:127.0.0.1:45751_    ] o.a.s.h.a.CollectionsHandler Wait for new collection to be active for at most 30 seconds. Check all shard replicas
   [junit4]   2> 482339 INFO  (zkCallback-1280-thread-1) [    ] o.a.s.c.c.ZkStateReader A cluster state change: [WatchedEvent state:SyncConnected type:NodeDataChanged path:/collections/control_collection/state.json] for collection [control_collection] has occurred - updating... (live nodes size: [1])
   [junit4]   2> 482902 INFO  (OverseerCollectionConfigSetProcessor-72089598615879684-127.0.0.1:45751_-n_0000000000) [    ] o.a.s.c.OverseerTaskQueue Response ZK path: /overseer/collection-queue-work/qnr-0000000000 doesn't exist.  Requestor may have disconnected from ZooKeeper
   [junit4]   2> 483241 INFO  (qtp2047567685-4767) [n:127.0.0.1:45751_    ] o.a.s.s.HttpSolrCall [admin] webapp=null path=/admin/collections params={replicationFactor=1&collection.configName=conf1&name=control_collection&nrtReplicas=1&action=CREATE&numShards=1&createNodeSet=127.0.0.1:45751_&wt=javabin&version=2} status=0 QTime=2341
   [junit4]   2> 483244 INFO  (zkConnectionManagerCallback-1298-thread-1) [    ] o.a.s.c.c.ConnectionManager zkClient has connected
   [junit4]   2> 483245 INFO  (TEST-SSLMigrationTest.test-seed#[3CAFFCB092CF514D]) [    ] o.a.s.c.c.ZkStateReader Updated live nodes from ZooKeeper... (0) -> (1)
   [junit4]   2> 483246 INFO  (TEST-SSLMigrationTest.test-seed#[3CAFFCB092CF514D]) [    ] o.a.s.c.s.i.ZkClientClusterStateProvider Cluster at 127.0.0.1:40695/solr ready
   [junit4]   2> 483246 INFO  (TEST-SSLMigrationTest.test-seed#[3CAFFCB092CF514D]) [    ] o.a.s.c.ChaosMonkey monkey: init - expire sessions:false cause connection loss:false
   [junit4]   2> 483246 INFO  (qtp2047567685-4763) [n:127.0.0.1:45751_    ] o.a.s.h.a.CollectionsHandler Invoked Collection Action :create with params replicationFactor=1&collection.configName=conf1&name=collection1&nrtReplicas=1&action=CREATE&numShards=2&createNodeSet=&stateFormat=2&wt=javabin&version=2 and sendToOCPQueue=true
   [junit4]   2> 483247 INFO  (OverseerThreadFactory-1820-thread-2) [    ] o.a.s.c.a.c.CreateCollectionCmd Create collection collection1
   [junit4]   2> 483248 WARN  (OverseerThreadFactory-1820-thread-2) [    ] o.a.s.c.a.c.CreateCollectionCmd It is unusual to create a collection (collection1) without cores.
   [junit4]   2> 483450 INFO  (qtp2047567685-4763) [n:127.0.0.1:45751_    ] o.a.s.h.a.CollectionsHandler Wait for new collection to be active for at most 30 seconds. Check all shard replicas
   [junit4]   2> 483450 INFO  (qtp2047567685-4763) [n:127.0.0.1:45751_    ] o.a.s.s.HttpSolrCall [admin] webapp=null path=/admin/collections params={replicationFactor=1&collection.configName=conf1&name=collection1&nrtReplicas=1&action=CREATE&numShards=2&createNodeSet=&stateFormat=2&wt=javabin&version=2} status=0 QTime=204
   [junit4]   2> 483513 INFO  (TEST-SSLMigrationTest.test-seed#[3CAFFCB092CF514D]) [    ] o.a.s.c.AbstractFullDistribZkTestBase create jetty 1 in directory /home/jenkins/workspace/Lucene-Solr-BadApples-master-Linux/solr/build/solr-core/test/J0/temp/solr.cloud.SSLMigrationTest_3CAFFCB092CF514D-001/shard-1-001 of type NRT
   [junit4]   2> 483514 INFO  (TEST-SSLMigrationTest.test-seed#[3CAFFCB092CF514D]) [    ] o.e.j.s.Server jetty-9.4.10.v20180503; built: 2018-05-03T15:56:21.710Z; git: daa59876e6f384329b122929e70a80934569428c; jvm 10.0.1+10
   [junit4]   2> 483515 INFO  (TEST-SSLMigrationTest.test-seed#[3CAFFCB092CF514D]) [    ] o.e.j.s.session DefaultSessionIdManager workerName=node0
   [junit4]   2> 483515 INFO  (TEST-SSLMigrationTest.test-seed#[3CAFFCB092CF514D]) [    ] o.e.j.s.session No SessionScavenger set, using defaults
   [junit4]   2> 483515 INFO  (TEST-SSLMigrationTest.test-seed#[3CAFFCB092CF514D]) [    ] o.e.j.s.session node0 Scavenging every 600000ms
   [junit4]   2> 483515 INFO  (TEST-SSLMigrationTest.test-seed#[3CAFFCB092CF514D]) [    ] o.e.j.s.h.ContextHandler Started o.e.j.s.ServletContextHandler@207550dc{/,null,AVAILABLE}
   [junit4]   2> 483515 INFO  (TEST-SSLMigrationTest.test-seed#[3CAFFCB092CF514D]) [    ] o.e.j.s.AbstractConnector Started ServerConnector@2a41e9bf{HTTP/1.1,[http/1.1]}{127.0.0.1:33749}
   [junit4]   2> 483515 INFO  (TEST-SSLMigrationTest.test-seed#[3CAFFCB092CF514D]) [    ] o.e.j.s.Server Started @483540ms
   [junit4]   2> 483515 INFO  (TEST-SSLMigrationTest.tes

[...truncated too long message...]

ead-1-processing-n:127.0.0.1:38801_ x:collection1_shard1_replica_n47 c:collection1 s:shard1 r:core_node48) [n:127.0.0.1:38801_ c:collection1 s:shard1 r:core_node48 x:collection1_shard1_replica_n47] o.a.s.c.ZkController Error getting leader from zk
   [junit4]   2> org.apache.solr.common.SolrException: CoreContainer is closed
   [junit4]   2> 	at org.apache.solr.cloud.ZkController.getLeaderProps(ZkController.java:1287) ~[java/:?]
   [junit4]   2> 	at org.apache.solr.cloud.ZkController.getLeaderProps(ZkController.java:1254) ~[java/:?]
   [junit4]   2> 	at org.apache.solr.cloud.ZkController.getLeader(ZkController.java:1210) [java/:?]
   [junit4]   2> 	at org.apache.solr.cloud.ZkController.register(ZkController.java:1094) [java/:?]
   [junit4]   2> 	at org.apache.solr.cloud.ZkController.register(ZkController.java:1025) [java/:?]
   [junit4]   2> 	at org.apache.solr.core.ZkContainer.lambda$registerInZk$0(ZkContainer.java:187) [java/:?]
   [junit4]   2> 	at org.apache.solr.common.util.ExecutorUtil$MDCAwareThreadPoolExecutor.lambda$execute$0(ExecutorUtil.java:202) [java/:?]
   [junit4]   2> 	at java.util.concurrent.ThreadPoolExecutor.runWorker(ThreadPoolExecutor.java:1135) [?:?]
   [junit4]   2> 	at java.util.concurrent.ThreadPoolExecutor$Worker.run(ThreadPoolExecutor.java:635) [?:?]
   [junit4]   2> 	at java.lang.Thread.run(Thread.java:844) [?:?]
   [junit4]   2> 197142 ERROR (coreZkRegister-807-thread-1-processing-n:127.0.0.1:38801_ x:collection1_shard1_replica_n47 c:collection1 s:shard1 r:core_node48) [n:127.0.0.1:38801_ c:collection1 s:shard1 r:core_node48 x:collection1_shard1_replica_n47] o.a.s.c.ZkContainer :org.apache.solr.common.SolrException: Error getting leader from zk for shard shard1
   [junit4]   2> 	at org.apache.solr.cloud.ZkController.getLeader(ZkController.java:1243)
   [junit4]   2> 	at org.apache.solr.cloud.ZkController.register(ZkController.java:1094)
   [junit4]   2> 	at org.apache.solr.cloud.ZkController.register(ZkController.java:1025)
   [junit4]   2> 	at org.apache.solr.core.ZkContainer.lambda$registerInZk$0(ZkContainer.java:187)
   [junit4]   2> 	at org.apache.solr.common.util.ExecutorUtil$MDCAwareThreadPoolExecutor.lambda$execute$0(ExecutorUtil.java:202)
   [junit4]   2> 	at java.base/java.util.concurrent.ThreadPoolExecutor.runWorker(ThreadPoolExecutor.java:1135)
   [junit4]   2> 	at java.base/java.util.concurrent.ThreadPoolExecutor$Worker.run(ThreadPoolExecutor.java:635)
   [junit4]   2> 	at java.base/java.lang.Thread.run(Thread.java:844)
   [junit4]   2> Caused by: org.apache.solr.common.SolrException: CoreContainer is closed
   [junit4]   2> 	at org.apache.solr.cloud.ZkController.getLeaderProps(ZkController.java:1287)
   [junit4]   2> 	at org.apache.solr.cloud.ZkController.getLeaderProps(ZkController.java:1254)
   [junit4]   2> 	at org.apache.solr.cloud.ZkController.getLeader(ZkController.java:1210)
   [junit4]   2> 	... 7 more
   [junit4]   2> 
   [junit4]   2> 197143 INFO  (TEST-SSLMigrationTest.test-seed#[3CAFFCB092CF514D]) [    ] o.e.j.s.AbstractConnector Stopped ServerConnector@5678623e{SSL,[ssl, http/1.1]}{127.0.0.1:38801}
   [junit4]   2> 197143 INFO  (TEST-SSLMigrationTest.test-seed#[3CAFFCB092CF514D]) [    ] o.e.j.s.h.ContextHandler Stopped o.e.j.s.ServletContextHandler@389a4218{/,null,UNAVAILABLE}
   [junit4]   2> 197143 INFO  (TEST-SSLMigrationTest.test-seed#[3CAFFCB092CF514D]) [    ] o.e.j.s.session node0 Stopped scavenging
   [junit4]   2> 197143 ERROR (TEST-SSLMigrationTest.test-seed#[3CAFFCB092CF514D]) [    ] o.a.z.s.ZooKeeperServer ZKShutdownHandler is not registered, so ZooKeeper server won't take any action on ERROR or SHUTDOWN server state changes
   [junit4]   2> 197144 INFO  (TEST-SSLMigrationTest.test-seed#[3CAFFCB092CF514D]) [    ] o.a.s.c.ZkTestServer connecting to 127.0.0.1:41035 41035
   [junit4]   2> 198600 INFO  (Thread-419) [    ] o.a.s.c.ZkTestServer connecting to 127.0.0.1:41035 41035
   [junit4]   2> 198600 WARN  (Thread-419) [    ] o.a.s.c.ZkTestServer Watch limit violations: 
   [junit4]   2> Maximum concurrent create/delete watches above limit:
   [junit4]   2> 
   [junit4]   2> 	20	/solr/aliases.json
   [junit4]   2> 	13	/solr/collections/collection1/terms/shard2
   [junit4]   2> 	9	/solr/security.json
   [junit4]   2> 	9	/solr/configs/conf1
   [junit4]   2> 	9	/solr/collections/collection1/terms/shard1
   [junit4]   2> 	2	/solr/collections/control_collection/terms/shard1
   [junit4]   2> 
   [junit4]   2> Maximum concurrent data watches above limit:
   [junit4]   2> 
   [junit4]   2> 	20	/solr/clusterprops.json
   [junit4]   2> 	20	/solr/clusterstate.json
   [junit4]   2> 	16	/solr/collections/collection1/state.json
   [junit4]   2> 	5	/solr/overseer_elect/election/72089779814531076-127.0.0.1:34699_-n_0000000000
   [junit4]   2> 	5	/solr/autoscaling.json
   [junit4]   2> 
   [junit4]   2> Maximum concurrent children watches above limit:
   [junit4]   2> 
   [junit4]   2> 	20	/solr/live_nodes
   [junit4]   2> 	20	/solr/collections
   [junit4]   2> 	5	/solr/overseer/queue
   [junit4]   2> 	5	/solr/autoscaling/events/.scheduled_maintenance
   [junit4]   2> 	5	/solr/autoscaling/events/.auto_add_replicas
   [junit4]   2> 	5	/solr/overseer/queue-work
   [junit4]   2> 	5	/solr/overseer/collection-queue-work
   [junit4]   2> 
   [junit4]   2> NOTE: reproduce with: ant test  -Dtestcase=SSLMigrationTest -Dtests.method=test -Dtests.seed=3CAFFCB092CF514D -Dtests.multiplier=3 -Dtests.slow=true -Dtests.badapples=true -Dtests.locale=he -Dtests.timezone=Europe/Helsinki -Dtests.asserts=true -Dtests.file.encoding=ISO-8859-1
   [junit4] FAILURE 25.3s J0 | SSLMigrationTest.test <<<
   [junit4]    > Throwable #1: java.lang.AssertionError: Replica didn't have the proper urlScheme in the ClusterState
   [junit4]    > 	at __randomizedtesting.SeedInfo.seed([3CAFFCB092CF514D:B4FBC36A3C333CB5]:0)
   [junit4]    > 	at org.apache.solr.cloud.SSLMigrationTest.assertReplicaInformation(SSLMigrationTest.java:104)
   [junit4]    > 	at org.apache.solr.cloud.SSLMigrationTest.testMigrateSSL(SSLMigrationTest.java:97)
   [junit4]    > 	at org.apache.solr.cloud.SSLMigrationTest.test(SSLMigrationTest.java:61)
   [junit4]    > 	at java.base/jdk.internal.reflect.NativeMethodAccessorImpl.invoke0(Native Method)
   [junit4]    > 	at java.base/jdk.internal.reflect.NativeMethodAccessorImpl.invoke(NativeMethodAccessorImpl.java:62)
   [junit4]    > 	at java.base/jdk.internal.reflect.DelegatingMethodAccessorImpl.invoke(DelegatingMethodAccessorImpl.java:43)
   [junit4]    > 	at java.base/java.lang.reflect.Method.invoke(Method.java:564)
   [junit4]    > 	at org.apache.solr.BaseDistributedSearchTestCase$ShardsRepeatRule$ShardsFixedStatement.callStatement(BaseDistributedSearchTestCase.java:993)
   [junit4]    > 	at org.apache.solr.BaseDistributedSearchTestCase$ShardsRepeatRule$ShardsStatement.evaluate(BaseDistributedSearchTestCase.java:968)
   [junit4]    > 	at java.base/java.lang.Thread.run(Thread.java:844)
   [junit4]   2> NOTE: leaving temporary files on disk at: /home/jenkins/workspace/Lucene-Solr-BadApples-master-Linux/solr/build/solr-core/test/J0/temp/solr.cloud.SSLMigrationTest_3CAFFCB092CF514D-001
   [junit4]   2> NOTE: test params are: codec=Asserting(Lucene70): {}, docValues:{}, maxPointsInLeafNode=563, maxMBSortInHeap=6.4363585257282985, sim=Asserting(org.apache.lucene.search.similarities.AssertingSimilarity@50738811), locale=he, timezone=Europe/Helsinki
   [junit4]   2> NOTE: Linux 4.13.0-41-generic amd64/Oracle Corporation 10.0.1 (64-bit)/cpus=8,threads=1,free=159649384,total=536870912
   [junit4]   2> NOTE: All tests run in this JVM: [TestPolicyCloud, TestPolicyCloud, TestPolicyCloud, SSLMigrationTest, TestPolicyCloud, TestDistributedSearch, SSLMigrationTest]
   [junit4] Completed [20/20 (1!)] on J0 in 25.29s, 1 test, 1 failure <<< FAILURES!

[...truncated 11 lines...]
BUILD FAILED
/home/jenkins/workspace/Lucene-Solr-BadApples-master-Linux/lucene/common-build.xml:1568: The following error occurred while executing this line:
/home/jenkins/workspace/Lucene-Solr-BadApples-master-Linux/lucene/common-build.xml:1092: There were test failures: 20 suites, 80 tests, 1 failure [seed: 3CAFFCB092CF514D]

Total time: 3 minutes 20 seconds

[repro] Setting last failure code to 256

[repro] Failures:
[repro]   0/5 failed: org.apache.solr.TestDistributedSearch
[repro]   0/5 failed: org.apache.solr.cloud.autoscaling.TestPolicyCloud
[repro]   0/5 failed: org.apache.solr.cloud.autoscaling.sim.TestPolicyCloud
[repro]   1/5 failed: org.apache.solr.cloud.SSLMigrationTest
[repro] Exiting with code 256
+ mv lucene/build lucene/build.repro
+ mv solr/build solr/build.repro
+ mv lucene/build.orig lucene/build
+ mv solr/build.orig solr/build
Archiving artifacts
Setting ANT_1_8_2_HOME=/var/lib/jenkins/tools/hudson.tasks.Ant_AntInstallation/ANT_1.8.2
[WARNINGS] Parsing warnings in console log with parser Java Compiler (javac)
Setting ANT_1_8_2_HOME=/var/lib/jenkins/tools/hudson.tasks.Ant_AntInstallation/ANT_1.8.2
Setting ANT_1_8_2_HOME=/var/lib/jenkins/tools/hudson.tasks.Ant_AntInstallation/ANT_1.8.2
<Git Blamer> Using GitBlamer to create author and commit information for all warnings.
<Git Blamer> GIT_COMMIT=fd929c1d601bd6e946489f51e7b3c0887a3392a6, workspace=/var/lib/jenkins/workspace/Lucene-Solr-BadApples-master-Linux
[WARNINGS] Computing warning deltas based on reference build #41
Recording test results
Setting ANT_1_8_2_HOME=/var/lib/jenkins/tools/hudson.tasks.Ant_AntInstallation/ANT_1.8.2
Build step 'Publish JUnit test result report' changed build result to UNSTABLE
Email was triggered for: Unstable (Test Failures)
Sending email for trigger: Unstable (Test Failures)
Setting ANT_1_8_2_HOME=/var/lib/jenkins/tools/hudson.tasks.Ant_AntInstallation/ANT_1.8.2
Setting ANT_1_8_2_HOME=/var/lib/jenkins/tools/hudson.tasks.Ant_AntInstallation/ANT_1.8.2
Setting ANT_1_8_2_HOME=/var/lib/jenkins/tools/hudson.tasks.Ant_AntInstallation/ANT_1.8.2
Setting ANT_1_8_2_HOME=/var/lib/jenkins/tools/hudson.tasks.Ant_AntInstallation/ANT_1.8.2

Mime
View raw message