lucene-dev mailing list archives

Site index · List index
Message view « Date » · « Thread »
Top « Date » · « Thread »
From Policeman Jenkins Server <jenk...@thetaphi.de>
Subject [JENKINS-EA] Lucene-Solr-master-Linux (64bit/jdk-11-ea+5) - Build # 21984 - Still Unstable!
Date Thu, 10 May 2018 01:44:03 GMT
Build: https://jenkins.thetaphi.de/job/Lucene-Solr-master-Linux/21984/
Java: 64bit/jdk-11-ea+5 -XX:-UseCompressedOops -XX:+UseConcMarkSweepGC

2 tests failed.
FAILED:  org.apache.solr.update.MaxSizeAutoCommitTest.deleteTest

Error Message:
Tlog size exceeds the max size bound. Tlog path: /home/jenkins/workspace/Lucene-Solr-master-Linux/solr/build/solr-core/test/J0/temp/solr.update.MaxSizeAutoCommitTest_2D2E153AF68C619C-001/init-core-data-001/tlog/tlog.0000000000000000002, tlog size: 1302

Stack Trace:
java.lang.AssertionError: Tlog size exceeds the max size bound. Tlog path: /home/jenkins/workspace/Lucene-Solr-master-Linux/solr/build/solr-core/test/J0/temp/solr.update.MaxSizeAutoCommitTest_2D2E153AF68C619C-001/init-core-data-001/tlog/tlog.0000000000000000002, tlog size: 1302
	at __randomizedtesting.SeedInfo.seed([2D2E153AF68C619C:3D60F0C58D22586D]:0)
	at org.junit.Assert.fail(Assert.java:93)
	at org.junit.Assert.assertTrue(Assert.java:43)
	at org.apache.solr.update.MaxSizeAutoCommitTest.getTlogFileSizes(MaxSizeAutoCommitTest.java:379)
	at org.apache.solr.update.MaxSizeAutoCommitTest.deleteTest(MaxSizeAutoCommitTest.java:200)
	at java.base/jdk.internal.reflect.NativeMethodAccessorImpl.invoke0(Native Method)
	at java.base/jdk.internal.reflect.NativeMethodAccessorImpl.invoke(NativeMethodAccessorImpl.java:62)
	at java.base/jdk.internal.reflect.DelegatingMethodAccessorImpl.invoke(DelegatingMethodAccessorImpl.java:43)
	at java.base/java.lang.reflect.Method.invoke(Method.java:564)
	at com.carrotsearch.randomizedtesting.RandomizedRunner.invoke(RandomizedRunner.java:1737)
	at com.carrotsearch.randomizedtesting.RandomizedRunner$8.evaluate(RandomizedRunner.java:934)
	at com.carrotsearch.randomizedtesting.RandomizedRunner$9.evaluate(RandomizedRunner.java:970)
	at com.carrotsearch.randomizedtesting.RandomizedRunner$10.evaluate(RandomizedRunner.java:984)
	at com.carrotsearch.randomizedtesting.rules.SystemPropertiesRestoreRule$1.evaluate(SystemPropertiesRestoreRule.java:57)
	at org.apache.lucene.util.TestRuleSetupTeardownChained$1.evaluate(TestRuleSetupTeardownChained.java:49)
	at org.apache.lucene.util.AbstractBeforeAfterRule$1.evaluate(AbstractBeforeAfterRule.java:45)
	at org.apache.lucene.util.TestRuleThreadAndTestName$1.evaluate(TestRuleThreadAndTestName.java:48)
	at org.apache.lucene.util.TestRuleIgnoreAfterMaxFailures$1.evaluate(TestRuleIgnoreAfterMaxFailures.java:64)
	at org.apache.lucene.util.TestRuleMarkFailure$1.evaluate(TestRuleMarkFailure.java:47)
	at com.carrotsearch.randomizedtesting.rules.StatementAdapter.evaluate(StatementAdapter.java:36)
	at com.carrotsearch.randomizedtesting.ThreadLeakControl$StatementRunner.run(ThreadLeakControl.java:368)
	at com.carrotsearch.randomizedtesting.ThreadLeakControl.forkTimeoutingTask(ThreadLeakControl.java:817)
	at com.carrotsearch.randomizedtesting.ThreadLeakControl$3.evaluate(ThreadLeakControl.java:468)
	at com.carrotsearch.randomizedtesting.RandomizedRunner.runSingleTest(RandomizedRunner.java:943)
	at com.carrotsearch.randomizedtesting.RandomizedRunner$5.evaluate(RandomizedRunner.java:829)
	at com.carrotsearch.randomizedtesting.RandomizedRunner$6.evaluate(RandomizedRunner.java:879)
	at com.carrotsearch.randomizedtesting.RandomizedRunner$7.evaluate(RandomizedRunner.java:890)
	at com.carrotsearch.randomizedtesting.rules.StatementAdapter.evaluate(StatementAdapter.java:36)
	at com.carrotsearch.randomizedtesting.rules.SystemPropertiesRestoreRule$1.evaluate(SystemPropertiesRestoreRule.java:57)
	at org.apache.lucene.util.AbstractBeforeAfterRule$1.evaluate(AbstractBeforeAfterRule.java:45)
	at com.carrotsearch.randomizedtesting.rules.StatementAdapter.evaluate(StatementAdapter.java:36)
	at org.apache.lucene.util.TestRuleStoreClassName$1.evaluate(TestRuleStoreClassName.java:41)
	at com.carrotsearch.randomizedtesting.rules.NoShadowingOrOverridesOnMethodsRule$1.evaluate(NoShadowingOrOverridesOnMethodsRule.java:40)
	at com.carrotsearch.randomizedtesting.rules.NoShadowingOrOverridesOnMethodsRule$1.evaluate(NoShadowingOrOverridesOnMethodsRule.java:40)
	at com.carrotsearch.randomizedtesting.rules.StatementAdapter.evaluate(StatementAdapter.java:36)
	at com.carrotsearch.randomizedtesting.rules.StatementAdapter.evaluate(StatementAdapter.java:36)
	at org.apache.lucene.util.TestRuleAssertionsRequired$1.evaluate(TestRuleAssertionsRequired.java:53)
	at org.apache.lucene.util.TestRuleMarkFailure$1.evaluate(TestRuleMarkFailure.java:47)
	at org.apache.lucene.util.TestRuleIgnoreAfterMaxFailures$1.evaluate(TestRuleIgnoreAfterMaxFailures.java:64)
	at org.apache.lucene.util.TestRuleIgnoreTestSuites$1.evaluate(TestRuleIgnoreTestSuites.java:54)
	at com.carrotsearch.randomizedtesting.rules.StatementAdapter.evaluate(StatementAdapter.java:36)
	at com.carrotsearch.randomizedtesting.ThreadLeakControl$StatementRunner.run(ThreadLeakControl.java:368)
	at java.base/java.lang.Thread.run(Thread.java:841)


FAILED:  org.apache.solr.update.MaxSizeAutoCommitTest.deleteTest

Error Message:
Tlog size exceeds the max size bound. Tlog path: /home/jenkins/workspace/Lucene-Solr-master-Linux/solr/build/solr-core/test/J0/temp/solr.update.MaxSizeAutoCommitTest_2D2E153AF68C619C-001/init-core-data-001/tlog/tlog.0000000000000000002, tlog size: 1302

Stack Trace:
java.lang.AssertionError: Tlog size exceeds the max size bound. Tlog path: /home/jenkins/workspace/Lucene-Solr-master-Linux/solr/build/solr-core/test/J0/temp/solr.update.MaxSizeAutoCommitTest_2D2E153AF68C619C-001/init-core-data-001/tlog/tlog.0000000000000000002, tlog size: 1302
	at __randomizedtesting.SeedInfo.seed([2D2E153AF68C619C:3D60F0C58D22586D]:0)
	at org.junit.Assert.fail(Assert.java:93)
	at org.junit.Assert.assertTrue(Assert.java:43)
	at org.apache.solr.update.MaxSizeAutoCommitTest.getTlogFileSizes(MaxSizeAutoCommitTest.java:379)
	at org.apache.solr.update.MaxSizeAutoCommitTest.deleteTest(MaxSizeAutoCommitTest.java:200)
	at java.base/jdk.internal.reflect.NativeMethodAccessorImpl.invoke0(Native Method)
	at java.base/jdk.internal.reflect.NativeMethodAccessorImpl.invoke(NativeMethodAccessorImpl.java:62)
	at java.base/jdk.internal.reflect.DelegatingMethodAccessorImpl.invoke(DelegatingMethodAccessorImpl.java:43)
	at java.base/java.lang.reflect.Method.invoke(Method.java:564)
	at com.carrotsearch.randomizedtesting.RandomizedRunner.invoke(RandomizedRunner.java:1737)
	at com.carrotsearch.randomizedtesting.RandomizedRunner$8.evaluate(RandomizedRunner.java:934)
	at com.carrotsearch.randomizedtesting.RandomizedRunner$9.evaluate(RandomizedRunner.java:970)
	at com.carrotsearch.randomizedtesting.RandomizedRunner$10.evaluate(RandomizedRunner.java:984)
	at com.carrotsearch.randomizedtesting.rules.SystemPropertiesRestoreRule$1.evaluate(SystemPropertiesRestoreRule.java:57)
	at org.apache.lucene.util.TestRuleSetupTeardownChained$1.evaluate(TestRuleSetupTeardownChained.java:49)
	at org.apache.lucene.util.AbstractBeforeAfterRule$1.evaluate(AbstractBeforeAfterRule.java:45)
	at org.apache.lucene.util.TestRuleThreadAndTestName$1.evaluate(TestRuleThreadAndTestName.java:48)
	at org.apache.lucene.util.TestRuleIgnoreAfterMaxFailures$1.evaluate(TestRuleIgnoreAfterMaxFailures.java:64)
	at org.apache.lucene.util.TestRuleMarkFailure$1.evaluate(TestRuleMarkFailure.java:47)
	at com.carrotsearch.randomizedtesting.rules.StatementAdapter.evaluate(StatementAdapter.java:36)
	at com.carrotsearch.randomizedtesting.ThreadLeakControl$StatementRunner.run(ThreadLeakControl.java:368)
	at com.carrotsearch.randomizedtesting.ThreadLeakControl.forkTimeoutingTask(ThreadLeakControl.java:817)
	at com.carrotsearch.randomizedtesting.ThreadLeakControl$3.evaluate(ThreadLeakControl.java:468)
	at com.carrotsearch.randomizedtesting.RandomizedRunner.runSingleTest(RandomizedRunner.java:943)
	at com.carrotsearch.randomizedtesting.RandomizedRunner$5.evaluate(RandomizedRunner.java:829)
	at com.carrotsearch.randomizedtesting.RandomizedRunner$6.evaluate(RandomizedRunner.java:879)
	at com.carrotsearch.randomizedtesting.RandomizedRunner$7.evaluate(RandomizedRunner.java:890)
	at com.carrotsearch.randomizedtesting.rules.StatementAdapter.evaluate(StatementAdapter.java:36)
	at com.carrotsearch.randomizedtesting.rules.SystemPropertiesRestoreRule$1.evaluate(SystemPropertiesRestoreRule.java:57)
	at org.apache.lucene.util.AbstractBeforeAfterRule$1.evaluate(AbstractBeforeAfterRule.java:45)
	at com.carrotsearch.randomizedtesting.rules.StatementAdapter.evaluate(StatementAdapter.java:36)
	at org.apache.lucene.util.TestRuleStoreClassName$1.evaluate(TestRuleStoreClassName.java:41)
	at com.carrotsearch.randomizedtesting.rules.NoShadowingOrOverridesOnMethodsRule$1.evaluate(NoShadowingOrOverridesOnMethodsRule.java:40)
	at com.carrotsearch.randomizedtesting.rules.NoShadowingOrOverridesOnMethodsRule$1.evaluate(NoShadowingOrOverridesOnMethodsRule.java:40)
	at com.carrotsearch.randomizedtesting.rules.StatementAdapter.evaluate(StatementAdapter.java:36)
	at com.carrotsearch.randomizedtesting.rules.StatementAdapter.evaluate(StatementAdapter.java:36)
	at org.apache.lucene.util.TestRuleAssertionsRequired$1.evaluate(TestRuleAssertionsRequired.java:53)
	at org.apache.lucene.util.TestRuleMarkFailure$1.evaluate(TestRuleMarkFailure.java:47)
	at org.apache.lucene.util.TestRuleIgnoreAfterMaxFailures$1.evaluate(TestRuleIgnoreAfterMaxFailures.java:64)
	at org.apache.lucene.util.TestRuleIgnoreTestSuites$1.evaluate(TestRuleIgnoreTestSuites.java:54)
	at com.carrotsearch.randomizedtesting.rules.StatementAdapter.evaluate(StatementAdapter.java:36)
	at com.carrotsearch.randomizedtesting.ThreadLeakControl$StatementRunner.run(ThreadLeakControl.java:368)
	at java.base/java.lang.Thread.run(Thread.java:841)




Build Log:
[...truncated 1869 lines...]
   [junit4] JVM J1: stderr was not empty, see: /home/jenkins/workspace/Lucene-Solr-master-Linux/lucene/build/core/test/temp/junit4-J1-20180510_003126_71215730800050152652044.syserr
   [junit4] >>> JVM J1 emitted unexpected output (verbatim) ----
   [junit4] OpenJDK 64-Bit Server VM warning: Option UseConcMarkSweepGC was deprecated in version 9.0 and will likely be removed in a future release.
   [junit4] <<< JVM J1: EOF ----

   [junit4] JVM J2: stderr was not empty, see: /home/jenkins/workspace/Lucene-Solr-master-Linux/lucene/build/core/test/temp/junit4-J2-20180510_003126_7126682368614378348897.syserr
   [junit4] >>> JVM J2 emitted unexpected output (verbatim) ----
   [junit4] OpenJDK 64-Bit Server VM warning: Option UseConcMarkSweepGC was deprecated in version 9.0 and will likely be removed in a future release.
   [junit4] <<< JVM J2: EOF ----

[...truncated 3 lines...]
   [junit4] JVM J0: stderr was not empty, see: /home/jenkins/workspace/Lucene-Solr-master-Linux/lucene/build/core/test/temp/junit4-J0-20180510_003126_7123385020945151981140.syserr
   [junit4] >>> JVM J0 emitted unexpected output (verbatim) ----
   [junit4] OpenJDK 64-Bit Server VM warning: Option UseConcMarkSweepGC was deprecated in version 9.0 and will likely be removed in a future release.
   [junit4] <<< JVM J0: EOF ----

[...truncated 295 lines...]
   [junit4] JVM J1: stderr was not empty, see: /home/jenkins/workspace/Lucene-Solr-master-Linux/lucene/build/test-framework/test/temp/junit4-J1-20180510_004042_91615959011698089704986.syserr
   [junit4] >>> JVM J1 emitted unexpected output (verbatim) ----
   [junit4] OpenJDK 64-Bit Server VM warning: Option UseConcMarkSweepGC was deprecated in version 9.0 and will likely be removed in a future release.
   [junit4] <<< JVM J1: EOF ----

[...truncated 3 lines...]
   [junit4] JVM J2: stderr was not empty, see: /home/jenkins/workspace/Lucene-Solr-master-Linux/lucene/build/test-framework/test/temp/junit4-J2-20180510_004042_9169773376779730853926.syserr
   [junit4] >>> JVM J2 emitted unexpected output (verbatim) ----
   [junit4] OpenJDK 64-Bit Server VM warning: Option UseConcMarkSweepGC was deprecated in version 9.0 and will likely be removed in a future release.
   [junit4] <<< JVM J2: EOF ----

[...truncated 3 lines...]
   [junit4] JVM J0: stderr was not empty, see: /home/jenkins/workspace/Lucene-Solr-master-Linux/lucene/build/test-framework/test/temp/junit4-J0-20180510_004042_91617603698758210026276.syserr
   [junit4] >>> JVM J0 emitted unexpected output (verbatim) ----
   [junit4] OpenJDK 64-Bit Server VM warning: Option UseConcMarkSweepGC was deprecated in version 9.0 and will likely be removed in a future release.
   [junit4] <<< JVM J0: EOF ----

[...truncated 1065 lines...]
   [junit4] JVM J0: stderr was not empty, see: /home/jenkins/workspace/Lucene-Solr-master-Linux/lucene/build/analysis/common/test/temp/junit4-J0-20180510_004218_34818097825872009014983.syserr
   [junit4] >>> JVM J0 emitted unexpected output (verbatim) ----
   [junit4] OpenJDK 64-Bit Server VM warning: Option UseConcMarkSweepGC was deprecated in version 9.0 and will likely be removed in a future release.
   [junit4] <<< JVM J0: EOF ----

[...truncated 3 lines...]
   [junit4] JVM J2: stderr was not empty, see: /home/jenkins/workspace/Lucene-Solr-master-Linux/lucene/build/analysis/common/test/temp/junit4-J2-20180510_004218_3489658434743227819692.syserr
   [junit4] >>> JVM J2 emitted unexpected output (verbatim) ----
   [junit4] OpenJDK 64-Bit Server VM warning: Option UseConcMarkSweepGC was deprecated in version 9.0 and will likely be removed in a future release.
   [junit4] <<< JVM J2: EOF ----

[...truncated 3 lines...]
   [junit4] JVM J1: stderr was not empty, see: /home/jenkins/workspace/Lucene-Solr-master-Linux/lucene/build/analysis/common/test/temp/junit4-J1-20180510_004218_34816952314290130723143.syserr
   [junit4] >>> JVM J1 emitted unexpected output (verbatim) ----
   [junit4] OpenJDK 64-Bit Server VM warning: Option UseConcMarkSweepGC was deprecated in version 9.0 and will likely be removed in a future release.
   [junit4] <<< JVM J1: EOF ----

[...truncated 258 lines...]
   [junit4] JVM J0: stderr was not empty, see: /home/jenkins/workspace/Lucene-Solr-master-Linux/lucene/build/analysis/icu/test/temp/junit4-J0-20180510_004406_4584725279300726873511.syserr
   [junit4] >>> JVM J0 emitted unexpected output (verbatim) ----
   [junit4] OpenJDK 64-Bit Server VM warning: Option UseConcMarkSweepGC was deprecated in version 9.0 and will likely be removed in a future release.
   [junit4] <<< JVM J0: EOF ----

   [junit4] JVM J2: stderr was not empty, see: /home/jenkins/workspace/Lucene-Solr-master-Linux/lucene/build/analysis/icu/test/temp/junit4-J2-20180510_004406_45813642907839364978689.syserr
   [junit4] >>> JVM J2 emitted unexpected output (verbatim) ----
   [junit4] OpenJDK 64-Bit Server VM warning: Option UseConcMarkSweepGC was deprecated in version 9.0 and will likely be removed in a future release.
   [junit4] <<< JVM J2: EOF ----

[...truncated 3 lines...]
   [junit4] JVM J1: stderr was not empty, see: /home/jenkins/workspace/Lucene-Solr-master-Linux/lucene/build/analysis/icu/test/temp/junit4-J1-20180510_004406_4583495853883441587804.syserr
   [junit4] >>> JVM J1 emitted unexpected output (verbatim) ----
   [junit4] OpenJDK 64-Bit Server VM warning: Option UseConcMarkSweepGC was deprecated in version 9.0 and will likely be removed in a future release.
   [junit4] <<< JVM J1: EOF ----

[...truncated 244 lines...]
   [junit4] JVM J0: stderr was not empty, see: /home/jenkins/workspace/Lucene-Solr-master-Linux/lucene/build/analysis/kuromoji/test/temp/junit4-J0-20180510_004418_6714682946578206390018.syserr
   [junit4] >>> JVM J0 emitted unexpected output (verbatim) ----
   [junit4] OpenJDK 64-Bit Server VM warning: Option UseConcMarkSweepGC was deprecated in version 9.0 and will likely be removed in a future release.
   [junit4] <<< JVM J0: EOF ----

[...truncated 12 lines...]
   [junit4] JVM J2: stderr was not empty, see: /home/jenkins/workspace/Lucene-Solr-master-Linux/lucene/build/analysis/kuromoji/test/temp/junit4-J2-20180510_004418_67613359949465482627502.syserr
   [junit4] >>> JVM J2 emitted unexpected output (verbatim) ----
   [junit4] OpenJDK 64-Bit Server VM warning: Option UseConcMarkSweepGC was deprecated in version 9.0 and will likely be removed in a future release.
   [junit4] <<< JVM J2: EOF ----

[...truncated 3 lines...]
   [junit4] JVM J1: stderr was not empty, see: /home/jenkins/workspace/Lucene-Solr-master-Linux/lucene/build/analysis/kuromoji/test/temp/junit4-J1-20180510_004418_6767210252318404120263.syserr
   [junit4] >>> JVM J1 emitted unexpected output (verbatim) ----
   [junit4] OpenJDK 64-Bit Server VM warning: Option UseConcMarkSweepGC was deprecated in version 9.0 and will likely be removed in a future release.
   [junit4] <<< JVM J1: EOF ----

[...truncated 162 lines...]
   [junit4] JVM J1: stderr was not empty, see: /home/jenkins/workspace/Lucene-Solr-master-Linux/lucene/build/analysis/morfologik/test/temp/junit4-J1-20180510_004445_99014265796064343853791.syserr
   [junit4] >>> JVM J1 emitted unexpected output (verbatim) ----
   [junit4] OpenJDK 64-Bit Server VM warning: Option UseConcMarkSweepGC was deprecated in version 9.0 and will likely be removed in a future release.
   [junit4] <<< JVM J1: EOF ----

[...truncated 3 lines...]
   [junit4] JVM J0: stderr was not empty, see: /home/jenkins/workspace/Lucene-Solr-master-Linux/lucene/build/analysis/morfologik/test/temp/junit4-J0-20180510_004445_99068343449366185862.syserr
   [junit4] >>> JVM J0 emitted unexpected output (verbatim) ----
   [junit4] OpenJDK 64-Bit Server VM warning: Option UseConcMarkSweepGC was deprecated in version 9.0 and will likely be removed in a future release.
   [junit4] <<< JVM J0: EOF ----

[...truncated 3 lines...]
   [junit4] JVM J2: stderr was not empty, see: /home/jenkins/workspace/Lucene-Solr-master-Linux/lucene/build/analysis/morfologik/test/temp/junit4-J2-20180510_004445_99015915848775011032596.syserr
   [junit4] >>> JVM J2 emitted unexpected output (verbatim) ----
   [junit4] OpenJDK 64-Bit Server VM warning: Option UseConcMarkSweepGC was deprecated in version 9.0 and will likely be removed in a future release.
   [junit4] <<< JVM J2: EOF ----

[...truncated 207 lines...]
   [junit4] JVM J2: stderr was not empty, see: /home/jenkins/workspace/Lucene-Solr-master-Linux/lucene/build/analysis/nori/test/temp/junit4-J2-20180510_004450_966127076733230762556.syserr
   [junit4] >>> JVM J2 emitted unexpected output (verbatim) ----
   [junit4] OpenJDK 64-Bit Server VM warning: Option UseConcMarkSweepGC was deprecated in version 9.0 and will likely be removed in a future release.
   [junit4] <<< JVM J2: EOF ----

[...truncated 3 lines...]
   [junit4] JVM J0: stderr was not empty, see: /home/jenkins/workspace/Lucene-Solr-master-Linux/lucene/build/analysis/nori/test/temp/junit4-J0-20180510_004450_96611968131005773998992.syserr
   [junit4] >>> JVM J0 emitted unexpected output (verbatim) ----
   [junit4] OpenJDK 64-Bit Server VM warning: Option UseConcMarkSweepGC was deprecated in version 9.0 and will likely be removed in a future release.
   [junit4] <<< JVM J0: EOF ----

[...truncated 3 lines...]
   [junit4] JVM J1: stderr was not empty, see: /home/jenkins/workspace/Lucene-Solr-master-Linux/lucene/build/analysis/nori/test/temp/junit4-J1-20180510_004450_96613726013373418081090.syserr
   [junit4] >>> JVM J1 emitted unexpected output (verbatim) ----
   [junit4] OpenJDK 64-Bit Server VM warning: Option UseConcMarkSweepGC was deprecated in version 9.0 and will likely be removed in a future release.
   [junit4] <<< JVM J1: EOF ----

[...truncated 174 lines...]
   [junit4] JVM J1: stderr was not empty, see: /home/jenkins/workspace/Lucene-Solr-master-Linux/lucene/build/analysis/opennlp/test/temp/junit4-J1-20180510_004501_41211354408563293570933.syserr
   [junit4] >>> JVM J1 emitted unexpected output (verbatim) ----
   [junit4] OpenJDK 64-Bit Server VM warning: Option UseConcMarkSweepGC was deprecated in version 9.0 and will likely be removed in a future release.
   [junit4] <<< JVM J1: EOF ----

   [junit4] JVM J2: stderr was not empty, see: /home/jenkins/workspace/Lucene-Solr-master-Linux/lucene/build/analysis/opennlp/test/temp/junit4-J2-20180510_004501_4125359296220098168509.syserr
   [junit4] >>> JVM J2 emitted unexpected output (verbatim) ----
   [junit4] OpenJDK 64-Bit Server VM warning: Option UseConcMarkSweepGC was deprecated in version 9.0 and will likely be removed in a future release.
   [junit4] <<< JVM J2: EOF ----

   [junit4] JVM J0: stderr was not empty, see: /home/jenkins/workspace/Lucene-Solr-master-Linux/lucene/build/analysis/opennlp/test/temp/junit4-J0-20180510_004501_41214339658503998706526.syserr
   [junit4] >>> JVM J0 emitted unexpected output (verbatim) ----
   [junit4] OpenJDK 64-Bit Server VM warning: Option UseConcMarkSweepGC was deprecated in version 9.0 and will likely be removed in a future release.
   [junit4] <<< JVM J0: EOF ----

[...truncated 176 lines...]
   [junit4] JVM J0: stderr was not empty, see: /home/jenkins/workspace/Lucene-Solr-master-Linux/lucene/build/analysis/phonetic/test/temp/junit4-J0-20180510_004504_261640298572898288707.syserr
   [junit4] >>> JVM J0 emitted unexpected output (verbatim) ----
   [junit4] OpenJDK 64-Bit Server VM warning: Option UseConcMarkSweepGC was deprecated in version 9.0 and will likely be removed in a future release.
   [junit4] <<< JVM J0: EOF ----

[...truncated 3 lines...]
   [junit4] JVM J2: stderr was not empty, see: /home/jenkins/workspace/Lucene-Solr-master-Linux/lucene/build/analysis/phonetic/test/temp/junit4-J2-20180510_004504_26114277145812582946450.syserr
   [junit4] >>> JVM J2 emitted unexpected output (verbatim) ----
   [junit4] OpenJDK 64-Bit Server VM warning: Option UseConcMarkSweepGC was deprecated in version 9.0 and will likely be removed in a future release.
   [junit4] <<< JVM J2: EOF ----

[...truncated 3 lines...]
   [junit4] JVM J1: stderr was not empty, see: /home/jenkins/workspace/Lucene-Solr-master-Linux/lucene/build/analysis/phonetic/test/temp/junit4-J1-20180510_004504_26116136871230925989761.syserr
   [junit4] >>> JVM J1 emitted unexpected output (verbatim) ----
   [junit4] OpenJDK 64-Bit Server VM warning: Option UseConcMarkSweepGC was deprecated in version 9.0 and will likely be removed in a future release.
   [junit4] <<< JVM J1: EOF ----

[...truncated 161 lines...]
   [junit4] JVM J1: stderr was not empty, see: /home/jenkins/workspace/Lucene-Solr-master-Linux/lucene/build/analysis/smartcn/test/temp/junit4-J1-20180510_004514_8011140415657157287340.syserr
   [junit4] >>> JVM J1 emitted unexpected output (verbatim) ----
   [junit4] OpenJDK 64-Bit Server VM warning: Option UseConcMarkSweepGC was deprecated in version 9.0 and will likely be removed in a future release.
   [junit4] <<< JVM J1: EOF ----

[...truncated 3 lines...]
   [junit4] JVM J0: stderr was not empty, see: /home/jenkins/workspace/Lucene-Solr-master-Linux/lucene/build/analysis/smartcn/test/temp/junit4-J0-20180510_004514_8012185767045746231614.syserr
   [junit4] >>> JVM J0 emitted unexpected output (verbatim) ----
   [junit4] OpenJDK 64-Bit Server VM warning: Option UseConcMarkSweepGC was deprecated in version 9.0 and will likely be removed in a future release.
   [junit4] <<< JVM J0: EOF ----

[...truncated 162 lines...]
   [junit4] JVM J1: stderr was not empty, see: /home/jenkins/workspace/Lucene-Solr-master-Linux/lucene/build/analysis/stempel/test/temp/junit4-J1-20180510_004524_02513800221370291683334.syserr
   [junit4] >>> JVM J1 emitted unexpected output (verbatim) ----
   [junit4] OpenJDK 64-Bit Server VM warning: Option UseConcMarkSweepGC was deprecated in version 9.0 and will likely be removed in a future release.
   [junit4] <<< JVM J1: EOF ----

[...truncated 6 lines...]
   [junit4] JVM J2: stderr was not empty, see: /home/jenkins/workspace/Lucene-Solr-master-Linux/lucene/build/analysis/stempel/test/temp/junit4-J2-20180510_004524_02515071470955871402695.syserr
   [junit4] >>> JVM J2 emitted unexpected output (verbatim) ----
   [junit4] OpenJDK 64-Bit Server VM warning: Option UseConcMarkSweepGC was deprecated in version 9.0 and will likely be removed in a future release.
   [junit4] <<< JVM J2: EOF ----

   [junit4] JVM J0: stderr was not empty, see: /home/jenkins/workspace/Lucene-Solr-master-Linux/lucene/build/analysis/stempel/test/temp/junit4-J0-20180510_004524_02512418889000651562693.syserr
   [junit4] >>> JVM J0 emitted unexpected output (verbatim) ----
   [junit4] OpenJDK 64-Bit Server VM warning: Option UseConcMarkSweepGC was deprecated in version 9.0 and will likely be removed in a future release.
   [junit4] <<< JVM J0: EOF ----

[...truncated 177 lines...]
   [junit4] JVM J0: stderr was not empty, see: /home/jenkins/workspace/Lucene-Solr-master-Linux/lucene/build/analysis/uima/test/temp/junit4-J0-20180510_004526_71911240814546216434131.syserr
   [junit4] >>> JVM J0 emitted unexpected output (verbatim) ----
   [junit4] OpenJDK 64-Bit Server VM warning: Option UseConcMarkSweepGC was deprecated in version 9.0 and will likely be removed in a future release.
   [junit4] <<< JVM J0: EOF ----

[...truncated 158 lines...]
   [junit4] JVM J2: stderr was not empty, see: /home/jenkins/workspace/Lucene-Solr-master-Linux/lucene/build/backward-codecs/test/temp/junit4-J2-20180510_004535_22311476943259297081397.syserr
   [junit4] JVM J1: stderr was not empty, see: /home/jenkins/workspace/Lucene-Solr-master-Linux/lucene/build/backward-codecs/test/temp/junit4-J1-20180510_004535_2237516888062748398753.syserr
   [junit4] >>> JVM J2 emitted unexpected output (verbatim) ----
   [junit4] OpenJDK 64-Bit Server VM warning: Option UseConcMarkSweepGC was deprecated in version 9.0 and will likely be removed in a future release.
   [junit4] <<< JVM J2: EOF ----

[...truncated 22 lines...]
   [junit4] JVM J0: stderr was not empty, see: /home/jenkins/workspace/Lucene-Solr-master-Linux/lucene/build/backward-codecs/test/temp/junit4-J0-20180510_004535_22315670268366504489354.syserr
   [junit4] >>> JVM J0 emitted unexpected output (verbatim) ----
   [junit4] OpenJDK 64-Bit Server VM warning: Option UseConcMarkSweepGC was deprecated in version 9.0 and will likely be removed in a future release.
   [junit4] <<< JVM J0: EOF ----

[...truncated 1391 lines...]
   [junit4] JVM J1: stderr was not empty, see: /home/jenkins/workspace/Lucene-Solr-master-Linux/lucene/build/benchmark/test/temp/junit4-J1-20180510_004558_62117239754454029687377.syserr
   [junit4] >>> JVM J1 emitted unexpected output (verbatim) ----
   [junit4] OpenJDK 64-Bit Server VM warning: Option UseConcMarkSweepGC was deprecated in version 9.0 and will likely be removed in a future release.
   [junit4] <<< JVM J1: EOF ----

   [junit4] JVM J2: stderr was not empty, see: /home/jenkins/workspace/Lucene-Solr-master-Linux/lucene/build/benchmark/test/temp/junit4-J2-20180510_004558_62112335609986433941602.syserr
   [junit4] >>> JVM J2 emitted unexpected output (verbatim) ----
   [junit4] OpenJDK 64-Bit Server VM warning: Option UseConcMarkSweepGC was deprecated in version 9.0 and will likely be removed in a future release.
   [junit4] <<< JVM J2: EOF ----

[...truncated 3 lines...]
   [junit4] JVM J0: stderr was not empty, see: /home/jenkins/workspace/Lucene-Solr-master-Linux/lucene/build/benchmark/test/temp/junit4-J0-20180510_004558_62011685934507168795573.syserr
   [junit4] >>> JVM J0 emitted unexpected output (verbatim) ----
   [junit4] OpenJDK 64-Bit Server VM warning: Option UseConcMarkSweepGC was deprecated in version 9.0 and will likely be removed in a future release.
   [junit4] <<< JVM J0: EOF ----

[...truncated 250 lines...]
   [junit4] JVM J2: stderr was not empty, see: /home/jenkins/workspace/Lucene-Solr-master-Linux/lucene/build/classification/test/temp/junit4-J2-20180510_004606_58011508229785537800991.syserr
   [junit4] >>> JVM J2 emitted unexpected output (verbatim) ----
   [junit4] OpenJDK 64-Bit Server VM warning: Option UseConcMarkSweepGC was deprecated in version 9.0 and will likely be removed in a future release.
   [junit4] <<< JVM J2: EOF ----

[...truncated 3 lines...]
   [junit4] JVM J0: stderr was not empty, see: /home/jenkins/workspace/Lucene-Solr-master-Linux/lucene/build/classification/test/temp/junit4-J0-20180510_004606_5806523123737471483105.syserr
   [junit4] >>> JVM J0 emitted unexpected output (verbatim) ----
   [junit4] OpenJDK 64-Bit Server VM warning: Option UseConcMarkSweepGC was deprecated in version 9.0 and will likely be removed in a future release.
   [junit4] <<< JVM J0: EOF ----

[...truncated 3 lines...]
   [junit4] JVM J1: stderr was not empty, see: /home/jenkins/workspace/Lucene-Solr-master-Linux/lucene/build/classification/test/temp/junit4-J1-20180510_004606_58011845963056944089827.syserr
   [junit4] >>> JVM J1 emitted unexpected output (verbatim) ----
   [junit4] OpenJDK 64-Bit Server VM warning: Option UseConcMarkSweepGC was deprecated in version 9.0 and will likely be removed in a future release.
   [junit4] <<< JVM J1: EOF ----

[...truncated 246 lines...]
   [junit4] JVM J1: stderr was not empty, see: /home/jenkins/workspace/Lucene-Solr-master-Linux/lucene/build/codecs/test/temp/junit4-J1-20180510_004616_58511821031109046513389.syserr
   [junit4] >>> JVM J1 emitted unexpected output (verbatim) ----
   [junit4] OpenJDK 64-Bit Server VM warning: Option UseConcMarkSweepGC was deprecated in version 9.0 and will likely be removed in a future release.
   [junit4] <<< JVM J1: EOF ----

[...truncated 10 lines...]
   [junit4] JVM J2: stderr was not empty, see: /home/jenkins/workspace/Lucene-Solr-master-Linux/lucene/build/codecs/test/temp/junit4-J2-20180510_004616_5854522106132100910707.syserr
   [junit4] >>> JVM J2 emitted unexpected output (verbatim) ----
   [junit4] OpenJDK 64-Bit Server VM warning: Option UseConcMarkSweepGC was deprecated in version 9.0 and will likely be removed in a future release.
   [junit4] <<< JVM J2: EOF ----

[...truncated 12 lines...]
   [junit4] JVM J0: stderr was not empty, see: /home/jenkins/workspace/Lucene-Solr-master-Linux/lucene/build/codecs/test/temp/junit4-J0-20180510_004616_5857940516981381145098.syserr
   [junit4] >>> JVM J0 emitted unexpected output (verbatim) ----
   [junit4] OpenJDK 64-Bit Server VM warning: Option UseConcMarkSweepGC was deprecated in version 9.0 and will likely be removed in a future release.
   [junit4] <<< JVM J0: EOF ----

[...truncated 233 lines...]
   [junit4] JVM J1: stderr was not empty, see: /home/jenkins/workspace/Lucene-Solr-master-Linux/lucene/build/demo/test/temp/junit4-J1-20180510_004858_18417336124785060322490.syserr
   [junit4] >>> JVM J1 emitted unexpected output (verbatim) ----
   [junit4] OpenJDK 64-Bit Server VM warning: Option UseConcMarkSweepGC was deprecated in version 9.0 and will likely be removed in a future release.
   [junit4] <<< JVM J1: EOF ----

   [junit4] JVM J2: stderr was not empty, see: /home/jenkins/workspace/Lucene-Solr-master-Linux/lucene/build/demo/test/temp/junit4-J2-20180510_004858_18411985475064080510016.syserr
   [junit4] >>> JVM J2 emitted unexpected output (verbatim) ----
   [junit4] OpenJDK 64-Bit Server VM warning: Option UseConcMarkSweepGC was deprecated in version 9.0 and will likely be removed in a future release.
   [junit4] <<< JVM J2: EOF ----

[...truncated 3 lines...]
   [junit4] JVM J0: stderr was not empty, see: /home/jenkins/workspace/Lucene-Solr-master-Linux/lucene/build/demo/test/temp/junit4-J0-20180510_004858_18412830648140920671100.syserr
   [junit4] >>> JVM J0 emitted unexpected output (verbatim) ----
   [junit4] OpenJDK 64-Bit Server VM warning: Option UseConcMarkSweepGC was deprecated in version 9.0 and will likely be removed in a future release.
   [junit4] <<< JVM J0: EOF ----

[...truncated 170 lines...]
   [junit4] JVM J2: stderr was not empty, see: /home/jenkins/workspace/Lucene-Solr-master-Linux/lucene/build/expressions/test/temp/junit4-J2-20180510_004901_90615887077283547406322.syserr
   [junit4] >>> JVM J2 emitted unexpected output (verbatim) ----
   [junit4] OpenJDK 64-Bit Server VM warning: Option UseConcMarkSweepGC was deprecated in version 9.0 and will likely be removed in a future release.
   [junit4] <<< JVM J2: EOF ----

[...truncated 3 lines...]
   [junit4] JVM J1: stderr was not empty, see: /home/jenkins/workspace/Lucene-Solr-master-Linux/lucene/build/expressions/test/temp/junit4-J1-20180510_004901_90512762359236466425239.syserr
   [junit4] >>> JVM J1 emitted unexpected output (verbatim) ----
   [junit4] OpenJDK 64-Bit Server VM warning: Option UseConcMarkSweepGC was deprecated in version 9.0 and will likely be removed in a future release.
   [junit4] <<< JVM J1: EOF ----

[...truncated 6 lines...]
   [junit4] JVM J0: stderr was not empty, see: /home/jenkins/workspace/Lucene-Solr-master-Linux/lucene/build/expressions/test/temp/junit4-J0-20180510_004901_90516513594723449794564.syserr
   [junit4] >>> JVM J0 emitted unexpected output (verbatim) ----
   [junit4] OpenJDK 64-Bit Server VM warning: Option UseConcMarkSweepGC was deprecated in version 9.0 and will likely be removed in a future release.
   [junit4] <<< JVM J0: EOF ----

[...truncated 232 lines...]
   [junit4] JVM J2: stderr was not empty, see: /home/jenkins/workspace/Lucene-Solr-master-Linux/lucene/build/facet/test/temp/junit4-J2-20180510_004910_077354159751339480005.syserr
   [junit4] >>> JVM J2 emitted unexpected output (verbatim) ----
   [junit4] OpenJDK 64-Bit Server VM warning: Option UseConcMarkSweepGC was deprecated in version 9.0 and will likely be removed in a future release.
   [junit4] <<< JVM J2: EOF ----

[...truncated 3 lines...]
   [junit4] JVM J0: stderr was not empty, see: /home/jenkins/workspace/Lucene-Solr-master-Linux/lucene/build/facet/test/temp/junit4-J0-20180510_004910_077205484059774504055.syserr
   [junit4] >>> JVM J0 emitted unexpected output (verbatim) ----
   [junit4] OpenJDK 64-Bit Server VM warning: Option UseConcMarkSweepGC was deprecated in version 9.0 and will likely be removed in a future release.
   [junit4] <<< JVM J0: EOF ----

[...truncated 3 lines...]
   [junit4] JVM J1: stderr was not empty, see: /home/jenkins/workspace/Lucene-Solr-master-Linux/lucene/build/facet/test/temp/junit4-J1-20180510_004910_0772024715397623157201.syserr
   [junit4] >>> JVM J1 emitted unexpected output (verbatim) ----
   [junit4] OpenJDK 64-Bit Server VM warning: Option UseConcMarkSweepGC was deprecated in version 9.0 and will likely be removed in a future release.
   [junit4] <<< JVM J1: EOF ----

[...truncated 185 lines...]
   [junit4] JVM J1: stderr was not empty, see: /home/jenkins/workspace/Lucene-Solr-master-Linux/lucene/build/grouping/test/temp/junit4-J1-20180510_004954_7658462170135380111056.syserr
   [junit4] >>> JVM J1 emitted unexpected output (verbatim) ----
   [junit4] OpenJDK 64-Bit Server VM warning: Option UseConcMarkSweepGC was deprecated in version 9.0 and will likely be removed in a future release.
   [junit4] <<< JVM J1: EOF ----

   [junit4] JVM J2: stderr was not empty, see: /home/jenkins/workspace/Lucene-Solr-master-Linux/lucene/build/grouping/test/temp/junit4-J2-20180510_004954_7653708394393122131548.syserr
   [junit4] >>> JVM J2 emitted unexpected output (verbatim) ----
   [junit4] OpenJDK 64-Bit Server VM warning: Option UseConcMarkSweepGC was deprecated in version 9.0 and will likely be removed in a future release.
   [junit4] <<< JVM J2: EOF ----

[...truncated 3 lines...]
   [junit4] JVM J0: stderr was not empty, see: /home/jenkins/workspace/Lucene-Solr-master-Linux/lucene/build/grouping/test/temp/junit4-J0-20180510_004954_76517697056256475560541.syserr
   [junit4] >>> JVM J0 emitted unexpected output (verbatim) ----
   [junit4] OpenJDK 64-Bit Server VM warning: Option UseConcMarkSweepGC was deprecated in version 9.0 and will likely be removed in a future release.
   [junit4] <<< JVM J0: EOF ----

[...truncated 258 lines...]
   [junit4] JVM J1: stderr was not empty, see: /home/jenkins/workspace/Lucene-Solr-master-Linux/lucene/build/highlighter/test/temp/junit4-J1-20180510_005006_35114992263227271288444.syserr
   [junit4] >>> JVM J1 emitted unexpected output (verbatim) ----
   [junit4] OpenJDK 64-Bit Server VM warning: Option UseConcMarkSweepGC was deprecated in version 9.0 and will likely be removed in a future release.
   [junit4] <<< JVM J1: EOF ----

   [junit4] JVM J2: stderr was not empty, see: /home/jenkins/workspace/Lucene-Solr-master-Linux/lucene/build/highlighter/test/temp/junit4-J2-20180510_005006_3539585830743178586989.syserr
   [junit4] >>> JVM J2 emitted unexpected output (verbatim) ----
   [junit4] OpenJDK 64-Bit Server VM warning: Option UseConcMarkSweepGC was deprecated in version 9.0 and will likely be removed in a future release.
   [junit4] <<< JVM J2: EOF ----

[...truncated 3 lines...]
   [junit4] JVM J0: stderr was not empty, see: /home/jenkins/workspace/Lucene-Solr-master-Linux/lucene/build/highlighter/test/temp/junit4-J0-20180510_005006_35115282661547727060479.syserr
   [junit4] >>> JVM J0 emitted unexpected output (verbatim) ----
   [junit4] OpenJDK 64-Bit Server VM warning: Option UseConcMarkSweepGC was deprecated in version 9.0 and will likely be removed in a future release.
   [junit4] <<< JVM J0: EOF ----

[...truncated 163 lines...]
   [junit4] JVM J2: stderr was not empty, see: /home/jenkins/workspace/Lucene-Solr-master-Linux/lucene/build/join/test/temp/junit4-J2-20180510_005034_1941967994603321468718.syserr
   [junit4] >>> JVM J2 emitted unexpected output (verbatim) ----
   [junit4] OpenJDK 64-Bit Server VM warning: Option UseConcMarkSweepGC was deprecated in version 9.0 and will likely be removed in a future release.
   [junit4] <<< JVM J2: EOF ----

[...truncated 3 lines...]
   [junit4] JVM J0: stderr was not empty, see: /home/jenkins/workspace/Lucene-Solr-master-Linux/lucene/build/join/test/temp/junit4-J0-20180510_005034_19413290275140407092564.syserr
   [junit4] >>> JVM J0 emitted unexpected output (verbatim) ----
   [junit4] OpenJDK 64-Bit Server VM warning: Option UseConcMarkSweepGC was deprecated in version 9.0 and will likely be removed in a future release.
   [junit4] <<< JVM J0: EOF ----

[...truncated 6 lines...]
   [junit4] JVM J1: stderr was not empty, see: /home/jenkins/workspace/Lucene-Solr-master-Linux/lucene/build/join/test/temp/junit4-J1-20180510_005034_19416913908451193659359.syserr
   [junit4] >>> JVM J1 emitted unexpected output (verbatim) ----
   [junit4] OpenJDK 64-Bit Server VM warning: Option UseConcMarkSweepGC was deprecated in version 9.0 and will likely be removed in a future release.
   [junit4] <<< JVM J1: EOF ----

[...truncated 155 lines...]
   [junit4] JVM J0: stderr was not empty, see: /home/jenkins/workspace/Lucene-Solr-master-Linux/lucene/build/memory/test/temp/junit4-J0-20180510_005054_05415754218766743238905.syserr
   [junit4] >>> JVM J0 emitted unexpected output (verbatim) ----
   [junit4] OpenJDK 64-Bit Server VM warning: Option UseConcMarkSweepGC was deprecated in version 9.0 and will likely be removed in a future release.
   [junit4] <<< JVM J0: EOF ----

[...truncated 3 lines...]
   [junit4] JVM J1: stderr was not empty, see: /home/jenkins/workspace/Lucene-Solr-master-Linux/lucene/build/memory/test/temp/junit4-J1-20180510_005054_054328020832054215372.syserr
   [junit4] >>> JVM J1 emitted unexpected output (verbatim) ----
   [junit4] OpenJDK 64-Bit Server VM warning: Option UseConcMarkSweepGC was deprecated in version 9.0 and will likely be removed in a future release.
   [junit4] <<< JVM J1: EOF ----

[...truncated 187 lines...]
   [junit4] JVM J2: stderr was not empty, see: /home/jenkins/workspace/Lucene-Solr-master-Linux/lucene/build/misc/test/temp/junit4-J2-20180510_005109_64312287416506779600577.syserr
   [junit4] >>> JVM J2 emitted unexpected output (verbatim) ----
   [junit4] OpenJDK 64-Bit Server VM warning: Option UseConcMarkSweepGC was deprecated in version 9.0 and will likely be removed in a future release.
   [junit4] <<< JVM J2: EOF ----

[...truncated 5 lines...]
   [junit4] JVM J1: stderr was not empty, see: /home/jenkins/workspace/Lucene-Solr-master-Linux/lucene/build/misc/test/temp/junit4-J1-20180510_005109_64317034664594041264522.syserr
   [junit4] >>> JVM J1 emitted unexpected output (verbatim) ----
   [junit4] OpenJDK 64-Bit Server VM warning: Option UseConcMarkSweepGC was deprecated in version 9.0 and will likely be removed in a future release.
   [junit4] <<< JVM J1: EOF ----

[...truncated 3 lines...]
   [junit4] JVM J0: stderr was not empty, see: /home/jenkins/workspace/Lucene-Solr-master-Linux/lucene/build/misc/test/temp/junit4-J0-20180510_005109_64314283802897643660416.syserr
   [junit4] >>> JVM J0 emitted unexpected output (verbatim) ----
   [junit4] OpenJDK 64-Bit Server VM warning: Option UseConcMarkSweepGC was deprecated in version 9.0 and will likely be removed in a future release.
   [junit4] <<< JVM J0: EOF ----

[...truncated 307 lines...]
   [junit4] JVM J2: stderr was not empty, see: /home/jenkins/workspace/Lucene-Solr-master-Linux/lucene/build/queries/test/temp/junit4-J2-20180510_005129_42611253662673640718340.syserr
   [junit4] JVM J1: stderr was not empty, see: /home/jenkins/workspace/Lucene-Solr-master-Linux/lucene/build/queries/test/temp/junit4-J1-20180510_005129_42312020966926643547742.syserr
   [junit4] >>> JVM J2 emitted unexpected output (verbatim) ----
   [junit4] OpenJDK 64-Bit Server VM warning: Option UseConcMarkSweepGC was deprecated in version 9.0 and will likely be removed in a future release.
   [junit4] <<< JVM J2: EOF ----

[...truncated 6 lines...]
   [junit4] JVM J0: stderr was not empty, see: /home/jenkins/workspace/Lucene-Solr-master-Linux/lucene/build/queries/test/temp/junit4-J0-20180510_005129_4226062841676472546685.syserr
   [junit4] >>> JVM J0 emitted unexpected output (verbatim) ----
   [junit4] OpenJDK 64-Bit Server VM warning: Option UseConcMarkSweepGC was deprecated in version 9.0 and will likely be removed in a future release.
   [junit4] <<< JVM J0: EOF ----

[...truncated 232 lines...]
   [junit4] JVM J2: stderr was not empty, see: /home/jenkins/workspace/Lucene-Solr-master-Linux/lucene/build/queryparser/test/temp/junit4-J2-20180510_005138_2354011593479175058026.syserr
   [junit4] >>> JVM J2 emitted unexpected output (verbatim) ----
   [junit4] OpenJDK 64-Bit Server VM warning: Option UseConcMarkSweepGC was deprecated in version 9.0 and will likely be removed in a future release.
   [junit4] <<< JVM J2: EOF ----

[...truncated 6 lines...]
   [junit4] JVM J0: stderr was not empty, see: /home/jenkins/workspace/Lucene-Solr-master-Linux/lucene/build/queryparser/test/temp/junit4-J0-20180510_005138_2355495174840091474962.syserr
   [junit4] >>> JVM J0 emitted unexpected output (verbatim) ----
   [junit4] OpenJDK 64-Bit Server VM warning: Option UseConcMarkSweepGC was deprecated in version 9.0 and will likely be removed in a future release.
   [junit4] <<< JVM J0: EOF ----

   [junit4] JVM J1: stderr was not empty, see: /home/jenkins/workspace/Lucene-Solr-master-Linux/lucene/build/queryparser/test/temp/junit4-J1-20180510_005138_23515522440657720524881.syserr
   [junit4] >>> JVM J1 emitted unexpected output (verbatim) ----
   [junit4] OpenJDK 64-Bit Server VM warning: Option UseConcMarkSweepGC was deprecated in version 9.0 and will likely be removed in a future release.
   [junit4] <<< JVM J1: EOF ----

[...truncated 212 lines...]
   [junit4] JVM J1: stderr was not empty, see: /home/jenkins/workspace/Lucene-Solr-master-Linux/lucene/build/replicator/test/temp/junit4-J1-20180510_005147_0845407694768779082678.syserr
   [junit4] >>> JVM J1 emitted unexpected output (verbatim) ----
   [junit4] OpenJDK 64-Bit Server VM warning: Option UseConcMarkSweepGC was deprecated in version 9.0 and will likely be removed in a future release.
   [junit4] <<< JVM J1: EOF ----

[...truncated 3 lines...]
   [junit4] JVM J2: stderr was not empty, see: /home/jenkins/workspace/Lucene-Solr-master-Linux/lucene/build/replicator/test/temp/junit4-J2-20180510_005147_084621266624991684627.syserr
   [junit4] >>> JVM J2 emitted unexpected output (verbatim) ----
   [junit4] OpenJDK 64-Bit Server VM warning: Option UseConcMarkSweepGC was deprecated in version 9.0 and will likely be removed in a future release.
   [junit4] <<< JVM J2: EOF ----

[...truncated 3 lines...]
   [junit4] JVM J0: stderr was not empty, see: /home/jenkins/workspace/Lucene-Solr-master-Linux/lucene/build/replicator/test/temp/junit4-J0-20180510_005147_08410620735751494512596.syserr
   [junit4] >>> JVM J0 emitted unexpected output (verbatim) ----
   [junit4] OpenJDK 64-Bit Server VM warning: Option UseConcMarkSweepGC was deprecated in version 9.0 and will likely be removed in a future release.
   [junit4] <<< JVM J0: EOF ----

[...truncated 210 lines...]
   [junit4] JVM J0: stderr was not empty, see: /home/jenkins/workspace/Lucene-Solr-master-Linux/lucene/build/sandbox/test/temp/junit4-J0-20180510_005158_2797524445936274162819.syserr
   [junit4] >>> JVM J0 emitted unexpected output (verbatim) ----
   [junit4] OpenJDK 64-Bit Server VM warning: Option UseConcMarkSweepGC was deprecated in version 9.0 and will likely be removed in a future release.
   [junit4] <<< JVM J0: EOF ----

[...truncated 6 lines...]
   [junit4] JVM J1: stderr was not empty, see: /home/jenkins/workspace/Lucene-Solr-master-Linux/lucene/build/sandbox/test/temp/junit4-J1-20180510_005158_2799524543964731907852.syserr
   [junit4] >>> JVM J1 emitted unexpected output (verbatim) ----
   [junit4] OpenJDK 64-Bit Server VM warning: Option UseConcMarkSweepGC was deprecated in version 9.0 and will likely be removed in a future release.
   [junit4] <<< JVM J1: EOF ----

[...truncated 21 lines...]
   [junit4] JVM J2: stderr was not empty, see: /home/jenkins/workspace/Lucene-Solr-master-Linux/lucene/build/sandbox/test/temp/junit4-J2-20180510_005158_27912962486603332797471.syserr
   [junit4] >>> JVM J2 emitted unexpected output (verbatim) ----
   [junit4] OpenJDK 64-Bit Server VM warning: Option UseConcMarkSweepGC was deprecated in version 9.0 and will likely be removed in a future release.
   [junit4] <<< JVM J2: EOF ----

[...truncated 320 lines...]
   [junit4] JVM J2: stderr was not empty, see: /home/jenkins/workspace/Lucene-Solr-master-Linux/lucene/build/spatial-extras/test/temp/junit4-J2-20180510_005253_25516992684923454122050.syserr
   [junit4] >>> JVM J2 emitted unexpected output (verbatim) ----
   [junit4] OpenJDK 64-Bit Server VM warning: Option UseConcMarkSweepGC was deprecated in version 9.0 and will likely be removed in a future release.
   [junit4] <<< JVM J2: EOF ----

[...truncated 3 lines...]
   [junit4] JVM J0: stderr was not empty, see: /home/jenkins/workspace/Lucene-Solr-master-Linux/lucene/build/spatial-extras/test/temp/junit4-J0-20180510_005253_2514535161286215686871.syserr
   [junit4] >>> JVM J0 emitted unexpected output (verbatim) ----
   [junit4] OpenJDK 64-Bit Server VM warning: Option UseConcMarkSweepGC was deprecated in version 9.0 and will likely be removed in a future release.
   [junit4] <<< JVM J0: EOF ----

[...truncated 3 lines...]
   [junit4] JVM J1: stderr was not empty, see: /home/jenkins/workspace/Lucene-Solr-master-Linux/lucene/build/spatial-extras/test/temp/junit4-J1-20180510_005253_2526806987142411409324.syserr
   [junit4] >>> JVM J1 emitted unexpected output (verbatim) ----
   [junit4] OpenJDK 64-Bit Server VM warning: Option UseConcMarkSweepGC was deprecated in version 9.0 and will likely be removed in a future release.
   [junit4] <<< JVM J1: EOF ----

[...truncated 153 lines...]
   [junit4] JVM J0: stderr was not empty, see: /home/jenkins/workspace/Lucene-Solr-master-Linux/lucene/build/spatial/test/temp/junit4-J0-20180510_005321_6015878456813552195438.syserr
   [junit4] >>> JVM J0 emitted unexpected output (verbatim) ----
   [junit4] OpenJDK 64-Bit Server VM warning: Option UseConcMarkSweepGC was deprecated in version 9.0 and will likely be removed in a future release.
   [junit4] <<< JVM J0: EOF ----

[...truncated 184 lines...]
   [junit4] JVM J2: stderr was not empty, see: /home/jenkins/workspace/Lucene-Solr-master-Linux/lucene/build/spatial3d/test/temp/junit4-J2-20180510_005323_31115486552786806628470.syserr
   [junit4] >>> JVM J2 emitted unexpected output (verbatim) ----
   [junit4] OpenJDK 64-Bit Server VM warning: Option UseConcMarkSweepGC was deprecated in version 9.0 and will likely be removed in a future release.
   [junit4] <<< JVM J2: EOF ----

[...truncated 3 lines...]
   [junit4] JVM J0: stderr was not empty, see: /home/jenkins/workspace/Lucene-Solr-master-Linux/lucene/build/spatial3d/test/temp/junit4-J0-20180510_005323_3115334711213701572994.syserr
   [junit4] >>> JVM J0 emitted unexpected output (verbatim) ----
   [junit4] OpenJDK 64-Bit Server VM warning: Option UseConcMarkSweepGC was deprecated in version 9.0 and will likely be removed in a future release.
   [junit4] <<< JVM J0: EOF ----

[...truncated 5 lines...]
   [junit4] JVM J1: stderr was not empty, see: /home/jenkins/workspace/Lucene-Solr-master-Linux/lucene/build/spatial3d/test/temp/junit4-J1-20180510_005323_3113014715941272211216.syserr
   [junit4] >>> JVM J1 emitted unexpected output (verbatim) ----
   [junit4] OpenJDK 64-Bit Server VM warning: Option UseConcMarkSweepGC was deprecated in version 9.0 and will likely be removed in a future release.
   [junit4] <<< JVM J1: EOF ----

[...truncated 261 lines...]
   [junit4] JVM J2: stderr was not empty, see: /home/jenkins/workspace/Lucene-Solr-master-Linux/lucene/build/suggest/test/temp/junit4-J2-20180510_005447_44812131240140814118114.syserr
   [junit4] >>> JVM J2 emitted unexpected output (verbatim) ----
   [junit4] OpenJDK 64-Bit Server VM warning: Option UseConcMarkSweepGC was deprecated in version 9.0 and will likely be removed in a future release.
   [junit4] <<< JVM J2: EOF ----

[...truncated 6 lines...]
   [junit4] JVM J0: stderr was not empty, see: /home/jenkins/workspace/Lucene-Solr-master-Linux/lucene/build/suggest/test/temp/junit4-J0-20180510_005447_44814723128688951434281.syserr
   [junit4] >>> JVM J0 emitted unexpected output (verbatim) ----
   [junit4] OpenJDK 64-Bit Server VM warning: Option UseConcMarkSweepGC was deprecated in version 9.0 and will likely be removed in a future release.
   [junit4] <<< JVM J0: EOF ----

[...truncated 3 lines...]
   [junit4] JVM J1: stderr was not empty, see: /home/jenkins/workspace/Lucene-Solr-master-Linux/lucene/build/suggest/test/temp/junit4-J1-20180510_005447_4489277103940353930875.syserr
   [junit4] >>> JVM J1 emitted unexpected output (verbatim) ----
   [junit4] OpenJDK 64-Bit Server VM warning: Option UseConcMarkSweepGC was deprecated in version 9.0 and will likely be removed in a future release.
   [junit4] <<< JVM J1: EOF ----

[...truncated 4519 lines...]
   [junit4] Suite: org.apache.solr.update.MaxSizeAutoCommitTest
   [junit4]   2> 1871605 INFO  (SUITE-MaxSizeAutoCommitTest-seed#[2D2E153AF68C619C]-worker) [    ] o.a.s.SolrTestCaseJ4 SecureRandom sanity checks: test.solr.allowed.securerandom=null & java.security.egd=file:/dev/./urandom
   [junit4]   2> Creating dataDir: /home/jenkins/workspace/Lucene-Solr-master-Linux/solr/build/solr-core/test/J0/temp/solr.update.MaxSizeAutoCommitTest_2D2E153AF68C619C-001/init-core-data-001
   [junit4]   2> 1871605 WARN  (SUITE-MaxSizeAutoCommitTest-seed#[2D2E153AF68C619C]-worker) [    ] o.a.s.SolrTestCaseJ4 startTrackingSearchers: numOpens=1 numCloses=1
   [junit4]   2> 1871605 INFO  (SUITE-MaxSizeAutoCommitTest-seed#[2D2E153AF68C619C]-worker) [    ] o.a.s.SolrTestCaseJ4 Using PointFields (NUMERIC_POINTS_SYSPROP=true) w/NUMERIC_DOCVALUES_SYSPROP=false
   [junit4]   2> 1871606 INFO  (SUITE-MaxSizeAutoCommitTest-seed#[2D2E153AF68C619C]-worker) [    ] o.a.s.SolrTestCaseJ4 Randomized ssl (false) and clientAuth (true) via: @org.apache.solr.util.RandomizeSSL(reason="", ssl=0.0/0.0, value=0.0/0.0, clientAuth=0.0/0.0)
   [junit4]   2> 1871608 INFO  (TEST-MaxSizeAutoCommitTest.simpleTest-seed#[2D2E153AF68C619C]) [    ] o.a.s.SolrTestCaseJ4 ###Starting simpleTest
   [junit4]   2> 1871608 INFO  (TEST-MaxSizeAutoCommitTest.simpleTest-seed#[2D2E153AF68C619C]) [    ] o.a.s.SolrTestCaseJ4 ####initCore
   [junit4]   2> 1871609 INFO  (TEST-MaxSizeAutoCommitTest.simpleTest-seed#[2D2E153AF68C619C]) [    ] o.a.s.c.SolrResourceLoader [null] Added 2 libs to classloader, from paths: [/home/jenkins/workspace/Lucene-Solr-master-Linux/solr/core/src/test-files/solr/collection1/lib, /home/jenkins/workspace/Lucene-Solr-master-Linux/solr/core/src/test-files/solr/collection1/lib/classes]
   [junit4]   2> 1871628 INFO  (TEST-MaxSizeAutoCommitTest.simpleTest-seed#[2D2E153AF68C619C]) [    ] o.a.s.c.SolrConfig Using Lucene MatchVersion: 8.0.0
   [junit4]   2> 1871694 INFO  (TEST-MaxSizeAutoCommitTest.simpleTest-seed#[2D2E153AF68C619C]) [    ] o.a.s.s.IndexSchema [null] Schema name=test
   [junit4]   2> 1871856 INFO  (TEST-MaxSizeAutoCommitTest.simpleTest-seed#[2D2E153AF68C619C]) [    ] o.a.s.s.IndexSchema Loaded schema test/1.0 with uniqueid field id
   [junit4]   2> 1871921 INFO  (TEST-MaxSizeAutoCommitTest.simpleTest-seed#[2D2E153AF68C619C]) [    ] o.a.s.m.r.SolrJmxReporter JMX monitoring for 'solr.node' (registry 'solr.node') enabled at server: com.sun.jmx.mbeanserver.JmxMBeanServer@fd2a371
   [junit4]   2> 1871929 INFO  (TEST-MaxSizeAutoCommitTest.simpleTest-seed#[2D2E153AF68C619C]) [    ] o.a.s.m.r.SolrJmxReporter JMX monitoring for 'solr.jvm' (registry 'solr.jvm') enabled at server: com.sun.jmx.mbeanserver.JmxMBeanServer@fd2a371
   [junit4]   2> 1871929 INFO  (TEST-MaxSizeAutoCommitTest.simpleTest-seed#[2D2E153AF68C619C]) [    ] o.a.s.m.r.SolrJmxReporter JMX monitoring for 'solr.jetty' (registry 'solr.jetty') enabled at server: com.sun.jmx.mbeanserver.JmxMBeanServer@fd2a371
   [junit4]   2> 1871931 INFO  (coreLoadExecutor-8410-thread-1) [    ] o.a.s.c.TransientSolrCoreCacheDefault Allocating transient cache for 2147483647 transient cores
   [junit4]   2> 1871932 INFO  (coreLoadExecutor-8410-thread-1) [    x:collection1] o.a.s.c.SolrResourceLoader [null] Added 2 libs to classloader, from paths: [/home/jenkins/workspace/Lucene-Solr-master-Linux/solr/core/src/test-files/solr/collection1/lib, /home/jenkins/workspace/Lucene-Solr-master-Linux/solr/core/src/test-files/solr/collection1/lib/classes]
   [junit4]   2> 1871947 INFO  (coreLoadExecutor-8410-thread-1) [    x:collection1] o.a.s.c.SolrConfig Using Lucene MatchVersion: 8.0.0
   [junit4]   2> 1871957 INFO  (coreLoadExecutor-8410-thread-1) [    x:collection1] o.a.s.s.IndexSchema [collection1] Schema name=test
   [junit4]   2> 1872047 INFO  (coreLoadExecutor-8410-thread-1) [    x:collection1] o.a.s.s.IndexSchema Loaded schema test/1.0 with uniqueid field id
   [junit4]   2> 1872070 INFO  (coreLoadExecutor-8410-thread-1) [    x:collection1] o.a.s.c.CoreContainer Creating SolrCore 'collection1' using configuration from instancedir /home/jenkins/workspace/Lucene-Solr-master-Linux/solr/core/src/test-files/solr/collection1, trusted=true
   [junit4]   2> 1872070 INFO  (coreLoadExecutor-8410-thread-1) [    x:collection1] o.a.s.m.r.SolrJmxReporter JMX monitoring for 'solr.core.collection1' (registry 'solr.core.collection1') enabled at server: com.sun.jmx.mbeanserver.JmxMBeanServer@fd2a371
   [junit4]   2> 1872070 INFO  (coreLoadExecutor-8410-thread-1) [    x:collection1] o.a.s.c.SolrCore solr.RecoveryStrategy.Builder
   [junit4]   2> 1872071 INFO  (coreLoadExecutor-8410-thread-1) [    x:collection1] o.a.s.c.SolrCore [[collection1] ] Opening new SolrCore at [/home/jenkins/workspace/Lucene-Solr-master-Linux/solr/core/src/test-files/solr/collection1], dataDir=[/home/jenkins/workspace/Lucene-Solr-master-Linux/solr/build/solr-core/test/J0/temp/solr.update.MaxSizeAutoCommitTest_2D2E153AF68C619C-001/init-core-data-001/]
   [junit4]   2> 1872072 INFO  (coreLoadExecutor-8410-thread-1) [    x:collection1] o.a.s.u.RandomMergePolicy RandomMergePolicy wrapping class org.apache.lucene.index.LogByteSizeMergePolicy: [LogByteSizeMergePolicy: minMergeSize=1677721, mergeFactor=37, maxMergeSize=2147483648, maxMergeSizeForForcedMerge=9223372036854775807, calibrateSizeByDeletes=false, maxMergeDocs=2147483647, maxCFSSegmentSizeMB=8.796093022207999E12, noCFSRatio=1.0]
   [junit4]   2> 1872092 WARN  (coreLoadExecutor-8410-thread-1) [    x:collection1] o.a.s.c.RequestHandlers INVALID paramSet a in requestHandler {type = requestHandler,name = /dump,class = DumpRequestHandler,attributes = {initParams=a, name=/dump, class=DumpRequestHandler},args = {defaults={a=A,b=B}}}
   [junit4]   2> 1872140 INFO  (coreLoadExecutor-8410-thread-1) [    x:collection1] o.a.s.u.UpdateHandler Using UpdateLog implementation: org.apache.solr.update.UpdateLog
   [junit4]   2> 1872140 INFO  (coreLoadExecutor-8410-thread-1) [    x:collection1] o.a.s.u.UpdateLog Initializing UpdateLog: dataDir= defaultSyncLevel=FLUSH numRecordsToKeep=100 maxNumLogsToKeep=10 numVersionBuckets=65536
   [junit4]   2> 1872141 INFO  (coreLoadExecutor-8410-thread-1) [    x:collection1] o.a.s.u.CommitTracker Hard AutoCommit: disabled
   [junit4]   2> 1872141 INFO  (coreLoadExecutor-8410-thread-1) [    x:collection1] o.a.s.u.CommitTracker Soft AutoCommit: disabled
   [junit4]   2> 1872142 INFO  (coreLoadExecutor-8410-thread-1) [    x:collection1] o.a.s.u.RandomMergePolicy RandomMergePolicy wrapping class org.apache.lucene.index.TieredMergePolicy: [TieredMergePolicy: maxMergeAtOnce=35, maxMergeAtOnceExplicit=29, maxMergedSegmentMB=45.015625, floorSegmentMB=0.2216796875, forceMergeDeletesPctAllowed=19.791866439651834, segmentsPerTier=33.0, maxCFSSegmentSizeMB=8.796093022207999E12, noCFSRatio=1.0
   [junit4]   2> 1872142 INFO  (coreLoadExecutor-8410-thread-1) [    x:collection1] o.a.s.s.SolrIndexSearcher Opening [Searcher@1fa29040[collection1] main]
   [junit4]   2> 1872143 WARN  (coreLoadExecutor-8410-thread-1) [    x:collection1] o.a.s.r.ManagedResourceStorage Cannot write to config directory /home/jenkins/workspace/Lucene-Solr-master-Linux/solr/core/src/test-files/solr/collection1/conf; switching to use InMemory storage instead.
   [junit4]   2> 1872143 INFO  (coreLoadExecutor-8410-thread-1) [    x:collection1] o.a.s.h.ReplicationHandler Commits will be reserved for 10000ms.
   [junit4]   2> 1872143 INFO  (coreLoadExecutor-8410-thread-1) [    x:collection1] o.a.s.u.UpdateLog Could not find max version in index or recent updates, using new clock 1600038514450235392
   [junit4]   2> 1872146 INFO  (TEST-MaxSizeAutoCommitTest.simpleTest-seed#[2D2E153AF68C619C]) [    ] o.a.s.SolrTestCaseJ4 ####initCore end
   [junit4]   2> 1872148 INFO  (TEST-MaxSizeAutoCommitTest.simpleTest-seed#[2D2E153AF68C619C]) [    ] o.a.s.u.p.LogUpdateProcessorFactory [collection1] {add=[0 (1600038514454429696), 1 (1600038514455478272), 2 (1600038514455478273)]} 0 2
   [junit4]   2> 1872149 INFO  (searcherExecutor-8411-thread-1-processing-x:collection1) [    x:collection1] o.a.s.c.SolrCore [collection1] Registered new searcher Searcher@1fa29040[collection1] main{ExitableDirectoryReader(UninvertingDirectoryReader())}
   [junit4]   2> 1872350 INFO  (TEST-MaxSizeAutoCommitTest.simpleTest-seed#[2D2E153AF68C619C]) [    ] o.a.s.u.p.LogUpdateProcessorFactory [collection1] {add=[3 (1600038514667290624), 4 (1600038514667290625), 5 (1600038514667290626)]} 0 0
   [junit4]   2> 1872552 INFO  (TEST-MaxSizeAutoCommitTest.simpleTest-seed#[2D2E153AF68C619C]) [    ] o.a.s.u.p.LogUpdateProcessorFactory [collection1] {add=[6 (1600038514878054400), 7 (1600038514878054401), 8 (1600038514878054402)]} 0 0
   [junit4]   2> 1872753 INFO  (TEST-MaxSizeAutoCommitTest.simpleTest-seed#[2D2E153AF68C619C]) [    ] o.a.s.u.p.LogUpdateProcessorFactory [collection1] {add=[9 (1600038515089866752), 10 (1600038515089866753), 11 (1600038515089866754)]} 0 0
   [junit4]   2> 1872957 INFO  (TEST-MaxSizeAutoCommitTest.simpleTest-seed#[2D2E153AF68C619C]) [    ] o.a.s.u.p.LogUpdateProcessorFactory [collection1] {add=[12 (1600038515303776256), 13 (1600038515303776257), 14 (1600038515303776258)]} 0 0
   [junit4]   2> 1873158 INFO  (TEST-MaxSizeAutoCommitTest.simpleTest-seed#[2D2E153AF68C619C]) [    ] o.a.s.u.p.LogUpdateProcessorFactory [collection1] {add=[15 (1600038515514540032), 16 (1600038515514540033), 17 (1600038515514540034)]} 0 0
   [junit4]   2> 1873363 INFO  (TEST-MaxSizeAutoCommitTest.simpleTest-seed#[2D2E153AF68C619C]) [    ] o.a.s.u.p.LogUpdateProcessorFactory [collection1] {add=[18 (1600038515729498112), 19 (1600038515729498113), 20 (1600038515729498114)]} 0 0
   [junit4]   2> 1873564 INFO  (TEST-MaxSizeAutoCommitTest.simpleTest-seed#[2D2E153AF68C619C]) [    ] o.a.s.u.p.LogUpdateProcessorFactory [collection1] {add=[21 (1600038515940261888), 22 (1600038515940261889), 23 (1600038515940261890)]} 0 0
   [junit4]   2> 1873765 INFO  (TEST-MaxSizeAutoCommitTest.simpleTest-seed#[2D2E153AF68C619C]) [    ] o.a.s.u.p.LogUpdateProcessorFactory [collection1] {add=[24 (1600038516151025664), 25 (1600038516151025665), 26 (1600038516151025666)]} 0 0
   [junit4]   2> 1873766 INFO  (commitScheduler-8414-thread-1) [    ] o.a.s.u.DirectUpdateHandler2 start commit{,optimize=false,openSearcher=false,waitSearcher=true,expungeDeletes=false,softCommit=false,prepareCommit=false}
   [junit4]   2> 1873766 INFO  (commitScheduler-8414-thread-1) [    ] o.a.s.u.SolrIndexWriter Calling setCommitData with IW:org.apache.solr.update.SolrIndexWriter@1a500517 commitCommandVersion:0
   [junit4]   2> 1873769 INFO  (commitScheduler-8414-thread-1) [    ] o.a.s.s.SolrIndexSearcher Opening [Searcher@7bd69824[collection1] realtime]
   [junit4]   2> 1873769 INFO  (commitScheduler-8414-thread-1) [    ] o.a.s.u.DirectUpdateHandler2 end_commit_flush
   [junit4]   2> 1873816 INFO  (TEST-MaxSizeAutoCommitTest.simpleTest-seed#[2D2E153AF68C619C]) [    ] o.a.s.u.p.LogUpdateProcessorFactory [collection1] {add=[27 (1600038516204503040), 28 (1600038516204503041), 29 (1600038516204503042)]} 0 0
   [junit4]   2> 1874017 INFO  (TEST-MaxSizeAutoCommitTest.simpleTest-seed#[2D2E153AF68C619C]) [    ] o.a.s.SolrTestCaseJ4 ###Ending simpleTest
   [junit4]   2> 1874017 INFO  (TEST-MaxSizeAutoCommitTest.simpleTest-seed#[2D2E153AF68C619C]) [    ] o.a.s.SolrTestCaseJ4 ###deleteCore
   [junit4]   2> 1874017 INFO  (TEST-MaxSizeAutoCommitTest.simpleTest-seed#[2D2E153AF68C619C]) [    ] o.a.s.c.CoreContainer Shutting down CoreContainer instance=569831187
   [junit4]   2> 1874017 INFO  (TEST-MaxSizeAutoCommitTest.simpleTest-seed#[2D2E153AF68C619C]) [    ] o.a.s.m.SolrMetricManager Closing metric reporters for registry=solr.node, tag=null
   [junit4]   2> 1874017 INFO  (TEST-MaxSizeAutoCommitTest.simpleTest-seed#[2D2E153AF68C619C]) [    ] o.a.s.m.r.SolrJmxReporter Closing reporter [org.apache.solr.metrics.reporters.SolrJmxReporter@758806b8: rootName = null, domain = solr.node, service url = null, agent id = null] for registry solr.node / com.codahale.metrics.MetricRegistry@5e51bfc9
   [junit4]   2> 1874022 INFO  (TEST-MaxSizeAutoCommitTest.simpleTest-seed#[2D2E153AF68C619C]) [    ] o.a.s.m.SolrMetricManager Closing metric reporters for registry=solr.jvm, tag=null
   [junit4]   2> 1874022 INFO  (TEST-MaxSizeAutoCommitTest.simpleTest-seed#[2D2E153AF68C619C]) [    ] o.a.s.m.r.SolrJmxReporter Closing reporter [org.apache.solr.metrics.reporters.SolrJmxReporter@273120b5: rootName = null, domain = solr.jvm, service url = null, agent id = null] for registry solr.jvm / com.codahale.metrics.MetricRegistry@2918e718
   [junit4]   2> 1874025 INFO  (TEST-MaxSizeAutoCommitTest.simpleTest-seed#[2D2E153AF68C619C]) [    ] o.a.s.m.SolrMetricManager Closing metric reporters for registry=solr.jetty, tag=null
   [junit4]   2> 1874026 INFO  (TEST-MaxSizeAutoCommitTest.simpleTest-seed#[2D2E153AF68C619C]) [    ] o.a.s.m.r.SolrJmxReporter Closing reporter [org.apache.solr.metrics.reporters.SolrJmxReporter@1689dc1e: rootName = null, domain = solr.jetty, service url = null, agent id = null] for registry solr.jetty / com.codahale.metrics.MetricRegistry@404e86b4
   [junit4]   2> 1874026 INFO  (coreCloseExecutor-8416-thread-1) [    x:collection1] o.a.s.c.SolrCore [collection1]  CLOSING SolrCore org.apache.solr.core.SolrCore@5bbb894c
   [junit4]   2> 1874026 INFO  (coreCloseExecutor-8416-thread-1) [    x:collection1] o.a.s.m.SolrMetricManager Closing metric reporters for registry=solr.core.collection1, tag=5bbb894c
   [junit4]   2> 1874026 INFO  (coreCloseExecutor-8416-thread-1) [    x:collection1] o.a.s.m.r.SolrJmxReporter Closing reporter [org.apache.solr.metrics.reporters.SolrJmxReporter@6ca234b0: rootName = null, domain = solr.core.collection1, service url = null, agent id = null] for registry solr.core.collection1 / com.codahale.metrics.MetricRegistry@67b0fb88
   [junit4]   2> 1874032 INFO  (coreCloseExecutor-8416-thread-1) [    x:collection1] o.a.s.u.DirectUpdateHandler2 Committing on IndexWriter close.
   [junit4]   2> 1874032 INFO  (coreCloseExecutor-8416-thread-1) [    x:collection1] o.a.s.u.SolrIndexWriter Calling setCommitData with IW:org.apache.solr.update.SolrIndexWriter@1a500517 commitCommandVersion:0
   [junit4]   2> 1874035 INFO  (TEST-MaxSizeAutoCommitTest.testRedundantDeletes-seed#[2D2E153AF68C619C]) [    ] o.a.s.SolrTestCaseJ4 ###Starting testRedundantDeletes
   [junit4]   2> 1874035 INFO  (TEST-MaxSizeAutoCommitTest.testRedundantDeletes-seed#[2D2E153AF68C619C]) [    ] o.a.s.SolrTestCaseJ4 ####initCore
   [junit4]   2> 1874035 INFO  (TEST-MaxSizeAutoCommitTest.testRedundantDeletes-seed#[2D2E153AF68C619C]) [    ] o.a.s.c.SolrResourceLoader [null] Added 2 libs to classloader, from paths: [/home/jenkins/workspace/Lucene-Solr-master-Linux/solr/core/src/test-files/solr/collection1/lib, /home/jenkins/workspace/Lucene-Solr-master-Linux/solr/core/src/test-files/solr/collection1/lib/classes]
   [junit4]   2> 1874045 INFO  (TEST-MaxSizeAutoCommitTest.testRedundantDeletes-seed#[2D2E153AF68C619C]) [    ] o.a.s.c.SolrConfig Using Lucene MatchVersion: 8.0.0
   [junit4]   2> 1874052 INFO  (TEST-MaxSizeAutoCommitTest.testRedundantDeletes-seed#[2D2E153AF68C619C]) [    ] o.a.s.s.IndexSchema [null] Schema name=test
   [junit4]   2> 1874119 INFO  (TEST-MaxSizeAutoCommitTest.testRedundantDeletes-seed#[2D2E153AF68C619C]) [    ] o.a.s.s.IndexSchema Loaded schema test/1.0 with uniqueid field id
   [junit4]   2> 1874152 INFO  (TEST-MaxSizeAutoCommitTest.testRedundantDeletes-seed#[2D2E153AF68C619C]) [    ] o.a.s.m.r.SolrJmxReporter JMX monitoring for 'solr.node' (registry 'solr.node') enabled at server: com.sun.jmx.mbeanserver.JmxMBeanServer@fd2a371
   [junit4]   2> 1874157 INFO  (TEST-MaxSizeAutoCommitTest.testRedundantDeletes-seed#[2D2E153AF68C619C]) [    ] o.a.s.m.r.SolrJmxReporter JMX monitoring for 'solr.jvm' (registry 'solr.jvm') enabled at server: com.sun.jmx.mbeanserver.JmxMBeanServer@fd2a371
   [junit4]   2> 1874157 INFO  (TEST-MaxSizeAutoCommitTest.testRedundantDeletes-seed#[2D2E153AF68C619C]) [    ] o.a.s.m.r.SolrJmxReporter JMX monitoring for 'solr.jetty' (registry 'solr.jetty') enabled at server: com.sun.jmx.mbeanserver.JmxMBeanServer@fd2a371
   [junit4]   2> 1874158 INFO  (coreLoadExecutor-8423-thread-1) [    ] o.a.s.c.TransientSolrCoreCacheDefault Allocating transient cache for 2147483647 transient cores
   [junit4]   2> 1874158 INFO  (coreLoadExecutor-8423-thread-1) [    x:collection1] o.a.s.c.SolrResourceLoader [null] Added 2 libs to classloader, from paths: [/home/jenkins/workspace/Lucene-Solr-master-Linux/solr/core/src/test-files/solr/collection1/lib, /home/jenkins/workspace/Lucene-Solr-master-Linux/solr/core/src/test-files/solr/collection1/lib/classes]
   [junit4]   2> 1874176 INFO  (coreLoadExecutor-8423-thread-1) [    x:collection1] o.a.s.c.SolrConfig Using Lucene MatchVersion: 8.0.0
   [junit4]   2> 1874182 INFO  (coreLoadExecutor-8423-thread-1) [    x:collection1] o.a.s.s.IndexSchema [collection1] Schema name=test
   [junit4]   2> 1874236 INFO  (coreLoadExecutor-8423-thread-1) [    x:collection1] o.a.s.s.IndexSchema Loaded schema test/1.0 with uniqueid field id
   [junit4]   2> 1874241 INFO  (coreLoadExecutor-8423-thread-1) [    x:collection1] o.a.s.c.CoreContainer Creating SolrCore 'collection1' using configuration from instancedir /home/jenkins/workspace/Lucene-Solr-master-Linux/solr/core/src/test-files/solr/collection1, trusted=true
   [junit4]   2> 1874241 INFO  (coreLoadExecutor-8423-thread-1) [    x:collection1] o.a.s.m.r.SolrJmxReporter JMX monitoring for 'solr.core.collection1' (registry 'solr.core.collection1') enabled at server: com.sun.jmx.mbeanserver.JmxMBeanServer@fd2a371
   [junit4]   2> 1874241 INFO  (coreLoadExecutor-8423-thread-1) [    x:collection1] o.a.s.c.SolrCore solr.RecoveryStrategy.Builder
   [junit4]   2> 1874241 INFO  (coreLoadExecutor-8423-thread-1) [    x:collection1] o.a.s.c.SolrCore [[collection1] ] Opening new SolrCore at [/home/jenkins/workspace/Lucene-Solr-master-Linux/solr/core/src/test-files/solr/collection1], dataDir=[/home/jenkins/workspace/Lucene-Solr-master-Linux/solr/build/solr-core/test/J0/temp/solr.update.MaxSizeAutoCommitTest_2D2E153AF68C619C-001/init-core-data-001/]
   [junit4]   2> 1874243 INFO  (coreLoadExecutor-8423-thread-1) [    x:collection1] o.a.s.u.RandomMergePolicy RandomMergePolicy wrapping class org.apache.lucene.index.LogByteSizeMergePolicy: [LogByteSizeMergePolicy: minMergeSize=1677721, mergeFactor=37, maxMergeSize=2147483648, maxMergeSizeForForcedMerge=9223372036854775807, calibrateSizeByDeletes=false, maxMergeDocs=2147483647, maxCFSSegmentSizeMB=8.796093022207999E12, noCFSRatio=1.0]
   [junit4]   2> 1874244 WARN  (coreLoadExecutor-8423-thread-1) [    x:collection1] o.a.s.c.RequestHandlers INVALID paramSet a in requestHandler {type = requestHandler,name = /dump,class = DumpRequestHandler,attributes = {initParams=a, name=/dump, class=DumpRequestHandler},args = {defaults={a=A,b=B}}}
   [junit4]   2> 1874276 INFO  (coreLoadExecutor-8423-thread-1) [    x:collection1] o.a.s.u.UpdateHandler Using UpdateLog implementation: org.apache.solr.update.UpdateLog
   [junit4]   2> 1874276 INFO  (coreLoadExecutor-8423-thread-1) [    x:collection1] o.a.s.u.UpdateLog Initializing UpdateLog: dataDir= defaultSyncLevel=FLUSH numRecordsToKeep=100 maxNumLogsToKeep=10 numVersionBuckets=65536
   [junit4]   2> 1874276 INFO  (coreLoadExecutor-8423-thread-1) [    x:collection1] o.a.s.u.CommitTracker Hard AutoCommit: disabled
   [junit4]   2> 1874276 INFO  (coreLoadExecutor-8423-thread-1) [    x:collection1] o.a.s.u.CommitTracker Soft AutoCommit: disabled
   [junit4]   2> 1874277 INFO  (coreLoadExecutor-8423-thread-1) [    x:collection1] o.a.s.u.RandomMergePolicy RandomMergePolicy wrapping class org.apache.lucene.index.TieredMergePolicy: [TieredMergePolicy: maxMergeAtOnce=35, maxMergeAtOnceExplicit=29, maxMergedSegmentMB=45.015625, floorSegmentMB=0.2216796875, forceMergeDeletesPctAllowed=19.791866439651834, segmentsPerTier=33.0, maxCFSSegmentSizeMB=8.796093022207999E12, noCFSRatio=1.0
   [junit4]   2> 1874277 INFO  (coreLoadExecutor-8423-thread-1) [    x:collection1] o.a.s.s.SolrIndexSearcher Opening [Searcher@252e595c[collection1] main]
   [junit4]   2> 1874277 WARN  (coreLoadExecutor-8423-thread-1) [    x:collection1] o.a.s.r.ManagedResourceStorage Cannot write to config directory /home/jenkins/workspace/Lucene-Solr-master-Linux/solr/core/src/test-files/solr/collection1/conf; switching to use InMemory storage instead.
   [junit4]   2> 1874277 INFO  (coreLoadExecutor-8423-thread-1) [    x:collection1] o.a.s.h.ReplicationHandler Commits will be reserved for 10000ms.
   [junit4]   2> 1874277 INFO  (searcherExecutor-8424-thread-1-processing-x:collection1) [    x:collection1] o.a.s.c.SolrCore [collection1] Registered new searcher Searcher@252e595c[collection1] main{ExitableDirectoryReader(UninvertingDirectoryReader())}
   [junit4]   2> 1874278 INFO  (coreLoadExecutor-8423-thread-1) [    x:collection1] o.a.s.u.UpdateLog Could not find max version in index or recent updates, using new clock 1600038516688945152
   [junit4]   2> 1874279 INFO  (TEST-MaxSizeAutoCommitTest.testRedundantDeletes-seed#[2D2E153AF68C619C]) [    ] o.a.s.SolrTestCaseJ4 ####initCore end
   [junit4]   2> 1874283 INFO  (commitScheduler-8427-thread-1) [    ] o.a.s.u.DirectUpdateHandler2 start commit{,optimize=false,openSearcher=false,waitSearcher=true,expungeDeletes=false,softCommit=false,prepareCommit=false}
   [junit4]   2> 1874283 INFO  (commitScheduler-8427-thread-1) [    ] o.a.s.u.SolrIndexWriter Calling setCommitData with IW:org.apache.solr.update.SolrIndexWriter@1088ee28 commitCommandVersion:0
   [junit4]   2> 1874288 INFO  (commitScheduler-8427-thread-1) [    ] o.a.s.s.SolrIndexSearcher Opening [Searcher@195e382c[collection1] realtime]
   [junit4]   2> 1874288 INFO  (commitScheduler-8427-thread-1) [    ] o.a.s.u.DirectUpdateHandler2 end_commit_flush
   [junit4]   2> 1874288 INFO  (commitScheduler-8427-thread-1) [    ] o.a.s.u.DirectUpdateHandler2 start commit{,optimize=false,openSearcher=false,waitSearcher=true,expungeDeletes=false,softCommit=false,prepareCommit=false}
   [junit4]   2> 1874288 INFO  (commitScheduler-8427-thread-1) [    ] o.a.s.u.SolrIndexWriter Calling setCommitData with IW:org.apache.solr.update.SolrIndexWriter@1088ee28 commitCommandVersion:0
   [junit4]   2> 1874291 INFO  (TEST-MaxSizeAutoCommitTest.testRedundantDeletes-seed#[2D2E153AF68C619C]) [    ] o.a.s.u.p.LogUpdateProcessorFactory [collection1] {add=[0 (1600038516691042304), 1 (1600038516692090880), 2 (1600038516692090881), 3 (1600038516692090882), 4 (1600038516692090883), 5 (1600038516692090884), 6 (1600038516692090885), 7 (1600038516692090886), 8 (1600038516692090887), 9 (1600038516692090888), ... (150 adds)]} 0 11
   [junit4]   2> 1874292 INFO  (commitScheduler-8427-thread-1) [    ] o.a.s.s.SolrIndexSearcher Opening [Searcher@b7a8275[collection1] realtime]
   [junit4]   2> 1874292 INFO  (commitScheduler-8427-thread-1) [    ] o.a.s.u.DirectUpdateHandler2 end_commit_flush
   [junit4]   2> 1874692 INFO  (TEST-MaxSizeAutoCommitTest.testRedundantDeletes-seed#[2D2E153AF68C619C]) [    ] o.a.s.u.p.LogUpdateProcessorFactory [collection1] {delete=[100 (-1600038517123055616)]} 0 200
   [junit4]   2> 1874692 INFO  (TEST-MaxSizeAutoCommitTest.testRedundantDeletes-seed#[2D2E153AF68C619C]) [    ] o.a.s.u.p.LogUpdateProcessorFactory [collection1] {delete=[100 (-1600038517123055617)]} 0 200
   [junit4]   2> 1874693 INFO  (TEST-MaxSizeAutoCommitTest.testRedundantDeletes-seed#[2D2E153AF68C619C]) [    ] o.a.s.u.p.LogUpdateProcessorFactory [collection1] {delete=[100 (-1600038517124104192)]} 0 200
   [junit4]   2> 1874693 INFO  (TEST-MaxSizeAutoCommitTest.testRedundantDeletes-seed#[2D2E153AF68C619C]) [    ] o.a.s.u.p.LogUpdateProcessorFactory [collection1] {delete=[100 (-1600038517124104193)]} 0 200
   [junit4]   2> 1874693 INFO  (TEST-MaxSizeAutoCommitTest.testRedundantDeletes-seed#[2D2E153AF68C619C]) [    ] o.a.s.u.p.LogUpdateProcessorFactory [collection1] {delete=[100 (-1600038517124104194)]} 0 201
   [junit4]   2> 1874693 INFO  (TEST-MaxSizeAutoCommitTest.testRedundantDeletes-seed#[2D2E153AF68C619C]) [    ] o.a.s.u.p.LogUpdateProcessorFactory [collection1] {delete=[100 (-1600038517124104195)]} 0 201
   [junit4]   2> 1874693 INFO  (TEST-MaxSizeAutoCommitTest.testRedundantDeletes-seed#[2D2E153AF68C619C]) [    ] o.a.s.u.p.LogUpdateProcessorFactory [collection1] {delete=[100 (-1600038517124104196)]} 0 201
   [junit4]   2> 1874693 INFO  (TEST-MaxSizeAutoCommitTest.testRedundantDeletes-seed#[2D2E153AF68C619C]) [    ] o.a.s.u.p.LogUpdateProcessorFactory [collection1] {delete=[100 (-1600038517124104197)]} 0 201
   [junit4]   2> 1874693 INFO  (TEST-MaxSizeAutoCommitTest.testRedundantDeletes-seed#[2D2E153AF68C619C]) [    ] o.a.s.u.p.LogUpdateProcessorFactory [collection1] {delete=[100 (-1600038517124104198)]} 0 201
   [junit4]   2> 1874693 INFO  (TEST-MaxSizeAutoCommitTest.testRedundantDeletes-seed#[2D2E153AF68C619C]) [    ] o.a.s.u.p.LogUpdateProcessorFactory [collection1] {delete=[100 (-1600038517124104199)]} 0 201
   [junit4]   2> 1874693 INFO  (TEST-MaxSizeAutoCommitTest.testRedundantDeletes-seed#[2D2E153AF68C619C]) [    ] o.a.s.u.p.LogUpdateProcessorFactory [collection1] {delete=[100 (-1600038517124104200)]} 0 201
   [junit4]   2> 1874693 INFO  (TEST-MaxSizeAutoCommitTest.testRedundantDeletes-seed#[2D2E153AF68C619C]) [    ] o.a.s.u.p.LogUpdateProcessorFactory [collection1] {delete=[100 (-1600038517124104201)]} 0 201
   [junit4]   2> 1874693 INFO  (TEST-MaxSizeAutoCommitTest.testRedundantDeletes-seed#[2D2E153AF68C619C]) [    ] o.a.s.u.p.LogUpdateProcessorFactory [collection1] {delete=[100 (-1600038517124104202)]} 0 201
   [junit4]   2> 1874693 INFO  (TEST-MaxSizeAutoCommitTest.testRedundantDeletes-seed#[2D2E153AF68C619C]) [    ] o.a.s.u.p.LogUpdateProcessorFactory [collection1] {delete=[100 (-1600038517124104203)]} 0 201
   [junit4]   2> 1874693 INFO  (TEST-MaxSizeAutoCommitTest.testRedundantDeletes-seed#[2D2E153AF68C619C]) [    ] o.a.s.u.p.LogUpdateProcessorFactory [collection1] {delete=[100 (-1600038517124104204)]} 0 201
   [junit4]   2> 1874693 INFO  (TEST-MaxSizeAutoCommitTest.testRedundantDeletes-seed#[2D2E153AF68C619C]) [    ] o.a.s.u.p.LogUpdateProcessorFactory [collection1] {delete=[100 (-1600038517124104205)]} 0 201
   [junit4]   2> 1874693 INFO  (TEST-MaxSizeAutoCommitTest.testRedundantDeletes-seed#[2D2E153AF68C619C]) [    ] o.a.s.u.p.LogUpdateProcessorFactory [collection1] {delete=[100 (-1600038517124104206)]} 0 201
   [junit4]   2> 1874693 INFO  (TEST-MaxSizeAutoCommitTest.testRedundantDeletes-seed#[2D2E153AF68C619C]) [    ] o.a.s.u.p.LogUpdateProcessorFactory [collection1] {delete=[100 (-1600038517124104207)]} 0 201
   [junit4]   2> 1874693 INFO  (TEST-MaxSizeAutoCommitTest.testRedundantDeletes-seed#[2D2E153AF68C619C]) [    ] o.a.s.u.p.LogUpdateProcessorFactory [collection1] {delete=[100 (-1600038517124104208)]} 0 201
   [junit4]   2> 1874693 INFO  (TEST-MaxSizeAutoCommitTest.testRedundantDeletes-seed#[2D2E153AF68C619C]) [    ] o.a.s.u.p.LogUpdateProcessorFactory [collection1] {delete=[100 (-1600038517124104209)]} 0 201
   [junit4]   2> 1874693 INFO  (TEST-MaxSizeAutoCommitTest.testRedundantDeletes-seed#[2D2E153AF68C619C]) [    ] o.a.s.u.p.LogUpdateProcessorFactory [collection1] {delete=[100 (-1600038517124104210)]} 0 201
   [junit4]   2> 1874693 INFO  (TEST-MaxSizeAutoCommitTest.testRedundantDeletes-seed#[2D2E153AF68C619C]) [    ] o.a.s.u.p.LogUpdateProcessorFactory [collection1] {delete=[100 (-1600038517124104211)]} 0 201
   [junit4]   2> 1874693 INFO  (TEST-MaxSizeAutoCommitTest.testRedundantDeletes-seed#[2D2E153AF68C619C]) [    ] o.a.s.u.p.LogUpdateProcessorFactory [collection1] {delete=[100 (-1600038517124104212)]} 0 201
   [junit4]   2> 1874693 INFO  (TEST-MaxSizeAutoCommitTest.testRedundantDeletes-seed#[2D2E153AF68C619C]) [    ] o.a.s.u.p.LogUpdateProcessorFactory [collection1] {delete=[100 (-1600038517124104213)]} 0 201
   [junit4]   2> 1874693 INFO  (TEST-MaxSizeAutoCommitTest.testRedundantDeletes-seed#[2D2E153AF68C619C]) [    ] o.a.s.u.p.LogUpdateProcessorFactory [collection1] {delete=[100 (-1600038517124104214)]} 0 201
   [junit4]   2> 1874693 INFO  (TEST-MaxSizeAutoCommitTest.testRedundantDeletes-seed#[2D2E153AF68C619C]) [    ] o.a.s.u.p.LogUpdateProcessorFactory [collection1] {delete=[100 (-1600038517124104215)]} 0 201
   [junit4]   2> 1874693 INFO  (TEST-MaxSizeAutoCommitTest.testRedundantDeletes-seed#[2D2E153AF68C619C]) [    ] o.a.s.u.p.LogUpdateProcessorFactory [collection1] {delete=[100 (-1600038517124104216)]} 0 201
   [junit4]   2> 1874694 INFO  (TEST-MaxSizeAutoCommitTest.testRedundantDeletes-seed#[2D2E153AF68C619C]) [    ] o.a.s.u.p.LogUpdateProcessorFactory [collection1] {delete=[100 (-1600038517125152768)]} 0 201
   [junit4]   2> 1874694 INFO  (TEST-MaxSizeAutoCommitTest.testRedundantDeletes-seed#[2D2E153AF68C619C]) [    ] o.a.s.u.p.LogUpdateProcessorFactory [collection1] {delete=[100 (-1600038517125152769)]} 0 201
   [junit4]   2> 1874694 INFO  (TEST-MaxSizeAutoCommitTest.testRedundantDeletes-seed#[2D2E153AF68C619C]) [    ] o.a.s.u.p.LogUpdateProcessorFactory [collection1] {delete=[100 (-1600038517125152770)]} 0 201
   [junit4]   2> 1874694 INFO  (TEST-MaxSizeAutoCommitTest.testRedundantDeletes-seed#[2D2E153AF68C619C]) [    ] o.a.s.u.p.LogUpdateProcessorFactory [collection1] {delete=[100 (-1600038517125152771)]} 0 202
   [junit4]   2> 1874694 INFO  (TEST-MaxSizeAutoCommitTest.testRedundantDeletes-seed#[2D2E153AF68C619C]) [    ] o.a.s.u.p.LogUpdateProcessorFactory [collection1] {delete=[100 (-1600038517125152772)]} 0 202
   [junit4]   2> 1874694 INFO  (TEST-MaxSizeAutoCommitTest.testRedundantDeletes-seed#[2D2E153AF68C619C]) [    ] o.a.s.u.p.LogUpdateProcessorFactory [collection1] {delete=[100 (-1600038517125152773)]} 0 202
   [junit4]   2> 1874694 INFO  (TEST-MaxSizeAutoCommitTest.testRedundantDeletes-seed#[2D2E153AF68C619C]) [    ] o.a.s.u.p.LogUpdateProcessorFactory [collection1] {delete=[100 (-1600038517125152774)]} 0 202
   [junit4]   2> 1874694 INFO  (TEST-MaxSizeAutoCommitTest.testRedundantDeletes-seed#[2D2E153AF68C619C]) [    ] o.a.s.u.p.LogUpdateProcessorFactory [collection1] {delete=[100 (-1600038517125152775)]} 0 202
   [junit4]   2> 1874694 INFO  (TEST-MaxSizeAutoCommitTest.testRedundantDeletes-seed#[2D2E153AF68C619C]) [    ] o.a.s.u.p.LogUpdateProcessorFactory [collection1] {delete=[100 (-1600038517125152776)]} 0 202
   [junit4]   2> 1874694 INFO  (TEST-MaxSizeAutoCommitTest.testRedundantDeletes-seed#[2D2E153AF68C619C]) [    ] o.a.s.u.p.LogUpdateProcessorFactory [collection1] {delete=[100 (-1600038517125152777)]} 0 202
   [junit4]   2> 1874694 INFO  (TEST-MaxSizeAutoCommitTest.testRedundantDeletes-seed#[2D2E153AF68C619C]) [    ] o.a.s.u.p.LogUpdateProcessorFactory [collection1] {delete=[100 (-1600038517125152778)]} 0 202
   [junit4]   2> 1874694 INFO  (TEST-MaxSizeAutoCommitTest.testRedundantDeletes-seed#[2D2E153AF68C619C]) [    ] o.a.s.u.p.LogUpdateProcessorFactory [collection1] {delete=[100 (-1600038517125152779)]} 0 202
   [junit4]   2> 1874694 INFO  (TEST-MaxSizeAutoCommitTest.testRedundantDeletes-seed#[2D2E153AF68C619C]) [    ] o.a.s.u.p.LogUpdateProcessorFactory [collection1] {delete=[100 (-1600038517125152780)]} 0 202
   [junit4]   2> 1874694 INFO  (TEST-MaxSizeAutoCommitTest.testRedundantDeletes-seed#[2D2E153AF68C619C]) [    ] o.a.s.u.p.LogUpdateProcessorFactory [collection1] {delete=[100 (-1600038517125152781)]} 0 202
   [junit4]   2> 1874694 INFO  (TEST-MaxSizeAutoCommitTest.testRedundantDeletes-seed#[2D2E153AF68C619C]) [    ] o.a.s.u.p.LogUpdateProcessorFactory [collection1] {delete=[100 (-1600038517125152782)]} 0 202
   [junit4]   2> 1874694 INFO  (TEST-MaxSizeAutoCommitTest.testRedundantDeletes-seed#[2D2E153AF68C619C]) [    ] o.a.s.u.p.LogUpdateProcessorFactory [collection1] {delete=[100 (-1600038517125152783)]} 0 202
   [junit4]   2> 1874694 INFO  (TEST-MaxSizeAutoCommitTest.testRedundantDeletes-seed#[2D2E153AF68C619C]) [    ] o.a.s.u.p.LogUpdateProcessorFactory [collection1] {delete=[100 (-1600038517125152784)]} 0 202
   [junit4]   2> 1874694 INFO  (TEST-MaxSizeAutoCommitTest.testRedundantDeletes-seed#[2D2E153AF68C619C]) [    ] o.a.s.u.p.LogUpdateProcessorFactory [collection1] {delete=[100 (-1600038517125152785)]} 0 202
   [junit4]   2> 1874694 INFO  (TEST-MaxSizeAutoCommitTest.testRedundantDeletes-seed#[2D2E153AF68C619C]) [    ] o.a.s.u.p.LogUpdateProcessorFactory [collection1] {delete=[100 (-1600038517125152786)]} 0 202
   [junit4]   2> 1874695 INFO  (TEST-MaxSizeAutoCommitTest.testRedundantDeletes-seed#[2D2E153AF68C619C]) [    ] o.a.s.u.p.LogUpdateProcessorFactory [collection1] {delete=[100 (-1600038517126201344)]} 0 202
   [junit4]   2> 1874695 INFO  (TEST-MaxSizeAutoCommitTest.testRedundantDeletes-seed#[2D2E153AF68C619C]) [    ] o.a.s.u.p.LogUpdateProcessorFactory [collection1] {delete=[100 (-1600038517126201345)]} 0 202
   [junit4]   2> 1874695 INFO  (TEST-MaxSizeAutoCommitTest.testRedundantDeletes-seed#[2D2E153AF68C619C]) [    ] o.a.s.u.p.LogUpdateProcessorFactory [collection1] {delete=[100 (-1600038517126201346)]} 0 202
   [junit4]   2> 1874695 INFO  (TEST-MaxSizeAutoCommitTest.testRedundantDeletes-seed#[2D2E153AF68C619C]) [    ] o.a.s.u.p.LogUpdateProcessorFactory [collection1] {delete=[100 (-1600038517126201347)]} 0 202
   [junit4]   2> 1874696 INFO  (commitScheduler-8427-thread-1) [    ] o.a.s.u.DirectUpdateHandler2 start commit{,optimize=false,openSearcher=false,waitSearcher=true,expungeDeletes=false,softCommit=false,prepareCommit=false}
   [junit4]   2> 1874696 INFO  (commitScheduler-8427-thread-1) [    ] o.a.s.u.SolrIndexWriter Calling setCommitData with IW:org.apache.solr.update.SolrIndexWriter@1088ee28 commitCommandVersion:0
   [junit4]   2> 1874697 INFO  (commitScheduler-8427-thread-1) [    ] o.a.s.s.SolrIndexSearcher Opening [Searcher@21cbbc1d[collection1] realtime]
   [junit4]   2> 1874698 INFO  (commitScheduler-8427-thread-1) [    ] o.a.s.u.DirectUpdateHandler2 end_commit_flush
   [junit4]   2> 1874745 INFO  (TEST-MaxSizeAutoCommitTest.testRedundantDeletes-seed#[2D2E153AF68C619C]) [    ] o.a.s.u.p.LogUpdateProcessorFactory [collection1] {delete=[100 (-1600038517178630144)]} 0 253
   [junit4]   2> 1874746 INFO  (TEST-MaxSizeAutoCommitTest.testRedundantDeletes-seed#[2D2E153AF68C619C]) [    ] o.a.s.u.p.LogUpdateProcessorFactory [collection1] {delete=[100 (-1600038517179678720)]} 0 253
   [junit4]   2> 1874746 INFO  (TEST-MaxSizeAutoCommitTest.testRedundantDeletes-seed#[2D2E153AF68C619C]) [    ] o.a.s.u.p.LogUpdateProcessorFactory [collection1] {delete=[100 (-1600038517179678721)]} 0 254
   [junit4]   2> 1874746 INFO  (TEST-MaxSizeAutoCommitTest.testRedundantDeletes-seed#[2D2E153AF68C619C]) [    ] o.a.s.u.p.LogUpdateProcessorFactory [collection1] {delete=[100 (-1600038517179678722)]} 0 254
   [junit4]   2> 1874746 INFO  (TEST-MaxSizeAutoCommitTest.testRedundantDeletes-seed#[2D2E153AF68C619C]) [    ] o.a.s.u.p.LogUpdateProcessorFactory [collection1] {delete=[100 (-1600038517179678723)]} 0 254
   [junit4]   2> 1874746 INFO  (TEST-MaxSizeAutoCommitTest.testRedundantDeletes-seed#[2D2E153AF68C619C]) [    ] o.a.s.u.p.LogUpdateProcessorFactory [collection1] {delete=[100 (-1600038517179678724)]} 0 254
   [junit4]   2> 1874746 INFO  (TEST-MaxSizeAutoCommitTest.testRedundantDeletes-seed#[2D2E153AF68C619C]) [    ] o.a.s.u.p.LogUpdateProcessorFactory [collection1] {delete=[100 (-1600038517179678725)]} 0 254
   [junit4]   2> 1874746 INFO  (TEST-MaxSizeAutoCommitTest.testRedundantDeletes-seed#[2D2E153AF68C619C]) [    ] o.a.s.u.p.LogUpdateProcessorFactory [collection1] {delete=[100 (-1600038517179678726)]} 0 254
   [junit4]   2> 1874746 INFO  (TEST-MaxSizeAutoCommitTest.testRedundantDeletes-seed#[2D2E153AF68C619C]) [    ] o.a.s.u.p.LogUpdateProcessorFactory [collection1] {delete=[100 (-1600038517179678727)]} 0 254
   [junit4]   2> 1874746 INFO  (TEST-MaxSizeAutoCommitTest.testRedundantDeletes-seed#[2D2E153AF68C619C]) [    ] o.a.s.u.p.LogUpdateProcessorFactory [collection1] {delete=[100 (-1600038517179678728)]} 0 254
   [junit4]   2> 1874746 INFO  (TEST-MaxSizeAutoCommitTest.testRedundantDeletes-seed#[2D2E153AF68C619C]) [    ] o.a.s.u.p.LogUpdateProcessorFactory [collection1] {delete=[100 (-1600038517179678729)]} 0 254
   [junit4]   2> 1874746 INFO  (TEST-MaxSizeAutoCommitTest.testRedundantDeletes-seed#[2D2E153AF68C619C]) [    ] o.a.s.u.p.LogUpdateProcessorFactory [collection1] {delete=[100 (-1600038517179678730)]} 0 254
   [junit4]   2> 1874746 INFO  (TEST-MaxSizeAutoCommitTest.testRedundantDeletes-seed#[2D2E153AF68C619C]) [    ] o.a.s.u.p.LogUpdateProcessorFactory [collection1] {delete=[100 (-1600038517179678731)]} 0 254
   [junit4]   2> 1874746 INFO  (TEST-MaxSizeAutoCommitTest.testRedundantDeletes-seed#[2D2E153AF68C619C]) [    ] o.a.s.u.p.LogUpdateProcessorFactory [collection1] {delete=[100 (-1600038517179678732)]} 0 254
   [junit4]   2> 1874746 INFO  (TEST-MaxSizeAutoCommitTest.testRedundantDeletes-seed#[2D2E153AF68C619C]) [    ] o.a.s.u.p.LogUpdateProcessorFactory [collection1] {delete=[100 (-1600038517179678733)]} 0 254
   [junit4]   2> 1874746 INFO  (TEST-MaxSizeAutoCommitTest.testRedundantDeletes-seed#[2D2E153AF68C619C]) [    ] o.a.s.u.p.LogUpdateProcessorFactory [collection1] {delete=[100 (-1600038517179678734)]} 0 254
   [junit4]   2> 1874746 INFO  (TEST-MaxSizeAutoCommitTest.testRedundantDeletes-seed#[2D2E153AF68C619C]) [    ] o.a.s.u.p.LogUpdateProcessorFactory [collection1] {delete=[100 (-1600038517179678735)]} 0 254
   [junit4]   2> 1874746 INFO  (TEST-MaxSizeAutoCommitTest.testRedundantDeletes-seed#[2D2E153AF68C619C]) [    ] o.a.s.u.p.LogUpdateProcessorFactory [collection1] {delete=[100 (-1600038517179678736)]} 0 254
   [junit4]   2> 1874746 INFO  (TEST-MaxSizeAutoCommitTest.testRedundantDeletes-seed#[2D2E153AF68C619C]) [    ] o.a.s.u.p.LogUpdateProcessorFactory [collection1] {delete=[100 (-1600038517179678737)]} 0 254
   [junit4]   2> 1874746 INFO  (TEST-MaxSizeAutoCommitTest.testRedundantDeletes-seed#[2D2E153AF68C619C]) [    ] o.a.s.u.p.LogUpdateProcessorFactory [collection1] {delete=[100 (-1600038517179678738)]} 0 254
   [junit4]   2> 1874746 INFO  (TEST-MaxSizeAutoCommitTest.testRedundantDeletes-seed#[2D2E153AF68C619C]) [    ] o.a.s.u.p.LogUpdateProcessorFactory [collection1] {delete=[100 (-1600038517179678739)]} 0 254
   [junit4]   2> 1874747 INFO  (TEST-MaxSizeAutoCommitTest.testRedundantDeletes-seed#[2D2E153AF68C619C]) [    ] o.a.s.u.p.LogUpdateProcessorFactory [collection1] {delete=[100 (-1600038517180727296)]} 0 254
   [junit4]   2> 1874747 INFO  (TEST-MaxSizeAutoCommitTest.testRedundantDeletes-seed#[2D2E153AF68C619C]) [    ] o.a.s.u.p.LogUpdateProcessorFactory [collection1] {delete=[100 (-1600038517180727297)]} 0 254
   [junit4]   2> 1874747 INFO  (TEST-MaxSizeAutoCommitTest.testRedundantDeletes-seed#[2D2E153AF68C619C]) [    ] o.a.s.u.p.LogUpdateProcessorFactory [collection1] {delete=[100 (-1600038517180727298)]} 0 254
   [junit4]   2> 1874747 INFO  (TEST-MaxSizeAutoCommitTest.testRedundantDeletes-seed#[2D2E153AF68C619C]) [    ] o.a.s.u.p.LogUpdateProcessorFactory [collection1] {delete=[100 (-1600038517180727299)]} 0 254
   [junit4]   2> 1874747 INFO  (TEST-MaxSizeAutoCommitTest.testRedundantDeletes-seed#[2D2E153AF68C619C]) [    ] o.a.s.u.p.LogUpdateProcessorFactory [collection1] {delete=[100 (-1600038517180727300)]} 0 255
   [junit4]   2> 1874747 INFO  (TEST-MaxSizeAutoCommitTest.testRedundantDeletes-s

[...truncated too long message...]

r=false,waitSearcher=true,expungeDeletes=false,softCommit=false,prepareCommit=false}
   [junit4]   2> 126568 INFO  (commitScheduler-205-thread-1) [    ] o.a.s.u.SolrIndexWriter Calling setCommitData with IW:org.apache.solr.update.SolrIndexWriter@4e62b3df commitCommandVersion:0
   [junit4]   2> 126572 INFO  (commitScheduler-205-thread-1) [    ] o.a.s.s.SolrIndexSearcher Opening [Searcher@72162def[collection1] realtime]
   [junit4]   2> 126572 INFO  (commitScheduler-205-thread-1) [    ] o.a.s.u.DirectUpdateHandler2 end_commit_flush
   [junit4]   2> 126618 INFO  (TEST-MaxSizeAutoCommitTest.endToEndTest-seed#[2D2E153AF68C619C]) [    ] o.a.s.c.S.Request [collection1]  webapp=null path=null params={q=*:*&qt=&start=0&rows=20&version=2.2} hits=0 status=0 QTime=9397
   [junit4]   2> 126619 INFO  (TEST-MaxSizeAutoCommitTest.endToEndTest-seed#[2D2E153AF68C619C]) [    ] o.a.s.u.p.LogUpdateProcessorFactory [collection1] {add=[980 (1600039408408461312), 981 (1600039408409509888), 982 (1600039408409509889), 983 (1600039408409509890), 984 (1600039408409509891), 985 (1600039408409509892), 986 (1600039408409509893), 987 (1600039408409509894), 988 (1600039408409509895), 989 (1600039408409509896), ... (20 adds)]} 0 0
   [junit4]   2> 126820 INFO  (TEST-MaxSizeAutoCommitTest.endToEndTest-seed#[2D2E153AF68C619C]) [    ] o.a.s.c.S.Request [collection1]  webapp=null path=null params={q=*:*&qt=&start=0&rows=20&version=2.2} hits=0 status=0 QTime=9599
   [junit4]   2> 126820 INFO  (TEST-MaxSizeAutoCommitTest.endToEndTest-seed#[2D2E153AF68C619C]) [    ] o.a.s.u.DirectUpdateHandler2 start commit{,optimize=false,openSearcher=true,waitSearcher=true,expungeDeletes=false,softCommit=false,prepareCommit=false}
   [junit4]   2> 126820 INFO  (TEST-MaxSizeAutoCommitTest.endToEndTest-seed#[2D2E153AF68C619C]) [    ] o.a.s.u.SolrIndexWriter Calling setCommitData with IW:org.apache.solr.update.SolrIndexWriter@4e62b3df commitCommandVersion:0
   [junit4]   2> 126824 INFO  (TEST-MaxSizeAutoCommitTest.endToEndTest-seed#[2D2E153AF68C619C]) [    ] o.a.s.s.SolrIndexSearcher Opening [Searcher@786ff463[collection1] main]
   [junit4]   2> 126824 INFO  (TEST-MaxSizeAutoCommitTest.endToEndTest-seed#[2D2E153AF68C619C]) [    ] o.a.s.u.DirectUpdateHandler2 end_commit_flush
   [junit4]   2> 126825 INFO  (searcherExecutor-202-thread-1) [    ] o.a.s.c.SolrCore [collection1] Registered new searcher Searcher@786ff463[collection1] main{ExitableDirectoryReader(UninvertingDirectoryReader(Uninverting(_0(8.0.0):C74) Uninverting(_1(8.0.0):C66) Uninverting(_2(8.0.0):C74) Uninverting(_3(8.0.0):C66) Uninverting(_4(8.0.0):C74) Uninverting(_5(8.0.0):C66) Uninverting(_6(8.0.0):C74) Uninverting(_7(8.0.0):C66) Uninverting(_8(8.0.0):C74) Uninverting(_9(8.0.0):C66) Uninverting(_a(8.0.0):C74) Uninverting(_b(8.0.0):C66) Uninverting(_c(8.0.0):C74) Uninverting(_d(8.0.0):C66) Uninverting(_e(8.0.0):C20)))}
   [junit4]   2> 126876 INFO  (TEST-MaxSizeAutoCommitTest.endToEndTest-seed#[2D2E153AF68C619C]) [    ] o.a.s.c.S.Request [collection1]  webapp=null path=null params={q=*:*&qt=&start=0&rows=20&version=2.2} hits=1000 status=0 QTime=9656
   [junit4]   2> 126878 INFO  (TEST-MaxSizeAutoCommitTest.endToEndTest-seed#[2D2E153AF68C619C]) [    ] o.a.s.SolrTestCaseJ4 ###Ending endToEndTest {seed=[2D2E153AF68C619C:70E87E64BECE5EEB]}
   [junit4]   2> 126878 INFO  (TEST-MaxSizeAutoCommitTest.endToEndTest-seed#[2D2E153AF68C619C]) [    ] o.a.s.SolrTestCaseJ4 ###deleteCore
   [junit4]   2> 126878 INFO  (TEST-MaxSizeAutoCommitTest.endToEndTest-seed#[2D2E153AF68C619C]) [    ] o.a.s.c.CoreContainer Shutting down CoreContainer instance=296500830
   [junit4]   2> 126878 INFO  (TEST-MaxSizeAutoCommitTest.endToEndTest-seed#[2D2E153AF68C619C]) [    ] o.a.s.m.SolrMetricManager Closing metric reporters for registry=solr.node, tag=null
   [junit4]   2> 126878 INFO  (TEST-MaxSizeAutoCommitTest.endToEndTest-seed#[2D2E153AF68C619C]) [    ] o.a.s.m.r.SolrJmxReporter Closing reporter [org.apache.solr.metrics.reporters.SolrJmxReporter@19764a91: rootName = null, domain = solr.node, service url = null, agent id = null] for registry solr.node / com.codahale.metrics.MetricRegistry@6cd3eb82
   [junit4]   2> 126881 INFO  (TEST-MaxSizeAutoCommitTest.endToEndTest-seed#[2D2E153AF68C619C]) [    ] o.a.s.m.SolrMetricManager Closing metric reporters for registry=solr.jvm, tag=null
   [junit4]   2> 126881 INFO  (TEST-MaxSizeAutoCommitTest.endToEndTest-seed#[2D2E153AF68C619C]) [    ] o.a.s.m.r.SolrJmxReporter Closing reporter [org.apache.solr.metrics.reporters.SolrJmxReporter@2cb3ec8: rootName = null, domain = solr.jvm, service url = null, agent id = null] for registry solr.jvm / com.codahale.metrics.MetricRegistry@7dc76350
   [junit4]   2> 126881 INFO  (TEST-MaxSizeAutoCommitTest.endToEndTest-seed#[2D2E153AF68C619C]) [    ] o.a.s.m.SolrMetricManager Closing metric reporters for registry=solr.jetty, tag=null
   [junit4]   2> 126881 INFO  (TEST-MaxSizeAutoCommitTest.endToEndTest-seed#[2D2E153AF68C619C]) [    ] o.a.s.m.r.SolrJmxReporter Closing reporter [org.apache.solr.metrics.reporters.SolrJmxReporter@507bbc41: rootName = null, domain = solr.jetty, service url = null, agent id = null] for registry solr.jetty / com.codahale.metrics.MetricRegistry@3212c211
   [junit4]   2> 126881 INFO  (coreCloseExecutor-207-thread-1) [    x:collection1] o.a.s.c.SolrCore [collection1]  CLOSING SolrCore org.apache.solr.core.SolrCore@131f7408
   [junit4]   2> 126881 INFO  (coreCloseExecutor-207-thread-1) [    x:collection1] o.a.s.m.SolrMetricManager Closing metric reporters for registry=solr.core.collection1, tag=131f7408
   [junit4]   2> 126881 INFO  (coreCloseExecutor-207-thread-1) [    x:collection1] o.a.s.m.r.SolrJmxReporter Closing reporter [org.apache.solr.metrics.reporters.SolrJmxReporter@49af3a08: rootName = null, domain = solr.core.collection1, service url = null, agent id = null] for registry solr.core.collection1 / com.codahale.metrics.MetricRegistry@442d071
   [junit4] OK      9.93s J0 | MaxSizeAutoCommitTest.endToEndTest {seed=[2D2E153AF68C619C:70E87E64BECE5EEB]}
   [junit4]   2> NOTE: leaving temporary files on disk at: /home/jenkins/workspace/Lucene-Solr-master-Linux/solr/build/solr-core/test/J0/temp/solr.update.MaxSizeAutoCommitTest_2D2E153AF68C619C-001
   [junit4]   2> NOTE: test params are: codec=Asserting(Lucene70): {multiDefault=PostingsFormat(name=Asserting), id=BlockTreeOrds(blocksize=128)}, docValues:{range_facet_l_dv=DocValuesFormat(name=Lucene70), _version_=DocValuesFormat(name=Asserting), range_facet_i_dv=DocValuesFormat(name=Lucene70), intDvoDefault=DocValuesFormat(name=Lucene70), timestamp=DocValuesFormat(name=Lucene70)}, maxPointsInLeafNode=1787, maxMBSortInHeap=6.166431629589042, sim=Asserting(org.apache.lucene.search.similarities.AssertingSimilarity@1b6c9361), locale=pt-PT, timezone=Europe/Zagreb
   [junit4]   2> NOTE: Linux 4.13.0-39-generic amd64/Oracle Corporation 11-ea (64-bit)/cpus=8,threads=1,free=443954232,total=518979584
   [junit4]   2> NOTE: All tests run in this JVM: [MaxSizeAutoCommitTest, MaxSizeAutoCommitTest]
   [junit4] Completed [4/5 (1!)] on J0 in 58.48s, 8 tests, 1 failure <<< FAILURES!

[...truncated 1 lines...]
   [junit4] JVM J0: stderr was not empty, see: /home/jenkins/workspace/Lucene-Solr-master-Linux/solr/build/solr-core/test/temp/junit4-J0-20180510_013922_1901792523244533296545.syserr
   [junit4] >>> JVM J0 emitted unexpected output (verbatim) ----
   [junit4] OpenJDK 64-Bit Server VM warning: Option UseConcMarkSweepGC was deprecated in version 9.0 and will likely be removed in a future release.
   [junit4] <<< JVM J0: EOF ----

[...truncated 11 lines...]
   [junit4] JVM J1: stderr was not empty, see: /home/jenkins/workspace/Lucene-Solr-master-Linux/solr/build/solr-core/test/temp/junit4-J1-20180510_013922_19018417574465076027175.syserr
   [junit4] >>> JVM J1 emitted unexpected output (verbatim) ----
   [junit4] OpenJDK 64-Bit Server VM warning: Option UseConcMarkSweepGC was deprecated in version 9.0 and will likely be removed in a future release.
   [junit4] <<< JVM J1: EOF ----

[...truncated 10 lines...]
BUILD FAILED
/home/jenkins/workspace/Lucene-Solr-master-Linux/lucene/common-build.xml:1568: The following error occurred while executing this line:
/home/jenkins/workspace/Lucene-Solr-master-Linux/lucene/common-build.xml:1092: There were test failures: 5 suites, 40 tests, 1 failure [seed: 2D2E153AF68C619C]

Total time: 2 minutes 9 seconds

[repro] Setting last failure code to 256

[repro] Failures:
[repro]   1/5 failed: org.apache.solr.update.MaxSizeAutoCommitTest
[repro] Exiting with code 256
+ mv lucene/build lucene/build.repro
+ mv solr/build solr/build.repro
+ mv lucene/build.orig lucene/build
+ mv solr/build.orig solr/build
Archiving artifacts
Setting ANT_1_8_2_HOME=/var/lib/jenkins/tools/hudson.tasks.Ant_AntInstallation/ANT_1.8.2
[WARNINGS] Parsing warnings in console log with parser Java Compiler (javac)
Setting ANT_1_8_2_HOME=/var/lib/jenkins/tools/hudson.tasks.Ant_AntInstallation/ANT_1.8.2
Setting ANT_1_8_2_HOME=/var/lib/jenkins/tools/hudson.tasks.Ant_AntInstallation/ANT_1.8.2
<Git Blamer> Using GitBlamer to create author and commit information for all warnings.
<Git Blamer> GIT_COMMIT=c2819930d7a1ef675e1721242ac03ccc5d43b0b3, workspace=/var/lib/jenkins/workspace/Lucene-Solr-master-Linux
[WARNINGS] Computing warning deltas based on reference build #21983
Recording test results
Setting ANT_1_8_2_HOME=/var/lib/jenkins/tools/hudson.tasks.Ant_AntInstallation/ANT_1.8.2
Build step 'Publish JUnit test result report' changed build result to UNSTABLE
Email was triggered for: Unstable (Test Failures)
Sending email for trigger: Unstable (Test Failures)
Setting ANT_1_8_2_HOME=/var/lib/jenkins/tools/hudson.tasks.Ant_AntInstallation/ANT_1.8.2
Setting ANT_1_8_2_HOME=/var/lib/jenkins/tools/hudson.tasks.Ant_AntInstallation/ANT_1.8.2
Setting ANT_1_8_2_HOME=/var/lib/jenkins/tools/hudson.tasks.Ant_AntInstallation/ANT_1.8.2
Setting ANT_1_8_2_HOME=/var/lib/jenkins/tools/hudson.tasks.Ant_AntInstallation/ANT_1.8.2

Mime
View raw message