lucene-dev mailing list archives

Site index · List index
Message view « Date » · « Thread »
Top « Date » · « Thread »
From Policeman Jenkins Server <jenk...@thetaphi.de>
Subject [JENKINS] Lucene-Solr-master-Linux (64bit/jdk-10) - Build # 22099 - Unstable!
Date Fri, 25 May 2018 07:44:34 GMT
Build: https://jenkins.thetaphi.de/job/Lucene-Solr-master-Linux/22099/
Java: 64bit/jdk-10 -XX:+UseCompressedOops -XX:+UseParallelGC

2 tests failed.
FAILED:  org.apache.solr.cloud.autoscaling.SearchRateTriggerTest.testTrigger

Error Message:
expected:<1> but was:<2>

Stack Trace:
java.lang.AssertionError: expected:<1> but was:<2>
	at __randomizedtesting.SeedInfo.seed([F6BD4087D0C1623E:95767605490E1113]:0)
	at org.junit.Assert.fail(Assert.java:93)
	at org.junit.Assert.failNotEquals(Assert.java:647)
	at org.junit.Assert.assertEquals(Assert.java:128)
	at org.junit.Assert.assertEquals(Assert.java:472)
	at org.junit.Assert.assertEquals(Assert.java:456)
	at org.apache.solr.cloud.autoscaling.SearchRateTriggerTest.testTrigger(SearchRateTriggerTest.java:133)
	at java.base/jdk.internal.reflect.NativeMethodAccessorImpl.invoke0(Native Method)
	at java.base/jdk.internal.reflect.NativeMethodAccessorImpl.invoke(NativeMethodAccessorImpl.java:62)
	at java.base/jdk.internal.reflect.DelegatingMethodAccessorImpl.invoke(DelegatingMethodAccessorImpl.java:43)
	at java.base/java.lang.reflect.Method.invoke(Method.java:564)
	at com.carrotsearch.randomizedtesting.RandomizedRunner.invoke(RandomizedRunner.java:1737)
	at com.carrotsearch.randomizedtesting.RandomizedRunner$8.evaluate(RandomizedRunner.java:934)
	at com.carrotsearch.randomizedtesting.RandomizedRunner$9.evaluate(RandomizedRunner.java:970)
	at com.carrotsearch.randomizedtesting.RandomizedRunner$10.evaluate(RandomizedRunner.java:984)
	at com.carrotsearch.randomizedtesting.rules.SystemPropertiesRestoreRule$1.evaluate(SystemPropertiesRestoreRule.java:57)
	at org.apache.lucene.util.TestRuleSetupTeardownChained$1.evaluate(TestRuleSetupTeardownChained.java:49)
	at org.apache.lucene.util.AbstractBeforeAfterRule$1.evaluate(AbstractBeforeAfterRule.java:45)
	at org.apache.lucene.util.TestRuleThreadAndTestName$1.evaluate(TestRuleThreadAndTestName.java:48)
	at org.apache.lucene.util.TestRuleIgnoreAfterMaxFailures$1.evaluate(TestRuleIgnoreAfterMaxFailures.java:64)
	at org.apache.lucene.util.TestRuleMarkFailure$1.evaluate(TestRuleMarkFailure.java:47)
	at com.carrotsearch.randomizedtesting.rules.StatementAdapter.evaluate(StatementAdapter.java:36)
	at com.carrotsearch.randomizedtesting.ThreadLeakControl$StatementRunner.run(ThreadLeakControl.java:368)
	at com.carrotsearch.randomizedtesting.ThreadLeakControl.forkTimeoutingTask(ThreadLeakControl.java:817)
	at com.carrotsearch.randomizedtesting.ThreadLeakControl$3.evaluate(ThreadLeakControl.java:468)
	at com.carrotsearch.randomizedtesting.RandomizedRunner.runSingleTest(RandomizedRunner.java:943)
	at com.carrotsearch.randomizedtesting.RandomizedRunner$5.evaluate(RandomizedRunner.java:829)
	at com.carrotsearch.randomizedtesting.RandomizedRunner$6.evaluate(RandomizedRunner.java:879)
	at com.carrotsearch.randomizedtesting.RandomizedRunner$7.evaluate(RandomizedRunner.java:890)
	at com.carrotsearch.randomizedtesting.rules.StatementAdapter.evaluate(StatementAdapter.java:36)
	at com.carrotsearch.randomizedtesting.rules.SystemPropertiesRestoreRule$1.evaluate(SystemPropertiesRestoreRule.java:57)
	at org.apache.lucene.util.AbstractBeforeAfterRule$1.evaluate(AbstractBeforeAfterRule.java:45)
	at com.carrotsearch.randomizedtesting.rules.StatementAdapter.evaluate(StatementAdapter.java:36)
	at org.apache.lucene.util.TestRuleStoreClassName$1.evaluate(TestRuleStoreClassName.java:41)
	at com.carrotsearch.randomizedtesting.rules.NoShadowingOrOverridesOnMethodsRule$1.evaluate(NoShadowingOrOverridesOnMethodsRule.java:40)
	at com.carrotsearch.randomizedtesting.rules.NoShadowingOrOverridesOnMethodsRule$1.evaluate(NoShadowingOrOverridesOnMethodsRule.java:40)
	at com.carrotsearch.randomizedtesting.rules.StatementAdapter.evaluate(StatementAdapter.java:36)
	at com.carrotsearch.randomizedtesting.rules.StatementAdapter.evaluate(StatementAdapter.java:36)
	at org.apache.lucene.util.TestRuleAssertionsRequired$1.evaluate(TestRuleAssertionsRequired.java:53)
	at org.apache.lucene.util.TestRuleMarkFailure$1.evaluate(TestRuleMarkFailure.java:47)
	at org.apache.lucene.util.TestRuleIgnoreAfterMaxFailures$1.evaluate(TestRuleIgnoreAfterMaxFailures.java:64)
	at org.apache.lucene.util.TestRuleIgnoreTestSuites$1.evaluate(TestRuleIgnoreTestSuites.java:54)
	at com.carrotsearch.randomizedtesting.rules.StatementAdapter.evaluate(StatementAdapter.java:36)
	at com.carrotsearch.randomizedtesting.ThreadLeakControl$StatementRunner.run(ThreadLeakControl.java:368)
	at java.base/java.lang.Thread.run(Thread.java:844)


FAILED:  org.apache.solr.cloud.autoscaling.SearchRateTriggerTest.testTrigger

Error Message:
expected:<1> but was:<2>

Stack Trace:
java.lang.AssertionError: expected:<1> but was:<2>
	at __randomizedtesting.SeedInfo.seed([F6BD4087D0C1623E:95767605490E1113]:0)
	at org.junit.Assert.fail(Assert.java:93)
	at org.junit.Assert.failNotEquals(Assert.java:647)
	at org.junit.Assert.assertEquals(Assert.java:128)
	at org.junit.Assert.assertEquals(Assert.java:472)
	at org.junit.Assert.assertEquals(Assert.java:456)
	at org.apache.solr.cloud.autoscaling.SearchRateTriggerTest.testTrigger(SearchRateTriggerTest.java:133)
	at java.base/jdk.internal.reflect.NativeMethodAccessorImpl.invoke0(Native Method)
	at java.base/jdk.internal.reflect.NativeMethodAccessorImpl.invoke(NativeMethodAccessorImpl.java:62)
	at java.base/jdk.internal.reflect.DelegatingMethodAccessorImpl.invoke(DelegatingMethodAccessorImpl.java:43)
	at java.base/java.lang.reflect.Method.invoke(Method.java:564)
	at com.carrotsearch.randomizedtesting.RandomizedRunner.invoke(RandomizedRunner.java:1737)
	at com.carrotsearch.randomizedtesting.RandomizedRunner$8.evaluate(RandomizedRunner.java:934)
	at com.carrotsearch.randomizedtesting.RandomizedRunner$9.evaluate(RandomizedRunner.java:970)
	at com.carrotsearch.randomizedtesting.RandomizedRunner$10.evaluate(RandomizedRunner.java:984)
	at com.carrotsearch.randomizedtesting.rules.SystemPropertiesRestoreRule$1.evaluate(SystemPropertiesRestoreRule.java:57)
	at org.apache.lucene.util.TestRuleSetupTeardownChained$1.evaluate(TestRuleSetupTeardownChained.java:49)
	at org.apache.lucene.util.AbstractBeforeAfterRule$1.evaluate(AbstractBeforeAfterRule.java:45)
	at org.apache.lucene.util.TestRuleThreadAndTestName$1.evaluate(TestRuleThreadAndTestName.java:48)
	at org.apache.lucene.util.TestRuleIgnoreAfterMaxFailures$1.evaluate(TestRuleIgnoreAfterMaxFailures.java:64)
	at org.apache.lucene.util.TestRuleMarkFailure$1.evaluate(TestRuleMarkFailure.java:47)
	at com.carrotsearch.randomizedtesting.rules.StatementAdapter.evaluate(StatementAdapter.java:36)
	at com.carrotsearch.randomizedtesting.ThreadLeakControl$StatementRunner.run(ThreadLeakControl.java:368)
	at com.carrotsearch.randomizedtesting.ThreadLeakControl.forkTimeoutingTask(ThreadLeakControl.java:817)
	at com.carrotsearch.randomizedtesting.ThreadLeakControl$3.evaluate(ThreadLeakControl.java:468)
	at com.carrotsearch.randomizedtesting.RandomizedRunner.runSingleTest(RandomizedRunner.java:943)
	at com.carrotsearch.randomizedtesting.RandomizedRunner$5.evaluate(RandomizedRunner.java:829)
	at com.carrotsearch.randomizedtesting.RandomizedRunner$6.evaluate(RandomizedRunner.java:879)
	at com.carrotsearch.randomizedtesting.RandomizedRunner$7.evaluate(RandomizedRunner.java:890)
	at com.carrotsearch.randomizedtesting.rules.StatementAdapter.evaluate(StatementAdapter.java:36)
	at com.carrotsearch.randomizedtesting.rules.SystemPropertiesRestoreRule$1.evaluate(SystemPropertiesRestoreRule.java:57)
	at org.apache.lucene.util.AbstractBeforeAfterRule$1.evaluate(AbstractBeforeAfterRule.java:45)
	at com.carrotsearch.randomizedtesting.rules.StatementAdapter.evaluate(StatementAdapter.java:36)
	at org.apache.lucene.util.TestRuleStoreClassName$1.evaluate(TestRuleStoreClassName.java:41)
	at com.carrotsearch.randomizedtesting.rules.NoShadowingOrOverridesOnMethodsRule$1.evaluate(NoShadowingOrOverridesOnMethodsRule.java:40)
	at com.carrotsearch.randomizedtesting.rules.NoShadowingOrOverridesOnMethodsRule$1.evaluate(NoShadowingOrOverridesOnMethodsRule.java:40)
	at com.carrotsearch.randomizedtesting.rules.StatementAdapter.evaluate(StatementAdapter.java:36)
	at com.carrotsearch.randomizedtesting.rules.StatementAdapter.evaluate(StatementAdapter.java:36)
	at org.apache.lucene.util.TestRuleAssertionsRequired$1.evaluate(TestRuleAssertionsRequired.java:53)
	at org.apache.lucene.util.TestRuleMarkFailure$1.evaluate(TestRuleMarkFailure.java:47)
	at org.apache.lucene.util.TestRuleIgnoreAfterMaxFailures$1.evaluate(TestRuleIgnoreAfterMaxFailures.java:64)
	at org.apache.lucene.util.TestRuleIgnoreTestSuites$1.evaluate(TestRuleIgnoreTestSuites.java:54)
	at com.carrotsearch.randomizedtesting.rules.StatementAdapter.evaluate(StatementAdapter.java:36)
	at com.carrotsearch.randomizedtesting.ThreadLeakControl$StatementRunner.run(ThreadLeakControl.java:368)
	at java.base/java.lang.Thread.run(Thread.java:844)




Build Log:
[...truncated 14646 lines...]
   [junit4] Suite: org.apache.solr.cloud.autoscaling.SearchRateTriggerTest
   [junit4]   2> Creating dataDir: /home/jenkins/workspace/Lucene-Solr-master-Linux/solr/build/solr-core/test/J2/temp/solr.cloud.autoscaling.SearchRateTriggerTest_F6BD4087D0C1623E-001/init-core-data-001
   [junit4]   2> 1631686 INFO  (SUITE-SearchRateTriggerTest-seed#[F6BD4087D0C1623E]-worker) [    ] o.a.s.c.MiniSolrCloudCluster Starting cluster of 4 servers in /home/jenkins/workspace/Lucene-Solr-master-Linux/solr/build/solr-core/test/J2/temp/solr.cloud.autoscaling.SearchRateTriggerTest_F6BD4087D0C1623E-001/tempDir-001
   [junit4]   2> 1631686 INFO  (SUITE-SearchRateTriggerTest-seed#[F6BD4087D0C1623E]-worker) [    ] o.a.s.c.ZkTestServer STARTING ZK TEST SERVER
   [junit4]   2> 1631686 INFO  (Thread-5371) [    ] o.a.s.c.ZkTestServer client port:0.0.0.0/0.0.0.0:0
   [junit4]   2> 1631686 INFO  (Thread-5371) [    ] o.a.s.c.ZkTestServer Starting server
   [junit4]   2> 1631692 ERROR (Thread-5371) [    ] o.a.z.s.ZooKeeperServer ZKShutdownHandler is not registered, so ZooKeeper server won't take any action on ERROR or SHUTDOWN server state changes
   [junit4]   2> 1631786 INFO  (SUITE-SearchRateTriggerTest-seed#[F6BD4087D0C1623E]-worker) [    ] o.a.s.c.ZkTestServer start zk server on port:41117
   [junit4]   2> 1631788 INFO  (zkConnectionManagerCallback-7783-thread-1) [    ] o.a.s.c.c.ConnectionManager zkClient has connected
   [junit4]   2> 1631789 INFO  (jetty-launcher-7780-thread-2) [    ] o.e.j.s.Server jetty-9.4.10.v20180503; built: 2018-05-03T15:56:21.710Z; git: daa59876e6f384329b122929e70a80934569428c; jvm 10+46
   [junit4]   2> 1631789 INFO  (jetty-launcher-7780-thread-3) [    ] o.e.j.s.Server jetty-9.4.10.v20180503; built: 2018-05-03T15:56:21.710Z; git: daa59876e6f384329b122929e70a80934569428c; jvm 10+46
   [junit4]   2> 1631789 INFO  (jetty-launcher-7780-thread-1) [    ] o.e.j.s.Server jetty-9.4.10.v20180503; built: 2018-05-03T15:56:21.710Z; git: daa59876e6f384329b122929e70a80934569428c; jvm 10+46
   [junit4]   2> 1631790 INFO  (jetty-launcher-7780-thread-4) [    ] o.e.j.s.Server jetty-9.4.10.v20180503; built: 2018-05-03T15:56:21.710Z; git: daa59876e6f384329b122929e70a80934569428c; jvm 10+46
   [junit4]   2> 1631790 INFO  (jetty-launcher-7780-thread-2) [    ] o.e.j.s.session DefaultSessionIdManager workerName=node0
   [junit4]   2> 1631790 INFO  (jetty-launcher-7780-thread-2) [    ] o.e.j.s.session No SessionScavenger set, using defaults
   [junit4]   2> 1631790 INFO  (jetty-launcher-7780-thread-2) [    ] o.e.j.s.session node0 Scavenging every 600000ms
   [junit4]   2> 1631790 INFO  (jetty-launcher-7780-thread-4) [    ] o.e.j.s.session DefaultSessionIdManager workerName=node0
   [junit4]   2> 1631790 INFO  (jetty-launcher-7780-thread-4) [    ] o.e.j.s.session No SessionScavenger set, using defaults
   [junit4]   2> 1631790 INFO  (jetty-launcher-7780-thread-4) [    ] o.e.j.s.session node0 Scavenging every 600000ms
   [junit4]   2> 1631790 INFO  (jetty-launcher-7780-thread-2) [    ] o.e.j.s.h.ContextHandler Started o.e.j.s.ServletContextHandler@15bc8bf7{/solr,null,AVAILABLE}
   [junit4]   2> 1631790 INFO  (jetty-launcher-7780-thread-3) [    ] o.e.j.s.session DefaultSessionIdManager workerName=node0
   [junit4]   2> 1631790 INFO  (jetty-launcher-7780-thread-3) [    ] o.e.j.s.session No SessionScavenger set, using defaults
   [junit4]   2> 1631790 INFO  (jetty-launcher-7780-thread-3) [    ] o.e.j.s.session node0 Scavenging every 600000ms
   [junit4]   2> 1631790 INFO  (jetty-launcher-7780-thread-4) [    ] o.e.j.s.h.ContextHandler Started o.e.j.s.ServletContextHandler@11ca976a{/solr,null,AVAILABLE}
   [junit4]   2> 1631791 INFO  (jetty-launcher-7780-thread-2) [    ] o.e.j.s.AbstractConnector Started ServerConnector@3f86c70e{HTTP/1.1,[http/1.1]}{127.0.0.1:42199}
   [junit4]   2> 1631791 INFO  (jetty-launcher-7780-thread-2) [    ] o.e.j.s.Server Started @1631815ms
   [junit4]   2> 1631791 INFO  (jetty-launcher-7780-thread-2) [    ] o.a.s.c.s.e.JettySolrRunner Jetty properties: {hostContext=/solr, hostPort=42199}
   [junit4]   2> 1631791 ERROR (jetty-launcher-7780-thread-2) [    ] o.a.s.u.StartupLoggingUtils Missing Java Option solr.log.dir. Logging may be missing or incomplete.
   [junit4]   2> 1631791 INFO  (jetty-launcher-7780-thread-2) [    ] o.a.s.s.SolrDispatchFilter Using logger factory org.apache.logging.slf4j.Log4jLoggerFactory
   [junit4]   2> 1631791 INFO  (jetty-launcher-7780-thread-2) [    ] o.a.s.s.SolrDispatchFilter  ___      _       Welcome to Apache Solr™ version 8.0.0
   [junit4]   2> 1631791 INFO  (jetty-launcher-7780-thread-2) [    ] o.a.s.s.SolrDispatchFilter / __| ___| |_ _   Starting in cloud mode on port null
   [junit4]   2> 1631791 INFO  (jetty-launcher-7780-thread-2) [    ] o.a.s.s.SolrDispatchFilter \__ \/ _ \ | '_|  Install dir: null
   [junit4]   2> 1631791 INFO  (jetty-launcher-7780-thread-2) [    ] o.a.s.s.SolrDispatchFilter |___/\___/_|_|    Start time: 2018-05-25T07:22:02.778412Z
   [junit4]   2> 1631791 INFO  (jetty-launcher-7780-thread-1) [    ] o.e.j.s.session DefaultSessionIdManager workerName=node0
   [junit4]   2> 1631791 INFO  (jetty-launcher-7780-thread-1) [    ] o.e.j.s.session No SessionScavenger set, using defaults
   [junit4]   2> 1631791 INFO  (jetty-launcher-7780-thread-1) [    ] o.e.j.s.session node0 Scavenging every 660000ms
   [junit4]   2> 1631792 INFO  (jetty-launcher-7780-thread-4) [    ] o.e.j.s.AbstractConnector Started ServerConnector@6196e00f{HTTP/1.1,[http/1.1]}{127.0.0.1:42221}
   [junit4]   2> 1631792 INFO  (jetty-launcher-7780-thread-4) [    ] o.e.j.s.Server Started @1631816ms
   [junit4]   2> 1631792 INFO  (jetty-launcher-7780-thread-4) [    ] o.a.s.c.s.e.JettySolrRunner Jetty properties: {hostContext=/solr, hostPort=42221}
   [junit4]   2> 1631792 INFO  (jetty-launcher-7780-thread-1) [    ] o.e.j.s.h.ContextHandler Started o.e.j.s.ServletContextHandler@93d3718{/solr,null,AVAILABLE}
   [junit4]   2> 1631792 INFO  (jetty-launcher-7780-thread-3) [    ] o.e.j.s.h.ContextHandler Started o.e.j.s.ServletContextHandler@179fea48{/solr,null,AVAILABLE}
   [junit4]   2> 1631792 ERROR (jetty-launcher-7780-thread-4) [    ] o.a.s.u.StartupLoggingUtils Missing Java Option solr.log.dir. Logging may be missing or incomplete.
   [junit4]   2> 1631792 INFO  (jetty-launcher-7780-thread-4) [    ] o.a.s.s.SolrDispatchFilter Using logger factory org.apache.logging.slf4j.Log4jLoggerFactory
   [junit4]   2> 1631792 INFO  (jetty-launcher-7780-thread-4) [    ] o.a.s.s.SolrDispatchFilter  ___      _       Welcome to Apache Solr™ version 8.0.0
   [junit4]   2> 1631792 INFO  (jetty-launcher-7780-thread-4) [    ] o.a.s.s.SolrDispatchFilter / __| ___| |_ _   Starting in cloud mode on port null
   [junit4]   2> 1631792 INFO  (jetty-launcher-7780-thread-3) [    ] o.e.j.s.AbstractConnector Started ServerConnector@5a3759ee{HTTP/1.1,[http/1.1]}{127.0.0.1:45285}
   [junit4]   2> 1631792 INFO  (jetty-launcher-7780-thread-1) [    ] o.e.j.s.AbstractConnector Started ServerConnector@6f1f61e1{HTTP/1.1,[http/1.1]}{127.0.0.1:39323}
   [junit4]   2> 1631792 INFO  (jetty-launcher-7780-thread-4) [    ] o.a.s.s.SolrDispatchFilter \__ \/ _ \ | '_|  Install dir: null
   [junit4]   2> 1631792 INFO  (jetty-launcher-7780-thread-1) [    ] o.e.j.s.Server Started @1631817ms
   [junit4]   2> 1631792 INFO  (jetty-launcher-7780-thread-4) [    ] o.a.s.s.SolrDispatchFilter |___/\___/_|_|    Start time: 2018-05-25T07:22:02.779464Z
   [junit4]   2> 1631792 INFO  (jetty-launcher-7780-thread-1) [    ] o.a.s.c.s.e.JettySolrRunner Jetty properties: {hostContext=/solr, hostPort=39323}
   [junit4]   2> 1631792 INFO  (jetty-launcher-7780-thread-3) [    ] o.e.j.s.Server Started @1631817ms
   [junit4]   2> 1631792 INFO  (jetty-launcher-7780-thread-3) [    ] o.a.s.c.s.e.JettySolrRunner Jetty properties: {hostContext=/solr, hostPort=45285}
   [junit4]   2> 1631792 ERROR (jetty-launcher-7780-thread-3) [    ] o.a.s.u.StartupLoggingUtils Missing Java Option solr.log.dir. Logging may be missing or incomplete.
   [junit4]   2> 1631792 ERROR (jetty-launcher-7780-thread-1) [    ] o.a.s.u.StartupLoggingUtils Missing Java Option solr.log.dir. Logging may be missing or incomplete.
   [junit4]   2> 1631792 INFO  (jetty-launcher-7780-thread-3) [    ] o.a.s.s.SolrDispatchFilter Using logger factory org.apache.logging.slf4j.Log4jLoggerFactory
   [junit4]   2> 1631792 INFO  (jetty-launcher-7780-thread-1) [    ] o.a.s.s.SolrDispatchFilter Using logger factory org.apache.logging.slf4j.Log4jLoggerFactory
   [junit4]   2> 1631792 INFO  (jetty-launcher-7780-thread-3) [    ] o.a.s.s.SolrDispatchFilter  ___      _       Welcome to Apache Solr™ version 8.0.0
   [junit4]   2> 1631792 INFO  (jetty-launcher-7780-thread-1) [    ] o.a.s.s.SolrDispatchFilter  ___      _       Welcome to Apache Solr™ version 8.0.0
   [junit4]   2> 1631792 INFO  (jetty-launcher-7780-thread-3) [    ] o.a.s.s.SolrDispatchFilter / __| ___| |_ _   Starting in cloud mode on port null
   [junit4]   2> 1631792 INFO  (jetty-launcher-7780-thread-3) [    ] o.a.s.s.SolrDispatchFilter \__ \/ _ \ | '_|  Install dir: null
   [junit4]   2> 1631792 INFO  (jetty-launcher-7780-thread-1) [    ] o.a.s.s.SolrDispatchFilter / __| ___| |_ _   Starting in cloud mode on port null
   [junit4]   2> 1631792 INFO  (jetty-launcher-7780-thread-3) [    ] o.a.s.s.SolrDispatchFilter |___/\___/_|_|    Start time: 2018-05-25T07:22:02.779816Z
   [junit4]   2> 1631792 INFO  (jetty-launcher-7780-thread-1) [    ] o.a.s.s.SolrDispatchFilter \__ \/ _ \ | '_|  Install dir: null
   [junit4]   2> 1631792 INFO  (jetty-launcher-7780-thread-1) [    ] o.a.s.s.SolrDispatchFilter |___/\___/_|_|    Start time: 2018-05-25T07:22:02.779846Z
   [junit4]   2> 1631793 INFO  (zkConnectionManagerCallback-7787-thread-1) [    ] o.a.s.c.c.ConnectionManager zkClient has connected
   [junit4]   2> 1631793 INFO  (zkConnectionManagerCallback-7785-thread-1) [    ] o.a.s.c.c.ConnectionManager zkClient has connected
   [junit4]   2> 1631793 INFO  (zkConnectionManagerCallback-7789-thread-1) [    ] o.a.s.c.c.ConnectionManager zkClient has connected
   [junit4]   2> 1631793 INFO  (zkConnectionManagerCallback-7791-thread-1) [    ] o.a.s.c.c.ConnectionManager zkClient has connected
   [junit4]   2> 1631793 INFO  (jetty-launcher-7780-thread-4) [    ] o.a.s.s.SolrDispatchFilter solr.xml found in ZooKeeper. Loading...
   [junit4]   2> 1631793 INFO  (jetty-launcher-7780-thread-2) [    ] o.a.s.s.SolrDispatchFilter solr.xml found in ZooKeeper. Loading...
   [junit4]   2> 1631793 INFO  (jetty-launcher-7780-thread-3) [    ] o.a.s.s.SolrDispatchFilter solr.xml found in ZooKeeper. Loading...
   [junit4]   2> 1631793 INFO  (jetty-launcher-7780-thread-1) [    ] o.a.s.s.SolrDispatchFilter solr.xml found in ZooKeeper. Loading...
   [junit4]   2> 1631798 INFO  (jetty-launcher-7780-thread-2) [    ] o.a.s.c.ZkContainer Zookeeper client=127.0.0.1:41117/solr
   [junit4]   2> 1631798 INFO  (jetty-launcher-7780-thread-4) [    ] o.a.s.c.ZkContainer Zookeeper client=127.0.0.1:41117/solr
   [junit4]   2> 1631798 INFO  (jetty-launcher-7780-thread-3) [    ] o.a.s.c.ZkContainer Zookeeper client=127.0.0.1:41117/solr
   [junit4]   2> 1631798 INFO  (jetty-launcher-7780-thread-1) [    ] o.a.s.c.ZkContainer Zookeeper client=127.0.0.1:41117/solr
   [junit4]   2> 1631799 INFO  (zkConnectionManagerCallback-7807-thread-1) [    ] o.a.s.c.c.ConnectionManager zkClient has connected
   [junit4]   2> 1631799 INFO  (zkConnectionManagerCallback-7801-thread-1) [    ] o.a.s.c.c.ConnectionManager zkClient has connected
   [junit4]   2> 1631799 INFO  (zkConnectionManagerCallback-7803-thread-1) [    ] o.a.s.c.c.ConnectionManager zkClient has connected
   [junit4]   2> 1631799 INFO  (zkConnectionManagerCallback-7805-thread-1) [    ] o.a.s.c.c.ConnectionManager zkClient has connected
   [junit4]   2> 1631799 WARN  (NIOServerCxn.Factory:0.0.0.0/0.0.0.0:0) [    ] o.a.z.s.NIOServerCnxn Unable to read additional data from client sessionid 0x10018ada9b80005, likely client has closed socket
   [junit4]   2> 1631800 INFO  (zkConnectionManagerCallback-7813-thread-1) [    ] o.a.s.c.c.ConnectionManager zkClient has connected
   [junit4]   2> 1631800 INFO  (zkConnectionManagerCallback-7809-thread-1) [    ] o.a.s.c.c.ConnectionManager zkClient has connected
   [junit4]   2> 1631800 INFO  (zkConnectionManagerCallback-7811-thread-1) [    ] o.a.s.c.c.ConnectionManager zkClient has connected
   [junit4]   2> 1631800 INFO  (zkConnectionManagerCallback-7815-thread-1) [    ] o.a.s.c.c.ConnectionManager zkClient has connected
   [junit4]   2> 1631852 INFO  (jetty-launcher-7780-thread-4) [n:127.0.0.1:42221_solr    ] o.a.s.c.Overseer Overseer (id=null) closing
   [junit4]   2> 1631852 INFO  (jetty-launcher-7780-thread-2) [n:127.0.0.1:42199_solr    ] o.a.s.c.Overseer Overseer (id=null) closing
   [junit4]   2> 1631852 INFO  (jetty-launcher-7780-thread-1) [n:127.0.0.1:39323_solr    ] o.a.s.c.Overseer Overseer (id=null) closing
   [junit4]   2> 1631852 INFO  (jetty-launcher-7780-thread-3) [n:127.0.0.1:45285_solr    ] o.a.s.c.Overseer Overseer (id=null) closing
   [junit4]   2> 1631853 INFO  (jetty-launcher-7780-thread-4) [n:127.0.0.1:42221_solr    ] o.a.s.c.OverseerElectionContext I am going to be the leader 127.0.0.1:42221_solr
   [junit4]   2> 1631853 INFO  (jetty-launcher-7780-thread-1) [n:127.0.0.1:39323_solr    ] o.a.s.c.ZkController Register node as live in ZooKeeper:/live_nodes/127.0.0.1:39323_solr
   [junit4]   2> 1631853 INFO  (jetty-launcher-7780-thread-2) [n:127.0.0.1:42199_solr    ] o.a.s.c.ZkController Register node as live in ZooKeeper:/live_nodes/127.0.0.1:42199_solr
   [junit4]   2> 1631853 INFO  (jetty-launcher-7780-thread-3) [n:127.0.0.1:45285_solr    ] o.a.s.c.ZkController Register node as live in ZooKeeper:/live_nodes/127.0.0.1:45285_solr
   [junit4]   2> 1631853 INFO  (jetty-launcher-7780-thread-4) [n:127.0.0.1:42221_solr    ] o.a.s.c.Overseer Overseer (id=72084728193744905-127.0.0.1:42221_solr-n_0000000000) starting
   [junit4]   2> 1631864 INFO  (zkCallback-7808-thread-1) [    ] o.a.s.c.c.ZkStateReader Updated live nodes from ZooKeeper... (0) -> (3)
   [junit4]   2> 1631864 INFO  (zkCallback-7812-thread-1) [    ] o.a.s.c.c.ZkStateReader Updated live nodes from ZooKeeper... (0) -> (3)
   [junit4]   2> 1631882 INFO  (zkCallback-7814-thread-1) [    ] o.a.s.c.c.ZkStateReader Updated live nodes from ZooKeeper... (0) -> (3)
   [junit4]   2> 1631882 INFO  (zkCallback-7810-thread-1) [    ] o.a.s.c.c.ZkStateReader Updated live nodes from ZooKeeper... (0) -> (3)
   [junit4]   2> 1631885 INFO  (zkConnectionManagerCallback-7828-thread-1) [    ] o.a.s.c.c.ConnectionManager zkClient has connected
   [junit4]   2> 1631886 INFO  (jetty-launcher-7780-thread-4) [n:127.0.0.1:42221_solr    ] o.a.s.c.c.ZkStateReader Updated live nodes from ZooKeeper... (0) -> (3)
   [junit4]   2> 1631886 INFO  (jetty-launcher-7780-thread-4) [n:127.0.0.1:42221_solr    ] o.a.s.c.s.i.ZkClientClusterStateProvider Cluster at 127.0.0.1:41117/solr ready
   [junit4]   2> 1631889 INFO  (jetty-launcher-7780-thread-4) [n:127.0.0.1:42221_solr    ] o.a.s.c.TransientSolrCoreCacheDefault Allocating transient cache for 2147483647 transient cores
   [junit4]   2> 1631889 INFO  (jetty-launcher-7780-thread-4) [n:127.0.0.1:42221_solr    ] o.a.s.c.ZkController Register node as live in ZooKeeper:/live_nodes/127.0.0.1:42221_solr
   [junit4]   2> 1631890 INFO  (zkCallback-7808-thread-1) [    ] o.a.s.c.c.ZkStateReader Updated live nodes from ZooKeeper... (3) -> (4)
   [junit4]   2> 1631890 INFO  (zkCallback-7810-thread-1) [    ] o.a.s.c.c.ZkStateReader Updated live nodes from ZooKeeper... (3) -> (4)
   [junit4]   2> 1631892 INFO  (zkCallback-7814-thread-1) [    ] o.a.s.c.c.ZkStateReader Updated live nodes from ZooKeeper... (3) -> (4)
   [junit4]   2> 1631892 INFO  (zkCallback-7812-thread-1) [    ] o.a.s.c.c.ZkStateReader Updated live nodes from ZooKeeper... (3) -> (4)
   [junit4]   2> 1631905 INFO  (zkCallback-7827-thread-1) [    ] o.a.s.c.c.ZkStateReader Updated live nodes from ZooKeeper... (3) -> (4)
   [junit4]   2> 1632016 INFO  (jetty-launcher-7780-thread-2) [n:127.0.0.1:42199_solr    ] o.a.s.m.r.SolrJmxReporter JMX monitoring for 'solr_42199.solr.node' (registry 'solr.node') enabled at server: com.sun.jmx.mbeanserver.JmxMBeanServer@3d0adef1
   [junit4]   2> 1632017 INFO  (jetty-launcher-7780-thread-1) [n:127.0.0.1:39323_solr    ] o.a.s.m.r.SolrJmxReporter JMX monitoring for 'solr_39323.solr.node' (registry 'solr.node') enabled at server: com.sun.jmx.mbeanserver.JmxMBeanServer@3d0adef1
   [junit4]   2> 1632017 INFO  (jetty-launcher-7780-thread-4) [n:127.0.0.1:42221_solr    ] o.a.s.m.r.SolrJmxReporter JMX monitoring for 'solr_42221.solr.node' (registry 'solr.node') enabled at server: com.sun.jmx.mbeanserver.JmxMBeanServer@3d0adef1
   [junit4]   2> 1632024 INFO  (jetty-launcher-7780-thread-2) [n:127.0.0.1:42199_solr    ] o.a.s.m.r.SolrJmxReporter JMX monitoring for 'solr_42199.solr.jvm' (registry 'solr.jvm') enabled at server: com.sun.jmx.mbeanserver.JmxMBeanServer@3d0adef1
   [junit4]   2> 1632024 INFO  (jetty-launcher-7780-thread-2) [n:127.0.0.1:42199_solr    ] o.a.s.m.r.SolrJmxReporter JMX monitoring for 'solr_42199.solr.jetty' (registry 'solr.jetty') enabled at server: com.sun.jmx.mbeanserver.JmxMBeanServer@3d0adef1
   [junit4]   2> 1632025 INFO  (jetty-launcher-7780-thread-4) [n:127.0.0.1:42221_solr    ] o.a.s.m.r.SolrJmxReporter JMX monitoring for 'solr_42221.solr.jvm' (registry 'solr.jvm') enabled at server: com.sun.jmx.mbeanserver.JmxMBeanServer@3d0adef1
   [junit4]   2> 1632025 INFO  (jetty-launcher-7780-thread-4) [n:127.0.0.1:42221_solr    ] o.a.s.m.r.SolrJmxReporter JMX monitoring for 'solr_42221.solr.jetty' (registry 'solr.jetty') enabled at server: com.sun.jmx.mbeanserver.JmxMBeanServer@3d0adef1
   [junit4]   2> 1632025 INFO  (jetty-launcher-7780-thread-1) [n:127.0.0.1:39323_solr    ] o.a.s.m.r.SolrJmxReporter JMX monitoring for 'solr_39323.solr.jvm' (registry 'solr.jvm') enabled at server: com.sun.jmx.mbeanserver.JmxMBeanServer@3d0adef1
   [junit4]   2> 1632025 INFO  (jetty-launcher-7780-thread-1) [n:127.0.0.1:39323_solr    ] o.a.s.m.r.SolrJmxReporter JMX monitoring for 'solr_39323.solr.jetty' (registry 'solr.jetty') enabled at server: com.sun.jmx.mbeanserver.JmxMBeanServer@3d0adef1
   [junit4]   2> 1632025 INFO  (jetty-launcher-7780-thread-2) [n:127.0.0.1:42199_solr    ] o.a.s.c.CorePropertiesLocator Found 0 core definitions underneath /home/jenkins/workspace/Lucene-Solr-master-Linux/solr/build/solr-core/test/J2/temp/solr.cloud.autoscaling.SearchRateTriggerTest_F6BD4087D0C1623E-001/tempDir-001/node2/.
   [junit4]   2> 1632025 INFO  (jetty-launcher-7780-thread-4) [n:127.0.0.1:42221_solr    ] o.a.s.c.CorePropertiesLocator Found 0 core definitions underneath /home/jenkins/workspace/Lucene-Solr-master-Linux/solr/build/solr-core/test/J2/temp/solr.cloud.autoscaling.SearchRateTriggerTest_F6BD4087D0C1623E-001/tempDir-001/node4/.
   [junit4]   2> 1632026 INFO  (jetty-launcher-7780-thread-1) [n:127.0.0.1:39323_solr    ] o.a.s.c.CorePropertiesLocator Found 0 core definitions underneath /home/jenkins/workspace/Lucene-Solr-master-Linux/solr/build/solr-core/test/J2/temp/solr.cloud.autoscaling.SearchRateTriggerTest_F6BD4087D0C1623E-001/tempDir-001/node1/.
   [junit4]   2> 1632028 INFO  (zkConnectionManagerCallback-7833-thread-1) [    ] o.a.s.c.c.ConnectionManager zkClient has connected
   [junit4]   2> 1632029 INFO  (jetty-launcher-7780-thread-2) [n:127.0.0.1:42199_solr    ] o.a.s.c.c.ZkStateReader Updated live nodes from ZooKeeper... (0) -> (4)
   [junit4]   2> 1632030 INFO  (zkConnectionManagerCallback-7838-thread-1) [    ] o.a.s.c.c.ConnectionManager zkClient has connected
   [junit4]   2> 1632030 INFO  (jetty-launcher-7780-thread-2) [n:127.0.0.1:42199_solr    ] o.a.s.c.s.i.ZkClientClusterStateProvider Cluster at 127.0.0.1:41117/solr ready
   [junit4]   2> 1632032 INFO  (jetty-launcher-7780-thread-1) [n:127.0.0.1:39323_solr    ] o.a.s.c.c.ZkStateReader Updated live nodes from ZooKeeper... (0) -> (4)
   [junit4]   2> 1632032 INFO  (jetty-launcher-7780-thread-1) [n:127.0.0.1:39323_solr    ] o.a.s.c.s.i.ZkClientClusterStateProvider Cluster at 127.0.0.1:41117/solr ready
   [junit4]   2> 1632109 INFO  (jetty-launcher-7780-thread-3) [n:127.0.0.1:45285_solr    ] o.a.s.m.r.SolrJmxReporter JMX monitoring for 'solr_45285.solr.node' (registry 'solr.node') enabled at server: com.sun.jmx.mbeanserver.JmxMBeanServer@3d0adef1
   [junit4]   2> 1632114 INFO  (jetty-launcher-7780-thread-3) [n:127.0.0.1:45285_solr    ] o.a.s.m.r.SolrJmxReporter JMX monitoring for 'solr_45285.solr.jvm' (registry 'solr.jvm') enabled at server: com.sun.jmx.mbeanserver.JmxMBeanServer@3d0adef1
   [junit4]   2> 1632114 INFO  (jetty-launcher-7780-thread-3) [n:127.0.0.1:45285_solr    ] o.a.s.m.r.SolrJmxReporter JMX monitoring for 'solr_45285.solr.jetty' (registry 'solr.jetty') enabled at server: com.sun.jmx.mbeanserver.JmxMBeanServer@3d0adef1
   [junit4]   2> 1632115 INFO  (jetty-launcher-7780-thread-3) [n:127.0.0.1:45285_solr    ] o.a.s.c.CorePropertiesLocator Found 0 core definitions underneath /home/jenkins/workspace/Lucene-Solr-master-Linux/solr/build/solr-core/test/J2/temp/solr.cloud.autoscaling.SearchRateTriggerTest_F6BD4087D0C1623E-001/tempDir-001/node3/.
   [junit4]   2> 1632117 INFO  (zkConnectionManagerCallback-7843-thread-1) [    ] o.a.s.c.c.ConnectionManager zkClient has connected
   [junit4]   2> 1632118 INFO  (jetty-launcher-7780-thread-3) [n:127.0.0.1:45285_solr    ] o.a.s.c.c.ZkStateReader Updated live nodes from ZooKeeper... (0) -> (4)
   [junit4]   2> 1632118 INFO  (jetty-launcher-7780-thread-3) [n:127.0.0.1:45285_solr    ] o.a.s.c.s.i.ZkClientClusterStateProvider Cluster at 127.0.0.1:41117/solr ready
   [junit4]   2> 1632140 INFO  (zkConnectionManagerCallback-7845-thread-1) [    ] o.a.s.c.c.ConnectionManager zkClient has connected
   [junit4]   2> 1632142 INFO  (zkConnectionManagerCallback-7850-thread-1) [    ] o.a.s.c.c.ConnectionManager zkClient has connected
   [junit4]   2> 1632143 INFO  (SUITE-SearchRateTriggerTest-seed#[F6BD4087D0C1623E]-worker) [    ] o.a.s.c.c.ZkStateReader Updated live nodes from ZooKeeper... (0) -> (4)
   [junit4]   2> 1632143 INFO  (SUITE-SearchRateTriggerTest-seed#[F6BD4087D0C1623E]-worker) [    ] o.a.s.c.s.i.ZkClientClusterStateProvider Cluster at 127.0.0.1:41117/solr ready
   [junit4]   2> 1632157 INFO  (TEST-SearchRateTriggerTest.testTrigger-seed#[F6BD4087D0C1623E]) [    ] o.a.s.c.c.ZkStateReader Updated live nodes from ZooKeeper... (0) -> (4)
   [junit4]   2> 1632159 INFO  (qtp84213518-23483) [n:127.0.0.1:39323_solr    ] o.a.s.h.a.CollectionsHandler Invoked Collection Action :create with params replicationFactor=2&collection.configName=conf&maxShardsPerNode=1&name=SearchRateTriggerTest-collection1&nrtReplicas=2&action=CREATE&numShards=2&wt=javabin&version=2 and sendToOCPQueue=true
   [junit4]   2> 1632160 INFO  (OverseerThreadFactory-8681-thread-1) [    ] o.a.s.c.a.c.CreateCollectionCmd Create collection SearchRateTriggerTest-collection1
   [junit4]   2> 1632264 INFO  (OverseerStateUpdate-72084728193744905-127.0.0.1:42221_solr-n_0000000000) [    ] o.a.s.c.o.SliceMutator createReplica() {
   [junit4]   2>   "operation":"ADDREPLICA",
   [junit4]   2>   "collection":"SearchRateTriggerTest-collection1",
   [junit4]   2>   "shard":"shard1",
   [junit4]   2>   "core":"SearchRateTriggerTest-collection1_shard1_replica_n1",
   [junit4]   2>   "state":"down",
   [junit4]   2>   "base_url":"http://127.0.0.1:45285/solr",
   [junit4]   2>   "type":"NRT",
   [junit4]   2>   "waitForFinalState":"false"} 
   [junit4]   2> 1632265 INFO  (OverseerStateUpdate-72084728193744905-127.0.0.1:42221_solr-n_0000000000) [    ] o.a.s.c.o.SliceMutator createReplica() {
   [junit4]   2>   "operation":"ADDREPLICA",
   [junit4]   2>   "collection":"SearchRateTriggerTest-collection1",
   [junit4]   2>   "shard":"shard1",
   [junit4]   2>   "core":"SearchRateTriggerTest-collection1_shard1_replica_n2",
   [junit4]   2>   "state":"down",
   [junit4]   2>   "base_url":"http://127.0.0.1:42199/solr",
   [junit4]   2>   "type":"NRT",
   [junit4]   2>   "waitForFinalState":"false"} 
   [junit4]   2> 1632266 INFO  (OverseerStateUpdate-72084728193744905-127.0.0.1:42221_solr-n_0000000000) [    ] o.a.s.c.o.SliceMutator createReplica() {
   [junit4]   2>   "operation":"ADDREPLICA",
   [junit4]   2>   "collection":"SearchRateTriggerTest-collection1",
   [junit4]   2>   "shard":"shard2",
   [junit4]   2>   "core":"SearchRateTriggerTest-collection1_shard2_replica_n4",
   [junit4]   2>   "state":"down",
   [junit4]   2>   "base_url":"http://127.0.0.1:39323/solr",
   [junit4]   2>   "type":"NRT",
   [junit4]   2>   "waitForFinalState":"false"} 
   [junit4]   2> 1632266 INFO  (OverseerStateUpdate-72084728193744905-127.0.0.1:42221_solr-n_0000000000) [    ] o.a.s.c.o.SliceMutator createReplica() {
   [junit4]   2>   "operation":"ADDREPLICA",
   [junit4]   2>   "collection":"SearchRateTriggerTest-collection1",
   [junit4]   2>   "shard":"shard2",
   [junit4]   2>   "core":"SearchRateTriggerTest-collection1_shard2_replica_n6",
   [junit4]   2>   "state":"down",
   [junit4]   2>   "base_url":"http://127.0.0.1:42221/solr",
   [junit4]   2>   "type":"NRT",
   [junit4]   2>   "waitForFinalState":"false"} 
   [junit4]   2> 1632469 INFO  (qtp84213518-23457) [n:127.0.0.1:39323_solr    x:SearchRateTriggerTest-collection1_shard2_replica_n4] o.a.s.h.a.CoreAdminOperation core create command qt=/admin/cores&coreNodeName=core_node7&collection.configName=conf&newCollection=true&name=SearchRateTriggerTest-collection1_shard2_replica_n4&action=CREATE&numShards=2&collection=SearchRateTriggerTest-collection1&shard=shard2&wt=javabin&version=2&replicaType=NRT
   [junit4]   2> 1632469 INFO  (qtp674343881-23482) [n:127.0.0.1:45285_solr    x:SearchRateTriggerTest-collection1_shard1_replica_n1] o.a.s.h.a.CoreAdminOperation core create command qt=/admin/cores&coreNodeName=core_node3&collection.configName=conf&newCollection=true&name=SearchRateTriggerTest-collection1_shard1_replica_n1&action=CREATE&numShards=2&collection=SearchRateTriggerTest-collection1&shard=shard1&wt=javabin&version=2&replicaType=NRT
   [junit4]   2> 1632469 INFO  (qtp674343881-23482) [n:127.0.0.1:45285_solr    x:SearchRateTriggerTest-collection1_shard1_replica_n1] o.a.s.c.TransientSolrCoreCacheDefault Allocating transient cache for 2147483647 transient cores
   [junit4]   2> 1632469 INFO  (qtp84213518-23457) [n:127.0.0.1:39323_solr    x:SearchRateTriggerTest-collection1_shard2_replica_n4] o.a.s.c.TransientSolrCoreCacheDefault Allocating transient cache for 2147483647 transient cores
   [junit4]   2> 1632470 INFO  (qtp810516989-23478) [n:127.0.0.1:42221_solr    x:SearchRateTriggerTest-collection1_shard2_replica_n6] o.a.s.h.a.CoreAdminOperation core create command qt=/admin/cores&coreNodeName=core_node8&collection.configName=conf&newCollection=true&name=SearchRateTriggerTest-collection1_shard2_replica_n6&action=CREATE&numShards=2&collection=SearchRateTriggerTest-collection1&shard=shard2&wt=javabin&version=2&replicaType=NRT
   [junit4]   2> 1632470 INFO  (qtp1539286898-23471) [n:127.0.0.1:42199_solr    x:SearchRateTriggerTest-collection1_shard1_replica_n2] o.a.s.h.a.CoreAdminOperation core create command qt=/admin/cores&coreNodeName=core_node5&collection.configName=conf&newCollection=true&name=SearchRateTriggerTest-collection1_shard1_replica_n2&action=CREATE&numShards=2&collection=SearchRateTriggerTest-collection1&shard=shard1&wt=javabin&version=2&replicaType=NRT
   [junit4]   2> 1632470 INFO  (qtp1539286898-23471) [n:127.0.0.1:42199_solr    x:SearchRateTriggerTest-collection1_shard1_replica_n2] o.a.s.c.TransientSolrCoreCacheDefault Allocating transient cache for 2147483647 transient cores
   [junit4]   2> 1633475 INFO  (qtp1539286898-23471) [n:127.0.0.1:42199_solr c:SearchRateTriggerTest-collection1 s:shard1 r:core_node5 x:SearchRateTriggerTest-collection1_shard1_replica_n2] o.a.s.c.SolrConfig Using Lucene MatchVersion: 8.0.0
   [junit4]   2> 1633475 INFO  (qtp810516989-23478) [n:127.0.0.1:42221_solr c:SearchRateTriggerTest-collection1 s:shard2 r:core_node8 x:SearchRateTriggerTest-collection1_shard2_replica_n6] o.a.s.c.SolrConfig Using Lucene MatchVersion: 8.0.0
   [junit4]   2> 1633475 INFO  (qtp674343881-23482) [n:127.0.0.1:45285_solr c:SearchRateTriggerTest-collection1 s:shard1 r:core_node3 x:SearchRateTriggerTest-collection1_shard1_replica_n1] o.a.s.c.SolrConfig Using Lucene MatchVersion: 8.0.0
   [junit4]   2> 1633476 INFO  (qtp84213518-23457) [n:127.0.0.1:39323_solr c:SearchRateTriggerTest-collection1 s:shard2 r:core_node7 x:SearchRateTriggerTest-collection1_shard2_replica_n4] o.a.s.c.SolrConfig Using Lucene MatchVersion: 8.0.0
   [junit4]   2> 1633484 INFO  (qtp1539286898-23471) [n:127.0.0.1:42199_solr c:SearchRateTriggerTest-collection1 s:shard1 r:core_node5 x:SearchRateTriggerTest-collection1_shard1_replica_n2] o.a.s.s.IndexSchema [SearchRateTriggerTest-collection1_shard1_replica_n2] Schema name=minimal
   [junit4]   2> 1633484 INFO  (qtp810516989-23478) [n:127.0.0.1:42221_solr c:SearchRateTriggerTest-collection1 s:shard2 r:core_node8 x:SearchRateTriggerTest-collection1_shard2_replica_n6] o.a.s.s.IndexSchema [SearchRateTriggerTest-collection1_shard2_replica_n6] Schema name=minimal
   [junit4]   2> 1633485 INFO  (qtp674343881-23482) [n:127.0.0.1:45285_solr c:SearchRateTriggerTest-collection1 s:shard1 r:core_node3 x:SearchRateTriggerTest-collection1_shard1_replica_n1] o.a.s.s.IndexSchema [SearchRateTriggerTest-collection1_shard1_replica_n1] Schema name=minimal
   [junit4]   2> 1633485 INFO  (qtp84213518-23457) [n:127.0.0.1:39323_solr c:SearchRateTriggerTest-collection1 s:shard2 r:core_node7 x:SearchRateTriggerTest-collection1_shard2_replica_n4] o.a.s.s.IndexSchema [SearchRateTriggerTest-collection1_shard2_replica_n4] Schema name=minimal
   [junit4]   2> 1633485 INFO  (qtp1539286898-23471) [n:127.0.0.1:42199_solr c:SearchRateTriggerTest-collection1 s:shard1 r:core_node5 x:SearchRateTriggerTest-collection1_shard1_replica_n2] o.a.s.s.IndexSchema Loaded schema minimal/1.1 with uniqueid field id
   [junit4]   2> 1633485 INFO  (qtp1539286898-23471) [n:127.0.0.1:42199_solr c:SearchRateTriggerTest-collection1 s:shard1 r:core_node5 x:SearchRateTriggerTest-collection1_shard1_replica_n2] o.a.s.c.CoreContainer Creating SolrCore 'SearchRateTriggerTest-collection1_shard1_replica_n2' using configuration from collection SearchRateTriggerTest-collection1, trusted=true
   [junit4]   2> 1633485 INFO  (qtp810516989-23478) [n:127.0.0.1:42221_solr c:SearchRateTriggerTest-collection1 s:shard2 r:core_node8 x:SearchRateTriggerTest-collection1_shard2_replica_n6] o.a.s.s.IndexSchema Loaded schema minimal/1.1 with uniqueid field id
   [junit4]   2> 1633485 INFO  (qtp810516989-23478) [n:127.0.0.1:42221_solr c:SearchRateTriggerTest-collection1 s:shard2 r:core_node8 x:SearchRateTriggerTest-collection1_shard2_replica_n6] o.a.s.c.CoreContainer Creating SolrCore 'SearchRateTriggerTest-collection1_shard2_replica_n6' using configuration from collection SearchRateTriggerTest-collection1, trusted=true
   [junit4]   2> 1633485 INFO  (qtp1539286898-23471) [n:127.0.0.1:42199_solr c:SearchRateTriggerTest-collection1 s:shard1 r:core_node5 x:SearchRateTriggerTest-collection1_shard1_replica_n2] o.a.s.m.r.SolrJmxReporter JMX monitoring for 'solr_42199.solr.core.SearchRateTriggerTest-collection1.shard1.replica_n2' (registry 'solr.core.SearchRateTriggerTest-collection1.shard1.replica_n2') enabled at server: com.sun.jmx.mbeanserver.JmxMBeanServer@3d0adef1
   [junit4]   2> 1633485 INFO  (qtp810516989-23478) [n:127.0.0.1:42221_solr c:SearchRateTriggerTest-collection1 s:shard2 r:core_node8 x:SearchRateTriggerTest-collection1_shard2_replica_n6] o.a.s.m.r.SolrJmxReporter JMX monitoring for 'solr_42221.solr.core.SearchRateTriggerTest-collection1.shard2.replica_n6' (registry 'solr.core.SearchRateTriggerTest-collection1.shard2.replica_n6') enabled at server: com.sun.jmx.mbeanserver.JmxMBeanServer@3d0adef1
   [junit4]   2> 1633485 INFO  (qtp1539286898-23471) [n:127.0.0.1:42199_solr c:SearchRateTriggerTest-collection1 s:shard1 r:core_node5 x:SearchRateTriggerTest-collection1_shard1_replica_n2] o.a.s.c.SolrCore solr.RecoveryStrategy.Builder
   [junit4]   2> 1633486 INFO  (qtp674343881-23482) [n:127.0.0.1:45285_solr c:SearchRateTriggerTest-collection1 s:shard1 r:core_node3 x:SearchRateTriggerTest-collection1_shard1_replica_n1] o.a.s.s.IndexSchema Loaded schema minimal/1.1 with uniqueid field id
   [junit4]   2> 1633486 INFO  (qtp1539286898-23471) [n:127.0.0.1:42199_solr c:SearchRateTriggerTest-collection1 s:shard1 r:core_node5 x:SearchRateTriggerTest-collection1_shard1_replica_n2] o.a.s.c.SolrCore [[SearchRateTriggerTest-collection1_shard1_replica_n2] ] Opening new SolrCore at [/home/jenkins/workspace/Lucene-Solr-master-Linux/solr/build/solr-core/test/J2/temp/solr.cloud.autoscaling.SearchRateTriggerTest_F6BD4087D0C1623E-001/tempDir-001/node2/SearchRateTriggerTest-collection1_shard1_replica_n2], dataDir=[/home/jenkins/workspace/Lucene-Solr-master-Linux/solr/build/solr-core/test/J2/temp/solr.cloud.autoscaling.SearchRateTriggerTest_F6BD4087D0C1623E-001/tempDir-001/node2/./SearchRateTriggerTest-collection1_shard1_replica_n2/data/]
   [junit4]   2> 1633486 INFO  (qtp810516989-23478) [n:127.0.0.1:42221_solr c:SearchRateTriggerTest-collection1 s:shard2 r:core_node8 x:SearchRateTriggerTest-collection1_shard2_replica_n6] o.a.s.c.SolrCore solr.RecoveryStrategy.Builder
   [junit4]   2> 1633486 INFO  (qtp674343881-23482) [n:127.0.0.1:45285_solr c:SearchRateTriggerTest-collection1 s:shard1 r:core_node3 x:SearchRateTriggerTest-collection1_shard1_replica_n1] o.a.s.c.CoreContainer Creating SolrCore 'SearchRateTriggerTest-collection1_shard1_replica_n1' using configuration from collection SearchRateTriggerTest-collection1, trusted=true
   [junit4]   2> 1633486 INFO  (qtp810516989-23478) [n:127.0.0.1:42221_solr c:SearchRateTriggerTest-collection1 s:shard2 r:core_node8 x:SearchRateTriggerTest-collection1_shard2_replica_n6] o.a.s.c.SolrCore [[SearchRateTriggerTest-collection1_shard2_replica_n6] ] Opening new SolrCore at [/home/jenkins/workspace/Lucene-Solr-master-Linux/solr/build/solr-core/test/J2/temp/solr.cloud.autoscaling.SearchRateTriggerTest_F6BD4087D0C1623E-001/tempDir-001/node4/SearchRateTriggerTest-collection1_shard2_replica_n6], dataDir=[/home/jenkins/workspace/Lucene-Solr-master-Linux/solr/build/solr-core/test/J2/temp/solr.cloud.autoscaling.SearchRateTriggerTest_F6BD4087D0C1623E-001/tempDir-001/node4/./SearchRateTriggerTest-collection1_shard2_replica_n6/data/]
   [junit4]   2> 1633486 INFO  (qtp674343881-23482) [n:127.0.0.1:45285_solr c:SearchRateTriggerTest-collection1 s:shard1 r:core_node3 x:SearchRateTriggerTest-collection1_shard1_replica_n1] o.a.s.m.r.SolrJmxReporter JMX monitoring for 'solr_45285.solr.core.SearchRateTriggerTest-collection1.shard1.replica_n1' (registry 'solr.core.SearchRateTriggerTest-collection1.shard1.replica_n1') enabled at server: com.sun.jmx.mbeanserver.JmxMBeanServer@3d0adef1
   [junit4]   2> 1633486 INFO  (qtp674343881-23482) [n:127.0.0.1:45285_solr c:SearchRateTriggerTest-collection1 s:shard1 r:core_node3 x:SearchRateTriggerTest-collection1_shard1_replica_n1] o.a.s.c.SolrCore solr.RecoveryStrategy.Builder
   [junit4]   2> 1633486 INFO  (qtp674343881-23482) [n:127.0.0.1:45285_solr c:SearchRateTriggerTest-collection1 s:shard1 r:core_node3 x:SearchRateTriggerTest-collection1_shard1_replica_n1] o.a.s.c.SolrCore [[SearchRateTriggerTest-collection1_shard1_replica_n1] ] Opening new SolrCore at [/home/jenkins/workspace/Lucene-Solr-master-Linux/solr/build/solr-core/test/J2/temp/solr.cloud.autoscaling.SearchRateTriggerTest_F6BD4087D0C1623E-001/tempDir-001/node3/SearchRateTriggerTest-collection1_shard1_replica_n1], dataDir=[/home/jenkins/workspace/Lucene-Solr-master-Linux/solr/build/solr-core/test/J2/temp/solr.cloud.autoscaling.SearchRateTriggerTest_F6BD4087D0C1623E-001/tempDir-001/node3/./SearchRateTriggerTest-collection1_shard1_replica_n1/data/]
   [junit4]   2> 1633486 INFO  (qtp84213518-23457) [n:127.0.0.1:39323_solr c:SearchRateTriggerTest-collection1 s:shard2 r:core_node7 x:SearchRateTriggerTest-collection1_shard2_replica_n4] o.a.s.s.IndexSchema Loaded schema minimal/1.1 with uniqueid field id
   [junit4]   2> 1633486 INFO  (qtp84213518-23457) [n:127.0.0.1:39323_solr c:SearchRateTriggerTest-collection1 s:shard2 r:core_node7 x:SearchRateTriggerTest-collection1_shard2_replica_n4] o.a.s.c.CoreContainer Creating SolrCore 'SearchRateTriggerTest-collection1_shard2_replica_n4' using configuration from collection SearchRateTriggerTest-collection1, trusted=true
   [junit4]   2> 1633486 INFO  (qtp84213518-23457) [n:127.0.0.1:39323_solr c:SearchRateTriggerTest-collection1 s:shard2 r:core_node7 x:SearchRateTriggerTest-collection1_shard2_replica_n4] o.a.s.m.r.SolrJmxReporter JMX monitoring for 'solr_39323.solr.core.SearchRateTriggerTest-collection1.shard2.replica_n4' (registry 'solr.core.SearchRateTriggerTest-collection1.shard2.replica_n4') enabled at server: com.sun.jmx.mbeanserver.JmxMBeanServer@3d0adef1
   [junit4]   2> 1633486 INFO  (qtp84213518-23457) [n:127.0.0.1:39323_solr c:SearchRateTriggerTest-collection1 s:shard2 r:core_node7 x:SearchRateTriggerTest-collection1_shard2_replica_n4] o.a.s.c.SolrCore solr.RecoveryStrategy.Builder
   [junit4]   2> 1633486 INFO  (qtp84213518-23457) [n:127.0.0.1:39323_solr c:SearchRateTriggerTest-collection1 s:shard2 r:core_node7 x:SearchRateTriggerTest-collection1_shard2_replica_n4] o.a.s.c.SolrCore [[SearchRateTriggerTest-collection1_shard2_replica_n4] ] Opening new SolrCore at [/home/jenkins/workspace/Lucene-Solr-master-Linux/solr/build/solr-core/test/J2/temp/solr.cloud.autoscaling.SearchRateTriggerTest_F6BD4087D0C1623E-001/tempDir-001/node1/SearchRateTriggerTest-collection1_shard2_replica_n4], dataDir=[/home/jenkins/workspace/Lucene-Solr-master-Linux/solr/build/solr-core/test/J2/temp/solr.cloud.autoscaling.SearchRateTriggerTest_F6BD4087D0C1623E-001/tempDir-001/node1/./SearchRateTriggerTest-collection1_shard2_replica_n4/data/]
   [junit4]   2> 1633528 INFO  (qtp674343881-23482) [n:127.0.0.1:45285_solr c:SearchRateTriggerTest-collection1 s:shard1 r:core_node3 x:SearchRateTriggerTest-collection1_shard1_replica_n1] o.a.s.u.UpdateHandler Using UpdateLog implementation: org.apache.solr.update.UpdateLog
   [junit4]   2> 1633528 INFO  (qtp674343881-23482) [n:127.0.0.1:45285_solr c:SearchRateTriggerTest-collection1 s:shard1 r:core_node3 x:SearchRateTriggerTest-collection1_shard1_replica_n1] o.a.s.u.UpdateLog Initializing UpdateLog: dataDir=null defaultSyncLevel=FLUSH numRecordsToKeep=100 maxNumLogsToKeep=10 numVersionBuckets=65536
   [junit4]   2> 1633534 INFO  (qtp84213518-23457) [n:127.0.0.1:39323_solr c:SearchRateTriggerTest-collection1 s:shard2 r:core_node7 x:SearchRateTriggerTest-collection1_shard2_replica_n4] o.a.s.u.UpdateHandler Using UpdateLog implementation: org.apache.solr.update.UpdateLog
   [junit4]   2> 1633534 INFO  (qtp84213518-23457) [n:127.0.0.1:39323_solr c:SearchRateTriggerTest-collection1 s:shard2 r:core_node7 x:SearchRateTriggerTest-collection1_shard2_replica_n4] o.a.s.u.UpdateLog Initializing UpdateLog: dataDir=null defaultSyncLevel=FLUSH numRecordsToKeep=100 maxNumLogsToKeep=10 numVersionBuckets=65536
   [junit4]   2> 1633534 INFO  (qtp674343881-23482) [n:127.0.0.1:45285_solr c:SearchRateTriggerTest-collection1 s:shard1 r:core_node3 x:SearchRateTriggerTest-collection1_shard1_replica_n1] o.a.s.u.CommitTracker Hard AutoCommit: disabled
   [junit4]   2> 1633534 INFO  (qtp674343881-23482) [n:127.0.0.1:45285_solr c:SearchRateTriggerTest-collection1 s:shard1 r:core_node3 x:SearchRateTriggerTest-collection1_shard1_replica_n1] o.a.s.u.CommitTracker Soft AutoCommit: disabled
   [junit4]   2> 1633534 INFO  (qtp84213518-23457) [n:127.0.0.1:39323_solr c:SearchRateTriggerTest-collection1 s:shard2 r:core_node7 x:SearchRateTriggerTest-collection1_shard2_replica_n4] o.a.s.u.CommitTracker Hard AutoCommit: disabled
   [junit4]   2> 1633534 INFO  (qtp84213518-23457) [n:127.0.0.1:39323_solr c:SearchRateTriggerTest-collection1 s:shard2 r:core_node7 x:SearchRateTriggerTest-collection1_shard2_replica_n4] o.a.s.u.CommitTracker Soft AutoCommit: disabled
   [junit4]   2> 1633535 INFO  (qtp810516989-23478) [n:127.0.0.1:42221_solr c:SearchRateTriggerTest-collection1 s:shard2 r:core_node8 x:SearchRateTriggerTest-collection1_shard2_replica_n6] o.a.s.u.UpdateHandler Using UpdateLog implementation: org.apache.solr.update.UpdateLog
   [junit4]   2> 1633535 INFO  (qtp810516989-23478) [n:127.0.0.1:42221_solr c:SearchRateTriggerTest-collection1 s:shard2 r:core_node8 x:SearchRateTriggerTest-collection1_shard2_replica_n6] o.a.s.u.UpdateLog Initializing UpdateLog: dataDir=null defaultSyncLevel=FLUSH numRecordsToKeep=100 maxNumLogsToKeep=10 numVersionBuckets=65536
   [junit4]   2> 1633535 INFO  (qtp1539286898-23471) [n:127.0.0.1:42199_solr c:SearchRateTriggerTest-collection1 s:shard1 r:core_node5 x:SearchRateTriggerTest-collection1_shard1_replica_n2] o.a.s.u.UpdateHandler Using UpdateLog implementation: org.apache.solr.update.UpdateLog
   [junit4]   2> 1633535 INFO  (qtp1539286898-23471) [n:127.0.0.1:42199_solr c:SearchRateTriggerTest-collection1 s:shard1 r:core_node5 x:SearchRateTriggerTest-collection1_shard1_replica_n2] o.a.s.u.UpdateLog Initializing UpdateLog: dataDir=null defaultSyncLevel=FLUSH numRecordsToKeep=100 maxNumLogsToKeep=10 numVersionBuckets=65536
   [junit4]   2> 1633536 INFO  (qtp674343881-23482) [n:127.0.0.1:45285_solr c:SearchRateTriggerTest-collection1 s:shard1 r:core_node3 x:SearchRateTriggerTest-collection1_shard1_replica_n1] o.a.s.s.SolrIndexSearcher Opening [Searcher@6edb70c3[SearchRateTriggerTest-collection1_shard1_replica_n1] main]
   [junit4]   2> 1633536 INFO  (qtp84213518-23457) [n:127.0.0.1:39323_solr c:SearchRateTriggerTest-collection1 s:shard2 r:core_node7 x:SearchRateTriggerTest-collection1_shard2_replica_n4] o.a.s.s.SolrIndexSearcher Opening [Searcher@574d18d6[SearchRateTriggerTest-collection1_shard2_replica_n4] main]
   [junit4]   2> 1633536 INFO  (qtp810516989-23478) [n:127.0.0.1:42221_solr c:SearchRateTriggerTest-collection1 s:shard2 r:core_node8 x:SearchRateTriggerTest-collection1_shard2_replica_n6] o.a.s.u.CommitTracker Hard AutoCommit: disabled
   [junit4]   2> 1633536 INFO  (qtp810516989-23478) [n:127.0.0.1:42221_solr c:SearchRateTriggerTest-collection1 s:shard2 r:core_node8 x:SearchRateTriggerTest-collection1_shard2_replica_n6] o.a.s.u.CommitTracker Soft AutoCommit: disabled
   [junit4]   2> 1633536 INFO  (qtp1539286898-23471) [n:127.0.0.1:42199_solr c:SearchRateTriggerTest-collection1 s:shard1 r:core_node5 x:SearchRateTriggerTest-collection1_shard1_replica_n2] o.a.s.u.CommitTracker Hard AutoCommit: disabled
   [junit4]   2> 1633536 INFO  (qtp1539286898-23471) [n:127.0.0.1:42199_solr c:SearchRateTriggerTest-collection1 s:shard1 r:core_node5 x:SearchRateTriggerTest-collection1_shard1_replica_n2] o.a.s.u.CommitTracker Soft AutoCommit: disabled
   [junit4]   2> 1633536 INFO  (qtp674343881-23482) [n:127.0.0.1:45285_solr c:SearchRateTriggerTest-collection1 s:shard1 r:core_node3 x:SearchRateTriggerTest-collection1_shard1_replica_n1] o.a.s.r.ManagedResourceStorage Configured ZooKeeperStorageIO with znodeBase: /configs/conf
   [junit4]   2> 1633536 INFO  (qtp84213518-23457) [n:127.0.0.1:39323_solr c:SearchRateTriggerTest-collection1 s:shard2 r:core_node7 x:SearchRateTriggerTest-collection1_shard2_replica_n4] o.a.s.r.ManagedResourceStorage Configured ZooKeeperStorageIO with znodeBase: /configs/conf
   [junit4]   2> 1633536 INFO  (qtp674343881-23482) [n:127.0.0.1:45285_solr c:SearchRateTriggerTest-collection1 s:shard1 r:core_node3 x:SearchRateTriggerTest-collection1_shard1_replica_n1] o.a.s.r.ManagedResourceStorage Loaded null at path _rest_managed.json using ZooKeeperStorageIO:path=/configs/conf
   [junit4]   2> 1633536 INFO  (qtp84213518-23457) [n:127.0.0.1:39323_solr c:SearchRateTriggerTest-collection1 s:shard2 r:core_node7 x:SearchRateTriggerTest-collection1_shard2_replica_n4] o.a.s.r.ManagedResourceStorage Loaded null at path _rest_managed.json using ZooKeeperStorageIO:path=/configs/conf
   [junit4]   2> 1633537 INFO  (qtp674343881-23482) [n:127.0.0.1:45285_solr c:SearchRateTriggerTest-collection1 s:shard1 r:core_node3 x:SearchRateTriggerTest-collection1_shard1_replica_n1] o.a.s.h.ReplicationHandler Commits will be reserved for 10000ms.
   [junit4]   2> 1633537 INFO  (qtp84213518-23457) [n:127.0.0.1:39323_solr c:SearchRateTriggerTest-collection1 s:shard2 r:core_node7 x:SearchRateTriggerTest-collection1_shard2_replica_n4] o.a.s.h.ReplicationHandler Commits will be reserved for 10000ms.
   [junit4]   2> 1633537 INFO  (qtp810516989-23478) [n:127.0.0.1:42221_solr c:SearchRateTriggerTest-collection1 s:shard2 r:core_node8 x:SearchRateTriggerTest-collection1_shard2_replica_n6] o.a.s.s.SolrIndexSearcher Opening [Searcher@35ed6f7e[SearchRateTriggerTest-collection1_shard2_replica_n6] main]
   [junit4]   2> 1633537 INFO  (qtp1539286898-23471) [n:127.0.0.1:42199_solr c:SearchRateTriggerTest-collection1 s:shard1 r:core_node5 x:SearchRateTriggerTest-collection1_shard1_replica_n2] o.a.s.s.SolrIndexSearcher Opening [Searcher@2c99802f[SearchRateTriggerTest-collection1_shard1_replica_n2] main]
   [junit4]   2> 1633537 INFO  (qtp810516989-23478) [n:127.0.0.1:42221_solr c:SearchRateTriggerTest-collection1 s:shard2 r:core_node8 x:SearchRateTriggerTest-collection1_shard2_replica_n6] o.a.s.r.ManagedResourceStorage Configured ZooKeeperStorageIO with znodeBase: /configs/conf
   [junit4]   2> 1633537 INFO  (searcherExecutor-8693-thread-1-processing-n:127.0.0.1:39323_solr x:SearchRateTriggerTest-collection1_shard2_replica_n4 c:SearchRateTriggerTest-collection1 s:shard2 r:core_node7) [n:127.0.0.1:39323_solr c:SearchRateTriggerTest-collection1 s:shard2 r:core_node7 x:SearchRateTriggerTest-collection1_shard2_replica_n4] o.a.s.c.SolrCore [SearchRateTriggerTest-collection1_shard2_replica_n4] Registered new searcher Searcher@574d18d6[SearchRateTriggerTest-collection1_shard2_replica_n4] main{ExitableDirectoryReader(UninvertingDirectoryReader())}
   [junit4]   2> 1633537 INFO  (searcherExecutor-8692-thread-1-processing-n:127.0.0.1:45285_solr x:SearchRateTriggerTest-collection1_shard1_replica_n1 c:SearchRateTriggerTest-collection1 s:shard1 r:core_node3) [n:127.0.0.1:45285_solr c:SearchRateTriggerTest-collection1 s:shard1 r:core_node3 x:SearchRateTriggerTest-collection1_shard1_replica_n1] o.a.s.c.SolrCore [SearchRateTriggerTest-collection1_shard1_replica_n1] Registered new searcher Searcher@6edb70c3[SearchRateTriggerTest-collection1_shard1_replica_n1] main{ExitableDirectoryReader(UninvertingDirectoryReader())}
   [junit4]   2> 1633537 INFO  (qtp1539286898-23471) [n:127.0.0.1:42199_solr c:SearchRateTriggerTest-collection1 s:shard1 r:core_node5 x:SearchRateTriggerTest-collection1_shard1_replica_n2] o.a.s.r.ManagedResourceStorage Configured ZooKeeperStorageIO with znodeBase: /configs/conf
   [junit4]   2> 1633537 INFO  (qtp674343881-23482) [n:127.0.0.1:45285_solr c:SearchRateTriggerTest-collection1 s:shard1 r:core_node3 x:SearchRateTriggerTest-collection1_shard1_replica_n1] o.a.s.u.UpdateLog Could not find max version in index or recent updates, using new clock 1601419791065677824
   [junit4]   2> 1633537 INFO  (qtp810516989-23478) [n:127.0.0.1:42221_solr c:SearchRateTriggerTest-collection1 s:shard2 r:core_node8 x:SearchRateTriggerTest-collection1_shard2_replica_n6] o.a.s.r.ManagedResourceStorage Loaded null at path _rest_managed.json using ZooKeeperStorageIO:path=/configs/conf
   [junit4]   2> 1633537 INFO  (qtp84213518-23457) [n:127.0.0.1:39323_solr c:SearchRateTriggerTest-collection1 s:shard2 r:core_node7 x:SearchRateTriggerTest-collection1_shard2_replica_n4] o.a.s.u.UpdateLog Could not find max version in index or recent updates, using new clock 1601419791065677824
   [junit4]   2> 1633538 INFO  (qtp1539286898-23471) [n:127.0.0.1:42199_solr c:SearchRateTriggerTest-collection1 s:shard1 r:core_node5 x:SearchRateTriggerTest-collection1_shard1_replica_n2] o.a.s.r.ManagedResourceStorage Loaded null at path _rest_managed.json using ZooKeeperStorageIO:path=/configs/conf
   [junit4]   2> 1633538 INFO  (qtp810516989-23478) [n:127.0.0.1:42221_solr c:SearchRateTriggerTest-collection1 s:shard2 r:core_node8 x:SearchRateTriggerTest-collection1_shard2_replica_n6] o.a.s.h.ReplicationHandler Commits will be reserved for 10000ms.
   [junit4]   2> 1633538 INFO  (qtp1539286898-23471) [n:127.0.0.1:42199_solr c:SearchRateTriggerTest-collection1 s:shard1 r:core_node5 x:SearchRateTriggerTest-collection1_shard1_replica_n2] o.a.s.h.ReplicationHandler Commits will be reserved for 10000ms.
   [junit4]   2> 1633538 INFO  (qtp1539286898-23471) [n:127.0.0.1:42199_solr c:SearchRateTriggerTest-collection1 s:shard1 r:core_node5 x:SearchRateTriggerTest-collection1_shard1_replica_n2] o.a.s.u.UpdateLog Could not find max version in index or recent updates, using new clock 1601419791066726400
   [junit4]   2> 1633538 INFO  (searcherExecutor-8691-thread-1-processing-n:127.0.0.1:42221_solr x:SearchRateTriggerTest-collection1_shard2_replica_n6 c:SearchRateTriggerTest-collection1 s:shard2 r:core_node8) [n:127.0.0.1:42221_solr c:SearchRateTriggerTest-collection1 s:shard2 r:core_node8 x:SearchRateTriggerTest-collection1_shard2_replica_n6] o.a.s.c.SolrCore [SearchRateTriggerTest-collection1_shard2_replica_n6] Registered new searcher Searcher@35ed6f7e[SearchRateTriggerTest-collection1_shard2_replica_n6] main{ExitableDirectoryReader(UninvertingDirectoryReader())}
   [junit4]   2> 1633538 INFO  (qtp810516989-23478) [n:127.0.0.1:42221_solr c:SearchRateTriggerTest-collection1 s:shard2 r:core_node8 x:SearchRateTriggerTest-collection1_shard2_replica_n6] o.a.s.u.UpdateLog Could not find max version in index or recent updates, using new clock 1601419791066726400
   [junit4]   2> 1633540 INFO  (searcherExecutor-8690-thread-1-processing-n:127.0.0.1:42199_solr x:SearchRateTriggerTest-collection1_shard1_replica_n2 c:SearchRateTriggerTest-collection1 s:shard1 r:core_node5) [n:127.0.0.1:42199_solr c:SearchRateTriggerTest-collection1 s:shard1 r:core_node5 x:SearchRateTriggerTest-collection1_shard1_replica_n2] o.a.s.c.SolrCore [SearchRateTriggerTest-collection1_shard1_replica_n2] Registered new searcher Searcher@2c99802f[SearchRateTriggerTest-collection1_shard1_replica_n2] main{ExitableDirectoryReader(UninvertingDirectoryReader())}
   [junit4]   2> 1633541 INFO  (qtp84213518-23457) [n:127.0.0.1:39323_solr c:SearchRateTriggerTest-collection1 s:shard2 r:core_node7 x:SearchRateTriggerTest-collection1_shard2_replica_n4] o.a.s.c.ZkShardTerms Successful update of terms at /collections/SearchRateTriggerTest-collection1/terms/shard2 to Terms{values={core_node7=0}, version=0}
   [junit4]   2> 1633541 INFO  (qtp1539286898-23471) [n:127.0.0.1:42199_solr c:SearchRateTriggerTest-collection1 s:shard1 r:core_node5 x:SearchRateTriggerTest-collection1_shard1_replica_n2] o.a.s.c.ZkShardTerms Successful update of terms at /collections/SearchRateTriggerTest-collection1/terms/shard1 to Terms{values={core_node5=0}, version=0}
   [junit4]   2> 1633542 INFO  (qtp674343881-23482) [n:127.0.0.1:45285_solr c:SearchRateTriggerTest-collection1 s:shard1 r:core_node3 x:SearchRateTriggerTest-collection1_shard1_replica_n1] o.a.s.c.ZkShardTerms Failed to save terms, version is not a match, retrying
   [junit4]   2> 1633542 INFO  (qtp810516989-23478) [n:127.0.0.1:42221_solr c:SearchRateTriggerTest-collection1 s:shard2 r:core_node8 x:SearchRateTriggerTest-collection1_shard2_replica_n6] o.a.s.c.ZkShardTerms Successful update of terms at /collections/SearchRateTriggerTest-collection1/terms/shard2 to Terms{values={core_node7=0, core_node8=0}, version=1}
   [junit4]   2> 1633543 INFO  (qtp674343881-23482) [n:127.0.0.1:45285_solr c:SearchRateTriggerTest-collection1 s:shard1 r:core_node3 x:SearchRateTriggerTest-collection1_shard1_replica_n1] o.a.s.c.ZkShardTerms Successful update of terms at /collections/SearchRateTriggerTest-collection1/terms/shard1 to Terms{values={core_node3=0, core_node5=0}, version=1}
   [junit4]   2> 1633543 INFO  (qtp1539286898-23471) [n:127.0.0.1:42199_solr c:SearchRateTriggerTest-collection1 s:shard1 r:core_node5 x:SearchRateTriggerTest-collection1_shard1_replica_n2] o.a.s.c.ShardLeaderElectionContext Enough replicas found to continue.
   [junit4]   2> 1633543 INFO  (qtp1539286898-23471) [n:127.0.0.1:42199_solr c:SearchRateTriggerTest-collection1 s:shard1 r:core_node5 x:SearchRateTriggerTest-collection1_shard1_replica_n2] o.a.s.c.ShardLeaderElectionContext I may be the new leader - try and sync
   [junit4]   2> 1633543 INFO  (qtp84213518-23457) [n:127.0.0.1:39323_solr c:SearchRateTriggerTest-collection1 s:shard2 r:core_node7 x:SearchRateTriggerTest-collection1_shard2_replica_n4] o.a.s.c.ShardLeaderElectionContext Enough replicas found to continue.
   [junit4]   2> 1633543 INFO  (qtp1539286898-23471) [n:127.0.0.1:42199_solr c:SearchRateTriggerTest-collection1 s:shard1 r:core_node5 x:SearchRateTriggerTest-collection1_shard1_replica_n2] o.a.s.c.SyncStrategy Sync replicas to http://127.0.0.1:42199/solr/SearchRateTriggerTest-collection1_shard1_replica_n2/
   [junit4]   2> 1633544 INFO  (qtp84213518-23457) [n:127.0.0.1:39323_solr c:SearchRateTriggerTest-collection1 s:shard2 r:core_node7 x:SearchRateTriggerTest-collection1_shard2_replica_n4] o.a.s.c.ShardLeaderElectionContext I may be the new leader - try and sync
   [junit4]   2> 1633544 INFO  (qtp84213518-23457) [n:127.0.0.1:39323_solr c:SearchRateTriggerTest-collection1 s:shard2 r:core_node7 x:SearchRateTriggerTest-collection1_shard2_replica_n4] o.a.s.c.SyncStrategy Sync replicas to http://127.0.0.1:39323/solr/SearchRateTriggerTest-collection1_shard2_replica_n4/
   [junit4]   2> 1633544 INFO  (qtp84213518-23457) [n:127.0.0.1:39323_solr c:SearchRateTriggerTest-collection1 s:shard2 r:core_node7 x:SearchRateTriggerTest-collection1_shard2_replica_n4] o.a.s.u.PeerSync PeerSync: core=SearchRateTriggerTest-collection1_shard2_replica_n4 url=http://127.0.0.1:39323/solr START replicas=[http://127.0.0.1:42221/solr/SearchRateTriggerTest-collection1_shard2_replica_n6/] nUpdates=100
   [junit4]   2> 1633544 INFO  (qtp1539286898-23471) [n:127.0.0.1:42199_solr c:SearchRateTriggerTest-collection1 s:shard1 r:core_node5 x:SearchRateTriggerTest-collection1_shard1_replica_n2] o.a.s.u.PeerSync PeerSync: core=SearchRateTriggerTest-collection1_shard1_replica_n2 url=http://127.0.0.1:42199/solr START replicas=[http://127.0.0.1:45285/solr/SearchRateTriggerTest-collection1_shard1_replica_n1/] nUpdates=100
   [junit4]   2> 1633549 INFO  (qtp810516989-23464) [n:127.0.0.1:42221_solr c:SearchRateTriggerTest-collection1 s:shard2 r:core_node8 x:SearchRateTriggerTest-collection1_shard2_replica_n6] o.a.s.c.S.Request [SearchRateTriggerTest-collection1_shard2_replica_n6]  webapp=/solr path=/get params={distrib=false&qt=/get&fingerprint=false&getVersions=100&wt=javabin&version=2} status=0 QTime=4
   [junit4]   2> 1633549 INFO  (qtp674343881-23460) [n:127.0.0.1:45285_solr c:SearchRateTriggerTest-collection1 s:shard1 r:core_node3 x:SearchRateTriggerTest-collection1_shard1_replica_n1] o.a.s.c.S.Request [SearchRateTriggerTest-collection1_shard1_replica_n1]  webapp=/solr path=/get params={distrib=false&qt=/get&fingerprint=false&getVersions=100&wt=javabin&version=2} status=0 QTime=0
   [junit4]   2> 1633844 INFO  (qtp84213518-23457) [n:127.0.0.1:39323_solr c:SearchRateTriggerTest-collection1 s:shard2 r:core_node7 x:SearchRateTriggerTest-collection1_shard2_replica_n4] o.a.s.u.PeerSync PeerSync: core=SearchRateTriggerTest-collection1_shard2_replica_n4 url=http://127.0.0.1:39323/solr DONE.  We have no versions.  sync failed.
   [junit4]   2> 1633844 INFO  (qtp84213518-23457) [n:127.0.0.1:39323_solr c:SearchRateTriggerTest-collection1 s:shard2 r:core_node7 x:SearchRateTriggerTest-collection1_shard2_replica_n4] o.a.s.c.SyncStrategy Leader's attempt to sync with shard failed, moving to the next candidate
   [junit4]   2> 1633844 INFO  (qtp84213518-23457) [n:127.0.0.1:39323_solr c:SearchRateTriggerTest-collection1 s:shard2 r:core_node7 x:SearchRateTriggerTest-collection1_shard2_replica_n4] o.a.s.c.ShardLeaderElectionContext We failed sync, but we have no versions - we can't sync in that case - we were active before, so become leader anyway
   [junit4]   2> 1633844 INFO  (qtp84213518-23457) [n:127.0.0.1:39323_solr c:SearchRateTriggerTest-collection1 s:shard2 r:core_node7 x:SearchRateTriggerTest-collection1_shard2_replica_n4] o.a.s.c.ShardLeaderElectionContext Found all replicas participating in election, clear LIR
   [junit4]   2> 1633844 INFO  (qtp1539286898-23471) [n:127.0.0.1:42199_solr c:SearchRateTriggerTest-collection1 s:shard1 r:core_node5 x:SearchRateTriggerTest-collection1_shard1_replica_n2] o.a.s.u.PeerSync PeerSync: core=SearchRateTriggerTest-collection1_shard1_replica_n2 url=http://127.0.0.1:42199/solr DONE.  We have no versions.  sync failed.
   [junit4]   2> 1633844 INFO  (qtp1539286898-23471) [n:127.0.0.1:42199_solr c:SearchRateTriggerTest-collection1 s:shard1 r:core_node5 x:SearchRateTriggerTest-collection1_shard1_replica_n2] o.a.s.c.SyncStrategy Leader's attempt to sync with shard failed, moving to the next candidate
   [junit4]   2> 1633844 INFO  (qtp1539286898-23471) [n:127.0.0.1:42199_solr c:SearchRateTriggerTest-collection1 s:shard1 r:core_node5 x:SearchRateTriggerTest-collection1_shard1_replica_n2] o.a.s.c.ShardLeaderElectionContext We failed sync, but we have no versions - we can't sync in that case - we were active before, so become leader anyway
   [junit4]   2> 1633844 INFO  (qtp1539286898-23471) [n:127.0.0.1:42199_solr c:SearchRateTriggerTest-collection1 s:shard1 r:core_node5 x:SearchRateTriggerTest-collection1_shard1_replica_n2] o.a.s.c.ShardLeaderElectionContext Found all replicas participating in election, clear LIR
   [junit4]   2> 1633846 INFO  (qtp1539286898-23471) [n:127.0.0.1:42199_solr c:SearchRateTriggerTest-collection1 s:shard1 r:core_node5 x:SearchRateTriggerTest-collection1_shard1_replica_n2] o.a.s.c.ShardLeaderElectionContext I am the new leader: http://127.0.0.1:42199/solr/SearchRateTriggerTest-collection1_shard1_replica_n2/ shard1
   [junit4]   2> 1633846 INFO  (qtp84213518-23457) [n:127.0.0.1:39323_solr c:SearchRateTriggerTest-collection1 s:shard2 r:core_node7 x:SearchRateTriggerTest-collection1_shard2_replica_n4] o.a.s.c.ShardLeaderElectionContext I am the new leader: http://127.0.0.1:39323/solr/SearchRateTriggerTest-collection1_shard2_replica_n4/ shard2
   [junit4]   2> 1633947 INFO  (qtp84213518-23457) [n:127.0.0.1:39323_solr c:SearchRateTriggerTest-collection1 s:shard2 r:core_node7 x:SearchRateTriggerTest-collection1_shard2_replica_n4] o.a.s.c.ZkController I am the leader, no recovery necessary
   [junit4]   2> 1633947 INFO  (qtp1539286898-23471) [n:127.0.0.1:42199_solr c:SearchRateTriggerTest-collection1 s:shard1 r:core_node5 x:SearchRateTriggerTest-collection1_shard1_replica_n2] o.a.s.c.ZkController I am the leader, no recovery necessary
   [junit4]   2> 1633949 INFO  (qtp84213518-23457) [n:127.0.0.1:39323_solr c:SearchRateTriggerTest-collection1 s:shard2 r:core_node7 x:SearchRateTriggerTest-collection1_shard2_replica_n4] o.a.s.s.HttpSolrCall [admin] webapp=null path=/admin/cores params={qt=/admin/cores&coreNodeName=core_node7&collection.configName=conf&newCollection=true&name=SearchRateTriggerTest-collection1_shard2_replica_n4&action=CREATE&numShards=2&collection=SearchRateTriggerTest-collection1&shard=shard2&wt=javabin&version=2&replicaType=NRT} status=0 QTime=1480
   [junit4]   2> 1633954 INFO  (qtp1539286898-23471) [n:127.0.0.1:42199_solr c:SearchRateTriggerTest-collection1 s:shard1 r:core_node5 x:SearchRateTriggerTest-collection1_shard1_replica_n2] o.a.s.s.HttpSolrCall [admin] webapp=null path=/admin/cores params={qt=/admin/cores&coreNodeName=core_node5&collection.configName=conf&newCollection=true&name=SearchRateTriggerTest-collection1_shard1_replica_n2&action=CREATE&numShards=2&collection=SearchRateTriggerTest-collection1&shard=shard1&wt=javabin&version=2&replicaType=NRT} status=0 QTime=1483
   [junit4]   2> 1634050 INFO  (zkCallback-7808-thread-1) [    ] o.a.s.c.c.ZkStateReader A cluster state change: [WatchedEvent state:SyncConnected type:NodeDataChanged path:/collections/SearchRateTriggerTest-collection1/state.json] for collection [SearchRateTriggerTest-collection1] has occurred - updating... (live nodes size: [4])
   [junit4]   2> 1634050 INFO  (zkCallback-7810-thread-1) [    ] o.a.s.c.c.ZkStateReader A cluster state change: [WatchedEvent state:SyncConnected type:NodeDataChanged path:/collections/SearchRateTriggerTest-collection1/state.json] for collection [SearchRateTriggerTest-collection1] has occurred - updating... (live nodes size: [4])
   [junit4]   2> 1634646 INFO  (zkCallback-7814-thread-1) [    ] o.a.s.c.c.ZkStateReader A cluster state change: [WatchedEvent state:SyncConnected type:NodeDataChanged path:/collections/SearchRateTriggerTest-collection1/state.json] for collection [SearchRateTriggerTest-collection1] has occurred - updating... (live nodes size: [4])
   [junit4]   2> 1634646 INFO  (zkCallback-7810-thread-1) [    ] o.a.s.c.c.ZkStateReader A cluster state change: [WatchedEvent state:SyncConnected type:NodeDataChanged path:/collections/SearchRateTriggerTest-collection1/state.json] for collection [SearchRateTriggerTest-collection1] has occurred - updating... (live nodes size: [4])
   [junit4]   2> 1634646 INFO  (zkCallback-7808-thread-1) [    ] o.a.s.c.c.ZkStateReader A cluster state change: [WatchedEvent state:SyncConnected type:NodeDataChanged path:/collections/SearchRateTriggerTest-collection1/state.json] for collection [SearchRateTriggerTest-collection1] has occurred - updating... (live nodes size: [4])
   [junit4]   2> 1634646 INFO  (zkCallback-7812-thread-1) [    ] o.a.s.c.c.ZkStateReader A cluster state change: [WatchedEvent state:SyncConnected type:NodeDataChanged path:/collections/SearchRateTriggerTest-collection1/state.json] for collection [SearchRateTriggerTest-collection1] has occurred - updating... (live nodes size: [4])
   [junit4]   2> 1634787 INFO  (qtp810516989-23478) [n:127.0.0.1:42221_solr c:SearchRateTriggerTest-collection1 s:shard2 r:core_node8 x:SearchRateTriggerTest-collection1_shard2_replica_n6] o.a.s.s.HttpSolrCall [admin] webapp=null path=/admin/cores params={qt=/admin/cores&coreNodeName=core_node8&collection.configName=conf&newCollection=true&name=SearchRateTriggerTest-collection1_shard2_replica_n6&action=CREATE&numShards=2&collection=SearchRateTriggerTest-collection1&shard=shard2&wt=javabin&version=2&replicaType=NRT} status=0 QTime=2317
   [junit4]   2> 1634787 INFO  (qtp674343881-23482) [n:127.0.0.1:45285_solr c:SearchRateTriggerTest-collection1 s:shard1 r:core_node3 x:SearchRateTriggerTest-collection1_shard1_replica_n1] o.a.s.s.HttpSolrCall [admin] webapp=null path=/admin/cores params={qt=/admin/cores&coreNodeName=core_node3&collection.configName=conf&newCollection=true&name=SearchRateTriggerTest-collection1_shard1_replica_n1&action=CREATE&numShards=2&collection=SearchRateTriggerTest-collection1&shard=shard1&wt=javabin&version=2&replicaType=NRT} status=0 QTime=2317
   [junit4]   2> 1634788 INFO  (qtp84213518-23483) [n:127.0.0.1:39323_solr    ] o.a.s.h.a.CollectionsHandler Wait for new collection to be active for at most 30 seconds. Check all shard replicas
   [junit4]   2> 1634788 INFO  (qtp84213518-23483) [n:127.0.0.1:39323_solr    ] o.a.s.s.HttpSolrCall [admin] webapp=null path=/admin/collections params={replicationFactor=2&collection.configName=conf&maxShardsPerNode=1&name=SearchRateTriggerTest-collection1&nrtReplicas=2&action=CREATE&numShards=2&wt=javabin&version=2} status=0 QTime=2629
   [junit4]   2> 1634789 INFO  (qtp84213518-23453) [n:127.0.0.1:39323_solr    ] o.a.s.h.a.CollectionsHandler Invoked Collection Action :create with params replicationFactor=2&collection.configName=conf&maxShardsPerNode=1&name=SearchRateTriggerTest-collection2&nrtReplicas=2&action=CREATE&numShards=2&wt=javabin&version=2 and sendToOCPQueue=true
   [junit4]   2> 1634790 INFO  (OverseerThreadFactory-8681-thread-2) [    ] o.a.s.c.a.c.CreateCollectionCmd Create collection SearchRateTriggerTest-collection2
   [junit4]   2> 1634790 INFO  (OverseerCollectionConfigSetProcessor-72084728193744905-127.0.0.1:42221_solr-n_0000000000) [    ] o.a.s.c.OverseerTaskQueue Response ZK path: /overseer/collection-queue-work/qnr-0000000000 doesn't exist.  Requestor may have disconnected from ZooKeeper
   [junit4]   2> 1634994 INFO  (OverseerStateUpdate-72084728193744905-127.0.0.1:42221_solr-n_0000000000) [    ] o.a.s.c.o.SliceMutator createReplica() {
   [junit4]   2>   "operation":"ADDREPLICA",
   [junit4]   2>   "collection":"SearchRateTriggerTest-collection2",
   [junit4]   2>   "shard":"shard1",
   [junit4]   2>   "core":"SearchRateTriggerTest-collection2_shard1_replica_n1",
   [junit4]   2>   "state":"down",
   [junit4]   2>   "base_url":"http://127.0.0.1:39323/solr",
   [junit4]   2>   "type":"NRT",
   [junit4]   2>   "waitForFinalState":"false"} 
   [junit4]   2> 1634994 INFO  (OverseerStateUpdate-72084728193744905-127.0.0.1:42221_solr-n_0000000000) [    ] o.a.s.c.o.SliceMutator createReplica() {
   [junit4]   2>   "operation":"ADDREPLICA",
   [junit4]   2>   "collection":"SearchRateTriggerTest-collection2",
   [junit4]   2>   "shard":"shard1",
   [junit4]   2>   "core":"SearchRateTriggerTest-collection2_shard1_replica_n2",
   [junit4]   2>   "state":"down",
   [junit4]   2>   "base_url":"http://127.0.0.1:42221/solr",
   [junit4]   2>   "type":"NRT",
   [junit4]   2>   "waitForFinalState":"false"} 
   [junit4]   2> 1634995 INFO  (OverseerStateUpdate-72084728193744905-127.0.0.1:42221_solr-n_0000000000) [    ] o.a.s.c.o.SliceMutator createReplica() {
   [junit4]   2>   "operation":"ADDREPLICA",
   [junit4]   2>   "collection":"SearchRateTriggerTest-collection2",
   [junit4]   2>   "shard":"shard2",
   [junit4]   2>   "core":"SearchRateTriggerTest-collection2_shard2_replica_n4",
   [junit4]   2>   "state":"down",
   [junit4]   2>   "base_url":"http://127.0.0.1:42199/solr",
   [junit4]   2>   "type":"NRT",
   [junit4]   2>   "waitForFinalState":"false"} 
   [junit4]   2> 1634996 INFO  (OverseerStateUpdate-72084728193744905-127.0.0.1:42221_solr-n_0000000000) [    ] o.a.s.c.o.SliceMutator createReplica() {
   [junit4]   2>   "operation":"ADDREPLICA",
   [junit4]   2>   "collection":"SearchRateTriggerTest-collection2",
   [junit4]   2>   "shard":"shard2",
   [junit4]   2>   "core":"SearchRateTriggerTest-collection2_shard2_replica_n6",
   [junit4]   2>   "state":"down",
   [junit4]   2>   "base_url":"http://127.0.0.1:45285/solr",
   [junit4]   2>   "type":"NRT",
   [junit4]   2>   "waitForFinalState":"false"} 
   [junit4]   2> 1635197 INFO  (qtp810516989-23462) [n:127.0.0.1:42221_solr    x:SearchRateTriggerTest-collection2_shard1_replica_n2] o.a.s.h.a.CoreAdminOperation core create command qt=/admin/cores&coreNodeName=core_node5&collection.configName=conf&newCollection=true&name=SearchRateTriggerTest-collection2_shard1_replica_n2&action=CREATE&numShards=2&collection=SearchRateTriggerTest-collection2&shard=shard1&wt=javabin&version=2&replicaType=NRT
   [junit4]   2> 1635197 INFO  (qtp84213518-23479) [n:127.0.0.1:39323_solr    x:SearchRateTriggerTest-collection2_shard1_replica_n1] o.a.s.h.a.CoreAdminOperation core create command qt=/admin/cores&coreNodeName=core_node3&collection.configName=conf&newCollection=true&name=SearchRateTriggerTest-collection2_shard1_replica_n1&action=CREATE&numShards=2&collection=SearchRateTriggerTest-collection2&shard=shard1&wt=javabin&version=2&replicaType=NRT
   [junit4]   2> 1635197 INFO  (qtp674343881-23455) [n:127.0.0.1:45285_solr    x:SearchRateTriggerTest-collection2_shard2_replica_n6] o.a.s.h.a.CoreAdminOperation core create command qt=/admin/cores&coreNodeName=core_node8&collection.configName=conf&newCollection=true&name=SearchRateTriggerTest-collection2_shard2_replica_n6&action=CREATE&numShards=2&collection=SearchRateTriggerTest-collection2&shard=shard2&wt=javabin&version=2&replicaType=NRT
   [junit4]   2> 1635198 INFO  (qtp1539286898-23454) [n:127.0.0.1:42199_solr    x:SearchRateTriggerTest-collection2_shard2_replica_n4] o.a.s.h.a.CoreAdminOperation core create command qt=/admin/cores&coreNodeName=core_node7&collection.configName=conf&newCollection=true&name=SearchRateTriggerTest-collection2_shard2_replica_n4&action=CREATE&numShards=2&collection=SearchRateTriggerTest-collection2&shard=shard2&wt=javabin&version=2&replicaType=NRT
   [junit4]   2> 1636203 INFO  (qtp810516989-23462) [n:127.0.0.1:42221_solr c:SearchRateTriggerTest-collection2 s:shard1 r:core_node5 x:SearchRateTriggerTest-collection2_shard1_replica_n2] o.a.s.c.SolrConfig Using Lucene MatchVersion: 8.0.0
   [junit4]   2> 1636203 INFO  (qtp1539286898-23454) [n:127.0.0.1:42199_solr c:SearchRateTriggerTest-collection2 s:shard2 r:core_node7 x:SearchRateTriggerTest-collection2_shard2_replica_n4] o.a.s.c.SolrConfig Using Lucene MatchVersion: 8.0.0
   [junit4]   2> 1636203 INFO  (qtp84213518-23479) [n:127.0.0.1:39323_solr c:SearchRateTriggerTest-collection2 s:shard1 r:core_node3 x:SearchRateTriggerTest-collection2_shard1_replica_n1] o.a.s.c.SolrConfig Using Lucene MatchVersion: 8.0.0
   [junit4]   2> 1636206 INFO  (qtp674343881-23455) [n:127.0.0.1:45285_solr c:SearchRateTriggerTest-collection2 s:shard2 r:core_node8 x:SearchRateTriggerTest-collection2_shard2_replica_n6] o.a.s.c.SolrConfig Using Lucene MatchVersion: 8.0.0
   [junit4]   2> 1636208 INFO  (qtp84213518-23479) [n:127.0.0.1:39323_solr c:SearchRateTriggerTest-collection2 s:shard1 r:core_node3 x:SearchRateTriggerTest-collection2_shard1_replica_n1] o.a.s.s.IndexSchema [SearchRateTriggerTest-collection2_shard1_replica_n1] Schema name=minimal
   [junit4]   2> 1636208 INFO  (qtp810516989-23462) [n:127.0.0.1:42221_solr c:SearchRateTriggerTest-collection2 s:shard1 r:core_node5 x:SearchRateTriggerTest-collection2_shard1_replica_n2] o.a.s.s.IndexSchema [SearchRateTriggerTest-collection2_shard1_replica_n2] Schema name=minimal
   [junit4]   2> 1636208 INFO  (qtp1539286898-23454) [n:127.0.0.1:42199_solr c:SearchRateTriggerTest-collection2 s:shard2 r:core_node7 x:SearchRateTriggerTest-collection2_shard2_replica_n4] o.a.s.s.IndexSchema [SearchRateTriggerTest-collection2_shard2_replica_n4] Schema name=minimal
   [junit4]   2> 1636209 INFO  (qtp1539286898-23454) [n:127.0.0.1:42199_solr c:SearchRateTriggerTest-collection2 s:shard2 r:core_node7 x:SearchRateTriggerTest-collection2_shard2_replica_n4] o.a.s.s.IndexSchema Loaded schema minimal/1.1 with uniqueid field id
   [junit4]   2> 1636209 INFO  (qtp810516989-23462) [n:127.0.0.1:42221_solr c:SearchRateTriggerTest-collection2 s:shard1 r:core_node5 x:SearchRateTriggerTest-collection2_shard1_replica_n2] o.a.s.s.IndexSchema Loaded schema minimal/1.1 with uniqueid field id
   [junit4]   2> 1636209 INFO  (qtp84213518-23479) [n:127.0.0.1:39323_solr c:SearchRateTriggerTest-collection2 s:shard1 r:core_node3 x:SearchRateTriggerTest-collection2_shard1_replica_n1] o.a.s.s.IndexSchema Loaded schema minimal/1.1 with uniqueid field id
   [junit4]   2> 1636209 INFO  (qtp810516989-23462) [n:127.0.0.1:42221_solr c:SearchRateTriggerTest-collection2 s:shard1 r:core_node5 x:SearchRateTriggerTest-collection2_shard1_replica_n2] o.a.s.c.CoreContainer Creating SolrCore 'SearchRateTriggerTest-collection2_shard1_replica_n2' using configuration from collection SearchRateTriggerTest-collection2, trusted=true
   [junit4]   2> 1636209 INFO  (qtp1539286898-23454) [n:127.0.0.1:42199_solr c:SearchRateTriggerTest-collection2 s:shard2 r:core_node7 x:SearchRateTriggerTest-collection2_shard2_replica_n4] o.a.s.c.CoreContainer Creating SolrCore 'SearchRateTriggerTest-collection2_shard2_replica_n4' using configuration from collection SearchRateTriggerTest-collection2, trusted=true
   [junit4]   2> 1636209 INFO  (qtp84213518-23479) [n:127.0.0.1:39323_solr c:SearchRateTriggerTest-collection2 s:shard1 r:core_node3 x:SearchRateTriggerTest-collection2_shard1_replica_n1] o.a.s.c.CoreContainer Creating SolrCore 'SearchRateTriggerTest-collection2_shard1_replica_n1' using configuration from collection SearchRateTriggerTest-collection2, trusted=true
   [junit4]   2> 1636209 INFO  (qtp84213518-23479) [n:127.0.0.1:39323_solr c:SearchRateTriggerTest-collection2 s:shard1 r:core_node3 x:SearchRateTriggerTest-collection2_shard1_replica_n1] o.a.s.m.r.SolrJmxReporter JMX monitoring for 'solr_39323.solr.core.SearchRateTriggerTest-collection2.shard1.replica_n1' (registry 'solr.core.SearchRateTriggerTest-collection2.shard1.replica_n1') enabled at server: com.sun.jmx.mbeanserver.JmxMBeanServer@3d0adef1
   [junit4]   2> 1636209 INFO  (qtp1539286898-23454) [n:127.0.0.1:42199_solr c:SearchRateTriggerTest-collection2 s:shard2 r:core_node7 x:SearchRateTriggerTest-collection2_shard2_replica_n4] o.a.s.m.r.SolrJmxReporter JMX monitoring for 'solr_42199.solr.core.SearchRateTriggerTest-collection2.shard2.replica_n4' (registry 'solr.core.SearchRateTriggerTest-collection2.shard2.replica_n4') enabled at server: com.sun.jmx.mbeanserver.JmxMBeanServer@3d0adef1
   [junit4]   2> 1636209 INFO  (qtp810516989-23462) [n:127.0.0.1:42221_solr c:SearchRateTriggerTest-collection2 s:shard1 r:core_node5 x:SearchRateTriggerTest-collection2_shard1_replica_n2] o.a.s.m.r.SolrJmxReporter JMX monitoring for 'solr_42221.solr.core.SearchRateTriggerTest-collection2.shard1.replica_n2' (registry 'solr.core.SearchRateTriggerTest-collection2.shard1.replica_n2') enabled at server: com.sun.jmx.mbeanserver.JmxMBeanServer@3d0adef1
   [junit4]   2> 1636209 INFO  (qtp84213518-23479) [n:127.0.0.1:39323_solr c:SearchRateTriggerTest-collection2 s:shard1 r:core_node3 x:SearchRateTriggerTest-collection2_shard1_replica_n1] o.a.s.c.SolrCore solr.RecoveryStrategy.Builder
   [junit4]   2> 1636209 INFO  (qtp1539286898-23454) [n:127.0.0.1:42199_solr c:SearchRateTriggerTest-collection2 s:shard2 r:core_node7 x:SearchRateTriggerTest-collection2_shard2_replica_n4] o.a.s.c.SolrCore solr.RecoveryStrategy.Builder
   [junit4]   2> 1636210 INFO  (qtp810516989-23462) [n:127.0.0.1:42221_solr c:SearchRateTriggerTest-collection2 s:shard1 r:core_node5 x:SearchRateTriggerTest-collection2_shard1_replica_n2] o.a.s.c.SolrCore solr.RecoveryStrategy.Builder
   [junit4]   2> 1636210 INFO  (qtp1539286898-23454) [n:127.0.0.1:42199_solr c:SearchRateTriggerTest-collection2 s:shard2 r:core_node7 x:SearchRateTriggerTest-collection2_shard2_replica_n4] o.a.s.c.SolrCore [[SearchRateTriggerTest-collection2_shard2_replica_n4] ] Opening new SolrCore at [/home/jenkins/workspace/Lucene-Solr-master-Linux/solr/build/solr-core/test/J2/temp/solr.cloud.autoscaling.SearchRateTriggerTest_F6BD4087D0C1623E-001/tempDir-001/node2/SearchRateTriggerTest-collection2_shard2_replica_n4], dataDir=[/home/jenkins/workspace/Lucene-Solr-master-Linux/solr/build/solr-core/test/J2/temp/solr.cloud.autoscaling.SearchRateTriggerTest_F6BD4087D0C1623E-001/tempDir-001/node2/./SearchRateTriggerTest-collection2_shard2_replica_n4/data/]
   [junit4]   2> 1636210 INFO  (qtp84213518-23479) [n:127.0.0.1:39323_solr c:SearchRateTriggerTest-collection2 s:shard1 r:core_node3 x:SearchRateTriggerTest-collection2_shard1_replica_n1] o.a.s.c.SolrCore [[SearchRateTriggerTest-collection2_shard1_replica_n1] ] Opening new SolrCore at [/home/jenkins/workspace/Lucene-Solr-master-Linux/solr/build/solr-core/test/J2/temp/solr.cloud.autoscaling.SearchRateTriggerTest_F6BD4087D0C1623E-001/tempDir-001/node1/SearchRateTriggerTest-collection2_shard1_replica_n1], dataDir=[/home/jenkins/workspace/Lucene-Solr-master-Linux/solr/build/solr-core/test/J2/temp/solr.cloud.autoscaling.SearchRateTriggerTest_F6BD4087D0C1623E-001/tempDir-001/node1/./SearchRateTriggerTest-collection2_shard1_replica_n1/data/]
   [junit4]   2> 1636210 INFO  (qtp810516989-23462) [n:127.0.0.1:42221_solr c:SearchRateTriggerTest-collection2 s:shard1 r:core_node5 x:SearchRateTriggerTest-collection2_shard1_replica_n2] o.a.s.c.SolrCore [[SearchRateTriggerTest-collection2_shard1_replica_n2] ] Opening new SolrCore at [/home/jenkins/workspace/Lucene-Solr-master-Linux/solr/build/solr-core/test/J2/temp/solr.cloud.autoscaling.SearchRateTriggerTest_F6BD4087D0C1623E-001/tempDir-001/node4/SearchRateTriggerTest-collection2_shard1_replica_n2], dataDir=[/home/jenkins/workspace/Lucene-Solr-master-Linux/solr/build/solr-core/test/J2/temp/solr.cloud.autoscaling.SearchRateTriggerTest_F6BD4087D0C1623E-001/tempDir-001/node4/./SearchRateTriggerTest-collection2_shard1_replica_n2/data/]
   [junit4]   2> 1636210 INFO  (qtp674343881-23455) [n:127.0.0.1:45285_solr c:SearchRateTriggerTest-collection2 s:shard2 r:core_node8 x:SearchRateTriggerTest-collection2_shard2_replica_n6] o.a.s.s.IndexSchema [SearchRateTriggerTest-collection2_shard2_replica_n6] Schema name=minimal
   [junit4]   2> 1636221 INFO  (qtp674343881-23455) [n:127.0.0.1:45285_solr c:SearchRateTriggerTest-collection2 s:shard2 r:core_node8 x:SearchRateTriggerTest-collection2_shard2_replica_n6] o.a.s.s.IndexSchema Loaded schema minimal/1.1 with uniqueid field id
   [junit4]   2> 1636221 INFO  (qtp674343881-23455) [n:127.0.0.1:45285_solr c:SearchRateTriggerTest-collection2 s:shard2 r:core_node8 x:SearchRateTriggerTest-collection2_shard2_replica_n6] o.a.s.c.CoreContainer Creating SolrCore 'SearchRateTriggerTest-collection2_shard2_replica_n6' using configuration from collection SearchRateTriggerTest-collection2, trusted=true
   [junit4]   2> 1636221 INFO  (qtp674343881-23455) [n:127.0.0.1:45285_solr c:SearchRateTriggerTest-collection2 s:shard2 r:core_node8 x:SearchRateTriggerTest-collection2_shard2_replica_n6] o.a.s.m.r.SolrJmxReporter JMX monitoring for 'solr_45285.solr.core.SearchRateTriggerTest-collection2.shard2.replica_n6' (registry 'solr.core.SearchRateTriggerTest-collection2.shard2.replica_n6') enabled at server: com.sun.jmx.mbeanserver.JmxMBeanServer@3d0adef1
   [junit4]   2> 1636221 INFO  (qtp674343881-23455) [n:127.0.0.1:45285_solr c:SearchRateTriggerTest-collection2 s:shard2 r:core_node8 x:SearchRateTriggerTest-collection2_shard2_replica_n6] o.a.s.c.SolrCore solr.RecoveryStrategy.Builder
   [junit4]   2> 1636221 INFO  (qtp674343881-23455) [n:127.0.0.1:45285_solr c:SearchRateTriggerTest-collection2 s:shard2 r:core_node8 x:SearchRateTriggerTest-collection2_shard2_replica_n6] o.a.s.c.SolrCore [[SearchRateTriggerTest-collection2_shard2_replica_n6] ] Opening new SolrCore at [/home/jenkins/workspace/Lucene-Solr-master-Linux/solr/build/solr-core/test/J2/temp/solr.cloud.autoscaling.SearchRateTriggerTest_F6BD4087D0C1623E-001/tempDir-001/node3/SearchRateTriggerTest-collection2_shard2_replica_n6], dataDir=[/home/jenkins/workspace/Lucene-Solr-master-Linux/solr/build/solr-core/test/J2/temp/solr.cloud.autoscaling.SearchRateTriggerTest_F6BD4087D0C1623E-001/tempDir-001/node3/./SearchRateTriggerTest-collection2_shard2_replica_n6/data/]
   [junit4]   2> 1636259 INFO  (qtp84213518-23479) [n:127.0.0.1:39323_solr c:SearchRateTriggerTest-collection2 s:shard1 r:core_node3 x:SearchRateTriggerTest-collection2_shard1_replica_n1] o.a.s.u.UpdateHandler Using UpdateLog implementation: org.apache.solr.update.UpdateLog
   [junit4]   2> 1636259 INFO  (qtp84213518-23479) [n:127.0.0.1:39323_solr c:SearchRateTriggerTest-collection2 s:shard1 r:core_node3 x:SearchRateTriggerTest-collection2_shard1_replica_n1] o.a.s.u.UpdateLog Initializing UpdateLog: dataDir=null defaultSyncLevel=FLUSH numRecordsToKeep=100 maxNumLogsToKeep=10 numVersionBuckets=65536
   [junit4]   2> 1636260 INFO  (qtp84213518-23479) [n:127.0.0.1:39323_solr c:SearchRateTriggerTest-collection2 s:shard1 r:core_node3 x:SearchRateTriggerTest-collection2_shard1_replica_n1] o.a.s.u.CommitTracker Hard AutoCommit: disabled
   [junit4]   2> 1636260 INFO  (qtp84213518-23479) [n:127.0.0.1:39323_solr c:SearchRateTriggerTest-collection2 s:shard1 r:core_node3 x:SearchRateTriggerTest-collection2_shard1_replica_n1] o.a.s.u.CommitTracker Soft AutoCommit: disabled
   [junit4]   2> 1636262 INFO  (qtp84213518-23479) [n:127.0.0.1:39323_solr c:SearchRateTriggerTest-collection2 s:shard1 r:core_node3 x:SearchRateTriggerTest-collection2_shard1_replica_n1] o.a.s.s.SolrIndexSearcher Opening [Searcher@538cd02c[SearchRateTriggerTest-collection2_shard1_replica_n1] main]
   [junit4]   2> 1636263 INFO  (qtp1539286898-23454) [n:127.0.0.1:42199_solr c:SearchRateTriggerTest-collection2 s:shard2 r:core_node7 x:SearchRateTriggerTest-collection2_shard2_replica_n4] o.a.s.u.UpdateHandler Using UpdateLog implementation: org.apache.solr.update.UpdateLog
   [junit4]   2> 1636263 INFO  (qtp1539286898-23454) [n:127.0.0.1:42199_solr c:SearchRateTriggerTest-collection2 s:shard2 r:core_node7 x:SearchRateTriggerTest-collection2_shard2_replica_n4] o.a.s.u.UpdateLog Initializing UpdateLog: dataDir=null defaultSyncLevel=FLUSH numRecordsToKeep=100 maxNumLogsToKeep=10 numVersionBuckets=65536
   [junit4]   2> 1636263 INFO  (qtp84213518-23479) [n:127.0.0.1:39323_solr c:SearchRateTriggerTest-collection2 s:shard1 r:core_node3 x:SearchRateTriggerTest-collection2_shard1_replica_n1] o.a.s.r.Ma

[...truncated too long message...]

thread-2) [    ] o.a.s.m.r.SolrJmxReporter Closing reporter [org.apache.solr.metrics.reporters.SolrJmxReporter@2d4ac3ab: rootName = solr_43347, domain = solr.jetty, service url = null, agent id = null] for registry solr.jetty / com.codahale.metrics.MetricRegistry@926363b
   [junit4]   2> 158342 INFO  (jetty-closer-94-thread-3) [    ] o.a.s.m.SolrMetricManager Closing metric reporters for registry=solr.jetty, tag=null
   [junit4]   2> 158342 INFO  (jetty-closer-94-thread-3) [    ] o.a.s.m.r.SolrJmxReporter Closing reporter [org.apache.solr.metrics.reporters.SolrJmxReporter@23732f8b: rootName = solr_46667, domain = solr.jetty, service url = null, agent id = null] for registry solr.jetty / com.codahale.metrics.MetricRegistry@926363b
   [junit4]   2> 158343 INFO  (jetty-closer-94-thread-1) [    ] o.e.j.s.h.ContextHandler Stopped o.e.j.s.ServletContextHandler@7762e6ba{/solr,null,UNAVAILABLE}
   [junit4]   2> 158343 INFO  (jetty-closer-94-thread-1) [    ] o.e.j.s.session node0 Stopped scavenging
   [junit4]   2> 158343 INFO  (jetty-closer-94-thread-2) [    ] o.a.s.c.ZkController Remove node as live in ZooKeeper:/live_nodes/127.0.0.1:43347_solr
   [junit4]   2> 158344 INFO  (jetty-closer-94-thread-3) [    ] o.a.s.c.ZkController Remove node as live in ZooKeeper:/live_nodes/127.0.0.1:46667_solr
   [junit4]   2> 158344 INFO  (jetty-closer-94-thread-4) [    ] o.a.s.m.SolrMetricManager Closing metric reporters for registry=solr.jetty, tag=null
   [junit4]   2> 158344 INFO  (jetty-closer-94-thread-4) [    ] o.a.s.m.r.SolrJmxReporter Closing reporter [org.apache.solr.metrics.reporters.SolrJmxReporter@61707895: rootName = solr_44519, domain = solr.jetty, service url = null, agent id = null] for registry solr.jetty / com.codahale.metrics.MetricRegistry@926363b
   [junit4]   2> 158344 INFO  (jetty-closer-94-thread-2) [    ] o.a.s.m.SolrMetricManager Closing metric reporters for registry=solr.cluster, tag=null
   [junit4]   2> 158344 INFO  (zkCallback-155-thread-1) [    ] o.a.s.c.c.ZkStateReader Updated live nodes from ZooKeeper... (3) -> (1)
   [junit4]   2> 158344 INFO  (zkCallback-138-thread-2) [    ] o.a.s.c.c.ZkStateReader Updated live nodes from ZooKeeper... (3) -> (1)
   [junit4]   2> 158345 INFO  (zkCallback-151-thread-1) [    ] o.a.s.c.c.ZkStateReader Updated live nodes from ZooKeeper... (3) -> (1)
   [junit4]   2> 158345 INFO  (zkCallback-125-thread-1) [    ] o.a.s.c.c.ZkStateReader Updated live nodes from ZooKeeper... (3) -> (1)
   [junit4]   2> 158345 INFO  (zkCallback-123-thread-1) [    ] o.a.s.c.c.ZkStateReader Updated live nodes from ZooKeeper... (3) -> (1)
   [junit4]   2> 158345 INFO  (zkCallback-121-thread-1) [    ] o.a.s.c.c.ZkStateReader Updated live nodes from ZooKeeper... (3) -> (1)
   [junit4]   2> 158345 INFO  (jetty-closer-94-thread-3) [    ] o.a.s.m.SolrMetricManager Closing metric reporters for registry=solr.cluster, tag=null
   [junit4]   2> 158346 INFO  (jetty-closer-94-thread-2) [    ] o.a.s.c.Overseer Overseer (id=72084799614615562-127.0.0.1:43347_solr-n_0000000000) closing
   [junit4]   2> 158347 INFO  (OverseerStateUpdate-72084799614615562-127.0.0.1:43347_solr-n_0000000000) [    ] o.a.s.c.Overseer Overseer Loop exiting : 127.0.0.1:43347_solr
   [junit4]   2> 158347 WARN  (OverseerAutoScalingTriggerThread-72084799614615562-127.0.0.1:43347_solr-n_0000000000) [    ] o.a.s.c.a.OverseerTriggerThread OverseerTriggerThread woken up but we are closed, exiting.
   [junit4]   2> 158348 INFO  (jetty-closer-94-thread-3) [    ] o.e.j.s.h.ContextHandler Stopped o.e.j.s.ServletContextHandler@13249abb{/solr,null,UNAVAILABLE}
   [junit4]   2> 158348 INFO  (jetty-closer-94-thread-3) [    ] o.e.j.s.session node0 Stopped scavenging
   [junit4]   2> 158350 INFO  (jetty-closer-94-thread-4) [    ] o.a.s.c.ZkController Remove node as live in ZooKeeper:/live_nodes/127.0.0.1:44519_solr
   [junit4]   2> 158350 WARN  (NIOServerCxn.Factory:0.0.0.0/0.0.0.0:0) [    ] o.a.z.s.NIOServerCnxn Unable to read additional data from client sessionid 0x10018be4abc000a, likely client has closed socket
   [junit4]   2> 158350 INFO  (zkCallback-155-thread-1) [    ] o.a.s.c.c.ZkStateReader Updated live nodes from ZooKeeper... (1) -> (0)
   [junit4]   2> 158350 INFO  (jetty-closer-94-thread-4) [    ] o.a.s.m.SolrMetricManager Closing metric reporters for registry=solr.cluster, tag=null
   [junit4]   2> 158350 INFO  (zkCallback-125-thread-1) [    ] o.a.s.c.c.ZkStateReader Updated live nodes from ZooKeeper... (1) -> (0)
   [junit4]   2> 158350 INFO  (zkCallback-125-thread-2) [    ] o.a.s.c.OverseerElectionContext I am going to be the leader 127.0.0.1:44519_solr
   [junit4]   2> 158352 INFO  (jetty-closer-94-thread-4) [    ] o.e.j.s.h.ContextHandler Stopped o.e.j.s.ServletContextHandler@675c5e72{/solr,null,UNAVAILABLE}
   [junit4]   2> 158353 INFO  (jetty-closer-94-thread-4) [    ] o.e.j.s.session node0 Stopped scavenging
   [junit4]   2> 159850 WARN  (zkCallback-121-thread-1) [    ] o.a.s.c.c.ZkStateReader ZooKeeper watch triggered, but Solr cannot talk to ZK: [KeeperErrorCode = Session expired for /live_nodes]
   [junit4]   2> 159851 INFO  (jetty-closer-94-thread-2) [    ] o.e.j.s.h.ContextHandler Stopped o.e.j.s.ServletContextHandler@13043e15{/solr,null,UNAVAILABLE}
   [junit4]   2> 159851 INFO  (jetty-closer-94-thread-2) [    ] o.e.j.s.session node0 Stopped scavenging
   [junit4]   2> 159852 ERROR (SUITE-SearchRateTriggerTest-seed#[F6BD4087D0C1623E]-worker) [    ] o.a.z.s.ZooKeeperServer ZKShutdownHandler is not registered, so ZooKeeper server won't take any action on ERROR or SHUTDOWN server state changes
   [junit4]   2> 159852 INFO  (SUITE-SearchRateTriggerTest-seed#[F6BD4087D0C1623E]-worker) [    ] o.a.s.c.ZkTestServer connecting to 127.0.0.1:42431 42431
   [junit4]   2> 160807 INFO  (Thread-65) [    ] o.a.s.c.ZkTestServer connecting to 127.0.0.1:42431 42431
   [junit4]   2> 160808 WARN  (Thread-65) [    ] o.a.s.c.ZkTestServer Watch limit violations: 
   [junit4]   2> Maximum concurrent create/delete watches above limit:
   [junit4]   2> 
   [junit4]   2> 	15	/solr/collections/SearchRateTriggerTest-collection1/terms/shard1
   [junit4]   2> 	15	/solr/collections/SearchRateTriggerTest-collection1/terms/shard2
   [junit4]   2> 	12	/solr/clusterprops.json
   [junit4]   2> 	12	/solr/aliases.json
   [junit4]   2> 	8	/solr/configs/conf
   [junit4]   2> 	8	/solr/collections/SearchRateTriggerTest-collection2/terms/shard2
   [junit4]   2> 	8	/solr/collections/SearchRateTriggerTest-collection2/terms/shard1
   [junit4]   2> 	4	/solr/security.json
   [junit4]   2> 
   [junit4]   2> Maximum concurrent data watches above limit:
   [junit4]   2> 
   [junit4]   2> 	12	/solr/clusterstate.json
   [junit4]   2> 	8	/solr/collections/SearchRateTriggerTest-collection1/state.json
   [junit4]   2> 	4	/solr/collections/SearchRateTriggerTest-collection2/state.json
   [junit4]   2> 	2	/solr/overseer_elect/election/72084799614615562-127.0.0.1:43347_solr-n_0000000000
   [junit4]   2> 	2	/solr/overseer_elect/election/72084799614615563-127.0.0.1:46667_solr-n_0000000001
   [junit4]   2> 
   [junit4]   2> Maximum concurrent children watches above limit:
   [junit4]   2> 
   [junit4]   2> 	23	/solr/collections
   [junit4]   2> 	12	/solr/live_nodes
   [junit4]   2> 
   [junit4]   2> NOTE: leaving temporary files on disk at: /home/jenkins/workspace/Lucene-Solr-master-Linux/solr/build/solr-core/test/J1/temp/solr.cloud.autoscaling.SearchRateTriggerTest_F6BD4087D0C1623E-001
   [junit4]   2> NOTE: test params are: codec=Asserting(Lucene70): {}, docValues:{}, maxPointsInLeafNode=1148, maxMBSortInHeap=6.216331458588025, sim=Asserting(org.apache.lucene.search.similarities.AssertingSimilarity@6f3ab5f5), locale=en-BE, timezone=Pacific/Niue
   [junit4]   2> NOTE: Linux 4.13.0-41-generic amd64/Oracle Corporation 10 (64-bit)/cpus=8,threads=1,free=302969336,total=519569408
   [junit4]   2> NOTE: All tests run in this JVM: [SearchRateTriggerTest, SearchRateTriggerTest]
   [junit4] Completed [4/5 (1!)] on J1 in 51.89s, 3 tests, 1 failure <<< FAILURES!

[...truncated 18 lines...]
BUILD FAILED
/home/jenkins/workspace/Lucene-Solr-master-Linux/lucene/common-build.xml:1568: The following error occurred while executing this line:
/home/jenkins/workspace/Lucene-Solr-master-Linux/lucene/common-build.xml:1092: There were test failures: 5 suites, 15 tests, 1 failure [seed: F6BD4087D0C1623E]

Total time: 3 minutes 20 seconds

[repro] Setting last failure code to 256

[repro] Failures:
[repro]   1/5 failed: org.apache.solr.cloud.autoscaling.SearchRateTriggerTest
[repro] Exiting with code 256
+ mv lucene/build lucene/build.repro
+ mv solr/build solr/build.repro
+ mv lucene/build.orig lucene/build
+ mv solr/build.orig solr/build
Archiving artifacts
Setting ANT_1_8_2_HOME=/var/lib/jenkins/tools/hudson.tasks.Ant_AntInstallation/ANT_1.8.2
[WARNINGS] Parsing warnings in console log with parser Java Compiler (javac)
Setting ANT_1_8_2_HOME=/var/lib/jenkins/tools/hudson.tasks.Ant_AntInstallation/ANT_1.8.2
Setting ANT_1_8_2_HOME=/var/lib/jenkins/tools/hudson.tasks.Ant_AntInstallation/ANT_1.8.2
<Git Blamer> Using GitBlamer to create author and commit information for all warnings.
<Git Blamer> GIT_COMMIT=c93f6283176070b9cc036faec919ef28290f5c4a, workspace=/var/lib/jenkins/workspace/Lucene-Solr-master-Linux
[WARNINGS] Computing warning deltas based on reference build #22098
Recording test results
Setting ANT_1_8_2_HOME=/var/lib/jenkins/tools/hudson.tasks.Ant_AntInstallation/ANT_1.8.2
Build step 'Publish JUnit test result report' changed build result to UNSTABLE
Email was triggered for: Unstable (Test Failures)
Sending email for trigger: Unstable (Test Failures)
Setting ANT_1_8_2_HOME=/var/lib/jenkins/tools/hudson.tasks.Ant_AntInstallation/ANT_1.8.2
Setting ANT_1_8_2_HOME=/var/lib/jenkins/tools/hudson.tasks.Ant_AntInstallation/ANT_1.8.2
Setting ANT_1_8_2_HOME=/var/lib/jenkins/tools/hudson.tasks.Ant_AntInstallation/ANT_1.8.2
Setting ANT_1_8_2_HOME=/var/lib/jenkins/tools/hudson.tasks.Ant_AntInstallation/ANT_1.8.2

Mime
View raw message