lucene-dev mailing list archives

Site index · List index
Message view « Date » · « Thread »
Top « Date » · « Thread »
From Apache Jenkins Server <jenk...@builds.apache.org>
Subject [JENKINS] Lucene-Solr-NightlyTests-7.3 - Build # 21 - Unstable
Date Sat, 05 May 2018 07:02:38 GMT
Build: https://builds.apache.org/job/Lucene-Solr-NightlyTests-7.3/21/

3 tests failed.
FAILED:  org.apache.lucene.index.TestBinaryDocValuesUpdates.testTonsOfUpdates

Error Message:
_3_4.fnm

Stack Trace:
java.io.FileNotFoundException: _3_4.fnm
	at __randomizedtesting.SeedInfo.seed([44891BA4A58B78F8:3CACC5AF47AB571A]:0)
	at org.apache.lucene.store.RAMDirectory.openInput(RAMDirectory.java:243)
	at org.apache.lucene.store.Directory.openChecksumInput(Directory.java:119)
	at org.apache.lucene.store.RawDirectoryWrapper.openChecksumInput(RawDirectoryWrapper.java:41)
	at org.apache.lucene.codecs.lucene60.Lucene60FieldInfosFormat.read(Lucene60FieldInfosFormat.java:113)
	at org.apache.lucene.index.SegmentReader.initFieldInfos(SegmentReader.java:190)
	at org.apache.lucene.index.SegmentReader.<init>(SegmentReader.java:93)
	at org.apache.lucene.index.ReadersAndUpdates.writeFieldUpdates(ReadersAndUpdates.java:688)
	at org.apache.lucene.index.IndexWriter$ReaderPool.writeSomeDocValuesUpdates(IndexWriter.java:705)
	at org.apache.lucene.index.FrozenBufferedUpdates.apply(FrozenBufferedUpdates.java:331)
	at org.apache.lucene.index.DocumentsWriter$ResolveUpdatesEvent.process(DocumentsWriter.java:740)
	at org.apache.lucene.index.IndexWriter.processEvents(IndexWriter.java:5106)
	at org.apache.lucene.index.IndexWriter.processEvents(IndexWriter.java:5096)
	at org.apache.lucene.index.IndexWriter.updateDocValues(IndexWriter.java:1891)
	at org.apache.lucene.index.TestBinaryDocValuesUpdates.testTonsOfUpdates(TestBinaryDocValuesUpdates.java:1323)
	at sun.reflect.NativeMethodAccessorImpl.invoke0(Native Method)
	at sun.reflect.NativeMethodAccessorImpl.invoke(NativeMethodAccessorImpl.java:62)
	at sun.reflect.DelegatingMethodAccessorImpl.invoke(DelegatingMethodAccessorImpl.java:43)
	at java.lang.reflect.Method.invoke(Method.java:498)
	at com.carrotsearch.randomizedtesting.RandomizedRunner.invoke(RandomizedRunner.java:1737)
	at com.carrotsearch.randomizedtesting.RandomizedRunner$8.evaluate(RandomizedRunner.java:934)
	at com.carrotsearch.randomizedtesting.RandomizedRunner$9.evaluate(RandomizedRunner.java:970)
	at com.carrotsearch.randomizedtesting.RandomizedRunner$10.evaluate(RandomizedRunner.java:984)
	at org.apache.lucene.util.TestRuleSetupTeardownChained$1.evaluate(TestRuleSetupTeardownChained.java:49)
	at org.apache.lucene.util.AbstractBeforeAfterRule$1.evaluate(AbstractBeforeAfterRule.java:45)
	at org.apache.lucene.util.TestRuleThreadAndTestName$1.evaluate(TestRuleThreadAndTestName.java:48)
	at org.apache.lucene.util.TestRuleIgnoreAfterMaxFailures$1.evaluate(TestRuleIgnoreAfterMaxFailures.java:64)
	at org.apache.lucene.util.TestRuleMarkFailure$1.evaluate(TestRuleMarkFailure.java:47)
	at com.carrotsearch.randomizedtesting.rules.StatementAdapter.evaluate(StatementAdapter.java:36)
	at com.carrotsearch.randomizedtesting.ThreadLeakControl$StatementRunner.run(ThreadLeakControl.java:368)
	at com.carrotsearch.randomizedtesting.ThreadLeakControl.forkTimeoutingTask(ThreadLeakControl.java:817)
	at com.carrotsearch.randomizedtesting.ThreadLeakControl$3.evaluate(ThreadLeakControl.java:468)
	at com.carrotsearch.randomizedtesting.RandomizedRunner.runSingleTest(RandomizedRunner.java:943)
	at com.carrotsearch.randomizedtesting.RandomizedRunner$5.evaluate(RandomizedRunner.java:829)
	at com.carrotsearch.randomizedtesting.RandomizedRunner$6.evaluate(RandomizedRunner.java:879)
	at com.carrotsearch.randomizedtesting.RandomizedRunner$7.evaluate(RandomizedRunner.java:890)
	at org.apache.lucene.util.AbstractBeforeAfterRule$1.evaluate(AbstractBeforeAfterRule.java:45)
	at com.carrotsearch.randomizedtesting.rules.StatementAdapter.evaluate(StatementAdapter.java:36)
	at org.apache.lucene.util.TestRuleStoreClassName$1.evaluate(TestRuleStoreClassName.java:41)
	at com.carrotsearch.randomizedtesting.rules.NoShadowingOrOverridesOnMethodsRule$1.evaluate(NoShadowingOrOverridesOnMethodsRule.java:40)
	at com.carrotsearch.randomizedtesting.rules.NoShadowingOrOverridesOnMethodsRule$1.evaluate(NoShadowingOrOverridesOnMethodsRule.java:40)
	at com.carrotsearch.randomizedtesting.rules.StatementAdapter.evaluate(StatementAdapter.java:36)
	at com.carrotsearch.randomizedtesting.rules.StatementAdapter.evaluate(StatementAdapter.java:36)
	at com.carrotsearch.randomizedtesting.rules.StatementAdapter.evaluate(StatementAdapter.java:36)
	at org.apache.lucene.util.TestRuleAssertionsRequired$1.evaluate(TestRuleAssertionsRequired.java:53)
	at org.apache.lucene.util.TestRuleMarkFailure$1.evaluate(TestRuleMarkFailure.java:47)
	at org.apache.lucene.util.TestRuleIgnoreAfterMaxFailures$1.evaluate(TestRuleIgnoreAfterMaxFailures.java:64)
	at org.apache.lucene.util.TestRuleIgnoreTestSuites$1.evaluate(TestRuleIgnoreTestSuites.java:54)
	at com.carrotsearch.randomizedtesting.rules.StatementAdapter.evaluate(StatementAdapter.java:36)
	at com.carrotsearch.randomizedtesting.ThreadLeakControl$StatementRunner.run(ThreadLeakControl.java:368)
	at java.lang.Thread.run(Thread.java:748)


FAILED:  org.apache.lucene.index.TestMixedDocValuesUpdates.testTonsOfUpdates

Error Message:
_2_3.inf

Stack Trace:
java.io.FileNotFoundException: _2_3.inf
	at __randomizedtesting.SeedInfo.seed([44891BA4A58B78F8:3CACC5AF47AB571A]:0)
	at org.apache.lucene.store.RAMDirectory.openInput(RAMDirectory.java:243)
	at org.apache.lucene.store.Directory.openChecksumInput(Directory.java:119)
	at org.apache.lucene.store.RawDirectoryWrapper.openChecksumInput(RawDirectoryWrapper.java:41)
	at org.apache.lucene.codecs.simpletext.SimpleTextFieldInfosFormat.read(SimpleTextFieldInfosFormat.java:73)
	at org.apache.lucene.index.SegmentReader.initFieldInfos(SegmentReader.java:190)
	at org.apache.lucene.index.SegmentReader.<init>(SegmentReader.java:93)
	at org.apache.lucene.index.ReadersAndUpdates.writeFieldUpdates(ReadersAndUpdates.java:688)
	at org.apache.lucene.index.IndexWriter$ReaderPool.writeSomeDocValuesUpdates(IndexWriter.java:705)
	at org.apache.lucene.index.FrozenBufferedUpdates.apply(FrozenBufferedUpdates.java:331)
	at org.apache.lucene.index.DocumentsWriter$ResolveUpdatesEvent.process(DocumentsWriter.java:740)
	at org.apache.lucene.index.IndexWriter.processEvents(IndexWriter.java:5106)
	at org.apache.lucene.index.IndexWriter.processEvents(IndexWriter.java:5096)
	at org.apache.lucene.index.IndexWriter.updateDocValues(IndexWriter.java:1891)
	at org.apache.lucene.index.TestMixedDocValuesUpdates.testTonsOfUpdates(TestMixedDocValuesUpdates.java:374)
	at sun.reflect.NativeMethodAccessorImpl.invoke0(Native Method)
	at sun.reflect.NativeMethodAccessorImpl.invoke(NativeMethodAccessorImpl.java:62)
	at sun.reflect.DelegatingMethodAccessorImpl.invoke(DelegatingMethodAccessorImpl.java:43)
	at java.lang.reflect.Method.invoke(Method.java:498)
	at com.carrotsearch.randomizedtesting.RandomizedRunner.invoke(RandomizedRunner.java:1737)
	at com.carrotsearch.randomizedtesting.RandomizedRunner$8.evaluate(RandomizedRunner.java:934)
	at com.carrotsearch.randomizedtesting.RandomizedRunner$9.evaluate(RandomizedRunner.java:970)
	at com.carrotsearch.randomizedtesting.RandomizedRunner$10.evaluate(RandomizedRunner.java:984)
	at org.apache.lucene.util.TestRuleSetupTeardownChained$1.evaluate(TestRuleSetupTeardownChained.java:49)
	at org.apache.lucene.util.AbstractBeforeAfterRule$1.evaluate(AbstractBeforeAfterRule.java:45)
	at org.apache.lucene.util.TestRuleThreadAndTestName$1.evaluate(TestRuleThreadAndTestName.java:48)
	at org.apache.lucene.util.TestRuleIgnoreAfterMaxFailures$1.evaluate(TestRuleIgnoreAfterMaxFailures.java:64)
	at org.apache.lucene.util.TestRuleMarkFailure$1.evaluate(TestRuleMarkFailure.java:47)
	at com.carrotsearch.randomizedtesting.rules.StatementAdapter.evaluate(StatementAdapter.java:36)
	at com.carrotsearch.randomizedtesting.ThreadLeakControl$StatementRunner.run(ThreadLeakControl.java:368)
	at com.carrotsearch.randomizedtesting.ThreadLeakControl.forkTimeoutingTask(ThreadLeakControl.java:817)
	at com.carrotsearch.randomizedtesting.ThreadLeakControl$3.evaluate(ThreadLeakControl.java:468)
	at com.carrotsearch.randomizedtesting.RandomizedRunner.runSingleTest(RandomizedRunner.java:943)
	at com.carrotsearch.randomizedtesting.RandomizedRunner$5.evaluate(RandomizedRunner.java:829)
	at com.carrotsearch.randomizedtesting.RandomizedRunner$6.evaluate(RandomizedRunner.java:879)
	at com.carrotsearch.randomizedtesting.RandomizedRunner$7.evaluate(RandomizedRunner.java:890)
	at org.apache.lucene.util.AbstractBeforeAfterRule$1.evaluate(AbstractBeforeAfterRule.java:45)
	at com.carrotsearch.randomizedtesting.rules.StatementAdapter.evaluate(StatementAdapter.java:36)
	at org.apache.lucene.util.TestRuleStoreClassName$1.evaluate(TestRuleStoreClassName.java:41)
	at com.carrotsearch.randomizedtesting.rules.NoShadowingOrOverridesOnMethodsRule$1.evaluate(NoShadowingOrOverridesOnMethodsRule.java:40)
	at com.carrotsearch.randomizedtesting.rules.NoShadowingOrOverridesOnMethodsRule$1.evaluate(NoShadowingOrOverridesOnMethodsRule.java:40)
	at com.carrotsearch.randomizedtesting.rules.StatementAdapter.evaluate(StatementAdapter.java:36)
	at com.carrotsearch.randomizedtesting.rules.StatementAdapter.evaluate(StatementAdapter.java:36)
	at com.carrotsearch.randomizedtesting.rules.StatementAdapter.evaluate(StatementAdapter.java:36)
	at org.apache.lucene.util.TestRuleAssertionsRequired$1.evaluate(TestRuleAssertionsRequired.java:53)
	at org.apache.lucene.util.TestRuleMarkFailure$1.evaluate(TestRuleMarkFailure.java:47)
	at org.apache.lucene.util.TestRuleIgnoreAfterMaxFailures$1.evaluate(TestRuleIgnoreAfterMaxFailures.java:64)
	at org.apache.lucene.util.TestRuleIgnoreTestSuites$1.evaluate(TestRuleIgnoreTestSuites.java:54)
	at com.carrotsearch.randomizedtesting.rules.StatementAdapter.evaluate(StatementAdapter.java:36)
	at com.carrotsearch.randomizedtesting.ThreadLeakControl$StatementRunner.run(ThreadLeakControl.java:368)
	at java.lang.Thread.run(Thread.java:748)


FAILED:  org.apache.solr.cloud.hdfs.HdfsUnloadDistributedZkTest.test

Error Message:
Error from server at http://127.0.0.1:45125: ADDREPLICA failed to create replica

Stack Trace:
org.apache.solr.client.solrj.impl.HttpSolrClient$RemoteSolrException: Error from server at http://127.0.0.1:45125: ADDREPLICA failed to create replica
	at __randomizedtesting.SeedInfo.seed([7E3C6CC6C037BFE:8FB7F916C2FF1606]:0)
	at org.apache.solr.client.solrj.impl.HttpSolrClient.executeMethod(HttpSolrClient.java:643)
	at org.apache.solr.client.solrj.impl.HttpSolrClient.request(HttpSolrClient.java:255)
	at org.apache.solr.client.solrj.impl.HttpSolrClient.request(HttpSolrClient.java:244)
	at org.apache.solr.client.solrj.impl.LBHttpSolrClient.doRequest(LBHttpSolrClient.java:483)
	at org.apache.solr.client.solrj.impl.LBHttpSolrClient.request(LBHttpSolrClient.java:413)
	at org.apache.solr.client.solrj.impl.CloudSolrClient.sendRequest(CloudSolrClient.java:1105)
	at org.apache.solr.client.solrj.impl.CloudSolrClient.requestWithRetryOnStaleState(CloudSolrClient.java:885)
	at org.apache.solr.client.solrj.impl.CloudSolrClient.request(CloudSolrClient.java:818)
	at org.apache.solr.client.solrj.SolrRequest.process(SolrRequest.java:194)
	at org.apache.solr.client.solrj.SolrRequest.process(SolrRequest.java:211)
	at org.apache.solr.cloud.UnloadDistributedZkTest.testUnloadShardAndCollection(UnloadDistributedZkTest.java:120)
	at org.apache.solr.cloud.UnloadDistributedZkTest.test(UnloadDistributedZkTest.java:72)
	at sun.reflect.NativeMethodAccessorImpl.invoke0(Native Method)
	at sun.reflect.NativeMethodAccessorImpl.invoke(NativeMethodAccessorImpl.java:62)
	at sun.reflect.DelegatingMethodAccessorImpl.invoke(DelegatingMethodAccessorImpl.java:43)
	at java.lang.reflect.Method.invoke(Method.java:498)
	at com.carrotsearch.randomizedtesting.RandomizedRunner.invoke(RandomizedRunner.java:1737)
	at com.carrotsearch.randomizedtesting.RandomizedRunner$8.evaluate(RandomizedRunner.java:934)
	at com.carrotsearch.randomizedtesting.RandomizedRunner$9.evaluate(RandomizedRunner.java:970)
	at com.carrotsearch.randomizedtesting.RandomizedRunner$10.evaluate(RandomizedRunner.java:984)
	at org.apache.solr.BaseDistributedSearchTestCase$ShardsRepeatRule$ShardsFixedStatement.callStatement(BaseDistributedSearchTestCase.java:993)
	at org.apache.solr.BaseDistributedSearchTestCase$ShardsRepeatRule$ShardsStatement.evaluate(BaseDistributedSearchTestCase.java:968)
	at com.carrotsearch.randomizedtesting.rules.SystemPropertiesRestoreRule$1.evaluate(SystemPropertiesRestoreRule.java:57)
	at org.apache.lucene.util.TestRuleSetupTeardownChained$1.evaluate(TestRuleSetupTeardownChained.java:49)
	at org.apache.lucene.util.AbstractBeforeAfterRule$1.evaluate(AbstractBeforeAfterRule.java:45)
	at org.apache.lucene.util.TestRuleThreadAndTestName$1.evaluate(TestRuleThreadAndTestName.java:48)
	at org.apache.lucene.util.TestRuleIgnoreAfterMaxFailures$1.evaluate(TestRuleIgnoreAfterMaxFailures.java:64)
	at org.apache.lucene.util.TestRuleMarkFailure$1.evaluate(TestRuleMarkFailure.java:47)
	at com.carrotsearch.randomizedtesting.rules.StatementAdapter.evaluate(StatementAdapter.java:36)
	at com.carrotsearch.randomizedtesting.ThreadLeakControl$StatementRunner.run(ThreadLeakControl.java:368)
	at com.carrotsearch.randomizedtesting.ThreadLeakControl.forkTimeoutingTask(ThreadLeakControl.java:817)
	at com.carrotsearch.randomizedtesting.ThreadLeakControl$3.evaluate(ThreadLeakControl.java:468)
	at com.carrotsearch.randomizedtesting.RandomizedRunner.runSingleTest(RandomizedRunner.java:943)
	at com.carrotsearch.randomizedtesting.RandomizedRunner$5.evaluate(RandomizedRunner.java:829)
	at com.carrotsearch.randomizedtesting.RandomizedRunner$6.evaluate(RandomizedRunner.java:879)
	at com.carrotsearch.randomizedtesting.RandomizedRunner$7.evaluate(RandomizedRunner.java:890)
	at com.carrotsearch.randomizedtesting.rules.StatementAdapter.evaluate(StatementAdapter.java:36)
	at com.carrotsearch.randomizedtesting.rules.SystemPropertiesRestoreRule$1.evaluate(SystemPropertiesRestoreRule.java:57)
	at org.apache.lucene.util.AbstractBeforeAfterRule$1.evaluate(AbstractBeforeAfterRule.java:45)
	at com.carrotsearch.randomizedtesting.rules.StatementAdapter.evaluate(StatementAdapter.java:36)
	at org.apache.lucene.util.TestRuleStoreClassName$1.evaluate(TestRuleStoreClassName.java:41)
	at com.carrotsearch.randomizedtesting.rules.NoShadowingOrOverridesOnMethodsRule$1.evaluate(NoShadowingOrOverridesOnMethodsRule.java:40)
	at com.carrotsearch.randomizedtesting.rules.NoShadowingOrOverridesOnMethodsRule$1.evaluate(NoShadowingOrOverridesOnMethodsRule.java:40)
	at com.carrotsearch.randomizedtesting.rules.StatementAdapter.evaluate(StatementAdapter.java:36)
	at com.carrotsearch.randomizedtesting.rules.StatementAdapter.evaluate(StatementAdapter.java:36)
	at com.carrotsearch.randomizedtesting.rules.StatementAdapter.evaluate(StatementAdapter.java:36)
	at org.apache.lucene.util.TestRuleAssertionsRequired$1.evaluate(TestRuleAssertionsRequired.java:53)
	at org.apache.lucene.util.TestRuleMarkFailure$1.evaluate(TestRuleMarkFailure.java:47)
	at org.apache.lucene.util.TestRuleIgnoreAfterMaxFailures$1.evaluate(TestRuleIgnoreAfterMaxFailures.java:64)
	at org.apache.lucene.util.TestRuleIgnoreTestSuites$1.evaluate(TestRuleIgnoreTestSuites.java:54)
	at com.carrotsearch.randomizedtesting.rules.StatementAdapter.evaluate(StatementAdapter.java:36)
	at com.carrotsearch.randomizedtesting.ThreadLeakControl$StatementRunner.run(ThreadLeakControl.java:368)
	at java.lang.Thread.run(Thread.java:748)




Build Log:
[...truncated 9 lines...]
ERROR: Error fetching remote repo 'origin'
hudson.plugins.git.GitException: Failed to fetch from git://git.apache.org/lucene-solr.git
	at hudson.plugins.git.GitSCM.fetchFrom(GitSCM.java:862)
	at hudson.plugins.git.GitSCM.retrieveChanges(GitSCM.java:1129)
	at hudson.plugins.git.GitSCM.checkout(GitSCM.java:1160)
	at org.jenkinsci.plugins.multiplescms.MultiSCM.checkout(MultiSCM.java:143)
	at hudson.scm.SCM.checkout(SCM.java:495)
	at hudson.model.AbstractProject.checkout(AbstractProject.java:1202)
	at hudson.model.AbstractBuild$AbstractBuildExecution.defaultCheckout(AbstractBuild.java:574)
	at jenkins.scm.SCMCheckoutStrategy.checkout(SCMCheckoutStrategy.java:86)
	at hudson.model.AbstractBuild$AbstractBuildExecution.run(AbstractBuild.java:499)
	at hudson.model.Run.execute(Run.java:1724)
	at hudson.model.FreeStyleBuild.run(FreeStyleBuild.java:43)
	at hudson.model.ResourceController.execute(ResourceController.java:97)
	at hudson.model.Executor.run(Executor.java:429)
Caused by: hudson.plugins.git.GitException: Command "git fetch --tags --progress git://git.apache.org/lucene-solr.git +refs/heads/*:refs/remotes/origin/*" returned status code 128:
stdout: 
stderr: fatal: unable to connect to git.apache.org:
git.apache.org[0: 54.84.58.65]: errno=Connection refused


	at org.jenkinsci.plugins.gitclient.CliGitAPIImpl.launchCommandIn(CliGitAPIImpl.java:1996)
	at org.jenkinsci.plugins.gitclient.CliGitAPIImpl.launchCommandWithCredentials(CliGitAPIImpl.java:1715)
	at org.jenkinsci.plugins.gitclient.CliGitAPIImpl.access$300(CliGitAPIImpl.java:72)
	at org.jenkinsci.plugins.gitclient.CliGitAPIImpl$1.execute(CliGitAPIImpl.java:405)
	at org.jenkinsci.plugins.gitclient.RemoteGitImpl$CommandInvocationHandler$1.call(RemoteGitImpl.java:153)
	at org.jenkinsci.plugins.gitclient.RemoteGitImpl$CommandInvocationHandler$1.call(RemoteGitImpl.java:146)
	at hudson.remoting.UserRequest.perform(UserRequest.java:207)
	at hudson.remoting.UserRequest.perform(UserRequest.java:53)
	at hudson.remoting.Request$2.run(Request.java:358)
	at hudson.remoting.InterceptingExecutorService$1.call(InterceptingExecutorService.java:72)
	at java.util.concurrent.FutureTask.run(FutureTask.java:266)
	at java.util.concurrent.ThreadPoolExecutor.runWorker(ThreadPoolExecutor.java:1142)
	at java.util.concurrent.ThreadPoolExecutor$Worker.run(ThreadPoolExecutor.java:617)
	at java.lang.Thread.run(Thread.java:748)
	Suppressed: hudson.remoting.Channel$CallSiteStackTrace: Remote call to lucene
		at hudson.remoting.Channel.attachCallSiteStackTrace(Channel.java:1693)
		at hudson.remoting.UserResponse.retrieve(UserRequest.java:310)
		at hudson.remoting.Channel.call(Channel.java:908)
		at org.jenkinsci.plugins.gitclient.RemoteGitImpl$CommandInvocationHandler.execute(RemoteGitImpl.java:146)
		at sun.reflect.GeneratedMethodAccessor646.invoke(Unknown Source)
		at sun.reflect.DelegatingMethodAccessorImpl.invoke(DelegatingMethodAccessorImpl.java:43)
		at java.lang.reflect.Method.invoke(Method.java:498)
		at org.jenkinsci.plugins.gitclient.RemoteGitImpl$CommandInvocationHandler.invoke(RemoteGitImpl.java:132)
		at com.sun.proxy.$Proxy111.execute(Unknown Source)
		at hudson.plugins.git.GitSCM.fetchFrom(GitSCM.java:860)
		at hudson.plugins.git.GitSCM.retrieveChanges(GitSCM.java:1129)
		at hudson.plugins.git.GitSCM.checkout(GitSCM.java:1160)
		at org.jenkinsci.plugins.multiplescms.MultiSCM.checkout(MultiSCM.java:143)
		at hudson.scm.SCM.checkout(SCM.java:495)
		at hudson.model.AbstractProject.checkout(AbstractProject.java:1202)
		at hudson.model.AbstractBuild$AbstractBuildExecution.defaultCheckout(AbstractBuild.java:574)
		at jenkins.scm.SCMCheckoutStrategy.checkout(SCMCheckoutStrategy.java:86)
		at hudson.model.AbstractBuild$AbstractBuildExecution.run(AbstractBuild.java:499)
		at hudson.model.Run.execute(Run.java:1724)
		at hudson.model.FreeStyleBuild.run(FreeStyleBuild.java:43)
		at hudson.model.ResourceController.execute(ResourceController.java:97)
		at hudson.model.Executor.run(Executor.java:429)
ERROR: Error fetching remote repo 'origin'
Retrying after 10 seconds
 > git rev-parse --is-inside-work-tree # timeout=10
Fetching changes from the remote Git repository
 > git config remote.origin.url git://git.apache.org/lucene-solr.git # timeout=10
Fetching upstream changes from git://git.apache.org/lucene-solr.git
 > git --version # timeout=10
 > git fetch --tags --progress git://git.apache.org/lucene-solr.git +refs/heads/*:refs/remotes/origin/*
 > git rev-parse refs/remotes/origin/branch_7_3^{commit} # timeout=10
 > git rev-parse refs/remotes/origin/origin/branch_7_3^{commit} # timeout=10
Checking out Revision 7b74345edb3969ffc523284b116a0437a275102a (refs/remotes/origin/branch_7_3)
 > git config core.sparsecheckout # timeout=10
 > git checkout -f 7b74345edb3969ffc523284b116a0437a275102a
Commit message: "SOLR-12202: Fix errors in solr-exporter.cmd"
 > git rev-list --no-walk 8fa7687413558b3bc65cbbbeb722a21314187e6a # timeout=10
Cleaning workspace
 > git rev-parse --verify HEAD # timeout=10
Resetting working tree
 > git reset --hard # timeout=10
 > git clean -fdx # timeout=10
Cleaning up /home/jenkins/jenkins-slave/workspace/Lucene-Solr-NightlyTests-7.3/test-data
Updating http://svn.apache.org/repos/asf/lucene/test-data at revision '2018-05-04T23:49:42.474 +0000'
At revision 1830946

No emails were triggered.
[checkout] $ /home/jenkins/tools/ant/apache-ant-1.8.4/bin/ant -file build.xml -Dtests.multiplier=2 -Dtests.linedocsfile=/home/jenkins/jenkins-slave/workspace/Lucene-Solr-NightlyTests-7.3/test-data/enwiki.random.lines.txt jenkins-nightly
Buildfile: /x1/jenkins/jenkins-slave/workspace/Lucene-Solr-NightlyTests-7.3/checkout/build.xml

jenkins-nightly:

-print-java-info:
[java-info] java version "1.8.0_172"
[java-info] Java(TM) SE Runtime Environment (1.8.0_172-b11, Oracle Corporation)
[java-info] Java HotSpot(TM) 64-Bit Server VM (25.172-b11, Oracle Corporation)
[java-info] Test args: []

clean:

clean:

clean:

ivy-availability-check:
[loadresource] Do not set property disallowed.ivy.jars.list as its length is 0.

-ivy-fail-disallowed-ivy-version:

ivy-fail:

ivy-configure:
[ivy:configure] :: Apache Ivy 2.4.0 - 20141213170938 :: http://ant.apache.org/ivy/ ::
[ivy:configure] :: loading settings :: file = /x1/jenkins/jenkins-slave/workspace/Lucene-Solr-NightlyTests-7.3/checkout/lucene/top-level-ivy-settings.xml

resolve-groovy:
[ivy:cachepath] :: resolving dependencies :: org.codehaus.groovy#groovy-all-caller;working
[ivy:cachepath] 	confs: [default]
[ivy:cachepath] 	found org.codehaus.groovy#groovy-all;2.4.13 in public
[ivy:cachepath] :: resolution report :: resolve 303ms :: artifacts dl 15ms
	---------------------------------------------------------------------
	|                  |            modules            ||   artifacts   |
	|       conf       | number| search|dwnlded|evicted|| number|dwnlded|
	---------------------------------------------------------------------
	|      default     |   1   |   0   |   0   |   0   ||   1   |   0   |
	---------------------------------------------------------------------

-test-with-heapdumps-enabled:
     [echo] Java HotSpot(TM) 64-Bit Server VM: Enabling heap dumps on OutOfMemoryError to dir '/x1/jenkins/jenkins-slave/workspace/Lucene-Solr-NightlyTests-7.3/checkout/heapdumps'.
    [mkdir] Created dir: /x1/jenkins/jenkins-slave/workspace/Lucene-Solr-NightlyTests-7.3/checkout/heapdumps

ivy-availability-check:
[loadresource] Do not set property disallowed.ivy.jars.list as its length is 0.

-ivy-fail-disallowed-ivy-version:

ivy-fail:

ivy-configure:
[ivy:configure] :: loading settings :: file = /x1/jenkins/jenkins-slave/workspace/Lucene-Solr-NightlyTests-7.3/checkout/lucene/top-level-ivy-settings.xml

resolve-groovy:

test:

ivy-availability-check:
[loadresource] Do not set property disallowed.ivy.jars.list as its length is 0.

-ivy-fail-disallowed-ivy-version:

ivy-fail:

ivy-configure:
[ivy:configure] :: loading settings :: file = /x1/jenkins/jenkins-slave/workspace/Lucene-Solr-NightlyTests-7.3/checkout/lucene/top-level-ivy-settings.xml

-clover.load:

resolve-groovy:

-init-totals:

test-core:

-clover.disable:

ivy-availability-check:
[loadresource] Do not set property disallowed.ivy.jars.list as its length is 0.

-ivy-fail-disallowed-ivy-version:

ivy-fail:

ivy-configure:
[ivy:configure] :: loading settings :: file = /x1/jenkins/jenkins-slave/workspace/Lucene-Solr-NightlyTests-7.3/checkout/lucene/top-level-ivy-settings.xml

-clover.load:

-clover.classpath:

-clover.setup:

clover:

-check-git-state:

-git-cleanroot:

-copy-git-state:
     [copy] Copying 1 file to /x1/jenkins/jenkins-slave/workspace/Lucene-Solr-NightlyTests-7.3/checkout/lucene/build

git-autoclean:

resolve:

init:

compile-core:
    [mkdir] Created dir: /x1/jenkins/jenkins-slave/workspace/Lucene-Solr-NightlyTests-7.3/checkout/lucene/build/core/classes/java
    [javac] Compiling 827 source files to /x1/jenkins/jenkins-slave/workspace/Lucene-Solr-NightlyTests-7.3/checkout/lucene/build/core/classes/java
    [javac] Note: Some input files use or override a deprecated API.
    [javac] Note: Recompile with -Xlint:deprecation for details.
    [javac] Creating empty /x1/jenkins/jenkins-slave/workspace/Lucene-Solr-NightlyTests-7.3/checkout/lucene/build/core/classes/java/org/apache/lucene/util/graph/package-info.class
    [javac] Creating empty /x1/jenkins/jenkins-slave/workspace/Lucene-Solr-NightlyTests-7.3/checkout/lucene/build/core/classes/java/org/apache/lucene/document/package-info.class
    [javac] Creating empty /x1/jenkins/jenkins-slave/workspace/Lucene-Solr-NightlyTests-7.3/checkout/lucene/build/core/classes/java/org/apache/lucene/package-info.class
    [javac] Creating empty /x1/jenkins/jenkins-slave/workspace/Lucene-Solr-NightlyTests-7.3/checkout/lucene/build/core/classes/java/org/apache/lucene/util/bkd/package-info.class
    [javac] Creating empty /x1/jenkins/jenkins-slave/workspace/Lucene-Solr-NightlyTests-7.3/checkout/lucene/build/core/classes/java/org/apache/lucene/codecs/compressing/package-info.class
    [javac] Creating empty /x1/jenkins/jenkins-slave/workspace/Lucene-Solr-NightlyTests-7.3/checkout/lucene/build/core/classes/java/org/apache/lucene/codecs/lucene60/package-info.class
    [javac] Creating empty /x1/jenkins/jenkins-slave/workspace/Lucene-Solr-NightlyTests-7.3/checkout/lucene/build/core/classes/java/org/apache/lucene/codecs/package-info.class
    [javac] Creating empty /x1/jenkins/jenkins-slave/workspace/Lucene-Solr-NightlyTests-7.3/checkout/lucene/build/core/classes/java/org/apache/lucene/util/package-info.class
    [javac] Creating empty /x1/jenkins/jenkins-slave/workspace/Lucene-Solr-NightlyTests-7.3/checkout/lucene/build/core/classes/java/org/apache/lucene/index/package-info.class
    [javac] Creating empty /x1/jenkins/jenkins-slave/workspace/Lucene-Solr-NightlyTests-7.3/checkout/lucene/build/core/classes/java/org/apache/lucene/util/fst/package-info.class
    [javac] Creating empty /x1/jenkins/jenkins-slave/workspace/Lucene-Solr-NightlyTests-7.3/checkout/lucene/build/core/classes/java/org/apache/lucene/analysis/tokenattributes/package-info.class
    [javac] Creating empty /x1/jenkins/jenkins-slave/workspace/Lucene-Solr-NightlyTests-7.3/checkout/lucene/build/core/classes/java/org/apache/lucene/search/package-info.class
    [javac] Creating empty /x1/jenkins/jenkins-slave/workspace/Lucene-Solr-NightlyTests-7.3/checkout/lucene/build/core/classes/java/org/apache/lucene/codecs/lucene62/package-info.class
    [javac] Creating empty /x1/jenkins/jenkins-slave/workspace/Lucene-Solr-NightlyTests-7.3/checkout/lucene/build/core/classes/java/org/apache/lucene/util/packed/package-info.class
    [javac] Creating empty /x1/jenkins/jenkins-slave/workspace/Lucene-Solr-NightlyTests-7.3/checkout/lucene/build/core/classes/java/org/apache/lucene/util/mutable/package-info.class
    [javac] Creating empty /x1/jenkins/jenkins-slave/workspace/Lucene-Solr-NightlyTests-7.3/checkout/lucene/build/core/classes/java/org/apache/lucene/codecs/lucene70/package-info.class
    [javac] Creating empty /x1/jenkins/jenkins-slave/workspace/Lucene-Solr-NightlyTests-7.3/checkout/lucene/build/core/classes/java/org/apache/lucene/codecs/perfield/package-info.class
    [javac] Creating empty /x1/jenkins/jenkins-slave/workspace/Lucene-Solr-NightlyTests-7.3/checkout/lucene/build/core/classes/java/org/apache/lucene/analysis/package-info.class
    [javac] Creating empty /x1/jenkins/jenkins-slave/workspace/Lucene-Solr-NightlyTests-7.3/checkout/lucene/build/core/classes/java/org/apache/lucene/analysis/standard/package-info.class
    [javac] Creating empty /x1/jenkins/jenkins-slave/workspace/Lucene-Solr-NightlyTests-7.3/checkout/lucene/build/core/classes/java/org/apache/lucene/store/package-info.class
    [javac] Creating empty /x1/jenkins/jenkins-slave/workspace/Lucene-Solr-NightlyTests-7.3/checkout/lucene/build/core/classes/java/org/apache/lucene/codecs/blocktree/package-info.class
    [javac] Creating empty /x1/jenkins/jenkins-slave/workspace/Lucene-Solr-NightlyTests-7.3/checkout/lucene/build/core/classes/java/org/apache/lucene/search/spans/package-info.class
    [javac] Creating empty /x1/jenkins/jenkins-slave/workspace/Lucene-Solr-NightlyTests-7.3/checkout/lucene/build/core/classes/java/org/apache/lucene/search/similarities/package-info.class
    [javac] Creating empty /x1/jenkins/jenkins-slave/workspace/Lucene-Solr-NightlyTests-7.3/checkout/lucene/build/core/classes/java/org/apache/lucene/util/automaton/package-info.class
    [javac] Creating empty /x1/jenkins/jenkins-slave/workspace/Lucene-Solr-NightlyTests-7.3/checkout/lucene/build/core/classes/java/org/apache/lucene/codecs/lucene50/package-info.class
    [javac] Creating empty /x1/jenkins/jenkins-slave/workspace/Lucene-Solr-NightlyTests-7.3/checkout/lucene/build/core/classes/java/org/apache/lucene/geo/package-info.class
     [copy] Copying 3 files to /x1/jenkins/jenkins-slave/workspace/Lucene-Solr-NightlyTests-7.3/checkout/lucene/build/core/classes/java

compile-test-framework:

-check-git-state:

-git-cleanroot:

-copy-git-state:

git-autoclean:

ivy-availability-check:
[loadresource] Do not set property disallowed.ivy.jars.list as its length is 0.

-ivy-fail-disallowed-ivy-version:

ivy-fail:

ivy-configure:
[ivy:configure] :: loading settings :: file = /x1/jenkins/jenkins-slave/workspace/Lucene-Solr-NightlyTests-7.3/checkout/lucene/top-level-ivy-settings.xml

resolve:

init:

compile-lucene-core:

-check-git-state:

-git-cleanroot:

-copy-git-state:

git-autoclean:

ivy-availability-check:
[loadresource] Do not set property disallowed.ivy.jars.list as its length is 0.

-ivy-fail-disallowed-ivy-version:

ivy-fail:

ivy-configure:
[ivy:configure] :: loading settings :: file = /x1/jenkins/jenkins-slave/workspace/Lucene-Solr-NightlyTests-7.3/checkout/lucene/top-level-ivy-settings.xml

resolve:

init:

-clover.disable:

-clover.load:

-clover.classpath:

-clover.setup:

clover:

compile-core:

compile-codecs:

-check-git-state:

-git-cleanroot:

-copy-git-state:

git-autoclean:

ivy-availability-check:
[loadresource] Do not set property disallowed.ivy.jars.list as its length is 0.

-ivy-fail-disallowed-ivy-version:

ivy-fail:

ivy-configure:
[ivy:configure] :: loading settings :: file = /x1/jenkins/jenkins-slave/workspace/Lucene-Solr-NightlyTests-7.3/checkout/lucene/top-level-ivy-settings.xml

resolve:

common.init:

compile-lucene-core:

init:

-clover.disable:

-clover.load:

-clover.classpath:

-clover.setup:

clover:

compile-core:
    [mkdir] Created dir: /x1/jenkins/jenkins-slave/workspace/Lucene-Solr-NightlyTests-7.3/checkout/lucene/build/codecs/classes/java
    [javac] Compiling 67 source files to /x1/jenkins/jenkins-slave/workspace/Lucene-Solr-NightlyTests-7.3/checkout/lucene/build/codecs/classes/java
    [javac] Note: Some input files use or override a deprecated API.
    [javac] Note: Recompile with -Xlint:deprecation for details.
    [javac] Creating empty /x1/jenkins/jenkins-slave/workspace/Lucene-Solr-NightlyTests-7.3/checkout/lucene/build/codecs/classes/java/org/apache/lucene/codecs/bloom/package-info.class
    [javac] Creating empty /x1/jenkins/jenkins-slave/workspace/Lucene-Solr-NightlyTests-7.3/checkout/lucene/build/codecs/classes/java/org/apache/lucene/codecs/memory/package-info.class
    [javac] Creating empty /x1/jenkins/jenkins-slave/workspace/Lucene-Solr-NightlyTests-7.3/checkout/lucene/build/codecs/classes/java/org/apache/lucene/codecs/simpletext/package-info.class
    [javac] Creating empty /x1/jenkins/jenkins-slave/workspace/Lucene-Solr-NightlyTests-7.3/checkout/lucene/build/codecs/classes/java/org/apache/lucene/codecs/blockterms/package-info.class
    [javac] Creating empty /x1/jenkins/jenkins-slave/workspace/Lucene-Solr-NightlyTests-7.3/checkout/lucene/build/codecs/classes/java/org/apache/lucene/codecs/blocktreeords/package-info.class
     [copy] Copying 3 files to /x1/jenkins/jenkins-slave/workspace/Lucene-Solr-NightlyTests-7.3/checkout/lucene/build/codecs/classes/java

-clover.disable:

-clover.load:

-clover.classpath:

-clover.setup:

clover:

common.compile-core:
    [mkdir] Created dir: /x1/jenkins/jenkins-slave/workspace/Lucene-Solr-NightlyTests-7.3/checkout/lucene/build/test-framework/classes/java
    [javac] Compiling 188 source files to /x1/jenkins/jenkins-slave/workspace/Lucene-Solr-NightlyTests-7.3/checkout/lucene/build/test-framework/classes/java
    [javac] Note: Some input files use or override a deprecated API.
    [javac] Note: Recompile with -Xlint:deprecation for details.
    [javac] Creating empty /x1/jenkins/jenkins-slave/workspace/Lucene-Solr-NightlyTests-7.3/checkout/lucene/build/test-framework/classes/java/org/apache/lucene/codecs/asserting/package-info.class
    [javac] Creating empty /x1/jenkins/jenkins-slave/workspace/Lucene-Solr-NightlyTests-7.3/checkout/lucene/build/test-framework/classes/java/org/apache/lucene/codecs/ramonly/package-info.class
    [javac] Creating empty /x1/jenkins/jenkins-slave/workspace/Lucene-Solr-NightlyTests-7.3/checkout/lucene/build/test-framework/classes/java/org/apache/lucene/mockfile/package-info.class
    [javac] Creating empty /x1/jenkins/jenkins-slave/workspace/Lucene-Solr-NightlyTests-7.3/checkout/lucene/build/test-framework/classes/java/org/apache/lucene/codecs/cheapbastard/package-info.class
    [javac] Creating empty /x1/jenkins/jenkins-slave/workspace/Lucene-Solr-NightlyTests-7.3/checkout/lucene/build/test-framework/classes/java/org/apache/lucene/codecs/mockrandom/package-info.class
    [javac] Creating empty /x1/jenkins/jenkins-slave/workspace/Lucene-Solr-NightlyTests-7.3/checkout/lucene/build/test-framework/classes/java/org/apache/lucene/codecs/cranky/package-info.class
    [javac] Creating empty /x1/jenkins/jenkins-slave/workspace/Lucene-Solr-NightlyTests-7.3/checkout/lucene/build/test-framework/classes/java/org/apache/lucene/codecs/compressing/dummy/package-info.class
     [copy] Copying 4 files to /x1/jenkins/jenkins-slave/workspace/Lucene-Solr-NightlyTests-7.3/checkout/lucene/build/test-framework/classes/java

compile-core:

compile-test:
    [mkdir] Created dir: /x1/jenkins/jenkins-slave/workspace/Lucene-Solr-NightlyTests-7.3/checkout/lucene/build/core/classes/test
    [javac] Compiling 473 source files to /x1/jenkins/jenkins-slave/workspace/Lucene-Solr-NightlyTests-7.3/checkout/lucene/build/core/classes/test
    [javac] Note: Some input files use or override a deprecated API.
    [javac] Note: Recompile with -Xlint:deprecation for details.
     [copy] Copying 3 files to /x1/jenkins/jenkins-slave/workspace/Lucene-Solr-NightlyTests-7.3/checkout/lucene/build/core/classes/test

-mrjar-classes-uptodate:

resolve-groovy:

patch-mrjar-classes:
[patch-cls] Remapped: org/apache/lucene/analysis/tokenattributes/CharTermAttributeImpl
[patch-cls] Remapped: org/apache/lucene/codecs/compressing/LZ4
[patch-cls] Remapped: org/apache/lucene/document/BinaryPoint$2
[patch-cls] Remapped: org/apache/lucene/document/DoubleRange
[patch-cls] Remapped: org/apache/lucene/document/FloatRange
[patch-cls] Remapped: org/apache/lucene/document/IntRange
[patch-cls] Remapped: org/apache/lucene/document/LongRange
[patch-cls] Remapped: org/apache/lucene/index/BitsSlice
[patch-cls] Remapped: org/apache/lucene/index/CodecReader
[patch-cls] Remapped: org/apache/lucene/index/MergeReaderWrapper
[patch-cls] Remapped: org/apache/lucene/search/BooleanScorer$TailPriorityQueue
[patch-cls] Remapped: org/apache/lucene/util/BytesRef
[patch-cls] Remapped: org/apache/lucene/util/BytesRefArray
[patch-cls] Remapped: org/apache/lucene/util/CharsRef$UTF16SortedAsUTF8Comparator
[patch-cls] Remapped: org/apache/lucene/util/CharsRef
[patch-cls] Remapped: org/apache/lucene/util/IntsRef
[patch-cls] Remapped: org/apache/lucene/util/LongsRef
[patch-cls] Remapped: org/apache/lucene/util/StringHelper
[patch-cls] Remapped: org/apache/lucene/util/automaton/Automaton$Builder
[patch-cls] Remapped: org/apache/lucene/util/automaton/Automaton
[patch-cls] Remapped 20 class files for Java 9 to: /x1/jenkins/jenkins-slave/workspace/Lucene-Solr-NightlyTests-7.3/checkout/lucene/build/core/classes/java9
    [touch] Creating /x1/jenkins/jenkins-slave/workspace/Lucene-Solr-NightlyTests-7.3/checkout/lucene/build/core/patch-mrjar.stamp

install-junit4-taskdef:

validate:

-init-totals:

-test:
    [mkdir] Created dir: /x1/jenkins/jenkins-slave/workspace/Lucene-Solr-NightlyTests-7.3/checkout/lucene/build/core/test
    [mkdir] Created dir: /x1/jenkins/jenkins-slave/workspace/Lucene-Solr-NightlyTests-7.3/checkout/lucene/build/core/test/temp
    [mkdir] Created dir: /x1/jenkins/jenkins-slave/workspace/Lucene-Solr-NightlyTests-7.3/checkout/.caches/test-stats/core
   [junit4] <JUnit4> says cześć! Master seed: 44891BA4A58B78F8
   [junit4] Executing 466 suites with 3 JVMs.
   [junit4] 
   [junit4] Started J0 PID(8886@localhost).
   [junit4] Started J2 PID(8887@localhost).
   [junit4] Started J1 PID(8888@localhost).
   [junit4] Suite: org.apache.lucene.search.TestQueryRescorer
   [junit4] Completed [1/466] on J0 in 17.24s, 6 tests
   [junit4] 
   [junit4] Suite: org.apache.lucene.codecs.lucene50.TestLucene60FieldInfoFormat
   [junit4] Completed [2/466] on J1 in 17.12s, 11 tests
   [junit4] 
   [junit4] Suite: org.apache.lucene.index.Test2BDocs
   [junit4] IGNOR/A 0.04s J1 | Test2BDocs.test2BDocs
   [junit4]    > Assumption #1: 'monster' test group is disabled (@Monster(value=Takes ~30min))
   [junit4] Completed [3/466] on J1 in 0.06s, 1 test, 1 skipped
   [junit4] 
   [junit4] Suite: org.apache.lucene.search.spans.TestSpanMultiTermQueryWrapper
   [junit4] Completed [4/466] on J0 in 1.93s, 9 tests
   [junit4] 
   [junit4] Suite: org.apache.lucene.index.TestDocCount
   [junit4] Completed [5/466] on J0 in 2.97s, 1 test
   [junit4] 
   [junit4] Suite: org.apache.lucene.index.TestIntBlockPool
   [junit4] Completed [6/466] on J0 in 1.33s, 2 tests
   [junit4] 
   [junit4] Suite: org.apache.lucene.codecs.TestCodecLoadingDeadlock
   [junit4] Completed [7/466] on J0 in 1.42s, 1 test
   [junit4] 
   [junit4] Suite: org.apache.lucene.index.Test2BBinaryDocValues
   [junit4] IGNOR/A 0.02s J0 | Test2BBinaryDocValues.testFixedBinary
   [junit4]    > Assumption #1: 'monster' test group is disabled (@Monster(value=takes ~ 6 hours if the heap is 5gb))
   [junit4] IGNOR/A 0.00s J0 | Test2BBinaryDocValues.testVariableBinary
   [junit4]    > Assumption #1: 'monster' test group is disabled (@Monster(value=takes ~ 6 hours if the heap is 5gb))
   [junit4] Completed [8/466] on J0 in 0.31s, 2 tests, 2 skipped
   [junit4] 
   [junit4] Suite: org.apache.lucene.util.automaton.LimitedFiniteStringsIteratorTest
   [junit4] Completed [9/466] on J0 in 1.78s, 6 tests
   [junit4] 
   [junit4] Suite: org.apache.lucene.search.spans.TestSpansEnum
   [junit4] Completed [10/466] on J0 in 0.76s, 7 tests
   [junit4] 
   [junit4] Suite: org.apache.lucene.util.packed.TestDirectMonotonic
   [junit4] Completed [11/466] on J1 in 11.20s, 4 tests
   [junit4] 
   [junit4] Suite: org.apache.lucene.index.TestFilterCodecReader
   [junit4] Completed [12/466] on J1 in 0.18s, 1 test
   [junit4] 
   [junit4] Suite: org.apache.lucene.util.bkd.TestMutablePointsReaderUtils
   [junit4] Completed [13/466] on J1 in 5.90s, 3 tests
   [junit4] 
   [junit4] Suite: org.apache.lucene.search.TestNormsFieldExistsQuery
   [junit4] Completed [14/466] on J1 in 58.72s, 6 tests
   [junit4] 
   [junit4] Suite: org.apache.lucene.search.TestMultiTermConstantScore
   [junit4] Completed [15/466] on J1 in 18.57s, 7 tests
   [junit4] 
   [junit4] Suite: org.apache.lucene.document.TestDoubleRange
   [junit4] Completed [16/466] on J1 in 0.05s, 1 test
   [junit4] 
   [junit4] Suite: org.apache.lucene.index.TestParallelReaderEmptyIndex
   [junit4] Completed [17/466] on J1 in 0.23s, 2 tests
   [junit4] 
   [junit4] Suite: org.apache.lucene.index.TestAtomicUpdate
   [junit4] Completed [18/466] on J1 in 5.67s, 1 test
   [junit4] 
   [junit4] HEARTBEAT J0 PID(8886@localhost): 2018-05-04T23:55:03, stalled for 71.7s at: TestFloatRangeFieldQueries.testRandomBig
   [junit4] Suite: org.apache.lucene.util.TestTimSorterWorstCase
   [junit4] Completed [19/466] on J1 in 42.64s, 1 test
   [junit4] 
   [junit4] Suite: org.apache.lucene.search.TestComplexExplanations
   [junit4] Completed [20/466] on J1 in 6.10s, 21 tests
   [junit4] 
   [junit4] Suite: org.apache.lucene.search.TestBooleanQuery
   [junit4] Completed [21/466] on J1 in 1.11s, 22 tests
   [junit4] 
   [junit4] Suite: org.apache.lucene.search.TestMatchNoDocsQuery
   [junit4] Completed [22/466] on J1 in 0.08s, 3 tests
   [junit4] 
   [junit4] Suite: org.apache.lucene.search.spans.TestSpanContainQuery
   [junit4] Completed [23/466] on J1 in 0.22s, 4 tests
   [junit4] 
   [junit4] Suite: org.apache.lucene.search.spans.TestSpanOrQuery
   [junit4] Completed [24/466] on J1 in 0.10s, 3 tests
   [junit4] 
   [junit4] Suite: org.apache.lucene.index.TestOmitTf
   [junit4] Completed [25/466] on J1 in 2.54s, 6 tests
   [junit4] 
   [junit4] Suite: org.apache.lucene.index.TestTieredMergePolicy
   [junit4] Completed [26/466] on J1 in 21.68s, 6 tests
   [junit4] 
   [junit4] Suite: org.apache.lucene.util.TestFutureArrays
   [junit4] Completed [27/466] on J1 in 0.22s, 10 tests
   [junit4] 
   [junit4] Suite: org.apache.lucene.store.TestLockFactory
   [junit4] Completed [28/466] on J1 in 0.06s, 2 tests
   [junit4] 
   [junit4] Suite: org.apache.lucene.search.spans.TestSpanExplanationsOfNonMatches
   [junit4] Completed [29/466] on J1 in 0.24s, 30 tests
   [junit4] 
   [junit4] HEARTBEAT J0 PID(8886@localhost): 2018-05-04T23:56:03, stalled for  132s at: TestFloatRangeFieldQueries.testRandomBig
   [junit4] Suite: org.apache.lucene.codecs.lucene50.TestLucene50StoredFieldsFormat
   [junit4] Completed [30/466] on J1 in 40.27s, 17 tests
   [junit4] 
   [junit4] Suite: org.apache.lucene.search.TestNot
   [junit4] Completed [31/466] on J1 in 0.07s, 1 test
   [junit4] 
   [junit4] Suite: org.apache.lucene.codecs.lucene50.TestBlockPostingsFormat3
   [junit4] Completed [32/466] on J1 in 24.31s, 1 test
   [junit4] 
   [junit4] Suite: org.apache.lucene.search.TestPositionIncrement
   [junit4] Completed [33/466] on J1 in 0.14s, 2 tests
   [junit4] 
   [junit4] HEARTBEAT J0 PID(8886@localhost): 2018-05-04T23:57:03, stalled for  192s at: TestFloatRangeFieldQueries.testRandomBig
   [junit4] Suite: org.apache.lucene.search.TestFloatRangeFieldQueries
   [junit4] Completed [34/466] on J0 in 284.70s, 5 tests
   [junit4] 
   [junit4] Suite: org.apache.lucene.search.TestBooleanRewrites
   [junit4] Completed [35/466] on J0 in 3.08s, 12 tests
   [junit4] 
   [junit4] HEARTBEAT J2 PID(8887@localhost): 2018-05-04T23:57:51, stalled for 68.5s at: TestLucene70NormsFormat.testSparseNCommonBig
   [junit4] HEARTBEAT J1 PID(8888@localhost): 2018-05-04T23:57:51, stalled for 63.3s at: TestLRUQueryCache.testBulkScorerLocking
   [junit4] Suite: org.apache.lucene.analysis.standard.TestStandardAnalyzer
   [junit4] Completed [36/466] on J0 in 21.39s, 36 tests
   [junit4] 
   [junit4] Suite: org.apache.lucene.codecs.lucene70.TestIndexedDISI
   [junit4] Completed [37/466] on J0 in 8.75s, 10 tests
   [junit4] 
   [junit4] Suite: org.apache.lucene.search.TestSimilarity
   [junit4] Completed [38/466] on J0 in 0.09s, 1 test
   [junit4] 
   [junit4] Suite: org.apache.lucene.index.TestIndexWriterWithThreads
   [junit4] Completed [39/466] on J0 in 13.14s, 12 tests
   [junit4] 
   [junit4] Suite: org.apache.lucene.util.TestDocIdSetBuilder
   [junit4] Completed [40/466] on J0 in 8.65s, 7 tests
   [junit4] 
   [junit4] Suite: org.apache.lucene.index.TestInfoStream
   [junit4] Completed [41/466] on J0 in 0.18s, 2 tests
   [junit4] 
   [junit4] HEARTBEAT J2 PID(8887@localhost): 2018-05-04T23:58:51, stalled for  128s at: TestLucene70NormsFormat.testSparseNCommonBig
   [junit4] HEARTBEAT J1 PID(8888@localhost): 2018-05-04T23:58:51, stalled for  123s at: TestLRUQueryCache.testBulkScorerLocking
   [junit4] HEARTBEAT J2 PID(8887@localhost): 2018-05-04T23:59:51, stalled for  189s at: TestLucene70NormsFormat.testSparseNCommonBig
   [junit4] HEARTBEAT J1 PID(8888@localhost): 2018-05-04T23:59:51, stalled for  183s at: TestLRUQueryCache.testBulkScorerLocking
   [junit4] Suite: org.apache.lucene.codecs.lucene50.TestLucene50TermVectorsFormat
   [junit4] Completed [42/466] on J0 in 93.27s, 17 tests
   [junit4] 
   [junit4] Suite: org.apache.lucene.search.TestBooleanQueryVisitSubscorers
   [junit4] Completed [43/466] on J0 in 0.67s, 7 tests
   [junit4] 
   [junit4] HEARTBEAT J2 PID(8887@localhost): 2018-05-05T00:00:51, stalled for  249s at: TestLucene70NormsFormat.testSparseNCommonBig
   [junit4] HEARTBEAT J1 PID(8888@localhost): 2018-05-05T00:00:51, stalled for  244s at: TestLRUQueryCache.testBulkScorerLocking
   [junit4] HEARTBEAT J0 PID(8886@localhost): 2018-05-05T00:01:15, stalled for 64.3s at: TestControlledRealTimeReopenThread.testControlledRealTimeReopenThread
   [junit4] HEARTBEAT J2 PID(8887@localhost): 2018-05-05T00:01:51, stalled for  309s at: TestLucene70NormsFormat.testSparseNCommonBig
   [junit4] HEARTBEAT J1 PID(8888@localhost): 2018-05-05T00:01:51, stalled for  304s at: TestLRUQueryCache.testBulkScorerLocking
   [junit4] HEARTBEAT J0 PID(8886@localhost): 2018-05-05T00:02:15, stalled for  124s at: TestControlledRealTimeReopenThread.testControlledRealTimeReopenThread
   [junit4] HEARTBEAT J2 PID(8887@localhost): 2018-05-05T00:02:51, stalled for  369s at: TestLucene70NormsFormat.testSparseNCommonBig
   [junit4] HEARTBEAT J1 PID(8888@localhost): 2018-05-05T00:02:51, stalled for  364s at: TestLRUQueryCache.testBulkScorerLocking
   [junit4] HEARTBEAT J0 PID(8886@localhost): 2018-05-05T00:03:15, stalled for  184s at: TestControlledRealTimeReopenThread.testControlledRealTimeReopenThread
   [junit4] HEARTBEAT J2 PID(8887@localhost): 2018-05-05T00:03:52, stalled for  429s at: TestLucene70NormsFormat.testSparseNCommonBig
   [junit4] HEARTBEAT J0 PID(8886@localhost): 2018-05-05T00:04:15, stalled for  244s at: TestControlledRealTimeReopenThread.testControlledRealTimeReopenThread
   [junit4] HEARTBEAT J2 PID(8887@localhost): 2018-05-05T00:04:52, stalled for  489s at: TestLucene70NormsFormat.testSparseNCommonBig
   [junit4] Suite: org.apache.lucene.search.TestLRUQueryCache
   [junit4] Completed [44/466] on J1 in 495.70s, 22 tests
   [junit4] 
   [junit4] Suite: org.apache.lucene.index.TestDoc
   [junit4] Completed [45/466] on J1 in 0.73s, 1 test
   [junit4] 
   [junit4] HEARTBEAT J0 PID(8886@localhost): 2018-05-05T00:05:15, stalled for  304s at: TestControlledRealTimeReopenThread.testControlledRealTimeReopenThread
   [junit4] Suite: org.apache.lucene.store.TestFileSwitchDirectory
   [junit4] IGNOR/A 0.02s J1 | TestFileSwitchDirectory.testFsyncDoesntCreateNewFiles
   [junit4]    > Assumption #1: test only works for FSDirectory subclasses
   [junit4] IGNOR/A 0.04s J1 | TestFileSwitchDirectory.testPendingDeletions
   [junit4]    > Assumption #1: we can only install VirusCheckingFS on an FSDirectory
   [junit4] Completed [46/466] on J1 in 14.86s, 43 tests, 2 skipped
   [junit4] 
   [junit4] Suite: org.apache.lucene.util.TestFilterIterator
   [junit4] Completed [47/466] on J1 in 0.14s, 8 tests
   [junit4] 
   [junit4] Suite: org.apache.lucene.index.TestMergePolicyWrapper
   [junit4] Completed [48/466] on J1 in 0.05s, 1 test
   [junit4] 
   [junit4] Suite: org.apache.lucene.search.TestTimeLimitingCollector
   [junit4] Completed [49/466] on J1 in 12.57s, 7 tests
   [junit4] 
   [junit4] Suite: org.apache.lucene.search.TestBoostQuery
   [junit4] Completed [50/466] on J1 in 0.06s, 3 tests
   [junit4] 
   [junit4] Suite: org.apache.lucene.util.TestStringHelper
   [junit4] Completed [51/466] on J1 in 0.08s, 7 tests
   [junit4] 
   [junit4] Suite: org.apache.lucene.index.TestNorms
   [junit4] Completed [52/466] on J1 in 16.11s, 2 tests
   [junit4] 
   [junit4] HEARTBEAT J2 PID(8887@localhost): 2018-05-05T00:05:52, stalled for  549s at: TestLucene70NormsFormat.testSparseNCommonBig
   [junit4] HEARTBEAT J0 PID(8886@localhost): 2018-05-05T00:06:15, stalled for  364s at: TestControlledRealTimeReopenThread.testControlledRealTimeReopenThread
   [junit4] Suite: org.apache.lucene.index.TestDuelingCodecs
   [junit4] Completed [53/466] on J1 in 56.73s, 2 tests
   [junit4] 
   [junit4] Suite: org.apache.lucene.search.TestControlledRealTimeReopenThread
   [junit4] IGNOR/A 0.00s J0 | TestControlledRealTimeReopenThread.testCRTReopen
   [junit4]    > Assumption #1: 'awaitsfix' test group is disabled (@AwaitsFix(bugUrl=https://issues.apache.org/jira/browse/LUCENE-5737))
   [junit4] Completed [54/466] on J0 in 403.99s, 6 tests, 1 skipped
   [junit4] 
   [junit4] Suite: org.apache.lucene.search.TestTotalHitCountCollector
   [junit4] Completed [55/466] on J0 in 0.13s, 1 test
   [junit4] 
   [junit4] Suite: org.apache.lucene.search.TestEarlyTermination
   [junit4] Completed [56/466] on J0 in 0.54s, 1 test
   [junit4] 
   [junit4] Suite: org.apache.lucene.util.TestSmallFloat
   [junit4] Completed [57/466] on J0 in 0.44s, 4 tests
   [junit4] 
   [junit4] Suite: org.apache.lucene.util.automaton.TestUTF32ToUTF8
   [junit4] Completed [58/466] on J0 in 14.52s, 6 tests
   [junit4] 
   [junit4] Suite: org.apache.lucene.index.TestTwoPhaseCommitTool
   [junit4] Completed [59/466] on J0 in 0.06s, 3 tests
   [junit4] 
   [junit4] HEARTBEAT J2 PID(8887@localhost): 2018-05-05T00:08:04, stalled for 71.0s at: TestLucene70NormsFormat.testNCommonBig
   [junit4] HEARTBEAT J0 PID(8886@localhost): 2018-05-05T00:08:15, stalled for 64.4s at: TestDemoParallelLeafReader.testRandomMultipleSchemaGens
   [junit4] HEARTBEAT J1 PID(8888@localhost): 2018-05-05T00:08:40, stalled for 69.2s at: TestFSTs.testBigSet
   [junit4] HEARTBEAT J2 PID(8887@localhost): 2018-05-05T00:09:04, stalled for  131s at: TestLucene70NormsFormat.testNCommonBig
   [junit4] HEARTBEAT J0 PID(8886@localhost): 2018-05-05T00:09:16, stalled for  124s at: TestDemoParallelLeafReader.testRandomMultipleSchemaGens
   [junit4] Suite: org.apache.lucene.util.fst.TestFSTs
   [junit4] Completed [60/466] on J1 in 165.69s, 20 tests
   [junit4] 
   [junit4] Suite: org.apache.lucene.index.TestCodecHoldsOpenFiles
   [junit4] Completed [61/466] on J1 in 0.22s, 1 test
   [junit4] 
   [junit4] Suite: org.apache.lucene.util.TestSloppyMath
   [junit4] Completed [62/466] on J1 in 3.02s, 8 tests
   [junit4] 
   [junit4] Suite: org.apache.lucene.index.TestIndexFileDeleter
   [junit4] Completed [63/466] on J1 in 2.10s, 10 tests
   [junit4] 
   [junit4] Suite: org.apache.lucene.search.TestElevationComparator
   [junit4] Completed [64/466] on J1 in 0.05s, 1 test
   [junit4] 
   [junit4] Suite: org.apache.lucene.index.Test2BTerms
   [junit4] IGNOR/A 0.00s J1 | Test2BTerms.test2BTerms
   [junit4]    > Assumption #1: 'monster' test group is disabled (@Monster(value=very slow, use 5g minimum heap))
   [junit4] Completed [65/466] on J1 in 0.00s, 1 test, 1 skipped
   [junit4] 
   [junit4] Suite: org.apache.lucene.document.TestIntRange
   [junit4] Completed [66/466] on J1 in 0.02s, 1 test
   [junit4] 
   [junit4] Suite: org.apache.lucene.util.TestFixedBitDocIdSet
   [junit4] Completed [67/466] on J1 in 1.08s, 5 tests
   [junit4] 
   [junit4] Suite: org.apache.lucene.analysis.TestCharArraySet
   [junit4] Completed [68/466] on J1 in 0.09s, 15 tests
   [junit4] 
   [junit4] Suite: org.apache.lucene.search.TestPrefixRandom
   [junit4] Completed [69/466] on J1 in 2.15s, 1 test
   [junit4] 
   [junit4] Suite: org.apache.lucene.util.TestNumericUtils
   [junit4] Completed [70/466] on J1 in 8.47s, 24 tests
   [junit4] 
   [junit4] Suite: org.apache.lucene.util.TestVirtualMethod
   [junit4] Completed [71/466] on J1 in 0.03s, 2 tests
   [junit4] 
   [junit4] Suite: org.apache.lucene.search.spans.TestFilterSpans
   [junit4] Completed [72/466] on J1 in 0.02s, 1 test
   [junit4] 
   [junit4] Suite: org.apache.lucene.index.TestSumDocFreq
   [junit4] Completed [73/466] on J1 in 0.54s, 1 test
   [junit4] 
   [junit4] Suite: org.apache.lucene.store.TestRAMDirectory
   [junit4] IGNOR/A 0.00s J1 | TestRAMDirectory.testPendingDeletions
   [junit4]    > Assumption #1: we can only install VirusCheckingFS on an FSDirectory
   [junit4] IGNOR/A 0.00s J1 | TestRAMDirectory.testFsyncDoesntCreateNewFiles
   [junit4]    > Assumption #1: test only works for FSDirectory subclasses
   [junit4] Completed [74/466] on J1 in 5.27s, 46 tests, 2 skipped
   [junit4] 
   [junit4] Suite: org.apache.lucene.index.TestCheckIndex
   [junit4] Completed [75/466] on J1 in 2.89s, 4 tests
   [junit4] 
   [junit4] Suite: org.apache.lucene.util.TestBytesRefArray
   [junit4] Completed [76/466] on J1 in 0.59s, 2 tests
   [junit4] 
   [junit4] Suite: org.apache.lucene.index.Test2BPositions
   [junit4] IGNOR/A 0.01s J1 | Test2BPositions.test
   [junit4]    > Assumption #1: 'monster' test group is disabled (@Monster(value=uses lots of space and takes a few minutes))
   [junit4] Completed [77/466] on J1 in 0.02s, 1 test, 1 skipped
   [junit4] 
   [junit4] Suite: org.apache.lucene.search.TestBooleanOr
   [junit4] Completed [78/466] on J1 in 3.51s, 7 tests
   [junit4] 
   [junit4] HEARTBEAT J2 PID(8887@localhost): 2018-05-05T00:10:04, stalled for  191s at: TestLucene70NormsFormat.testNCommonBig
   [junit4] Suite: org.apache.lucene.index.TestCustomNorms
   [junit4] Completed [79/466] on J1 in 8.66s, 1 test
   [junit4] 
   [junit4] Suite: org.apache.lucene.index.TestReadOnlyIndex
   [junit4] Completed [80/466] on J1 in 0.20s, 1 test
   [junit4] 
   [junit4] Suite: org.apache.lucene.search.TestReqExclBulkScorer
   [junit4] Completed [81/466] on J1 in 0.05s, 1 test
   [junit4] 
   [junit4] Suite: org.apache.lucene.index.TestTermContext
   [junit4] Completed [82/466] on J1 in 0.25s, 1 test
   [junit4] 
   [junit4] Suite: org.apache.lucene.util.automaton.TestLevenshteinAutomata
   [junit4] Completed [83/466] on J1 in 3.88s, 4 tests
   [junit4] 
   [junit4] HEARTBEAT J0 PID(8886@localhost): 2018-05-05T00:10:28, stalled for 71.7s at: TestDemoParallelLeafReader.testRandom
   [junit4] HEARTBEAT J2 PID(8887@localhost): 2018-05-05T00:11:04, stalled for  251s at: TestLucene70NormsFormat.testNCommonBig
   [junit4] HEARTBEAT J1 PID(8888@localhost): 2018-05-05T00:11:16, stalled for 63.2s at: TestIndexWriterThreadsToSegments.testSegmentCountOnFlushRandom
   [junit4] HEARTBEAT J0 PID(8886@localhost): 2018-05-05T00:11:40, stalled for 64.0s at: TestDemoParallelLeafReader.testRandomMultipleSchemaGensSameField
   [junit4] HEARTBEAT J2 PID(8887@localhost): 2018-05-05T00:12:04, stalled for  311s at: TestLucene70NormsFormat.testNCommonBig
   [junit4] HEARTBEAT J1 PID(8888@localhost): 2018-05-05T00:12:16, stalled for  123s at: TestIndexWriterThreadsToSegments.testSegmentCountOnFlushRandom
   [junit4] HEARTBEAT J0 PID(8886@localhost): 2018-05-05T00:12:40, stalled for  124s at: TestDemoParallelLeafReader.testRandomMultipleSchemaGensSameField
   [junit4] Suite: org.apache.lucene.index.TestDemoParallelLeafReader
   [junit4] Completed [84/466] on J0 in 338.32s, 5 tests
   [junit4] 
   [junit4] Suite: org.apache.lucene.index.TestSegmentInfos
   [junit4] Completed [85/466] on J0 in 0.16s, 4 tests
   [junit4] 
   [junit4] HEARTBEAT J2 PID(8887@localhost): 2018-05-05T00:13:04, stalled for  371s at: TestLucene70NormsFormat.testNCommonBig
   [junit4] HEARTBEAT J1 PID(8888@localhost): 2018-05-05T00:13:16, stalled for  183s at: TestIndexWriterThreadsToSegments.testSegmentCountOnFlushRandom
   [junit4] Suite: org.apache.lucene.index.TestPointValues
   [junit4] Completed [86/466] on J0 in 39.20s, 32 tests
   [junit4] 
   [junit4] Suite: org.apache.lucene.index.TestUniqueTermCount
   [junit4] Completed [87/466] on J0 in 0.15s, 1 test
   [junit4] 
   [junit4] Suite: org.apache.lucene.index.TestForceMergeForever
   [junit4] Completed [88/466] on J0 in 1.34s, 1 test
   [junit4] 
   [junit4] Suite: org.apache.lucene.analysis.TestCharFilter
   [junit4] Completed [89/466] on J0 in 0.04s, 4 tests
   [junit4] 
   [junit4] Suite: org.apache.lucene.index.TestCodecs
   [junit4] Completed [90/466] on J0 in 0.51s, 3 tests
   [junit4] 
   [junit4] Suite: org.apache.lucene.util.fst.TestBytesStore
   [junit4] Completed [91/466] on J0 in 19.69s, 1 test
   [junit4] 
   [junit4] Suite: org.apache.lucene.search.TestMatchAllDocsQuery
   [junit4] Completed [92/466] on J0 in 0.08s, 2 tests
   [junit4] 
   [junit4] Suite: org.apache.lucene.index.TestFieldReuse
   [junit4] Completed [93/466] on J0 in 0.07s, 2 tests
   [junit4] 
   [junit4] Suite: org.apache.lucene.index.TestAllFilesHaveChecksumFooter
   [junit4] Completed [94/466] on J0 in 1.54s, 1 test
   [junit4] 
   [junit4] Suite: org.apache.lucene.search.TestNeedsScores
   [junit4] Completed [95/466] on J0 in 0.18s, 4 tests
   [junit4] 
   [junit4] Suite: org.apache.lucene.search.TestWildcardRandom
   [junit4] Completed [96/466] on J0 in 0.81s, 1 test
   [junit4] 
   [junit4] Suite: org.apache.lucene.search.TestMultiCollector
   [junit4] Completed [97/466] on J0 in 0.94s, 2 tests
   [junit4] 
   [junit4] Suite: org.apache.lucene.analysis.TestCharArrayMap
   [junit4] Completed [98/466] on J0 in 0.30s, 4 tests
   [junit4] 
   [junit4] Suite: org.apache.lucene.search.MultiCollectorTest
   [junit4] Completed [99/466] on J0 in 0.08s, 4 tests
   [junit4] 
   [junit4] HEARTBEAT J2 PID(8887@localhost): 2018-05-05T00:14:04, stalled for  431s at: TestLucene70NormsFormat.testNCommonBig
   [junit4] HEARTBEAT J1 PID(8888@localhost): 2018-05-05T00:14:16, stalled for  243s at: TestIndexWriterThreadsToSegments.testSegmentCountOnFlushRandom
   [junit4] HEARTBEAT J0 PID(8886@localhost): 2018-05-05T00:15:04, stalled for 69.9s at: TestBagOfPositions.test
   [junit4] HEARTBEAT J1 PID(8888@localhost): 2018-05-05T00:15:17, stalled for  303s at: TestIndexWriterThreadsToSegments.testSegmentCountOnFlushRandom
   [junit4] Suite: org.apache.lucene.index.TestBagOfPositions
   [junit4] Completed [100/466] on J0 in 127.64s, 1 test
   [junit4] 
   [junit4] Suite: org.apache.lucene.geo.TestGeoEncodingUtils
   [junit4] Completed [101/466] on J0 in 2.75s, 3 tests
   [junit4] 
   [junit4] Suite: org.apache.lucene.index.Test2BSortedDocValuesOrds
   [junit4] IGNOR/A 0.00s J0 | Test2BSortedDocValuesOrds.test2BOrds
   [junit4]    > Assumption #1: 'monster' test group is disabled (@Monster(value=Takes ~ 6 hours if the heap is 5gb))
   [junit4] Completed [102/466] on J0 in 0.01s, 1 test, 1 skipped
   [junit4] 
   [junit4] Suite: org.apache.lucene.index.TestIndexWriterThreadsToSegments
   [junit4] Completed [103/466] on J1 in 351.78s, 4 tests
   [junit4] 
   [junit4] Suite: org.apache.lucene.store.TestSingleInstanceLockFactory
   [junit4] IGNOR/A 0.00s J1 | TestSingleInstanceLockFactory.testStressLocks
   [junit4]    > Assumption #1: cannot handle buggy Files.delete
   [junit4] Completed [104/466] on J1 in 0.22s, 7 tests, 1 skipped
   [junit4] 
   [junit4] Suite: org.apache.lucene.util.bkd.Test2BBKDPoints
   [junit4] IGNOR/A 0.00s J1 | Test2BBKDPoints.test1D
   [junit4]    > Assumption #1: 'monster' test group is disabled (@Monster(value=takes at least 4 hours and consumes many GB of temp disk space))
   [junit4] IGNOR/A 0.00s J1 | Test2BBKDPoints.test2D
   [junit4]    > Assumption #1: 'monster' test group is disabled (@Monster(value=takes at least 4 hours and consumes many GB of temp disk space))
   [junit4] Completed [105/466] on J1 in 0.14s, 2 tests, 2 skipped
   [junit4] 
   [junit4] Suite: org.apache.lucene.index.TestOmitPositions
   [junit4] Completed [106/466] on J1 in 1.92s, 4 tests
   [junit4] 
   [junit4] Suite: org.apache.lucene.codecs.compressing.TestFastDecompressionMode
   [junit4] Completed [107/466] on J1 in 7.35s, 11 tests
   [junit4] 
   [junit4] HEARTBEAT J1 PID(8888@localhost): 2018-05-05T00:17:17, stalled for 62.2s at: Test2BPostings.test
   [junit4] Suite: org.apache.lucene.codecs.lucene70.TestLucene70NormsFormat
   [junit4] IGNOR/A 0.04s J2 | TestLucene70NormsFormat.testMergeStability
   [junit4]    > Assumption #1: The MockRandom PF randomizes content on the fly, so we can't check it
   [junit4] Completed [108/466] on J2 in 1493.93s, 29 tests, 1 skipped
   [junit4] 
   [junit4] Suite: org.apache.lucene.document.TestLongRange
   [junit4] Completed [109/466] on J2 in 0.12s, 1 test
   [junit4] 
   [junit4] HEARTBEAT J0 PID(8886@localhost): 2018-05-05T00:17:40, stalled for 65.4s at: TestDoubleRangeFieldQueries.testRandomBig
   [junit4] HEARTBEAT J1 PID(8888@localhost): 2018-05-05T00:18:17, stalled for  122s at: Test2BPostings.test
   [junit4] HEARTBEAT J0 PID(8886@localhost): 2018-05-05T00:18:40, stalled for  125s at: TestDoubleRangeFieldQueries.testRandomBig
   [junit4] HEARTBEAT J2 PID(8887@localhost): 2018-05-05T00:18:41, stalled for 71.8s at: TestPackedInts.testPackedLongValues
   [junit4] HEARTBEAT J1 PID(8888@localhost): 2018-05-05T00:19:17, stalled for  182s at: Test2BPostings.test
   [junit4] HEARTBEAT J0 PID(8886@localhost): 2018-05-05T00:19:40, stalled for  186s at: TestDoubleRangeFieldQueries.testRandomBig
   [junit4] HEARTBEAT J2 PID(8887@localhost): 2018-05-05T00:19:41, stalled for  132s at: TestPackedInts.testPackedLongValues
   [junit4] HEARTBEAT J1 PID(8888@localhost): 2018-05-05T00:20:17, stalled for  242s at: Test2BPostings.test
   [junit4] Suite: org.apache.lucene.search.TestDoubleRangeFieldQueries
   [junit4] Completed [110/466] on J0 in 253.33s, 5 tests
   [junit4] 
   [junit4] Suite: org.apache.lucene.index.TestTerm
   [junit4] Completed [111/466] on J0 in 0.05s, 1 test
   [junit4] 
   [junit4] Suite: org.apache.lucene.search.TestSloppyPhraseQuery
   [junit4] Completed [112/466] on J0 in 4.40s, 9 tests
   [junit4] 
   [junit4] Suite: org.apache.lucene.index.TestMaxPosition
   [junit4] Completed [113/466] on J0 in 0.07s, 2 tests
   [junit4] 
   [junit4] Suite: org.apache.lucene.store.TestNativeFSLockFactory
   [junit4] Completed [114/466] on J0 in 17.34s, 11 tests
   [junit4] 
   [junit4] HEARTBEAT J2 PID(8887@localhost): 2018-05-05T00:20:41, stalled for  192s at: TestPackedInts.testPackedLongValues
   [junit4] HEARTBEAT J1 PID(8888@localhost): 2018-05-05T00:21:17, stalled for  302s at: Test2BPostings.test
   [junit4] HEARTBEAT J2 PID(8887@localhost): 2018-05-05T00:21:41, stalled for  252s at: TestPackedInts.testPackedLongValues
   [junit4] Suite: org.apache.lucene.index.TestNumericDocValuesUpdates
   [junit4] Completed [115/466] on J0 in 84.70s, 32 tests
   [junit4] 
   [junit4] Suite: org.apache.lucene.search.TestSort
   [junit4] Completed [116/466] on J0 in 0.61s, 25 tests
   [junit4] 
   [junit4] HEARTBEAT J1 PID(8888@localhost): 2018-05-05T00:22:17, stalled for  363s at: Test2BPostings.test
   [junit4] Suite: org.apache.lucene.store.TestSimpleFSLockFactory
   [junit4] Completed [117/466] on J0 in 13.74s, 7 tests
   [junit4] 
   [junit4] Suite: org.apache.lucene.search.TestLongValuesSource
   [junit4] Completed [118/466] on J0 in 20.95s, 4 tests
   [junit4] 
   [junit4] Suite: org.apache.lucene.index.TestSwappedIndexFiles
   [junit4] Completed [119/466] on J0 in 0.09s, 1 test
   [junit4] 
   [junit4] Suite: org.apache.lucene.util.TestQueryBuilder
   [junit4] Completed [120/466] on J0 in 0.23s, 23 tests
   [junit4] 
   [junit4] Suite: org.apache.lucene.search.similarities.TestClassicSimilarity
   [junit4] Completed [121/466] on J0 in 0.33s, 12 tests
   [junit4] 
   [junit4] Suite: org.apache.lucene.search.spans.TestSpanCollection
   [junit4] Completed [122/466] on J0 in 0.15s, 3 tests
   [junit4] 
   [junit4] Suite: org.apache.lucene.util.automaton.TestRegExp
   [junit4] Completed [123/466] on J0 in 0.26s, 6 tests
   [junit4] 
   [junit4] HEARTBEAT J2 PID(8887@localhost): 2018-05-05T00:22:41, stalled for  312s at: TestPackedInts.testPackedLongValues
   [junit4] HEARTBEAT J1 PID(8888@localhost): 2018-05-05T00:23:17, stalled for  423s at: Test2BPostings.test
   [junit4] Suite: org.apache.lucene.util.packed.TestPackedInts
   [junit4] Completed [124/466] on J2 in 385.24s, 28 tests, 2 skipped
   [junit4] 
   [junit4] HEARTBEAT J0 PID(8886@localhost): 2018-05-05T00:23:52, stalled for 71.5s at: TestTermsEnum.testVaryingTermsPerSegment
   [junit4] HEARTBEAT J1 PID(8888@localhost): 2018-05-05T00:24:17, stalled for  483s at: Test2BPostings.test
   [junit4] HEARTBEAT J0 PID(8886@localhost): 2018-05-05T00:24:52, stalled for  131s at: TestTermsEnum.testVaryingTermsPerSegment
   [junit4] HEARTBEAT J2 PID(8887@localhost): 2018-05-05T00:24:53, stalled for 64.5s at: TestIndexWriterOnDiskFull.testAddIndexOnDiskFull
   [junit4] Suite: org.apache.lucene.index.TestIndexWriterOnDiskFull
   [junit4] Completed [125/466] on J2 in 80.01s, 4 tests
   [junit4] 
   [junit4] Suite: org.apache.lucene.util.graph.TestGraphTokenStreamFiniteStrings
   [junit4] Completed [126/466] on J2 in 0.18s, 12 tests
   [junit4] 
   [junit4] HEARTBEAT J1 PID(8888@localhost): 2018-05-05T00:25:17, stalled for  543s at: Test2BPostings.test
   [junit4] Suite: org.apache.lucene.search.TestScorerPerf
   [junit4] Completed [127/466] on J2 in 23.47s, 1 test
   [junit4] 
   [junit4] Suite: org.apache.lucene.search.TestRegexpQuery
   [junit4] Completed [128/466] on J2 in 0.45s, 7 tests
   [junit4] 
   [junit4] Suite: org.apache.lucene.document.TestDocument
   [junit4] Completed [129/466] on J2 in 0.41s, 12 tests
   [junit4] 
   [junit4] Suite: org.apache.lucene.index.TestReaderClosed
   [junit4] Completed [130/466] on J2 in 0.38s, 2 tests
   [junit4] 
   [junit4] Suite: org.apache.lucene.index.TestCustomTermFreq
   [junit4] Completed [131/466] on J2 in 0.50s, 12 tests
   [junit4] 
   [junit4] Suite: org.apache.lucene.util.TestRollingBuffer
   [junit4] Completed [132/466] on J2 in 0.73s, 1 test
   [junit4] 
   [junit4] HEARTBEAT J0 PID(8886@localhost): 2018-05-05T00:25:53, stalled for  192s at: TestTermsEnum.testVaryingTermsPerSegment
   [junit4] HEARTBEAT J1 PID(8888@localhost): 2018-05-05T00:26:17, stalled for  603s at: Test2BPostings.test
   [junit4] HEARTBEAT J2 PID(8887@localhost): 2018-05-05T00:26:41, stalled for 66.8s at: TestEarlyTerminatingSortingCollector.testTerminatedEarly
   [junit4] HEARTBEAT J0 PID(8886@localhost): 2018-05-05T00:26:53, stalled for  252s at: TestTermsEnum.testVaryingTermsPerSegment
   [junit4] HEARTBEAT J1 PID(8888@localhost): 2018-05-05T00:27:17, stalled for  663s at: Test2BPostings.test
   [junit4] HEARTBEAT J0 PID(8886@localhost): 2018-05-05T00:27:53, stalled for  312s at: TestTermsEnum.testVaryingTermsPerSegment
   [junit4] Suite: org.apache.lucene.search.TestEarlyTerminatingSortingCollector
   [junit4] Completed [133/466] on J2 in 151.88s, 4 tests
   [junit4] 
   [junit4] HEARTBEAT J1 PID(8888@localhost): 2018-05-05T00:28:18, stalled for  723s at: Test2BPostings.test
   [junit4] Suite: org.apache.lucene.search.TestDocValuesRewriteMethod
   [junit4] Completed [134/466] on J2 in 18.48s, 2 tests
   [junit4] 
   [junit4] Suite: org.apache.lucene.search.TestPositiveScoresOnlyCollector
   [junit4] Completed [135/466] on J2 in 0.05s, 1 test
   [junit4] 
   [junit4] Suite: org.apache.lucene.search.spans.TestSpanNearQuery
   [junit4] Completed [136/466] on J2 in 0.13s, 4 tests
   [junit4] 
   [junit4] Suite: org.apache.lucene.store.TestBufferedIndexInput
   [junit4] Completed [137/466] on J2 in 2.09s, 4 tests
   [junit4] 
   [junit4] Suite: org.apache.lucene.index.TestParallelCompositeReader
   [junit4] Completed [138/466] on J2 in 1.31s, 11 tests
   [junit4] 
   [junit4] Suite: org.apache.lucene.index.TestTryDelete
   [junit4] Completed [139/466] on J2 in 0.05s, 3 tests
   [junit4] 
   [junit4] Suite: org.apache.lucene.util.TestCloseableThreadLocal
   [junit4] Completed [140/466] on J2 in 0.04s, 3 tests
   [junit4] 
   [junit4] Suite: org.apache.lucene.store.TestNIOFSDirectory
   [junit4] Completed [141/466] on J2 in 6.88s, 42 tests
   [junit4] 
   [junit4] Suite: org.apache.lucene.search.spans.TestSpanTermQuery
   [junit4] Completed [142/466] on J2 in 0.17s, 2 tests
   [junit4] 
   [junit4] HEARTBEAT J0 PID(8886@localhost): 2018-05-05T00:28:53, stalled for  372s at: TestTermsEnum.testVaryingTermsPerSegment
   [junit4] HEARTBEAT J1 PID(8888@localhost): 2018-05-05T00:29:18, stalled for  783s at: Test2BPostings.test
   [junit4] Suite: org.apache.lucene.codecs.lucene60.TestLucene60PointsFormat
   [junit4] IGNOR/A 0.00s J2 | TestLucene60PointsFormat.testMergeStability
   [junit4]    > Assumption #1: merge is not stable
   [junit4] Completed [143/466] on J2 in 47.61s, 20 tests, 1 skipped
   [junit4] 
   [junit4] Suite: org.apache.lucene.search.TestSearchWithThreads
   [junit4] Completed [144/466] on J2 in 27.09s, 1 test
   [junit4] 
   [junit4] HEARTBEAT J0 PID(8886@localhost): 2018-05-05T00:29:53, stalled for  432s at: TestTermsEnum.testVaryingTermsPerSegment
   [junit4] HEARTBEAT J1 PID(8888@localhost): 2018-05-05T00:30:18, stalled for  843s at: Test2BPostings.test
   [junit4] Suite: org.apache.lucene.codecs.lucene50.TestLucene50StoredFieldsFormatHighCompression
   [junit4] Completed [145/466] on J2 in 75.49s, 19 tests
   [junit4] 
   [junit4] Suite: org.apache.lucene.search.TestSimpleExplanationsOfNonMatches
   [junit4] Completed [146/466] on J2 in 0.91s, 70 tests
   [junit4] 
   [junit4] HEARTBEAT J1 PID(8888@localhost): 2018-05-05T00:31:18, stalled for  903s at: Test2BPostings.test
   [junit4] Suite: org.apache.lucene.index.TestTermsEnum
   [junit4] Completed [147/466] on J0 in 518.30s, 13 tests
   [junit4] 
   [junit4] HEARTBEAT J1 PID(8888@localhost): 2018-05-05T00:32:18, stalled for  963s at: Test2BPostings.test
   [junit4] HEARTBEAT J2 PID(8887@localhost): 2018-05-05T00:32:42, stalled for 60.7s at: TestPointQueries.testRandomLongsBig
   [junit4] Suite: org.apache.lucene.index.TestMixedDocValuesUpdates
   [junit4]   2> NOTE: download the large Jenkins line-docs file by running 'ant get-jenkins-line-docs' in the lucene directory.
   [junit4]   2> NOTE: reproduce with: ant test  -Dtestcase=TestMixedDocValuesUpdates -Dtests.method=testTonsOfUpdates -Dtests.seed=44891BA4A58B78F8 -Dtests.multiplier=2 -Dtests.nightly=true -Dtests.slow=true -Dtests.linedocsfile=/home/jenkins/jenkins-slave/workspace/Lucene-Solr-NightlyTests-7.3/test-data/enwiki.random.lines.txt -Dtests.locale=ar-IQ -Dtests.timezone=AET -Dtests.asserts=true -Dtests.file.encoding=UTF-8
   [junit4] ERROR   27.7s J0 | TestMixedDocValuesUpdates.testTonsOfUpdates <<<
   [junit4]    > Throwable #1: java.io.FileNotFoundException: _2_3.inf
   [junit4]    > 	at __randomizedtesting.SeedInfo.seed([44891BA4A58B78F8:3CACC5AF47AB571A]:0)
   [junit4]    > 	at org.apache.lucene.store.RAMDirectory.openInput(RAMDirectory.java:243)
   [junit4]    > 	at org.apache.lucene.store.Directory.openChecksumInput(Directory.java:119)
   [junit4]    > 	at org.apache.lucene.store.RawDirectoryWrapper.openChecksumInput(RawDirectoryWrapper.java:41)
   [junit4]    > 	at org.apache.lucene.codecs.simpletext.SimpleTextFieldInfosFormat.read(SimpleTextFieldInfosFormat.java:73)
   [junit4]    > 	at org.apache.lucene.index.SegmentReader.initFieldInfos(SegmentReader.java:190)
   [junit4]    > 	at org.apache.lucene.index.SegmentReader.<init>(SegmentReader.java:93)
   [junit4]    > 	at org.apache.lucene.index.ReadersAndUpdates.writeFieldUpdates(ReadersAndUpdates.java:688)
   [junit4]    > 	at org.apache.lucene.index.IndexWriter$ReaderPool.writeSomeDocValuesUpdates(IndexWriter.java:705)
   [junit4]    > 	at org.apache.lucene.index.FrozenBufferedUpdates.apply(FrozenBufferedUpdates.java:331)
   [junit4]    > 	at org.apache.lucene.index.DocumentsWriter$ResolveUpdatesEvent.process(DocumentsWriter.java:740)
   [junit4]    > 	at org.apache.lucene.index.IndexWriter.processEvents(IndexWriter.java:5106)
   [junit4]    > 	at org.apache.lucene.index.IndexWriter.processEvents(IndexWriter.java:5096)
   [junit4]    > 	at org.apache.lucene.index.IndexWriter.updateDocValues(IndexWriter.java:1891)
   [junit4]    > 	at org.apache.lucene.index.TestMixedDocValuesUpdates.testTonsOfUpdates(TestMixedDocValuesUpdates.java:374)
   [junit4]    > 	at java.lang.Thread.run(Thread.java:748)
   [junit4]   2> NOTE: test params are: codec=SimpleText, sim=RandomSimilarity(queryNorm=false): {}, locale=ar-IQ, timezone=AET
   [junit4]   2> NOTE: Linux 3.13.0-88-generic amd64/Oracle Corporation 1.8.0_172 (64-bit)/cpus=4,threads=1,free=154733392,total=473956352
   [junit4]   2> NOTE: All tests run in this JVM: [TestQueryRescorer, TestSpanMultiTermQueryWrapper, TestDocCount, TestIntBlockPool, Test2BBinaryDocValues, LimitedFiniteStringsIteratorTest, TestSpansEnum, TestFloatRangeFieldQueries, TestBooleanRewrites, TestStandardAnalyzer, TestIndexedDISI, TestSimilarity, TestIndexWriterWithThreads, TestDocIdSetBuilder, TestInfoStream, TestLucene50TermVectorsFormat, TestBooleanQueryVisitSubscorers, TestControlledRealTimeReopenThread, TestTotalHitCountCollector, TestEarlyTermination, TestSmallFloat, TestUTF32ToUTF8, TestTwoPhaseCommitTool, TestDemoParallelLeafReader, TestSegmentInfos, TestPointValues, TestUniqueTermCount, TestForceMergeForever, TestCharFilter, TestCodecs, TestBytesStore, TestMatchAllDocsQuery, TestFieldReuse, TestAllFilesHaveChecksumFooter, TestNeedsScores, TestWildcardRandom, TestMultiCollector, TestCharArrayMap, MultiCollectorTest, TestBagOfPositions, TestGeoEncodingUtils, Test2BSortedDocValuesOrds, TestDoubleRangeFieldQueries, TestTerm, TestSloppyPhraseQuery, TestMaxPosition, TestNativeFSLockFactory, TestNumericDocValuesUpdates, TestSort, TestSimpleFSLockFactory, TestLongValuesSource, TestSwappedIndexFiles, TestQueryBuilder, TestClassicSimilarity, TestSpanCollection, TestRegExp, TestTermsEnum, TestMixedDocValuesUpdates]
   [junit4] Completed [148/466 (1!)] on J0 in 92.61s, 4 tests, 1 error <<< FAILURES!
   [junit4] 
   [junit4] Suite: org.apache.lucene.store.TestByteArrayDataInput
   [junit4] Completed [149/466 (1!)] on J0 in 0.02s, 1 test
   [junit4] 
   [junit4] Suite: org.apache.lucene.index.TestFlex
   [junit4] Completed [150/466 (1!)] on J0 in 0.55s, 2 tests
   [junit4] 
   [junit4] Suite: org.apache.lucene.index.TestDocsAndPositions
   [junit4] Completed [151/466 (1!)] on J0 in 1.97s, 6 tests
   [junit4] 
   [junit4] Suite: org.apache.lucene.TestSearch
   [junit4] Completed [152/466 (1!)] on J0 in 0.06s, 2 tests
   [junit4] 
   [junit4] Suite: org.apache.lucene.index.TestIsCurrent
   [junit4] Completed [153/466 (1!)] on J0 in 0.06s, 2 tests
   [junit4] 
   [junit4] HEARTBEAT J1 PID(8888@localhost): 2018-05-05T00:33:18, stalled for 1023s at: Test2BPostings.test
   [junit4] Suite: org.apache.lucene.search.TestSimpleExplanationsWithFillerDocs
   [junit4] Completed [154/466 (1!)] on J0 in 34.91s, 70 tests
   [junit4] 
   [junit4] HEARTBEAT J2 PID(8887@localhost): 2018-05-05T00:33:42, stalled for  121s at: TestPointQueries.testRandomLongsBig
   [junit4] Suite: org.apache.lucene.store.TestGrowableByteArrayDataOutput
   [junit4] Completed [155/466 (1!)] on J0 in 23.13s, 2 tests
   [junit4] 
   [junit4] Suite: org.apache.lucene.index.TestDocumentWriter
   [junit4] Completed [156/466 (1!)] on J0 in 0.79s, 6 tests
   [junit4] 
   [junit4] Suite: org.apache.lucene.util.TestNotDocIdSet
   [junit4] Completed [157/466 (1!)] on J0 in 2.65s, 6 tests
   [junit4] 
   [junit4] Suite: org.apache.lucene.analysis.TestDelegatingAnalyzerWrapper
   [junit4] Completed [158/466 (1!)] on J0 in 0.06s, 3 tests
   [junit4] 
   [junit4] Suite: org.apache.lucene.util.TestSPIClassIterator
   [junit4] Completed [159/466 (1!)] on J0 in 0.05s, 1 test
   [junit4] 
   [junit4] Suite: org.apache.lucene.index.TestIndexWriterOutOfFileDescriptors
   [junit4] Completed [160/466 (1!)] on J0 in 13.48s, 1 test
   [junit4] 
   [junit4] Suite: org.apache.lucene.index.TestNoDeletionPolicy
   [junit4] Completed [161/466 (1!)] on J0 in 0.31s, 4 tests
   [junit4] 
   [junit4] HEARTBEAT J1 PID(8888@localhost): 2018-05-05T00:34:18, stalled for 1083s at: Test2BPostings.test
   [junit4] Suite: org.apache.lucene.index.TestIndexWriterNRTIsCurrent
   [junit4] Completed [162/466 (1!)] on J0 in 24.85s, 1 test
   [junit4] 
   [junit4] Suite: org.apache.lucene.search.TestBooleanScorer
   [junit4] Completed [163/466 (1!)] on J0 in 6.26s, 5 tests
   [junit4] 
   [junit4] Suite: org.apache.lucene.index.TestDocValues
   [junit4] Completed [164/466 (1!)] on J0 in 0.20s, 7 tests
   [junit4] 
   [junit4] HEARTBEAT J2 PID(8887@localhost): 2018-05-05T00:34:42, stalled for  181s at: TestPointQueries.testRandomLongsBig
   [junit4] Suite: org.apache.lucene.index.TestIndexWriter
   [junit4] Completed [165/466 (1!)] on J0 in 17.43s, 76 tests, 1 skipped
   [junit4] 
   [junit4] Suite: org.apache.lucene.index.TestBinaryTerms
   [junit4] Completed [166/466 (1!)] on J0 in 0.10s, 2 tests
   [junit4] 
   [junit4] Suite: org.apache.lucene.index.TestSnapshotDeletionPolicy
   [junit4] Completed [167/466 (1!)] on J0 in 2.03s, 7 tests
   [junit4] 
   [junit4] HEARTBEAT J1 PID(8888@localhost): 2018-05-05T00:35:18, stalled for 1143s at: Test2BPostings.test
   [junit4] HEARTBEAT J1 PID(8888@localhost): 2018-05-05T00:36:18, stalled for 1204s at: Test2BPostings.test
   [junit4] HEARTBEAT J2 PID(8887@localhost): 2018-05-05T00:36:42, stalled for 71.0s at: TestPointQueries.testRandomBinaryBig
   [junit4] HEARTBEAT J1 PID(8888@localhost): 2018-05-05T00:37:18, stalled for 1264s at: Test2BPostings.test
   [junit4] HEARTBEAT J2 PID(8887@localhost): 2018-05-05T00:37:43, stalled for  131s at: TestPointQueries.testRandomBinaryBig
   [junit4] HEARTBEAT J1 PID(8888@localhost): 2018-05-05T00:38:19, stalled for 1324s at: Test2BPostings.test
   [junit4] Suite: org.apache.lucene.codecs.perfield.TestPerFieldDocValuesFormat
   [junit4] Completed [168/466 (1!)] on J0 in 226.99s, 110 tests
   [junit4] 
   [junit4] Suite: org.apache.lucene.search.TestPointQueries
   [junit4] Completed [169/466 (1!)] on J2 in 471.43s, 49 tests
   [junit4] 
   [junit4] Suite: org.apache.lucene.index.TestIndexCommit
   [junit4] Completed [170/466 (1!)] on J2 in 0.09s, 1 test
   [junit4] 
   [junit4] HEARTBEAT J1 PID(8888@localhost): 2018-05-05T00:39:19, stalled for 1384s at: Test2BPostings.test
   [junit4] Suite: org.apache.lucene.store.TestMultiMMap
   [junit4] Completed [171/466 (1!)] on J2 in 23.15s, 54 tests
   [junit4] 
   [junit4] Suite: org.apache.lucene.util.TestCharsRef
   [junit4] Completed [172/466 (1!)] on J2 in 0.19s, 5 tests
   [junit4] 
   [junit4] Suite: org.apache.lucene.index.TestNRTReaderCleanup
   [junit4] Completed [173/466 (1!)] on J2 in 0.49s, 1 test
   [junit4] 
   [junit4] Suite: org.apache.lucene.search.similarities.TestBooleanSimilarity
   [junit4] Completed [174/466 (1!)] on J2 in 0.09s, 3 tests
   [junit4] 
   [junit4] Suite: org.apache.lucene.search.TestDocValuesScoring
   [junit4] Completed [175/466 (1!)] on J2 in 0.52s, 1 test
   [junit4] 
   [junit4] Suite: org.apache.lucene.util.TestRoaringDocIdSet
   [junit4] Completed [176/466 (1!)] on J2 in 1.45s, 5 tests
   [junit4] 
   [junit4] Suite: org.apache.lucene.index.TestNoMergePolicy
   [junit4] Completed [177/466 (1!)] on J2 in 0.05s, 4 tests
   [junit4] 
   [junit4] Suite: org.apache.lucene.index.TestIndexWriterMergePolicy
   [junit4] Completed [178/466 (1!)] on J2 in 5.26s, 7 tests
   [junit4] 
   [junit4] Suite: org.apache.lucene.util.packed.TestDirectPacked
   [junit4] Completed [179/466 (1!)] on J2 in 16.59s, 4 tests
   [junit4] 
   [junit4] Suite: org.apache.lucene.index.TestFieldInfos
   [junit4] Completed [180/466 (1!)] on J2 in 0.06s, 1 test
   [junit4] 
   [junit4] Suite: org.apache.lucene.util.TestRamUsageEstimator
   [junit4] IGNOR/A 0.00s J2 | TestRamUsageEstimator.testPrintValues
   [junit4]    > Assumption #1: Specify -Dtests.verbose=true to print constants of RamUsageEstimator.
   [junit4] Completed [181/466 (1!)] on J2 in 0.02s, 5 tests, 1 skipped
   [junit4] 
   [junit4] Suite: org.apache.lucene.index.TestIndexWriterReader
   [junit4] Completed [182/466 (1!)] on J0 in 73.00s, 23 tests
   [junit4] 
   [junit4] Suite: org.apache.lucene.index.TestIndexWriterMerging
   [junit4] Completed [183/466 (1!)] on J0 in 15.94s, 6 tests
   [junit4] 
   [junit4] HEARTBEAT J1 PID(8888@localhost): 2018-05-05T00:40:19, stalled for 1444s at: Test2BPostings.test
   [junit4] Suite: org.apache.lucene.index.Test2BPostings
   [junit4] Completed [184/466 (1!)] on J1 in 1446.87s, 1 test
   [junit4] 
   [junit4] Suite: org.apache.lucene.analysis.TestGraphTokenizers
   [junit4] Completed [185/466 (1!)] on J0 in 6.64s, 23 tests
   [junit4] 
   [junit4] Suite: org.apache.lucene.geo.TestGeoUtils
   [junit4] Completed [186/466 (1!)] on J1 in 54.30s, 7 tests
   [junit4] 
   [junit4] Suite: org.apache.lucene.search.TestMultiPhraseEnum
   [junit4] Completed [187/466 (1!)] on J1 in 0.18s, 2 tests
   [junit4] 
   [junit4] Suite: org.apache.lucene.index.TestFilterLeafReader
   [junit4] Completed [188/466 (1!)] on J1 in 0.07s, 3 tests
   [junit4] 
   [junit4] Suite: org.apache.lucene.util.Test2BPagedBytes
   [junit4] IGNOR/A 0.00s J1 | Test2BPagedBytes.test
   [junit4]    > Assumption #1: 'monster' test group is disabled (@Monster(value=You must increase heap to > 2 G to run this))
   [junit4] Completed [189/466 (1!)] on J1 in 0.02s, 1 test, 1 skipped
   [junit4] 
   [junit4] HEARTBEAT J0 PID(8886@localhost): 2018-05-05T00:41:42, stalled for 66.4s at: TestIndexWriterExceptions.testTooManyTokens
   [junit4] Suite: org.apache.lucene.util.TestWeakIdentityMap
   [junit4] Completed [190/466 (1!)] on J1 in 37.82s, 2 tests
   [junit4] 
   [junit4] Suite: org.apache.lucene.store.TestMmapDirectory
   [junit4] Completed [191/466 (1!)] on J1 in 6.43s, 43 tests, 1 skipped
   [junit4] 
   [junit4] Suite: org.apache.lucene.search.TestWildcard
   [junit4] Completed [192/466 (1!)] on J1 in 0.39s, 8 tests
   [junit4] 
   [junit4] Suite: org.apache.lucene.search.TestSortRescorer
   [junit4] Completed [193/466 (1!)] on J1 in 5.64s, 3 tests
   [junit4] 
   [junit4] Suite: org.apache.lucene.search.TestSortRandom
   [junit4] Completed [194/466 (1!)] on J1 in 5.57s, 2 tests
   [junit4] 
   [junit4] Suite: org.apache.lucene.util.TestMathUtil
   [junit4] Completed [195/466 (1!)] on J1 in 0.11s, 5 tests
   [junit4] 
   [junit4] Suite: org.apache.lucene.index.TestAllFilesCheckIndexHeader
   [junit4] Completed [196/466 (1!)] on J1 in 5.41s, 1 test
   [junit4] 
   [junit4] Suite: org.apache.lucene.search.TestPhraseQuery
   [junit4] Completed [197/466 (1!)] on J1 in 5.71s, 21 tests
   [junit4] 
   [junit4] Suite: org.apache.lucene.index.TestIndexingSequenceNumbers
   [junit4] Completed [198/466 (1!)] on J2 in 167.07s, 8 tests
   [junit4] 
   [junit4] Suite: org.apache.lucene.index.TestAddIndexes
   [junit4] Completed [199/466 (1!)] on J1 in 11.60s, 25 tests
   [junit4] 
   [junit4] HEARTBEAT J0 PID(8886@localhost): 2018-05-05T00:42:42, stalled for  126s at: TestIndexWriterExceptions.testTooManyTokens
   [junit4] HEARTBEAT J0 PID(8886@localhost): 2018-05-05T00:43:42, stalled for  186s at: TestIndexWriterExceptions.testTooManyTokens
   [junit4] HEARTBEAT J1 PID(8888@localhost): 2018-05-05T00:43:43, stalled for 67.3s at: TestSearcherManager.testSearcherManager
   [junit4] HEARTBEAT J2 PID(8887@localhost): 2018-05-05T00:44:31, stalled for 61.1s at: TestLongRangeFieldQueries.testRandomBig
   [junit4] HEARTBEAT J0 PID(8886@localhost): 2018-05-05T00:44:42, stalled for  246s at: TestIndexWriterExceptions.testTooManyTokens
   [junit4] HEARTBEAT J1 PID(8888@localhost): 2018-05-05T00:44:43, stalled for  127s at: TestSearcherManager.testSearcherManager
   [junit4] HEARTBEAT J2 PID(8887@localhost): 2018-05-05T00:45:31, stalled for  121s at: TestLongRangeFieldQueries.testRandomBig
   [junit4] HEARTBEAT J0 PID(8886@localhost): 2018-05-05T00:45:42, stalled for  307s at: TestIndexWriterExceptions.testTooManyTokens
   [junit4] HEARTBEAT J1 PID(8888@localhost): 2018-05-05T00:45:43, stalled for  187s at: TestSearcherManager.testSearcherManager
   [junit4] HEARTBEAT J2 PID(8887@localhost): 2018-05-05T00:46:31, stalled for  181s at: TestLongRangeFieldQueries.testRandomBig
   [junit4] HEARTBEAT J0 PID(8886@localhost): 2018-05-05T00:46:42, stalled for  367s at: TestIndexWriterExceptions.testTooManyTokens
   [junit4] HEARTBEAT J1 PID(8888@localhost): 2018-05-05T00:46:43, stalled for  247s at: TestSearcherManager.testSearcherManager
   [junit4] HEARTBEAT J2 PID(8887@localhost): 2018-05-05T00:47:31, stalled for  241s at: TestLongRangeFieldQueries.testRandomBig
   [junit4] HEARTBEAT J0 PID(8886@localhost): 2018-05-05T00:47:42, stalled for  427s at: TestIndexWriterExceptions.testTooManyTokens
   [junit4] HEARTBEAT J1 PID(8888@localhost): 2018-05-05T00:47:43, stalled for  307s at: TestSearcherManager.testSearcherManager
   [junit4] HEARTBEAT J2 PID(8887@localhost): 2018-05-05T00:48:31, stalled for  301s at: TestLongRangeFieldQueries.testRandomBig
   [junit4] HEARTBEAT J0 PID(8886@localhost): 2018-05-05T00:48:43, stalled for  487s at: TestIndexWriterExceptions.testTooManyTokens
   [junit4] HEARTBEAT J1 PID(8888@localhost): 2018-05-05T00:48:43, stalled for  367s at: TestSearcherManager.testSearcherManager
   [junit4] Suite: org.apache.lucene.search.TestSearcherManager
   [junit4] Completed [200/466 (1!)] on J1 in 415.96s, 11 tests
   [junit4] 
   [junit4] HEARTBEAT J2 PID(8887@localhost): 2018-05-05T00:49:31, stalled for  361s at: TestLongRangeFieldQueries.testRandomBig
   [junit4] Suite: org.apache.lucene.index.TestDeletionPolicy
   [junit4] Completed [201/466 (1!)] on J1 in 6.05s, 6 tests
   [junit4] 
   [junit4] HEARTBEAT J0 PID(8886@localhost): 2018-05-05T00:49:43, stalled for  547s at: TestIndexWriterExceptions.testTooManyTokens
   [junit4] Suite: org.apache.lucene.search.spans.TestBasics
   [junit4] Completed [202/466 (1!)] on J1 in 6.25s, 27 tests
   [junit4] 
   [junit4] Suite: org.apache.lucene.search.TestLongRangeFieldQueries
   [junit4] Completed [203/466 (1!)] on J2 in 435.16s, 5 tests
   [junit4] 
   [junit4] Suite: org.apache.lucene.index.TestFlushByRamOrCountsPolicy
   [junit4] Completed [204/466 (1!)] on J1 in 5.69s, 5 tests
   [junit4] 
   [junit4] Suite: org.apache.lucene.index.TestAllFilesHaveCodecHeader
   [junit4] Completed [205/466 (1!)] on J2 in 1.93s, 1 test
   [junit4] 
   [junit4] Suite: org.apache.lucene.document.TestField
   [junit4] Completed [206/466 (1!)] on J2 in 0.18s, 23 tests
   [junit4] 
   [junit4] Suite: org.apache.lucene.util.TestCharsRefBuilder
   [junit4] Completed [207/466 (1!)] on J2 in 0.04s, 2 tests
   [junit4] 
   [junit4] Suite: org.apache.lucene.analysis.TestCharacterUtils
   [junit4] Completed [208/466 (1!)] on J2 in 0.09s, 4 tests
   [junit4] 
   [junit4] Suite: org.apache.lucene.search.TestSortedNumericSortField
   [junit4] Completed [209/466 (1!)] on J2 in 0.40s, 9 tests
   [junit4] 
   [junit4] Suite: org.apache.lucene.util.TestFutureObjects
   [junit4] Completed [210/466 (1!)] on J2 in 0.04s, 3 tests
   [junit4] 
   [junit4] Suite: org.apache.lucene.util.TestSetOnce
   [junit4] Completed [211/466 (1!)] on J2 in 0.09s, 4 tests
   [junit4] 
   [junit4] Suite: org.apache.lucene.search.spans.TestSpanBoostQuery
   [junit4] Completed [212/466 (1!)] on J2 in 0.14s, 2 tests
   [junit4] 
   [junit4] Suite: org.apache.lucene.index.TestStressDeletes
   [junit4] Completed [213/466 (1!)] on J2 in 3.13s, 1 test
   [junit4] 
   [junit4] Suite: org.apache.lucene.store.TestSleepingLockWrapper
   [junit4] IGNOR/A 0.00s J2 | TestSleepingLockWrapper.testStressLocks
   [junit4]    > Assumption #1: cannot handle buggy Files.delete
   [junit4] Completed [214/466 (1!)] on J2 in 20.28s, 6 tests, 1 skipped
   [junit4] 
   [junit4] HEARTBEAT J0 PID(8886@localhost): 2018-05-05T00:50:43, stalled for  607s at: TestIndexWriterExceptions.testTooManyTokens
   [junit4] Suite: org.apache.lucene.index.TestIndexWriterDelete
   [junit4] Completed [215/466 (1!)] on J1 in 60.38s, 25 tests, 1 skipped
   [junit4] 
   [junit4] HEARTBEAT J0 PID(8886@localhost): 2018-05-05T00:51:43, stalled for  667s at: TestIndexWriterExceptions.testTooManyTokens
   [junit4] HEARTBEAT J1 PID(8888@localhost): 2018-05-05T00:51:55, stalled for 64.6s at: TestNRTThreads.testNRTThreads
   [junit4] HEARTBEAT J2 PID(8887@localhost): 2018-05-05T00:52:20, stalled for 61.5s at: TestDuelingCodecsAtNight.testBigEquals
   [junit4] HEARTBEAT J0 PID(8886@localhost): 2018-05-05T00:52:43, stalled for  727s at: TestIndexWriterExceptions.testTooManyTokens
   [junit4] HEARTBEAT J1 PID(8888@localhost): 2018-05-05T00:52:55, stalled for  125s at: TestNRTThreads.testNRTThreads
   [junit4] HEARTBEAT J2 PID(8887@localhost): 2018-05-05T00:53:20, stalled for  122s at: TestDuelingCodecsAtNight.testBigEquals
   [junit4] HEARTBEAT J0 PID(8886@localhost): 2018-05-05T00:53:43, stalled for  787s at: TestIndexWriterExceptions.testTooManyTokens
   [junit4] HEARTBEAT J1 PID(8888@localhost): 2018-05-05T00:53:55, stalled for  185s at: TestNRTThreads.testNRTThreads
   [junit4] HEARTBEAT J2 PID(8887@localhost): 2018-05-05T00:54:20, stalled for  182s at: TestDuelingCodecsAtNight.testBigEquals
   [junit4] HEARTBEAT J0 PID(8886@localhost): 2018-05-05T00:54:43, stalled for  847s at: TestIndexWriterExceptions.testTooManyTokens
   [junit4] HEARTBEAT J1 PID(8888@localhost): 2018-05-05T00:54:55, stalled for  245s at: TestNRTThreads.testNRTThreads
   [junit4] HEARTBEAT J2 PID(8887@localhost): 2018-05-05T00:55:20, stalled for  242s at: TestDuelingCodecsAtNight.testBigEquals
   [junit4] HEARTBEAT J0 PID(8886@localhost): 2018-05-05T00:55:43, stalled for  907s at: TestIndexWriterExceptions.testTooManyTokens
   [junit4] HEARTBEAT J1 PID(8888@localhost): 2018-05-05T00:55:55, stalled for  305s at: TestNRTThreads.testNRTThreads
   [junit4] HEARTBEAT J2 PID(8887@localhost): 2018-05-05T00:56:20, stalled for  302s at: TestDuelingCodecsAtNight.testBigEquals
   [junit4] HEARTBEAT J0 PID(8886@localhost): 2

[...truncated too long message...]

checkout/lucene/top-level-ivy-settings.xml

resolve:

ivy-availability-check:
[loadresource] Do not set property disallowed.ivy.jars.list as its length is 0.

-ivy-fail-disallowed-ivy-version:

ivy-fail:

ivy-configure:
[ivy:configure] :: loading settings :: file = /x1/jenkins/jenkins-slave/workspace/Lucene-Solr-NightlyTests-7.3/checkout/lucene/top-level-ivy-settings.xml

resolve:

ivy-availability-check:
[loadresource] Do not set property disallowed.ivy.jars.list as its length is 0.

-ivy-fail-disallowed-ivy-version:

ivy-fail:

ivy-configure:
[ivy:configure] :: loading settings :: file = /x1/jenkins/jenkins-slave/workspace/Lucene-Solr-NightlyTests-7.3/checkout/lucene/top-level-ivy-settings.xml

resolve:

ivy-availability-check:
[loadresource] Do not set property disallowed.ivy.jars.list as its length is 0.

-ivy-fail-disallowed-ivy-version:

ivy-fail:

ivy-configure:
[ivy:configure] :: loading settings :: file = /x1/jenkins/jenkins-slave/workspace/Lucene-Solr-NightlyTests-7.3/checkout/lucene/top-level-ivy-settings.xml

resolve:

ivy-availability-check:
[loadresource] Do not set property disallowed.ivy.jars.list as its length is 0.

-ivy-fail-disallowed-ivy-version:

ivy-fail:

ivy-configure:
[ivy:configure] :: loading settings :: file = /x1/jenkins/jenkins-slave/workspace/Lucene-Solr-NightlyTests-7.3/checkout/lucene/top-level-ivy-settings.xml

resolve:

jar-checksums:
    [mkdir] Created dir: /x1/jenkins/jenkins-slave/workspace/Lucene-Solr-NightlyTests-7.3/checkout/lucene/null666734398
     [copy] Copying 40 files to /x1/jenkins/jenkins-slave/workspace/Lucene-Solr-NightlyTests-7.3/checkout/lucene/null666734398
   [delete] Deleting directory /x1/jenkins/jenkins-slave/workspace/Lucene-Solr-NightlyTests-7.3/checkout/lucene/null666734398

resolve-example:

ivy-availability-check:
[loadresource] Do not set property disallowed.ivy.jars.list as its length is 0.

-ivy-fail-disallowed-ivy-version:

ivy-fail:

ivy-configure:
[ivy:configure] :: loading settings :: file = /x1/jenkins/jenkins-slave/workspace/Lucene-Solr-NightlyTests-7.3/checkout/lucene/top-level-ivy-settings.xml

resolve:

resolve-server:

ivy-availability-check:
[loadresource] Do not set property disallowed.ivy.jars.list as its length is 0.

-ivy-fail-disallowed-ivy-version:

ivy-fail:

ivy-fail:

ivy-configure:
[ivy:configure] :: loading settings :: file = /x1/jenkins/jenkins-slave/workspace/Lucene-Solr-NightlyTests-7.3/checkout/lucene/top-level-ivy-settings.xml

resolve:

resolve:

ivy-availability-check:
[loadresource] Do not set property disallowed.ivy.jars.list as its length is 0.

-ivy-fail-disallowed-ivy-version:

ivy-fail:

ivy-fail:

ivy-configure:
[ivy:configure] :: loading settings :: file = /x1/jenkins/jenkins-slave/workspace/Lucene-Solr-NightlyTests-7.3/checkout/lucene/top-level-ivy-settings.xml

resolve:

ivy-availability-check:
[loadresource] Do not set property disallowed.ivy.jars.list as its length is 0.

-ivy-fail-disallowed-ivy-version:

ivy-fail:

ivy-fail:

ivy-configure:
[ivy:configure] :: loading settings :: file = /x1/jenkins/jenkins-slave/workspace/Lucene-Solr-NightlyTests-7.3/checkout/lucene/top-level-ivy-settings.xml

resolve:

ivy-availability-check:
[loadresource] Do not set property disallowed.ivy.jars.list as its length is 0.

-ivy-fail-disallowed-ivy-version:

ivy-fail:

ivy-configure:
[ivy:configure] :: loading settings :: file = /x1/jenkins/jenkins-slave/workspace/Lucene-Solr-NightlyTests-7.3/checkout/lucene/top-level-ivy-settings.xml

resolve:

ivy-availability-check:
[loadresource] Do not set property disallowed.ivy.jars.list as its length is 0.

-ivy-fail-disallowed-ivy-version:

ivy-fail:

ivy-configure:
[ivy:configure] :: loading settings :: file = /x1/jenkins/jenkins-slave/workspace/Lucene-Solr-NightlyTests-7.3/checkout/lucene/top-level-ivy-settings.xml

resolve:

ivy-availability-check:
[loadresource] Do not set property disallowed.ivy.jars.list as its length is 0.

-ivy-fail-disallowed-ivy-version:

ivy-fail:

ivy-fail:

ivy-configure:
[ivy:configure] :: loading settings :: file = /x1/jenkins/jenkins-slave/workspace/Lucene-Solr-NightlyTests-7.3/checkout/lucene/top-level-ivy-settings.xml

resolve:

ivy-availability-check:
[loadresource] Do not set property disallowed.ivy.jars.list as its length is 0.

-ivy-fail-disallowed-ivy-version:

ivy-fail:

ivy-fail:

ivy-configure:
[ivy:configure] :: loading settings :: file = /x1/jenkins/jenkins-slave/workspace/Lucene-Solr-NightlyTests-7.3/checkout/lucene/top-level-ivy-settings.xml

resolve:

ivy-availability-check:
[loadresource] Do not set property disallowed.ivy.jars.list as its length is 0.

-ivy-fail-disallowed-ivy-version:

ivy-fail:

ivy-fail:

ivy-configure:
[ivy:configure] :: loading settings :: file = /x1/jenkins/jenkins-slave/workspace/Lucene-Solr-NightlyTests-7.3/checkout/lucene/top-level-ivy-settings.xml

resolve:

ivy-availability-check:
[loadresource] Do not set property disallowed.ivy.jars.list as its length is 0.

-ivy-fail-disallowed-ivy-version:

ivy-fail:

ivy-fail:

ivy-configure:
[ivy:configure] :: loading settings :: file = /x1/jenkins/jenkins-slave/workspace/Lucene-Solr-NightlyTests-7.3/checkout/lucene/top-level-ivy-settings.xml

resolve:

ivy-availability-check:
[loadresource] Do not set property disallowed.ivy.jars.list as its length is 0.

-ivy-fail-disallowed-ivy-version:

ivy-fail:

ivy-fail:

ivy-configure:
[ivy:configure] :: loading settings :: file = /x1/jenkins/jenkins-slave/workspace/Lucene-Solr-NightlyTests-7.3/checkout/lucene/top-level-ivy-settings.xml

resolve:

ivy-availability-check:
[loadresource] Do not set property disallowed.ivy.jars.list as its length is 0.

-ivy-fail-disallowed-ivy-version:

ivy-fail:

ivy-fail:

ivy-configure:
[ivy:configure] :: loading settings :: file = /x1/jenkins/jenkins-slave/workspace/Lucene-Solr-NightlyTests-7.3/checkout/lucene/top-level-ivy-settings.xml

resolve:

ivy-availability-check:
[loadresource] Do not set property disallowed.ivy.jars.list as its length is 0.

-ivy-fail-disallowed-ivy-version:

ivy-fail:

ivy-fail:

ivy-configure:
[ivy:configure] :: loading settings :: file = /x1/jenkins/jenkins-slave/workspace/Lucene-Solr-NightlyTests-7.3/checkout/lucene/top-level-ivy-settings.xml

resolve:

ivy-availability-check:
[loadresource] Do not set property disallowed.ivy.jars.list as its length is 0.

-ivy-fail-disallowed-ivy-version:

ivy-fail:

ivy-fail:

ivy-configure:
[ivy:configure] :: loading settings :: file = /x1/jenkins/jenkins-slave/workspace/Lucene-Solr-NightlyTests-7.3/checkout/lucene/top-level-ivy-settings.xml

resolve:

ivy-availability-check:
[loadresource] Do not set property disallowed.ivy.jars.list as its length is 0.

-ivy-fail-disallowed-ivy-version:

ivy-fail:

ivy-fail:

ivy-configure:
[ivy:configure] :: loading settings :: file = /x1/jenkins/jenkins-slave/workspace/Lucene-Solr-NightlyTests-7.3/checkout/lucene/top-level-ivy-settings.xml

resolve:

ivy-availability-check:
[loadresource] Do not set property disallowed.ivy.jars.list as its length is 0.

-ivy-fail-disallowed-ivy-version:

ivy-fail:

ivy-fail:

ivy-configure:
[ivy:configure] :: loading settings :: file = /x1/jenkins/jenkins-slave/workspace/Lucene-Solr-NightlyTests-7.3/checkout/lucene/top-level-ivy-settings.xml

resolve:

ivy-availability-check:
[loadresource] Do not set property disallowed.ivy.jars.list as its length is 0.

-ivy-fail-disallowed-ivy-version:

ivy-fail:

ivy-fail:

ivy-configure:
[ivy:configure] :: loading settings :: file = /x1/jenkins/jenkins-slave/workspace/Lucene-Solr-NightlyTests-7.3/checkout/lucene/top-level-ivy-settings.xml

resolve:

jar-checksums:
    [mkdir] Created dir: /x1/jenkins/jenkins-slave/workspace/Lucene-Solr-NightlyTests-7.3/checkout/solr/null843101694
     [copy] Copying 238 files to /x1/jenkins/jenkins-slave/workspace/Lucene-Solr-NightlyTests-7.3/checkout/solr/null843101694
   [delete] Deleting directory /x1/jenkins/jenkins-slave/workspace/Lucene-Solr-NightlyTests-7.3/checkout/solr/null843101694

check-working-copy:
[ivy:cachepath] :: resolving dependencies :: org.eclipse.jgit#org.eclipse.jgit-caller;working
[ivy:cachepath] 	confs: [default]
[ivy:cachepath] 	found org.eclipse.jgit#org.eclipse.jgit;4.6.0.201612231935-r in public
[ivy:cachepath] 	found com.jcraft#jsch;0.1.53 in public
[ivy:cachepath] 	found com.googlecode.javaewah#JavaEWAH;1.1.6 in public
[ivy:cachepath] 	found org.apache.httpcomponents#httpclient;4.3.6 in public
[ivy:cachepath] 	found org.apache.httpcomponents#httpcore;4.3.3 in public
[ivy:cachepath] 	found commons-logging#commons-logging;1.1.3 in public
[ivy:cachepath] 	found commons-codec#commons-codec;1.6 in public
[ivy:cachepath] 	found org.slf4j#slf4j-api;1.7.2 in public
[ivy:cachepath] :: resolution report :: resolve 109ms :: artifacts dl 10ms
	---------------------------------------------------------------------
	|                  |            modules            ||   artifacts   |
	|       conf       | number| search|dwnlded|evicted|| number|dwnlded|
	---------------------------------------------------------------------
	|      default     |   8   |   0   |   0   |   0   ||   8   |   0   |
	---------------------------------------------------------------------
[wc-checker] Initializing working copy...
[wc-checker] SLF4J: Failed to load class "org.slf4j.impl.StaticLoggerBinder".
[wc-checker] SLF4J: Defaulting to no-operation (NOP) logger implementation
[wc-checker] SLF4J: See http://www.slf4j.org/codes.html#StaticLoggerBinder for further details.
[wc-checker] Checking working copy status...

-jenkins-base:

BUILD SUCCESSFUL
Total time: 428 minutes 23 seconds
Archiving artifacts
WARN: No artifacts found that match the file pattern "**/*.events,heapdumps/**,**/hs_err_pid*". Configuration error?
WARN: java.lang.InterruptedException: no matches found within 10000
Recording test results
Build step 'Publish JUnit test result report' changed build result to UNSTABLE
Email was triggered for: Unstable (Test Failures)
Sending email for trigger: Unstable (Test Failures)

Mime
View raw message