lucene-dev mailing list archives

Site index · List index
Message view « Date » · « Thread »
Top « Date » · « Thread »
From Apache Jenkins Server <jenk...@builds.apache.org>
Subject [JENKINS] Lucene-Solr-Tests-7.x - Build # 608 - Unstable
Date Wed, 16 May 2018 14:53:50 GMT
Build: https://builds.apache.org/job/Lucene-Solr-Tests-7.x/608/

1 tests failed.
FAILED:  org.apache.solr.cloud.autoscaling.SearchRateTriggerTest.testTrigger

Error Message:
expected:<1> but was:<2>

Stack Trace:
java.lang.AssertionError: expected:<1> but was:<2>
	at __randomizedtesting.SeedInfo.seed([EA90E50E2A63D089:895BD38CB3ACA3A4]:0)
	at org.junit.Assert.fail(Assert.java:93)
	at org.junit.Assert.failNotEquals(Assert.java:647)
	at org.junit.Assert.assertEquals(Assert.java:128)
	at org.junit.Assert.assertEquals(Assert.java:472)
	at org.junit.Assert.assertEquals(Assert.java:456)
	at org.apache.solr.cloud.autoscaling.SearchRateTriggerTest.testTrigger(SearchRateTriggerTest.java:133)
	at sun.reflect.NativeMethodAccessorImpl.invoke0(Native Method)
	at sun.reflect.NativeMethodAccessorImpl.invoke(NativeMethodAccessorImpl.java:62)
	at sun.reflect.DelegatingMethodAccessorImpl.invoke(DelegatingMethodAccessorImpl.java:43)
	at java.lang.reflect.Method.invoke(Method.java:498)
	at com.carrotsearch.randomizedtesting.RandomizedRunner.invoke(RandomizedRunner.java:1737)
	at com.carrotsearch.randomizedtesting.RandomizedRunner$8.evaluate(RandomizedRunner.java:934)
	at com.carrotsearch.randomizedtesting.RandomizedRunner$9.evaluate(RandomizedRunner.java:970)
	at com.carrotsearch.randomizedtesting.RandomizedRunner$10.evaluate(RandomizedRunner.java:984)
	at com.carrotsearch.randomizedtesting.rules.SystemPropertiesRestoreRule$1.evaluate(SystemPropertiesRestoreRule.java:57)
	at org.apache.lucene.util.TestRuleSetupTeardownChained$1.evaluate(TestRuleSetupTeardownChained.java:49)
	at org.apache.lucene.util.AbstractBeforeAfterRule$1.evaluate(AbstractBeforeAfterRule.java:45)
	at org.apache.lucene.util.TestRuleThreadAndTestName$1.evaluate(TestRuleThreadAndTestName.java:48)
	at org.apache.lucene.util.TestRuleIgnoreAfterMaxFailures$1.evaluate(TestRuleIgnoreAfterMaxFailures.java:64)
	at org.apache.lucene.util.TestRuleMarkFailure$1.evaluate(TestRuleMarkFailure.java:47)
	at com.carrotsearch.randomizedtesting.rules.StatementAdapter.evaluate(StatementAdapter.java:36)
	at com.carrotsearch.randomizedtesting.ThreadLeakControl$StatementRunner.run(ThreadLeakControl.java:368)
	at com.carrotsearch.randomizedtesting.ThreadLeakControl.forkTimeoutingTask(ThreadLeakControl.java:817)
	at com.carrotsearch.randomizedtesting.ThreadLeakControl$3.evaluate(ThreadLeakControl.java:468)
	at com.carrotsearch.randomizedtesting.RandomizedRunner.runSingleTest(RandomizedRunner.java:943)
	at com.carrotsearch.randomizedtesting.RandomizedRunner$5.evaluate(RandomizedRunner.java:829)
	at com.carrotsearch.randomizedtesting.RandomizedRunner$6.evaluate(RandomizedRunner.java:879)
	at com.carrotsearch.randomizedtesting.RandomizedRunner$7.evaluate(RandomizedRunner.java:890)
	at com.carrotsearch.randomizedtesting.rules.StatementAdapter.evaluate(StatementAdapter.java:36)
	at com.carrotsearch.randomizedtesting.rules.SystemPropertiesRestoreRule$1.evaluate(SystemPropertiesRestoreRule.java:57)
	at org.apache.lucene.util.AbstractBeforeAfterRule$1.evaluate(AbstractBeforeAfterRule.java:45)
	at com.carrotsearch.randomizedtesting.rules.StatementAdapter.evaluate(StatementAdapter.java:36)
	at org.apache.lucene.util.TestRuleStoreClassName$1.evaluate(TestRuleStoreClassName.java:41)
	at com.carrotsearch.randomizedtesting.rules.NoShadowingOrOverridesOnMethodsRule$1.evaluate(NoShadowingOrOverridesOnMethodsRule.java:40)
	at com.carrotsearch.randomizedtesting.rules.NoShadowingOrOverridesOnMethodsRule$1.evaluate(NoShadowingOrOverridesOnMethodsRule.java:40)
	at com.carrotsearch.randomizedtesting.rules.StatementAdapter.evaluate(StatementAdapter.java:36)
	at com.carrotsearch.randomizedtesting.rules.StatementAdapter.evaluate(StatementAdapter.java:36)
	at com.carrotsearch.randomizedtesting.rules.StatementAdapter.evaluate(StatementAdapter.java:36)
	at org.apache.lucene.util.TestRuleAssertionsRequired$1.evaluate(TestRuleAssertionsRequired.java:53)
	at org.apache.lucene.util.TestRuleMarkFailure$1.evaluate(TestRuleMarkFailure.java:47)
	at org.apache.lucene.util.TestRuleIgnoreAfterMaxFailures$1.evaluate(TestRuleIgnoreAfterMaxFailures.java:64)
	at org.apache.lucene.util.TestRuleIgnoreTestSuites$1.evaluate(TestRuleIgnoreTestSuites.java:54)
	at com.carrotsearch.randomizedtesting.rules.StatementAdapter.evaluate(StatementAdapter.java:36)
	at com.carrotsearch.randomizedtesting.ThreadLeakControl$StatementRunner.run(ThreadLeakControl.java:368)
	at java.lang.Thread.run(Thread.java:748)




Build Log:
[...truncated 12516 lines...]
   [junit4] Suite: org.apache.solr.cloud.autoscaling.SearchRateTriggerTest
   [junit4]   2> Creating dataDir: /x1/jenkins/jenkins-slave/workspace/Lucene-Solr-Tests-7.x/solr/build/solr-core/test/J2/temp/solr.cloud.autoscaling.SearchRateTriggerTest_EA90E50E2A63D089-001/init-core-data-001
   [junit4]   2> 119753 INFO  (SUITE-SearchRateTriggerTest-seed#[EA90E50E2A63D089]-worker) [    ] o.a.s.SolrTestCaseJ4 Using PointFields (NUMERIC_POINTS_SYSPROP=true) w/NUMERIC_DOCVALUES_SYSPROP=false
   [junit4]   2> 119759 INFO  (SUITE-SearchRateTriggerTest-seed#[EA90E50E2A63D089]-worker) [    ] o.a.s.SolrTestCaseJ4 Randomized ssl (false) and clientAuth (true) via: @org.apache.solr.util.RandomizeSSL(reason=, ssl=NaN, value=NaN, clientAuth=NaN)
   [junit4]   2> 119759 INFO  (SUITE-SearchRateTriggerTest-seed#[EA90E50E2A63D089]-worker) [    ] o.a.s.SolrTestCaseJ4 SecureRandom sanity checks: test.solr.allowed.securerandom=null & java.security.egd=file:/dev/./urandom
   [junit4]   2> 119761 INFO  (SUITE-SearchRateTriggerTest-seed#[EA90E50E2A63D089]-worker) [    ] o.a.s.c.MiniSolrCloudCluster Starting cluster of 4 servers in /x1/jenkins/jenkins-slave/workspace/Lucene-Solr-Tests-7.x/solr/build/solr-core/test/J2/temp/solr.cloud.autoscaling.SearchRateTriggerTest_EA90E50E2A63D089-001/tempDir-001
   [junit4]   2> 119761 INFO  (SUITE-SearchRateTriggerTest-seed#[EA90E50E2A63D089]-worker) [    ] o.a.s.c.ZkTestServer STARTING ZK TEST SERVER
   [junit4]   2> 119772 INFO  (Thread-195) [    ] o.a.s.c.ZkTestServer client port:0.0.0.0/0.0.0.0:0
   [junit4]   2> 119772 INFO  (Thread-195) [    ] o.a.s.c.ZkTestServer Starting server
   [junit4]   2> 119802 ERROR (Thread-195) [    ] o.a.z.s.ZooKeeperServer ZKShutdownHandler is not registered, so ZooKeeper server won't take any action on ERROR or SHUTDOWN server state changes
   [junit4]   2> 119872 INFO  (SUITE-SearchRateTriggerTest-seed#[EA90E50E2A63D089]-worker) [    ] o.a.s.c.ZkTestServer start zk server on port:56659
   [junit4]   2> 119940 INFO  (zkConnectionManagerCallback-143-thread-1) [    ] o.a.s.c.c.ConnectionManager zkClient has connected
   [junit4]   2> 119982 INFO  (jetty-launcher-140-thread-1) [    ] o.e.j.s.Server jetty-9.4.10.v20180503; built: 2018-05-03T15:56:21.710Z; git: daa59876e6f384329b122929e70a80934569428c; jvm 1.8.0_172-b11
   [junit4]   2> 120001 INFO  (jetty-launcher-140-thread-2) [    ] o.e.j.s.Server jetty-9.4.10.v20180503; built: 2018-05-03T15:56:21.710Z; git: daa59876e6f384329b122929e70a80934569428c; jvm 1.8.0_172-b11
   [junit4]   2> 120017 INFO  (jetty-launcher-140-thread-3) [    ] o.e.j.s.Server jetty-9.4.10.v20180503; built: 2018-05-03T15:56:21.710Z; git: daa59876e6f384329b122929e70a80934569428c; jvm 1.8.0_172-b11
   [junit4]   2> 120034 INFO  (jetty-launcher-140-thread-4) [    ] o.e.j.s.Server jetty-9.4.10.v20180503; built: 2018-05-03T15:56:21.710Z; git: daa59876e6f384329b122929e70a80934569428c; jvm 1.8.0_172-b11
   [junit4]   2> 120072 INFO  (jetty-launcher-140-thread-1) [    ] o.e.j.s.session DefaultSessionIdManager workerName=node0
   [junit4]   2> 120072 INFO  (jetty-launcher-140-thread-1) [    ] o.e.j.s.session No SessionScavenger set, using defaults
   [junit4]   2> 120072 INFO  (jetty-launcher-140-thread-1) [    ] o.e.j.s.session node0 Scavenging every 600000ms
   [junit4]   2> 120073 INFO  (jetty-launcher-140-thread-1) [    ] o.e.j.s.h.ContextHandler Started o.e.j.s.ServletContextHandler@2dd6d32f{/solr,null,AVAILABLE}
   [junit4]   2> 120076 INFO  (jetty-launcher-140-thread-1) [    ] o.e.j.s.AbstractConnector Started ServerConnector@f8f142a{HTTP/1.1,[http/1.1]}{127.0.0.1:40409}
   [junit4]   2> 120076 INFO  (jetty-launcher-140-thread-1) [    ] o.e.j.s.Server Started @120140ms
   [junit4]   2> 120076 INFO  (jetty-launcher-140-thread-1) [    ] o.a.s.c.s.e.JettySolrRunner Jetty properties: {hostContext=/solr, hostPort=40409}
   [junit4]   2> 120077 ERROR (jetty-launcher-140-thread-1) [    ] o.a.s.u.StartupLoggingUtils Missing Java Option solr.log.dir. Logging may be missing or incomplete.
   [junit4]   2> 120077 INFO  (jetty-launcher-140-thread-1) [    ] o.a.s.s.SolrDispatchFilter Using logger factory org.apache.logging.slf4j.Log4jLoggerFactory
   [junit4]   2> 120077 INFO  (jetty-launcher-140-thread-1) [    ] o.a.s.s.SolrDispatchFilter  ___      _       Welcome to Apache Solr™ version 7.4.0
   [junit4]   2> 120077 INFO  (jetty-launcher-140-thread-1) [    ] o.a.s.s.SolrDispatchFilter / __| ___| |_ _   Starting in cloud mode on port null
   [junit4]   2> 120077 INFO  (jetty-launcher-140-thread-1) [    ] o.a.s.s.SolrDispatchFilter \__ \/ _ \ | '_|  Install dir: null
   [junit4]   2> 120077 INFO  (jetty-launcher-140-thread-1) [    ] o.a.s.s.SolrDispatchFilter |___/\___/_|_|    Start time: 2018-05-16T13:24:02.572Z
   [junit4]   2> 120131 INFO  (jetty-launcher-140-thread-2) [    ] o.e.j.s.session DefaultSessionIdManager workerName=node0
   [junit4]   2> 120131 INFO  (jetty-launcher-140-thread-2) [    ] o.e.j.s.session No SessionScavenger set, using defaults
   [junit4]   2> 120131 INFO  (jetty-launcher-140-thread-2) [    ] o.e.j.s.session node0 Scavenging every 660000ms
   [junit4]   2> 120136 INFO  (jetty-launcher-140-thread-2) [    ] o.e.j.s.h.ContextHandler Started o.e.j.s.ServletContextHandler@66482317{/solr,null,AVAILABLE}
   [junit4]   2> 120137 INFO  (jetty-launcher-140-thread-2) [    ] o.e.j.s.AbstractConnector Started ServerConnector@1f22354{HTTP/1.1,[http/1.1]}{127.0.0.1:47293}
   [junit4]   2> 120137 INFO  (jetty-launcher-140-thread-2) [    ] o.e.j.s.Server Started @120201ms
   [junit4]   2> 120137 INFO  (jetty-launcher-140-thread-2) [    ] o.a.s.c.s.e.JettySolrRunner Jetty properties: {hostContext=/solr, hostPort=47293}
   [junit4]   2> 120138 ERROR (jetty-launcher-140-thread-2) [    ] o.a.s.u.StartupLoggingUtils Missing Java Option solr.log.dir. Logging may be missing or incomplete.
   [junit4]   2> 120138 INFO  (jetty-launcher-140-thread-2) [    ] o.a.s.s.SolrDispatchFilter Using logger factory org.apache.logging.slf4j.Log4jLoggerFactory
   [junit4]   2> 120138 INFO  (jetty-launcher-140-thread-2) [    ] o.a.s.s.SolrDispatchFilter  ___      _       Welcome to Apache Solr™ version 7.4.0
   [junit4]   2> 120138 INFO  (jetty-launcher-140-thread-2) [    ] o.a.s.s.SolrDispatchFilter / __| ___| |_ _   Starting in cloud mode on port null
   [junit4]   2> 120252 INFO  (jetty-launcher-140-thread-4) [    ] o.e.j.s.session DefaultSessionIdManager workerName=node0
   [junit4]   2> 120252 INFO  (jetty-launcher-140-thread-4) [    ] o.e.j.s.session No SessionScavenger set, using defaults
   [junit4]   2> 120252 INFO  (jetty-launcher-140-thread-4) [    ] o.e.j.s.session node0 Scavenging every 600000ms
   [junit4]   2> 120253 INFO  (jetty-launcher-140-thread-4) [    ] o.e.j.s.h.ContextHandler Started o.e.j.s.ServletContextHandler@1ec098d3{/solr,null,AVAILABLE}
   [junit4]   2> 120253 INFO  (jetty-launcher-140-thread-4) [    ] o.e.j.s.AbstractConnector Started ServerConnector@25eaf2a5{HTTP/1.1,[http/1.1]}{127.0.0.1:34142}
   [junit4]   2> 120254 INFO  (jetty-launcher-140-thread-4) [    ] o.e.j.s.Server Started @120318ms
   [junit4]   2> 120254 INFO  (jetty-launcher-140-thread-4) [    ] o.a.s.c.s.e.JettySolrRunner Jetty properties: {hostContext=/solr, hostPort=34142}
   [junit4]   2> 120255 ERROR (jetty-launcher-140-thread-4) [    ] o.a.s.u.StartupLoggingUtils Missing Java Option solr.log.dir. Logging may be missing or incomplete.
   [junit4]   2> 120255 INFO  (jetty-launcher-140-thread-4) [    ] o.a.s.s.SolrDispatchFilter Using logger factory org.apache.logging.slf4j.Log4jLoggerFactory
   [junit4]   2> 120255 INFO  (jetty-launcher-140-thread-4) [    ] o.a.s.s.SolrDispatchFilter  ___      _       Welcome to Apache Solr™ version 7.4.0
   [junit4]   2> 120255 INFO  (jetty-launcher-140-thread-4) [    ] o.a.s.s.SolrDispatchFilter / __| ___| |_ _   Starting in cloud mode on port null
   [junit4]   2> 120255 INFO  (jetty-launcher-140-thread-4) [    ] o.a.s.s.SolrDispatchFilter \__ \/ _ \ | '_|  Install dir: null
   [junit4]   2> 120255 INFO  (jetty-launcher-140-thread-4) [    ] o.a.s.s.SolrDispatchFilter |___/\___/_|_|    Start time: 2018-05-16T13:24:02.750Z
   [junit4]   2> 120138 INFO  (jetty-launcher-140-thread-2) [    ] o.a.s.s.SolrDispatchFilter \__ \/ _ \ | '_|  Install dir: null
   [junit4]   2> 120255 INFO  (jetty-launcher-140-thread-2) [    ] o.a.s.s.SolrDispatchFilter |___/\___/_|_|    Start time: 2018-05-16T13:24:02.750Z
   [junit4]   2> 120301 INFO  (jetty-launcher-140-thread-3) [    ] o.e.j.s.session DefaultSessionIdManager workerName=node0
   [junit4]   2> 120301 INFO  (jetty-launcher-140-thread-3) [    ] o.e.j.s.session No SessionScavenger set, using defaults
   [junit4]   2> 120302 INFO  (jetty-launcher-140-thread-3) [    ] o.e.j.s.session node0 Scavenging every 660000ms
   [junit4]   2> 120302 INFO  (jetty-launcher-140-thread-3) [    ] o.e.j.s.h.ContextHandler Started o.e.j.s.ServletContextHandler@671b5980{/solr,null,AVAILABLE}
   [junit4]   2> 120303 INFO  (jetty-launcher-140-thread-3) [    ] o.e.j.s.AbstractConnector Started ServerConnector@1fca07a7{HTTP/1.1,[http/1.1]}{127.0.0.1:43387}
   [junit4]   2> 120303 INFO  (jetty-launcher-140-thread-3) [    ] o.e.j.s.Server Started @120367ms
   [junit4]   2> 120303 INFO  (jetty-launcher-140-thread-3) [    ] o.a.s.c.s.e.JettySolrRunner Jetty properties: {hostContext=/solr, hostPort=43387}
   [junit4]   2> 120304 ERROR (jetty-launcher-140-thread-3) [    ] o.a.s.u.StartupLoggingUtils Missing Java Option solr.log.dir. Logging may be missing or incomplete.
   [junit4]   2> 120304 INFO  (jetty-launcher-140-thread-3) [    ] o.a.s.s.SolrDispatchFilter Using logger factory org.apache.logging.slf4j.Log4jLoggerFactory
   [junit4]   2> 120304 INFO  (jetty-launcher-140-thread-3) [    ] o.a.s.s.SolrDispatchFilter  ___      _       Welcome to Apache Solr™ version 7.4.0
   [junit4]   2> 120304 INFO  (jetty-launcher-140-thread-3) [    ] o.a.s.s.SolrDispatchFilter / __| ___| |_ _   Starting in cloud mode on port null
   [junit4]   2> 120304 INFO  (jetty-launcher-140-thread-3) [    ] o.a.s.s.SolrDispatchFilter \__ \/ _ \ | '_|  Install dir: null
   [junit4]   2> 120304 INFO  (jetty-launcher-140-thread-3) [    ] o.a.s.s.SolrDispatchFilter |___/\___/_|_|    Start time: 2018-05-16T13:24:02.799Z
   [junit4]   2> 120369 INFO  (zkConnectionManagerCallback-145-thread-1) [    ] o.a.s.c.c.ConnectionManager zkClient has connected
   [junit4]   2> 120410 INFO  (jetty-launcher-140-thread-1) [    ] o.a.s.s.SolrDispatchFilter solr.xml found in ZooKeeper. Loading...
   [junit4]   2> 120436 INFO  (zkConnectionManagerCallback-149-thread-1) [    ] o.a.s.c.c.ConnectionManager zkClient has connected
   [junit4]   2> 120611 INFO  (jetty-launcher-140-thread-4) [    ] o.a.s.s.SolrDispatchFilter solr.xml found in ZooKeeper. Loading...
   [junit4]   2> 120621 INFO  (zkConnectionManagerCallback-147-thread-1) [    ] o.a.s.c.c.ConnectionManager zkClient has connected
   [junit4]   2> 120624 INFO  (jetty-launcher-140-thread-2) [    ] o.a.s.s.SolrDispatchFilter solr.xml found in ZooKeeper. Loading...
   [junit4]   2> 120648 INFO  (jetty-launcher-140-thread-1) [    ] o.a.s.c.ZkContainer Zookeeper client=127.0.0.1:56659/solr
   [junit4]   2> 120691 INFO  (zkConnectionManagerCallback-151-thread-1) [    ] o.a.s.c.c.ConnectionManager zkClient has connected
   [junit4]   2> 120721 INFO  (jetty-launcher-140-thread-2) [    ] o.a.s.c.ZkContainer Zookeeper client=127.0.0.1:56659/solr
   [junit4]   2> 120728 INFO  (jetty-launcher-140-thread-3) [    ] o.a.s.s.SolrDispatchFilter solr.xml found in ZooKeeper. Loading...
   [junit4]   2> 120775 INFO  (jetty-launcher-140-thread-4) [    ] o.a.s.c.ZkContainer Zookeeper client=127.0.0.1:56659/solr
   [junit4]   2> 120818 INFO  (zkConnectionManagerCallback-155-thread-1) [    ] o.a.s.c.c.ConnectionManager zkClient has connected
   [junit4]   2> 120855 INFO  (zkConnectionManagerCallback-163-thread-1) [    ] o.a.s.c.c.ConnectionManager zkClient has connected
   [junit4]   2> 120908 WARN  (NIOServerCxn.Factory:0.0.0.0/0.0.0.0:0) [    ] o.a.z.s.NIOServerCnxn Unable to read additional data from client sessionid 0x106392b3f330005, likely client has closed socket
   [junit4]   2> 120984 INFO  (jetty-launcher-140-thread-3) [    ] o.a.s.c.ZkContainer Zookeeper client=127.0.0.1:56659/solr
   [junit4]   2> 121115 INFO  (zkConnectionManagerCallback-166-thread-1) [    ] o.a.s.c.c.ConnectionManager zkClient has connected
   [junit4]   2> 121139 INFO  (zkConnectionManagerCallback-159-thread-1) [    ] o.a.s.c.c.ConnectionManager zkClient has connected
   [junit4]   2> 121139 INFO  (zkConnectionManagerCallback-171-thread-1) [    ] o.a.s.c.c.ConnectionManager zkClient has connected
   [junit4]   2> 121139 INFO  (zkConnectionManagerCallback-168-thread-1) [    ] o.a.s.c.c.ConnectionManager zkClient has connected
   [junit4]   2> 121146 WARN  (NIOServerCxn.Factory:0.0.0.0/0.0.0.0:0) [    ] o.a.z.s.NIOServerCnxn Unable to read additional data from client sessionid 0x106392b3f330009, likely client has closed socket
   [junit4]   2> 121146 WARN  (NIOServerCxn.Factory:0.0.0.0/0.0.0.0:0) [    ] o.a.z.s.NIOServerCnxn Unable to read additional data from client sessionid 0x106392b3f330007, likely client has closed socket
   [junit4]   2> 121302 INFO  (zkConnectionManagerCallback-173-thread-1) [    ] o.a.s.c.c.ConnectionManager zkClient has connected
   [junit4]   2> 121377 INFO  (zkConnectionManagerCallback-175-thread-1) [    ] o.a.s.c.c.ConnectionManager zkClient has connected
   [junit4]   2> 121385 INFO  (jetty-launcher-140-thread-2) [n:127.0.0.1:47293_solr    ] o.a.s.c.Overseer Overseer (id=null) closing
   [junit4]   2> 121387 INFO  (jetty-launcher-140-thread-2) [n:127.0.0.1:47293_solr    ] o.a.s.c.OverseerElectionContext I am going to be the leader 127.0.0.1:47293_solr
   [junit4]   2> 121392 INFO  (jetty-launcher-140-thread-2) [n:127.0.0.1:47293_solr    ] o.a.s.c.Overseer Overseer (id=73809301804875787-127.0.0.1:47293_solr-n_0000000000) starting
   [junit4]   2> 121548 INFO  (jetty-launcher-140-thread-3) [n:127.0.0.1:43387_solr    ] o.a.s.c.Overseer Overseer (id=null) closing
   [junit4]   2> 121559 INFO  (jetty-launcher-140-thread-3) [n:127.0.0.1:43387_solr    ] o.a.s.c.ZkController Register node as live in ZooKeeper:/live_nodes/127.0.0.1:43387_solr
   [junit4]   2> 121657 INFO  (zkCallback-172-thread-1) [    ] o.a.s.c.c.ZkStateReader Updated live nodes from ZooKeeper... (0) -> (1)
   [junit4]   2> 121658 INFO  (zkCallback-174-thread-1) [    ] o.a.s.c.c.ZkStateReader Updated live nodes from ZooKeeper... (0) -> (1)
   [junit4]   2> 121658 INFO  (zkConnectionManagerCallback-188-thread-1) [    ] o.a.s.c.c.ConnectionManager zkClient has connected
   [junit4]   2> 121681 INFO  (jetty-launcher-140-thread-2) [n:127.0.0.1:47293_solr    ] o.a.s.c.c.ZkStateReader Updated live nodes from ZooKeeper... (0) -> (1)
   [junit4]   2> 121701 INFO  (jetty-launcher-140-thread-2) [n:127.0.0.1:47293_solr    ] o.a.s.c.s.i.ZkClientClusterStateProvider Cluster at 127.0.0.1:56659/solr ready
   [junit4]   2> 121725 INFO  (jetty-launcher-140-thread-2) [n:127.0.0.1:47293_solr    ] o.a.s.c.TransientSolrCoreCacheDefault Allocating transient cache for 2147483647 transient cores
   [junit4]   2> 121725 INFO  (jetty-launcher-140-thread-2) [n:127.0.0.1:47293_solr    ] o.a.s.c.ZkController Register node as live in ZooKeeper:/live_nodes/127.0.0.1:47293_solr
   [junit4]   2> 121736 INFO  (zkCallback-174-thread-1) [    ] o.a.s.c.c.ZkStateReader Updated live nodes from ZooKeeper... (1) -> (2)
   [junit4]   2> 121736 INFO  (zkCallback-172-thread-1) [    ] o.a.s.c.c.ZkStateReader Updated live nodes from ZooKeeper... (1) -> (2)
   [junit4]   2> 121792 INFO  (zkCallback-187-thread-1) [    ] o.a.s.c.c.ZkStateReader Updated live nodes from ZooKeeper... (1) -> (2)
   [junit4]   2> 121800 INFO  (jetty-launcher-140-thread-4) [n:127.0.0.1:34142_solr    ] o.a.s.c.c.ZkStateReader Updated live nodes from ZooKeeper... (0) -> (2)
   [junit4]   2> 121819 INFO  (jetty-launcher-140-thread-4) [n:127.0.0.1:34142_solr    ] o.a.s.c.Overseer Overseer (id=null) closing
   [junit4]   2> 121824 INFO  (jetty-launcher-140-thread-4) [n:127.0.0.1:34142_solr    ] o.a.s.c.TransientSolrCoreCacheDefault Allocating transient cache for 2147483647 transient cores
   [junit4]   2> 121824 INFO  (jetty-launcher-140-thread-4) [n:127.0.0.1:34142_solr    ] o.a.s.c.ZkController Register node as live in ZooKeeper:/live_nodes/127.0.0.1:34142_solr
   [junit4]   2> 121826 INFO  (zkCallback-174-thread-1) [    ] o.a.s.c.c.ZkStateReader Updated live nodes from ZooKeeper... (2) -> (3)
   [junit4]   2> 121842 INFO  (jetty-launcher-140-thread-1) [n:127.0.0.1:40409_solr    ] o.a.s.c.c.ZkStateReader Updated live nodes from ZooKeeper... (0) -> (3)
   [junit4]   2> 121849 INFO  (jetty-launcher-140-thread-1) [n:127.0.0.1:40409_solr    ] o.a.s.c.Overseer Overseer (id=null) closing
   [junit4]   2> 121877 INFO  (jetty-launcher-140-thread-1) [n:127.0.0.1:40409_solr    ] o.a.s.c.TransientSolrCoreCacheDefault Allocating transient cache for 2147483647 transient cores
   [junit4]   2> 121877 INFO  (jetty-launcher-140-thread-1) [n:127.0.0.1:40409_solr    ] o.a.s.c.ZkController Register node as live in ZooKeeper:/live_nodes/127.0.0.1:40409_solr
   [junit4]   2> 121880 INFO  (zkCallback-172-thread-2) [    ] o.a.s.c.c.ZkStateReader Updated live nodes from ZooKeeper... (2) -> (3)
   [junit4]   2> 121881 INFO  (zkCallback-174-thread-1) [    ] o.a.s.c.c.ZkStateReader Updated live nodes from ZooKeeper... (3) -> (4)
   [junit4]   2> 121881 INFO  (zkCallback-187-thread-1) [    ] o.a.s.c.c.ZkStateReader Updated live nodes from ZooKeeper... (2) -> (4)
   [junit4]   2> 121882 INFO  (zkCallback-172-thread-2) [    ] o.a.s.c.c.ZkStateReader Updated live nodes from ZooKeeper... (3) -> (4)
   [junit4]   2> 122032 INFO  (zkCallback-167-thread-1) [    ] o.a.s.c.c.ZkStateReader Updated live nodes from ZooKeeper... (2) -> (3)
   [junit4]   2> 122060 INFO  (zkCallback-167-thread-2) [    ] o.a.s.c.c.ZkStateReader Updated live nodes from ZooKeeper... (3) -> (4)
   [junit4]   2> 122084 INFO  (zkCallback-165-thread-1) [    ] o.a.s.c.c.ZkStateReader Updated live nodes from ZooKeeper... (3) -> (4)
   [junit4]   2> 122766 INFO  (jetty-launcher-140-thread-3) [n:127.0.0.1:43387_solr    ] o.a.s.m.r.SolrJmxReporter JMX monitoring for 'solr_43387.solr.node' (registry 'solr.node') enabled at server: com.sun.jmx.mbeanserver.JmxMBeanServer@3b9d3c18
   [junit4]   2> 122858 INFO  (jetty-launcher-140-thread-3) [n:127.0.0.1:43387_solr    ] o.a.s.m.r.SolrJmxReporter JMX monitoring for 'solr_43387.solr.jvm' (registry 'solr.jvm') enabled at server: com.sun.jmx.mbeanserver.JmxMBeanServer@3b9d3c18
   [junit4]   2> 122859 INFO  (jetty-launcher-140-thread-3) [n:127.0.0.1:43387_solr    ] o.a.s.m.r.SolrJmxReporter JMX monitoring for 'solr_43387.solr.jetty' (registry 'solr.jetty') enabled at server: com.sun.jmx.mbeanserver.JmxMBeanServer@3b9d3c18
   [junit4]   2> 122875 INFO  (jetty-launcher-140-thread-3) [n:127.0.0.1:43387_solr    ] o.a.s.c.CorePropertiesLocator Found 0 core definitions underneath /x1/jenkins/jenkins-slave/workspace/Lucene-Solr-Tests-7.x/solr/build/solr-core/test/J2/temp/solr.cloud.autoscaling.SearchRateTriggerTest_EA90E50E2A63D089-001/tempDir-001/node3/.
   [junit4]   2> 123364 INFO  (zkConnectionManagerCallback-193-thread-1) [    ] o.a.s.c.c.ConnectionManager zkClient has connected
   [junit4]   2> 123366 INFO  (jetty-launcher-140-thread-3) [n:127.0.0.1:43387_solr    ] o.a.s.c.c.ZkStateReader Updated live nodes from ZooKeeper... (0) -> (4)
   [junit4]   2> 123368 INFO  (jetty-launcher-140-thread-3) [n:127.0.0.1:43387_solr    ] o.a.s.c.s.i.ZkClientClusterStateProvider Cluster at 127.0.0.1:56659/solr ready
   [junit4]   2> 123458 INFO  (jetty-launcher-140-thread-2) [n:127.0.0.1:47293_solr    ] o.a.s.m.r.SolrJmxReporter JMX monitoring for 'solr_47293.solr.node' (registry 'solr.node') enabled at server: com.sun.jmx.mbeanserver.JmxMBeanServer@3b9d3c18
   [junit4]   2> 123462 INFO  (jetty-launcher-140-thread-4) [n:127.0.0.1:34142_solr    ] o.a.s.m.r.SolrJmxReporter JMX monitoring for 'solr_34142.solr.node' (registry 'solr.node') enabled at server: com.sun.jmx.mbeanserver.JmxMBeanServer@3b9d3c18
   [junit4]   2> 123502 INFO  (jetty-launcher-140-thread-4) [n:127.0.0.1:34142_solr    ] o.a.s.m.r.SolrJmxReporter JMX monitoring for 'solr_34142.solr.jvm' (registry 'solr.jvm') enabled at server: com.sun.jmx.mbeanserver.JmxMBeanServer@3b9d3c18
   [junit4]   2> 123502 INFO  (jetty-launcher-140-thread-4) [n:127.0.0.1:34142_solr    ] o.a.s.m.r.SolrJmxReporter JMX monitoring for 'solr_34142.solr.jetty' (registry 'solr.jetty') enabled at server: com.sun.jmx.mbeanserver.JmxMBeanServer@3b9d3c18
   [junit4]   2> 123512 INFO  (jetty-launcher-140-thread-2) [n:127.0.0.1:47293_solr    ] o.a.s.m.r.SolrJmxReporter JMX monitoring for 'solr_47293.solr.jvm' (registry 'solr.jvm') enabled at server: com.sun.jmx.mbeanserver.JmxMBeanServer@3b9d3c18
   [junit4]   2> 123513 INFO  (jetty-launcher-140-thread-2) [n:127.0.0.1:47293_solr    ] o.a.s.m.r.SolrJmxReporter JMX monitoring for 'solr_47293.solr.jetty' (registry 'solr.jetty') enabled at server: com.sun.jmx.mbeanserver.JmxMBeanServer@3b9d3c18
   [junit4]   2> 123516 INFO  (jetty-launcher-140-thread-4) [n:127.0.0.1:34142_solr    ] o.a.s.c.CorePropertiesLocator Found 0 core definitions underneath /x1/jenkins/jenkins-slave/workspace/Lucene-Solr-Tests-7.x/solr/build/solr-core/test/J2/temp/solr.cloud.autoscaling.SearchRateTriggerTest_EA90E50E2A63D089-001/tempDir-001/node4/.
   [junit4]   2> 123517 INFO  (jetty-launcher-140-thread-2) [n:127.0.0.1:47293_solr    ] o.a.s.c.CorePropertiesLocator Found 0 core definitions underneath /x1/jenkins/jenkins-slave/workspace/Lucene-Solr-Tests-7.x/solr/build/solr-core/test/J2/temp/solr.cloud.autoscaling.SearchRateTriggerTest_EA90E50E2A63D089-001/tempDir-001/node2/.
   [junit4]   2> 123599 INFO  (zkConnectionManagerCallback-198-thread-1) [    ] o.a.s.c.c.ConnectionManager zkClient has connected
   [junit4]   2> 123601 INFO  (jetty-launcher-140-thread-4) [n:127.0.0.1:34142_solr    ] o.a.s.c.c.ZkStateReader Updated live nodes from ZooKeeper... (0) -> (4)
   [junit4]   2> 123603 INFO  (jetty-launcher-140-thread-4) [n:127.0.0.1:34142_solr    ] o.a.s.c.s.i.ZkClientClusterStateProvider Cluster at 127.0.0.1:56659/solr ready
   [junit4]   2> 123765 INFO  (jetty-launcher-140-thread-1) [n:127.0.0.1:40409_solr    ] o.a.s.m.r.SolrJmxReporter JMX monitoring for 'solr_40409.solr.node' (registry 'solr.node') enabled at server: com.sun.jmx.mbeanserver.JmxMBeanServer@3b9d3c18
   [junit4]   2> 123780 INFO  (jetty-launcher-140-thread-1) [n:127.0.0.1:40409_solr    ] o.a.s.m.r.SolrJmxReporter JMX monitoring for 'solr_40409.solr.jvm' (registry 'solr.jvm') enabled at server: com.sun.jmx.mbeanserver.JmxMBeanServer@3b9d3c18
   [junit4]   2> 123780 INFO  (jetty-launcher-140-thread-1) [n:127.0.0.1:40409_solr    ] o.a.s.m.r.SolrJmxReporter JMX monitoring for 'solr_40409.solr.jetty' (registry 'solr.jetty') enabled at server: com.sun.jmx.mbeanserver.JmxMBeanServer@3b9d3c18
   [junit4]   2> 123782 INFO  (jetty-launcher-140-thread-1) [n:127.0.0.1:40409_solr    ] o.a.s.c.CorePropertiesLocator Found 0 core definitions underneath /x1/jenkins/jenkins-slave/workspace/Lucene-Solr-Tests-7.x/solr/build/solr-core/test/J2/temp/solr.cloud.autoscaling.SearchRateTriggerTest_EA90E50E2A63D089-001/tempDir-001/node1/.
   [junit4]   2> 123816 INFO  (zkConnectionManagerCallback-203-thread-1) [    ] o.a.s.c.c.ConnectionManager zkClient has connected
   [junit4]   2> 123818 INFO  (jetty-launcher-140-thread-1) [n:127.0.0.1:40409_solr    ] o.a.s.c.c.ZkStateReader Updated live nodes from ZooKeeper... (0) -> (4)
   [junit4]   2> 123820 INFO  (jetty-launcher-140-thread-1) [n:127.0.0.1:40409_solr    ] o.a.s.c.s.i.ZkClientClusterStateProvider Cluster at 127.0.0.1:56659/solr ready
   [junit4]   2> 124124 INFO  (zkConnectionManagerCallback-205-thread-1) [    ] o.a.s.c.c.ConnectionManager zkClient has connected
   [junit4]   2> 124149 INFO  (zkConnectionManagerCallback-210-thread-1) [    ] o.a.s.c.c.ConnectionManager zkClient has connected
   [junit4]   2> 124151 INFO  (SUITE-SearchRateTriggerTest-seed#[EA90E50E2A63D089]-worker) [    ] o.a.s.c.c.ZkStateReader Updated live nodes from ZooKeeper... (0) -> (4)
   [junit4]   2> 124153 INFO  (SUITE-SearchRateTriggerTest-seed#[EA90E50E2A63D089]-worker) [    ] o.a.s.c.s.i.ZkClientClusterStateProvider Cluster at 127.0.0.1:56659/solr ready
   [junit4]   2> 124224 INFO  (TEST-SearchRateTriggerTest.testTrigger-seed#[EA90E50E2A63D089]) [    ] o.a.s.SolrTestCaseJ4 ###Starting testTrigger
   [junit4]   2> 124226 INFO  (TEST-SearchRateTriggerTest.testTrigger-seed#[EA90E50E2A63D089]) [    ] o.a.s.c.c.ZkStateReader Updated live nodes from ZooKeeper... (0) -> (4)
   [junit4]   2> 124237 INFO  (qtp1164797472-634) [n:127.0.0.1:34142_solr    ] o.a.s.h.a.CollectionsHandler Invoked Collection Action :create with params replicationFactor=2&collection.configName=conf&maxShardsPerNode=1&name=SearchRateTriggerTest-collection1&nrtReplicas=2&action=CREATE&numShards=2&wt=javabin&version=2 and sendToOCPQueue=true
   [junit4]   2> 124259 INFO  (OverseerThreadFactory-295-thread-1) [    ] o.a.s.c.a.c.CreateCollectionCmd Create collection SearchRateTriggerTest-collection1
   [junit4]   2> 124425 INFO  (OverseerStateUpdate-73809301804875787-127.0.0.1:47293_solr-n_0000000000) [    ] o.a.s.c.o.SliceMutator createReplica() {
   [junit4]   2>   "operation":"ADDREPLICA",
   [junit4]   2>   "collection":"SearchRateTriggerTest-collection1",
   [junit4]   2>   "shard":"shard1",
   [junit4]   2>   "core":"SearchRateTriggerTest-collection1_shard1_replica_n1",
   [junit4]   2>   "state":"down",
   [junit4]   2>   "base_url":"http://127.0.0.1:40409/solr",
   [junit4]   2>   "type":"NRT",
   [junit4]   2>   "waitForFinalState":"false"} 
   [junit4]   2> 124441 INFO  (OverseerStateUpdate-73809301804875787-127.0.0.1:47293_solr-n_0000000000) [    ] o.a.s.c.o.SliceMutator createReplica() {
   [junit4]   2>   "operation":"ADDREPLICA",
   [junit4]   2>   "collection":"SearchRateTriggerTest-collection1",
   [junit4]   2>   "shard":"shard1",
   [junit4]   2>   "core":"SearchRateTriggerTest-collection1_shard1_replica_n2",
   [junit4]   2>   "state":"down",
   [junit4]   2>   "base_url":"http://127.0.0.1:43387/solr",
   [junit4]   2>   "type":"NRT",
   [junit4]   2>   "waitForFinalState":"false"} 
   [junit4]   2> 124452 INFO  (OverseerStateUpdate-73809301804875787-127.0.0.1:47293_solr-n_0000000000) [    ] o.a.s.c.o.SliceMutator createReplica() {
   [junit4]   2>   "operation":"ADDREPLICA",
   [junit4]   2>   "collection":"SearchRateTriggerTest-collection1",
   [junit4]   2>   "shard":"shard2",
   [junit4]   2>   "core":"SearchRateTriggerTest-collection1_shard2_replica_n4",
   [junit4]   2>   "state":"down",
   [junit4]   2>   "base_url":"http://127.0.0.1:47293/solr",
   [junit4]   2>   "type":"NRT",
   [junit4]   2>   "waitForFinalState":"false"} 
   [junit4]   2> 124459 INFO  (OverseerStateUpdate-73809301804875787-127.0.0.1:47293_solr-n_0000000000) [    ] o.a.s.c.o.SliceMutator createReplica() {
   [junit4]   2>   "operation":"ADDREPLICA",
   [junit4]   2>   "collection":"SearchRateTriggerTest-collection1",
   [junit4]   2>   "shard":"shard2",
   [junit4]   2>   "core":"SearchRateTriggerTest-collection1_shard2_replica_n6",
   [junit4]   2>   "state":"down",
   [junit4]   2>   "base_url":"http://127.0.0.1:34142/solr",
   [junit4]   2>   "type":"NRT",
   [junit4]   2>   "waitForFinalState":"false"} 
   [junit4]   2> 124707 INFO  (qtp141453425-610) [n:127.0.0.1:40409_solr    x:SearchRateTriggerTest-collection1_shard1_replica_n1] o.a.s.h.a.CoreAdminOperation core create command qt=/admin/cores&coreNodeName=core_node3&collection.configName=conf&newCollection=true&name=SearchRateTriggerTest-collection1_shard1_replica_n1&action=CREATE&numShards=2&collection=SearchRateTriggerTest-collection1&shard=shard1&wt=javabin&version=2&replicaType=NRT
   [junit4]   2> 124750 INFO  (qtp921154396-639) [n:127.0.0.1:43387_solr    x:SearchRateTriggerTest-collection1_shard1_replica_n2] o.a.s.h.a.CoreAdminOperation core create command qt=/admin/cores&coreNodeName=core_node5&collection.configName=conf&newCollection=true&name=SearchRateTriggerTest-collection1_shard1_replica_n2&action=CREATE&numShards=2&collection=SearchRateTriggerTest-collection1&shard=shard1&wt=javabin&version=2&replicaType=NRT
   [junit4]   2> 124751 INFO  (qtp921154396-639) [n:127.0.0.1:43387_solr    x:SearchRateTriggerTest-collection1_shard1_replica_n2] o.a.s.c.TransientSolrCoreCacheDefault Allocating transient cache for 2147483647 transient cores
   [junit4]   2> 124785 INFO  (qtp1164797472-627) [n:127.0.0.1:34142_solr    x:SearchRateTriggerTest-collection1_shard2_replica_n6] o.a.s.h.a.CoreAdminOperation core create command qt=/admin/cores&coreNodeName=core_node8&collection.configName=conf&newCollection=true&name=SearchRateTriggerTest-collection1_shard2_replica_n6&action=CREATE&numShards=2&collection=SearchRateTriggerTest-collection1&shard=shard2&wt=javabin&version=2&replicaType=NRT
   [junit4]   2> 124804 INFO  (qtp948898168-621) [n:127.0.0.1:47293_solr    x:SearchRateTriggerTest-collection1_shard2_replica_n4] o.a.s.h.a.CoreAdminOperation core create command qt=/admin/cores&coreNodeName=core_node7&collection.configName=conf&newCollection=true&name=SearchRateTriggerTest-collection1_shard2_replica_n4&action=CREATE&numShards=2&collection=SearchRateTriggerTest-collection1&shard=shard2&wt=javabin&version=2&replicaType=NRT
   [junit4]   2> 125827 INFO  (qtp921154396-639) [n:127.0.0.1:43387_solr c:SearchRateTriggerTest-collection1 s:shard1 r:core_node5 x:SearchRateTriggerTest-collection1_shard1_replica_n2] o.a.s.c.SolrConfig Using Lucene MatchVersion: 7.4.0
   [junit4]   2> 125893 INFO  (qtp141453425-610) [n:127.0.0.1:40409_solr c:SearchRateTriggerTest-collection1 s:shard1 r:core_node3 x:SearchRateTriggerTest-collection1_shard1_replica_n1] o.a.s.c.SolrConfig Using Lucene MatchVersion: 7.4.0
   [junit4]   2> 125917 INFO  (qtp1164797472-627) [n:127.0.0.1:34142_solr c:SearchRateTriggerTest-collection1 s:shard2 r:core_node8 x:SearchRateTriggerTest-collection1_shard2_replica_n6] o.a.s.c.SolrConfig Using Lucene MatchVersion: 7.4.0
   [junit4]   2> 125922 INFO  (qtp921154396-639) [n:127.0.0.1:43387_solr c:SearchRateTriggerTest-collection1 s:shard1 r:core_node5 x:SearchRateTriggerTest-collection1_shard1_replica_n2] o.a.s.s.IndexSchema [SearchRateTriggerTest-collection1_shard1_replica_n2] Schema name=minimal
   [junit4]   2> 125927 INFO  (qtp948898168-621) [n:127.0.0.1:47293_solr c:SearchRateTriggerTest-collection1 s:shard2 r:core_node7 x:SearchRateTriggerTest-collection1_shard2_replica_n4] o.a.s.c.SolrConfig Using Lucene MatchVersion: 7.4.0
   [junit4]   2> 125931 INFO  (qtp921154396-639) [n:127.0.0.1:43387_solr c:SearchRateTriggerTest-collection1 s:shard1 r:core_node5 x:SearchRateTriggerTest-collection1_shard1_replica_n2] o.a.s.s.IndexSchema Loaded schema minimal/1.1 with uniqueid field id
   [junit4]   2> 125931 INFO  (qtp921154396-639) [n:127.0.0.1:43387_solr c:SearchRateTriggerTest-collection1 s:shard1 r:core_node5 x:SearchRateTriggerTest-collection1_shard1_replica_n2] o.a.s.c.CoreContainer Creating SolrCore 'SearchRateTriggerTest-collection1_shard1_replica_n2' using configuration from collection SearchRateTriggerTest-collection1, trusted=true
   [junit4]   2> 125953 INFO  (qtp921154396-639) [n:127.0.0.1:43387_solr c:SearchRateTriggerTest-collection1 s:shard1 r:core_node5 x:SearchRateTriggerTest-collection1_shard1_replica_n2] o.a.s.m.r.SolrJmxReporter JMX monitoring for 'solr_43387.solr.core.SearchRateTriggerTest-collection1.shard1.replica_n2' (registry 'solr.core.SearchRateTriggerTest-collection1.shard1.replica_n2') enabled at server: com.sun.jmx.mbeanserver.JmxMBeanServer@3b9d3c18
   [junit4]   2> 125953 INFO  (qtp921154396-639) [n:127.0.0.1:43387_solr c:SearchRateTriggerTest-collection1 s:shard1 r:core_node5 x:SearchRateTriggerTest-collection1_shard1_replica_n2] o.a.s.c.SolrCore solr.RecoveryStrategy.Builder
   [junit4]   2> 125953 INFO  (qtp921154396-639) [n:127.0.0.1:43387_solr c:SearchRateTriggerTest-collection1 s:shard1 r:core_node5 x:SearchRateTriggerTest-collection1_shard1_replica_n2] o.a.s.c.SolrCore [[SearchRateTriggerTest-collection1_shard1_replica_n2] ] Opening new SolrCore at [/x1/jenkins/jenkins-slave/workspace/Lucene-Solr-Tests-7.x/solr/build/solr-core/test/J2/temp/solr.cloud.autoscaling.SearchRateTriggerTest_EA90E50E2A63D089-001/tempDir-001/node3/SearchRateTriggerTest-collection1_shard1_replica_n2], dataDir=[/x1/jenkins/jenkins-slave/workspace/Lucene-Solr-Tests-7.x/solr/build/solr-core/test/J2/temp/solr.cloud.autoscaling.SearchRateTriggerTest_EA90E50E2A63D089-001/tempDir-001/node3/./SearchRateTriggerTest-collection1_shard1_replica_n2/data/]
   [junit4]   2> 125956 INFO  (qtp141453425-610) [n:127.0.0.1:40409_solr c:SearchRateTriggerTest-collection1 s:shard1 r:core_node3 x:SearchRateTriggerTest-collection1_shard1_replica_n1] o.a.s.s.IndexSchema [SearchRateTriggerTest-collection1_shard1_replica_n1] Schema name=minimal
   [junit4]   2> 125962 INFO  (qtp948898168-621) [n:127.0.0.1:47293_solr c:SearchRateTriggerTest-collection1 s:shard2 r:core_node7 x:SearchRateTriggerTest-collection1_shard2_replica_n4] o.a.s.s.IndexSchema [SearchRateTriggerTest-collection1_shard2_replica_n4] Schema name=minimal
   [junit4]   2> 125966 INFO  (qtp141453425-610) [n:127.0.0.1:40409_solr c:SearchRateTriggerTest-collection1 s:shard1 r:core_node3 x:SearchRateTriggerTest-collection1_shard1_replica_n1] o.a.s.s.IndexSchema Loaded schema minimal/1.1 with uniqueid field id
   [junit4]   2> 125966 INFO  (qtp141453425-610) [n:127.0.0.1:40409_solr c:SearchRateTriggerTest-collection1 s:shard1 r:core_node3 x:SearchRateTriggerTest-collection1_shard1_replica_n1] o.a.s.c.CoreContainer Creating SolrCore 'SearchRateTriggerTest-collection1_shard1_replica_n1' using configuration from collection SearchRateTriggerTest-collection1, trusted=true
   [junit4]   2> 125966 INFO  (qtp141453425-610) [n:127.0.0.1:40409_solr c:SearchRateTriggerTest-collection1 s:shard1 r:core_node3 x:SearchRateTriggerTest-collection1_shard1_replica_n1] o.a.s.m.r.SolrJmxReporter JMX monitoring for 'solr_40409.solr.core.SearchRateTriggerTest-collection1.shard1.replica_n1' (registry 'solr.core.SearchRateTriggerTest-collection1.shard1.replica_n1') enabled at server: com.sun.jmx.mbeanserver.JmxMBeanServer@3b9d3c18
   [junit4]   2> 125967 INFO  (qtp141453425-610) [n:127.0.0.1:40409_solr c:SearchRateTriggerTest-collection1 s:shard1 r:core_node3 x:SearchRateTriggerTest-collection1_shard1_replica_n1] o.a.s.c.SolrCore solr.RecoveryStrategy.Builder
   [junit4]   2> 125967 INFO  (qtp141453425-610) [n:127.0.0.1:40409_solr c:SearchRateTriggerTest-collection1 s:shard1 r:core_node3 x:SearchRateTriggerTest-collection1_shard1_replica_n1] o.a.s.c.SolrCore [[SearchRateTriggerTest-collection1_shard1_replica_n1] ] Opening new SolrCore at [/x1/jenkins/jenkins-slave/workspace/Lucene-Solr-Tests-7.x/solr/build/solr-core/test/J2/temp/solr.cloud.autoscaling.SearchRateTriggerTest_EA90E50E2A63D089-001/tempDir-001/node1/SearchRateTriggerTest-collection1_shard1_replica_n1], dataDir=[/x1/jenkins/jenkins-slave/workspace/Lucene-Solr-Tests-7.x/solr/build/solr-core/test/J2/temp/solr.cloud.autoscaling.SearchRateTriggerTest_EA90E50E2A63D089-001/tempDir-001/node1/./SearchRateTriggerTest-collection1_shard1_replica_n1/data/]
   [junit4]   2> 125996 INFO  (qtp948898168-621) [n:127.0.0.1:47293_solr c:SearchRateTriggerTest-collection1 s:shard2 r:core_node7 x:SearchRateTriggerTest-collection1_shard2_replica_n4] o.a.s.s.IndexSchema Loaded schema minimal/1.1 with uniqueid field id
   [junit4]   2> 125996 INFO  (qtp948898168-621) [n:127.0.0.1:47293_solr c:SearchRateTriggerTest-collection1 s:shard2 r:core_node7 x:SearchRateTriggerTest-collection1_shard2_replica_n4] o.a.s.c.CoreContainer Creating SolrCore 'SearchRateTriggerTest-collection1_shard2_replica_n4' using configuration from collection SearchRateTriggerTest-collection1, trusted=true
   [junit4]   2> 125997 INFO  (qtp948898168-621) [n:127.0.0.1:47293_solr c:SearchRateTriggerTest-collection1 s:shard2 r:core_node7 x:SearchRateTriggerTest-collection1_shard2_replica_n4] o.a.s.m.r.SolrJmxReporter JMX monitoring for 'solr_47293.solr.core.SearchRateTriggerTest-collection1.shard2.replica_n4' (registry 'solr.core.SearchRateTriggerTest-collection1.shard2.replica_n4') enabled at server: com.sun.jmx.mbeanserver.JmxMBeanServer@3b9d3c18
   [junit4]   2> 125997 INFO  (qtp948898168-621) [n:127.0.0.1:47293_solr c:SearchRateTriggerTest-collection1 s:shard2 r:core_node7 x:SearchRateTriggerTest-collection1_shard2_replica_n4] o.a.s.c.SolrCore solr.RecoveryStrategy.Builder
   [junit4]   2> 125997 INFO  (qtp948898168-621) [n:127.0.0.1:47293_solr c:SearchRateTriggerTest-collection1 s:shard2 r:core_node7 x:SearchRateTriggerTest-collection1_shard2_replica_n4] o.a.s.c.SolrCore [[SearchRateTriggerTest-collection1_shard2_replica_n4] ] Opening new SolrCore at [/x1/jenkins/jenkins-slave/workspace/Lucene-Solr-Tests-7.x/solr/build/solr-core/test/J2/temp/solr.cloud.autoscaling.SearchRateTriggerTest_EA90E50E2A63D089-001/tempDir-001/node2/SearchRateTriggerTest-collection1_shard2_replica_n4], dataDir=[/x1/jenkins/jenkins-slave/workspace/Lucene-Solr-Tests-7.x/solr/build/solr-core/test/J2/temp/solr.cloud.autoscaling.SearchRateTriggerTest_EA90E50E2A63D089-001/tempDir-001/node2/./SearchRateTriggerTest-collection1_shard2_replica_n4/data/]
   [junit4]   2> 126178 INFO  (qtp1164797472-627) [n:127.0.0.1:34142_solr c:SearchRateTriggerTest-collection1 s:shard2 r:core_node8 x:SearchRateTriggerTest-collection1_shard2_replica_n6] o.a.s.s.IndexSchema [SearchRateTriggerTest-collection1_shard2_replica_n6] Schema name=minimal
   [junit4]   2> 126188 INFO  (qtp1164797472-627) [n:127.0.0.1:34142_solr c:SearchRateTriggerTest-collection1 s:shard2 r:core_node8 x:SearchRateTriggerTest-collection1_shard2_replica_n6] o.a.s.s.IndexSchema Loaded schema minimal/1.1 with uniqueid field id
   [junit4]   2> 126188 INFO  (qtp1164797472-627) [n:127.0.0.1:34142_solr c:SearchRateTriggerTest-collection1 s:shard2 r:core_node8 x:SearchRateTriggerTest-collection1_shard2_replica_n6] o.a.s.c.CoreContainer Creating SolrCore 'SearchRateTriggerTest-collection1_shard2_replica_n6' using configuration from collection SearchRateTriggerTest-collection1, trusted=true
   [junit4]   2> 126189 INFO  (qtp1164797472-627) [n:127.0.0.1:34142_solr c:SearchRateTriggerTest-collection1 s:shard2 r:core_node8 x:SearchRateTriggerTest-collection1_shard2_replica_n6] o.a.s.m.r.SolrJmxReporter JMX monitoring for 'solr_34142.solr.core.SearchRateTriggerTest-collection1.shard2.replica_n6' (registry 'solr.core.SearchRateTriggerTest-collection1.shard2.replica_n6') enabled at server: com.sun.jmx.mbeanserver.JmxMBeanServer@3b9d3c18
   [junit4]   2> 126189 INFO  (qtp1164797472-627) [n:127.0.0.1:34142_solr c:SearchRateTriggerTest-collection1 s:shard2 r:core_node8 x:SearchRateTriggerTest-collection1_shard2_replica_n6] o.a.s.c.SolrCore solr.RecoveryStrategy.Builder
   [junit4]   2> 126189 INFO  (qtp1164797472-627) [n:127.0.0.1:34142_solr c:SearchRateTriggerTest-collection1 s:shard2 r:core_node8 x:SearchRateTriggerTest-collection1_shard2_replica_n6] o.a.s.c.SolrCore [[SearchRateTriggerTest-collection1_shard2_replica_n6] ] Opening new SolrCore at [/x1/jenkins/jenkins-slave/workspace/Lucene-Solr-Tests-7.x/solr/build/solr-core/test/J2/temp/solr.cloud.autoscaling.SearchRateTriggerTest_EA90E50E2A63D089-001/tempDir-001/node4/SearchRateTriggerTest-collection1_shard2_replica_n6], dataDir=[/x1/jenkins/jenkins-slave/workspace/Lucene-Solr-Tests-7.x/solr/build/solr-core/test/J2/temp/solr.cloud.autoscaling.SearchRateTriggerTest_EA90E50E2A63D089-001/tempDir-001/node4/./SearchRateTriggerTest-collection1_shard2_replica_n6/data/]
   [junit4]   2> 126669 INFO  (qtp921154396-639) [n:127.0.0.1:43387_solr c:SearchRateTriggerTest-collection1 s:shard1 r:core_node5 x:SearchRateTriggerTest-collection1_shard1_replica_n2] o.a.s.u.UpdateHandler Using UpdateLog implementation: org.apache.solr.update.UpdateLog
   [junit4]   2> 126670 INFO  (qtp921154396-639) [n:127.0.0.1:43387_solr c:SearchRateTriggerTest-collection1 s:shard1 r:core_node5 x:SearchRateTriggerTest-collection1_shard1_replica_n2] o.a.s.u.UpdateLog Initializing UpdateLog: dataDir=null defaultSyncLevel=FLUSH numRecordsToKeep=100 maxNumLogsToKeep=10 numVersionBuckets=65536
   [junit4]   2> 126688 INFO  (qtp921154396-639) [n:127.0.0.1:43387_solr c:SearchRateTriggerTest-collection1 s:shard1 r:core_node5 x:SearchRateTriggerTest-collection1_shard1_replica_n2] o.a.s.u.CommitTracker Hard AutoCommit: disabled
   [junit4]   2> 126688 INFO  (qtp921154396-639) [n:127.0.0.1:43387_solr c:SearchRateTriggerTest-collection1 s:shard1 r:core_node5 x:SearchRateTriggerTest-collection1_shard1_replica_n2] o.a.s.u.CommitTracker Soft AutoCommit: disabled
   [junit4]   2> 126696 INFO  (qtp921154396-639) [n:127.0.0.1:43387_solr c:SearchRateTriggerTest-collection1 s:shard1 r:core_node5 x:SearchRateTriggerTest-collection1_shard1_replica_n2] o.a.s.s.SolrIndexSearcher Opening [Searcher@2a244e23[SearchRateTriggerTest-collection1_shard1_replica_n2] main]
   [junit4]   2> 126701 INFO  (qtp921154396-639) [n:127.0.0.1:43387_solr c:SearchRateTriggerTest-collection1 s:shard1 r:core_node5 x:SearchRateTriggerTest-collection1_shard1_replica_n2] o.a.s.r.ManagedResourceStorage Configured ZooKeeperStorageIO with znodeBase: /configs/conf
   [junit4]   2> 126702 INFO  (qtp921154396-639) [n:127.0.0.1:43387_solr c:SearchRateTriggerTest-collection1 s:shard1 r:core_node5 x:SearchRateTriggerTest-collection1_shard1_replica_n2] o.a.s.r.ManagedResourceStorage Loaded null at path _rest_managed.json using ZooKeeperStorageIO:path=/configs/conf
   [junit4]   2> 126703 INFO  (qtp921154396-639) [n:127.0.0.1:43387_solr c:SearchRateTriggerTest-collection1 s:shard1 r:core_node5 x:SearchRateTriggerTest-collection1_shard1_replica_n2] o.a.s.h.ReplicationHandler Commits will be reserved for 10000ms.
   [junit4]   2> 126712 INFO  (qtp141453425-610) [n:127.0.0.1:40409_solr c:SearchRateTriggerTest-collection1 s:shard1 r:core_node3 x:SearchRateTriggerTest-collection1_shard1_replica_n1] o.a.s.u.UpdateHandler Using UpdateLog implementation: org.apache.solr.update.UpdateLog
   [junit4]   2> 126712 INFO  (qtp141453425-610) [n:127.0.0.1:40409_solr c:SearchRateTriggerTest-collection1 s:shard1 r:core_node3 x:SearchRateTriggerTest-collection1_shard1_replica_n1] o.a.s.u.UpdateLog Initializing UpdateLog: dataDir=null defaultSyncLevel=FLUSH numRecordsToKeep=100 maxNumLogsToKeep=10 numVersionBuckets=65536
   [junit4]   2> 126714 INFO  (qtp141453425-610) [n:127.0.0.1:40409_solr c:SearchRateTriggerTest-collection1 s:shard1 r:core_node3 x:SearchRateTriggerTest-collection1_shard1_replica_n1] o.a.s.u.CommitTracker Hard AutoCommit: disabled
   [junit4]   2> 126715 INFO  (qtp141453425-610) [n:127.0.0.1:40409_solr c:SearchRateTriggerTest-collection1 s:shard1 r:core_node3 x:SearchRateTriggerTest-collection1_shard1_replica_n1] o.a.s.u.CommitTracker Soft AutoCommit: disabled
   [junit4]   2> 126726 INFO  (searcherExecutor-304-thread-1-processing-n:127.0.0.1:43387_solr x:SearchRateTriggerTest-collection1_shard1_replica_n2 c:SearchRateTriggerTest-collection1 s:shard1 r:core_node5) [n:127.0.0.1:43387_solr c:SearchRateTriggerTest-collection1 s:shard1 r:core_node5 x:SearchRateTriggerTest-collection1_shard1_replica_n2] o.a.s.c.SolrCore [SearchRateTriggerTest-collection1_shard1_replica_n2] Registered new searcher Searcher@2a244e23[SearchRateTriggerTest-collection1_shard1_replica_n2] main{ExitableDirectoryReader(UninvertingDirectoryReader())}
   [junit4]   2> 126726 INFO  (qtp921154396-639) [n:127.0.0.1:43387_solr c:SearchRateTriggerTest-collection1 s:shard1 r:core_node5 x:SearchRateTriggerTest-collection1_shard1_replica_n2] o.a.s.u.UpdateLog Could not find max version in index or recent updates, using new clock 1600627198363959296
   [junit4]   2> 126731 INFO  (qtp141453425-610) [n:127.0.0.1:40409_solr c:SearchRateTriggerTest-collection1 s:shard1 r:core_node3 x:SearchRateTriggerTest-collection1_shard1_replica_n1] o.a.s.s.SolrIndexSearcher Opening [Searcher@33ed50e5[SearchRateTriggerTest-collection1_shard1_replica_n1] main]
   [junit4]   2> 126735 INFO  (qtp141453425-610) [n:127.0.0.1:40409_solr c:SearchRateTriggerTest-collection1 s:shard1 r:core_node3 x:SearchRateTriggerTest-collection1_shard1_replica_n1] o.a.s.r.ManagedResourceStorage Configured ZooKeeperStorageIO with znodeBase: /configs/conf
   [junit4]   2> 126735 INFO  (qtp141453425-610) [n:127.0.0.1:40409_solr c:SearchRateTriggerTest-collection1 s:shard1 r:core_node3 x:SearchRateTriggerTest-collection1_shard1_replica_n1] o.a.s.r.ManagedResourceStorage Loaded null at path _rest_managed.json using ZooKeeperStorageIO:path=/configs/conf
   [junit4]   2> 126737 INFO  (qtp141453425-610) [n:127.0.0.1:40409_solr c:SearchRateTriggerTest-collection1 s:shard1 r:core_node3 x:SearchRateTriggerTest-collection1_shard1_replica_n1] o.a.s.h.ReplicationHandler Commits will be reserved for 10000ms.
   [junit4]   2> 126739 INFO  (qtp948898168-621) [n:127.0.0.1:47293_solr c:SearchRateTriggerTest-collection1 s:shard2 r:core_node7 x:SearchRateTriggerTest-collection1_shard2_replica_n4] o.a.s.u.UpdateHandler Using UpdateLog implementation: org.apache.solr.update.UpdateLog
   [junit4]   2> 126739 INFO  (qtp948898168-621) [n:127.0.0.1:47293_solr c:SearchRateTriggerTest-collection1 s:shard2 r:core_node7 x:SearchRateTriggerTest-collection1_shard2_replica_n4] o.a.s.u.UpdateLog Initializing UpdateLog: dataDir=null defaultSyncLevel=FLUSH numRecordsToKeep=100 maxNumLogsToKeep=10 numVersionBuckets=65536
   [junit4]   2> 126741 INFO  (qtp948898168-621) [n:127.0.0.1:47293_solr c:SearchRateTriggerTest-collection1 s:shard2 r:core_node7 x:SearchRateTriggerTest-collection1_shard2_replica_n4] o.a.s.u.CommitTracker Hard AutoCommit: disabled
   [junit4]   2> 126741 INFO  (qtp948898168-621) [n:127.0.0.1:47293_solr c:SearchRateTriggerTest-collection1 s:shard2 r:core_node7 x:SearchRateTriggerTest-collection1_shard2_replica_n4] o.a.s.u.CommitTracker Soft AutoCommit: disabled
   [junit4]   2> 126753 INFO  (qtp948898168-621) [n:127.0.0.1:47293_solr c:SearchRateTriggerTest-collection1 s:shard2 r:core_node7 x:SearchRateTriggerTest-collection1_shard2_replica_n4] o.a.s.s.SolrIndexSearcher Opening [Searcher@13baa91e[SearchRateTriggerTest-collection1_shard2_replica_n4] main]
   [junit4]   2> 126757 INFO  (searcherExecutor-305-thread-1-processing-n:127.0.0.1:40409_solr x:SearchRateTriggerTest-collection1_shard1_replica_n1 c:SearchRateTriggerTest-collection1 s:shard1 r:core_node3) [n:127.0.0.1:40409_solr c:SearchRateTriggerTest-collection1 s:shard1 r:core_node3 x:SearchRateTriggerTest-collection1_shard1_replica_n1] o.a.s.c.SolrCore [SearchRateTriggerTest-collection1_shard1_replica_n1] Registered new searcher Searcher@33ed50e5[SearchRateTriggerTest-collection1_shard1_replica_n1] main{ExitableDirectoryReader(UninvertingDirectoryReader())}
   [junit4]   2> 126758 INFO  (qtp141453425-610) [n:127.0.0.1:40409_solr c:SearchRateTriggerTest-collection1 s:shard1 r:core_node3 x:SearchRateTriggerTest-collection1_shard1_replica_n1] o.a.s.u.UpdateLog Could not find max version in index or recent updates, using new clock 1600627198397513728
   [junit4]   2> 126761 INFO  (qtp948898168-621) [n:127.0.0.1:47293_solr c:SearchRateTriggerTest-collection1 s:shard2 r:core_node7 x:SearchRateTriggerTest-collection1_shard2_replica_n4] o.a.s.r.ManagedResourceStorage Configured ZooKeeperStorageIO with znodeBase: /configs/conf
   [junit4]   2> 126762 INFO  (qtp948898168-621) [n:127.0.0.1:47293_solr c:SearchRateTriggerTest-collection1 s:shard2 r:core_node7 x:SearchRateTriggerTest-collection1_shard2_replica_n4] o.a.s.r.ManagedResourceStorage Loaded null at path _rest_managed.json using ZooKeeperStorageIO:path=/configs/conf
   [junit4]   2> 126772 INFO  (qtp948898168-621) [n:127.0.0.1:47293_solr c:SearchRateTriggerTest-collection1 s:shard2 r:core_node7 x:SearchRateTriggerTest-collection1_shard2_replica_n4] o.a.s.h.ReplicationHandler Commits will be reserved for 10000ms.
   [junit4]   2> 126809 INFO  (searcherExecutor-306-thread-1-processing-n:127.0.0.1:47293_solr x:SearchRateTriggerTest-collection1_shard2_replica_n4 c:SearchRateTriggerTest-collection1 s:shard2 r:core_node7) [n:127.0.0.1:47293_solr c:SearchRateTriggerTest-collection1 s:shard2 r:core_node7 x:SearchRateTriggerTest-collection1_shard2_replica_n4] o.a.s.c.SolrCore [SearchRateTriggerTest-collection1_shard2_replica_n4] Registered new searcher Searcher@13baa91e[SearchRateTriggerTest-collection1_shard2_replica_n4] main{ExitableDirectoryReader(UninvertingDirectoryReader())}
   [junit4]   2> 126809 INFO  (qtp948898168-621) [n:127.0.0.1:47293_solr c:SearchRateTriggerTest-collection1 s:shard2 r:core_node7 x:SearchRateTriggerTest-collection1_shard2_replica_n4] o.a.s.u.UpdateLog Could not find max version in index or recent updates, using new clock 1600627198450991104
   [junit4]   2> 126817 INFO  (qtp1164797472-627) [n:127.0.0.1:34142_solr c:SearchRateTriggerTest-collection1 s:shard2 r:core_node8 x:SearchRateTriggerTest-collection1_shard2_replica_n6] o.a.s.u.UpdateHandler Using UpdateLog implementation: org.apache.solr.update.UpdateLog
   [junit4]   2> 126817 INFO  (qtp1164797472-627) [n:127.0.0.1:34142_solr c:SearchRateTriggerTest-collection1 s:shard2 r:core_node8 x:SearchRateTriggerTest-collection1_shard2_replica_n6] o.a.s.u.UpdateLog Initializing UpdateLog: dataDir=null defaultSyncLevel=FLUSH numRecordsToKeep=100 maxNumLogsToKeep=10 numVersionBuckets=65536
   [junit4]   2> 126823 INFO  (qtp141453425-610) [n:127.0.0.1:40409_solr c:SearchRateTriggerTest-collection1 s:shard1 r:core_node3 x:SearchRateTriggerTest-collection1_shard1_replica_n1] o.a.s.c.ZkShardTerms Successful update of terms at /collections/SearchRateTriggerTest-collection1/terms/shard1 to Terms{values={core_node3=0}, version=0}
   [junit4]   2> 126831 INFO  (qtp921154396-639) [n:127.0.0.1:43387_solr c:SearchRateTriggerTest-collection1 s:shard1 r:core_node5 x:SearchRateTriggerTest-collection1_shard1_replica_n2] o.a.s.c.ZkShardTerms Failed to save terms, version is not a match, retrying
   [junit4]   2> 126832 INFO  (qtp1164797472-627) [n:127.0.0.1:34142_solr c:SearchRateTriggerTest-collection1 s:shard2 r:core_node8 x:SearchRateTriggerTest-collection1_shard2_replica_n6] o.a.s.u.CommitTracker Hard AutoCommit: disabled
   [junit4]   2> 126832 INFO  (qtp1164797472-627) [n:127.0.0.1:34142_solr c:SearchRateTriggerTest-collection1 s:shard2 r:core_node8 x:SearchRateTriggerTest-collection1_shard2_replica_n6] o.a.s.u.CommitTracker Soft AutoCommit: disabled
   [junit4]   2> 126834 INFO  (qtp921154396-639) [n:127.0.0.1:43387_solr c:SearchRateTriggerTest-collection1 s:shard1 r:core_node5 x:SearchRateTriggerTest-collection1_shard1_replica_n2] o.a.s.c.ZkShardTerms Successful update of terms at /collections/SearchRateTriggerTest-collection1/terms/shard1 to Terms{values={core_node3=0, core_node5=0}, version=1}
   [junit4]   2> 126834 INFO  (qtp948898168-621) [n:127.0.0.1:47293_solr c:SearchRateTriggerTest-collection1 s:shard2 r:core_node7 x:SearchRateTriggerTest-collection1_shard2_replica_n4] o.a.s.c.ZkShardTerms Successful update of terms at /collections/SearchRateTriggerTest-collection1/terms/shard2 to Terms{values={core_node7=0}, version=0}
   [junit4]   2> 126841 INFO  (qtp1164797472-627) [n:127.0.0.1:34142_solr c:SearchRateTriggerTest-collection1 s:shard2 r:core_node8 x:SearchRateTriggerTest-collection1_shard2_replica_n6] o.a.s.s.SolrIndexSearcher Opening [Searcher@65d09ffc[SearchRateTriggerTest-collection1_shard2_replica_n6] main]
   [junit4]   2> 126852 INFO  (qtp1164797472-627) [n:127.0.0.1:34142_solr c:SearchRateTriggerTest-collection1 s:shard2 r:core_node8 x:SearchRateTriggerTest-collection1_shard2_replica_n6] o.a.s.r.ManagedResourceStorage Configured ZooKeeperStorageIO with znodeBase: /configs/conf
   [junit4]   2> 126853 INFO  (qtp141453425-610) [n:127.0.0.1:40409_solr c:SearchRateTriggerTest-collection1 s:shard1 r:core_node3 x:SearchRateTriggerTest-collection1_shard1_replica_n1] o.a.s.c.ShardLeaderElectionContext Enough replicas found to continue.
   [junit4]   2> 126853 INFO  (qtp141453425-610) [n:127.0.0.1:40409_solr c:SearchRateTriggerTest-collection1 s:shard1 r:core_node3 x:SearchRateTriggerTest-collection1_shard1_replica_n1] o.a.s.c.ShardLeaderElectionContext I may be the new leader - try and sync
   [junit4]   2> 126854 INFO  (qtp141453425-610) [n:127.0.0.1:40409_solr c:SearchRateTriggerTest-collection1 s:shard1 r:core_node3 x:SearchRateTriggerTest-collection1_shard1_replica_n1] o.a.s.c.SyncStrategy Sync replicas to http://127.0.0.1:40409/solr/SearchRateTriggerTest-collection1_shard1_replica_n1/
   [junit4]   2> 126856 INFO  (qtp1164797472-627) [n:127.0.0.1:34142_solr c:SearchRateTriggerTest-collection1 s:shard2 r:core_node8 x:SearchRateTriggerTest-collection1_shard2_replica_n6] o.a.s.r.ManagedResourceStorage Loaded null at path _rest_managed.json using ZooKeeperStorageIO:path=/configs/conf
   [junit4]   2> 126857 INFO  (qtp1164797472-627) [n:127.0.0.1:34142_solr c:SearchRateTriggerTest-collection1 s:shard2 r:core_node8 x:SearchRateTriggerTest-collection1_shard2_replica_n6] o.a.s.h.ReplicationHandler Commits will be reserved for 10000ms.
   [junit4]   2> 126866 INFO  (searcherExecutor-307-thread-1-processing-n:127.0.0.1:34142_solr x:SearchRateTriggerTest-collection1_shard2_replica_n6 c:SearchRateTriggerTest-collection1 s:shard2 r:core_node8) [n:127.0.0.1:34142_solr c:SearchRateTriggerTest-collection1 s:shard2 r:core_node8 x:SearchRateTriggerTest-collection1_shard2_replica_n6] o.a.s.c.SolrCore [SearchRateTriggerTest-collection1_shard2_replica_n6] Registered new searcher Searcher@65d09ffc[SearchRateTriggerTest-collection1_shard2_replica_n6] main{ExitableDirectoryReader(UninvertingDirectoryReader())}
   [junit4]   2> 126866 INFO  (qtp1164797472-627) [n:127.0.0.1:34142_solr c:SearchRateTriggerTest-collection1 s:shard2 r:core_node8 x:SearchRateTriggerTest-collection1_shard2_replica_n6] o.a.s.u.UpdateLog Could not find max version in index or recent updates, using new clock 1600627198510759936
   [junit4]   2> 126868 INFO  (qtp141453425-610) [n:127.0.0.1:40409_solr c:SearchRateTriggerTest-collection1 s:shard1 r:core_node3 x:SearchRateTriggerTest-collection1_shard1_replica_n1] o.a.s.u.PeerSync PeerSync: core=SearchRateTriggerTest-collection1_shard1_replica_n1 url=http://127.0.0.1:40409/solr START replicas=[http://127.0.0.1:43387/solr/SearchRateTriggerTest-collection1_shard1_replica_n2/] nUpdates=100
   [junit4]   2> 126876 INFO  (qtp948898168-621) [n:127.0.0.1:47293_solr c:SearchRateTriggerTest-collection1 s:shard2 r:core_node7 x:SearchRateTriggerTest-collection1_shard2_replica_n4] o.a.s.c.ShardLeaderElectionContext Waiting until we see more replicas up for shard shard2: total=2 found=1 timeoutin=9998ms
   [junit4]   2> 126880 INFO  (qtp1164797472-627) [n:127.0.0.1:34142_solr c:SearchRateTriggerTest-collection1 s:shard2 r:core_node8 x:SearchRateTriggerTest-collection1_shard2_replica_n6] o.a.s.c.ZkShardTerms Successful update of terms at /collections/SearchRateTriggerTest-collection1/terms/shard2 to Terms{values={core_node7=0, core_node8=0}, version=1}
   [junit4]   2> 126918 INFO  (qtp921154396-614) [n:127.0.0.1:43387_solr c:SearchRateTriggerTest-collection1 s:shard1 r:core_node5 x:SearchRateTriggerTest-collection1_shard1_replica_n2] o.a.s.c.S.Request [SearchRateTriggerTest-collection1_shard1_replica_n2]  webapp=/solr path=/get params={distrib=false&qt=/get&fingerprint=false&getVersions=100&wt=javabin&version=2} status=0 QTime=32
   [junit4]   2> 127175 INFO  (qtp141453425-610) [n:127.0.0.1:40409_solr c:SearchRateTriggerTest-collection1 s:shard1 r:core_node3 x:SearchRateTriggerTest-collection1_shard1_replica_n1] o.a.s.u.PeerSync PeerSync: core=SearchRateTriggerTest-collection1_shard1_replica_n1 url=http://127.0.0.1:40409/solr DONE.  We have no versions.  sync failed.
   [junit4]   2> 127176 INFO  (qtp141453425-610) [n:127.0.0.1:40409_solr c:SearchRateTriggerTest-collection1 s:shard1 r:core_node3 x:SearchRateTriggerTest-collection1_shard1_replica_n1] o.a.s.c.SyncStrategy Leader's attempt to sync with shard failed, moving to the next candidate
   [junit4]   2> 127176 INFO  (qtp141453425-610) [n:127.0.0.1:40409_solr c:SearchRateTriggerTest-collection1 s:shard1 r:core_node3 x:SearchRateTriggerTest-collection1_shard1_replica_n1] o.a.s.c.ShardLeaderElectionContext We failed sync, but we have no versions - we can't sync in that case - we were active before, so become leader anyway
   [junit4]   2> 127176 INFO  (qtp141453425-610) [n:127.0.0.1:40409_solr c:SearchRateTriggerTest-collection1 s:shard1 r:core_node3 x:SearchRateTriggerTest-collection1_shard1_replica_n1] o.a.s.c.ShardLeaderElectionContext Found all replicas participating in election, clear LIR
   [junit4]   2> 127198 INFO  (qtp141453425-610) [n:127.0.0.1:40409_solr c:SearchRateTriggerTest-collection1 s:shard1 r:core_node3 x:SearchRateTriggerTest-collection1_shard1_replica_n1] o.a.s.c.ShardLeaderElectionContext I am the new leader: http://127.0.0.1:40409/solr/SearchRateTriggerTest-collection1_shard1_replica_n1/ shard1
   [junit4]   2> 127352 INFO  (qtp141453425-610) [n:127.0.0.1:40409_solr c:SearchRateTriggerTest-collection1 s:shard1 r:core_node3 x:SearchRateTriggerTest-collection1_shard1_replica_n1] o.a.s.c.ZkController I am the leader, no recovery necessary
   [junit4]   2> 127371 INFO  (qtp141453425-610) [n:127.0.0.1:40409_solr c:SearchRateTriggerTest-collection1 s:shard1 r:core_node3 x:SearchRateTriggerTest-collection1_shard1_replica_n1] o.a.s.s.HttpSolrCall [admin] webapp=null path=/admin/cores params={qt=/admin/cores&coreNodeName=core_node3&collection.configName=conf&newCollection=true&name=SearchRateTriggerTest-collection1_shard1_replica_n1&action=CREATE&numShards=2&collection=SearchRateTriggerTest-collection1&shard=shard1&wt=javabin&version=2&replicaType=NRT} status=0 QTime=2666
   [junit4]   2> 127378 INFO  (qtp948898168-621) [n:127.0.0.1:47293_solr c:SearchRateTriggerTest-collection1 s:shard2 r:core_node7 x:SearchRateTriggerTest-collection1_shard2_replica_n4] o.a.s.c.ShardLeaderElectionContext Enough replicas found to continue.
   [junit4]   2> 127378 INFO  (qtp948898168-621) [n:127.0.0.1:47293_solr c:SearchRateTriggerTest-collection1 s:shard2 r:core_node7 x:SearchRateTriggerTest-collection1_shard2_replica_n4] o.a.s.c.ShardLeaderElectionContext I may be the new leader - try and sync
   [junit4]   2> 127378 INFO  (qtp948898168-621) [n:127.0.0.1:47293_solr c:SearchRateTriggerTest-collection1 s:shard2 r:core_node7 x:SearchRateTriggerTest-collection1_shard2_replica_n4] o.a.s.c.SyncStrategy Sync replicas to http://127.0.0.1:47293/solr/SearchRateTriggerTest-collection1_shard2_replica_n4/
   [junit4]   2> 127379 INFO  (qtp948898168-621) [n:127.0.0.1:47293_solr c:SearchRateTriggerTest-collection1 s:shard2 r:core_node7 x:SearchRateTriggerTest-collection1_shard2_replica_n4] o.a.s.u.PeerSync PeerSync: core=SearchRateTriggerTest-collection1_shard2_replica_n4 url=http://127.0.0.1:47293/solr START replicas=[http://127.0.0.1:34142/solr/SearchRateTriggerTest-collection1_shard2_replica_n6/] nUpdates=100
   [junit4]   2> 127391 INFO  (qtp1164797472-628) [n:127.0.0.1:34142_solr c:SearchRateTriggerTest-collection1 s:shard2 r:core_node8 x:SearchRateTriggerTest-collection1_shard2_replica_n6] o.a.s.c.S.Request [SearchRateTriggerTest-collection1_shard2_replica_n6]  webapp=/solr path=/get params={distrib=false&qt=/get&fingerprint=false&getVersions=100&wt=javabin&version=2} status=0 QTime=2
   [junit4]   2> 127458 INFO  (zkCallback-165-thread-1) [    ] o.a.s.c.c.ZkStateReader A cluster state change: [WatchedEvent state:SyncConnected type:NodeDataChanged path:/collections/SearchRateTriggerTest-collection1/state.json] for collection [SearchRateTriggerTest-collection1] has occurred - updating... (live nodes size: [4])
   [junit4]   2> 127679 INFO  (qtp948898168-621) [n:127.0.0.1:47293_solr c:SearchRateTriggerTest-collection1 s:shard2 r:core_node7 x:SearchRateTriggerTest-collection1_shard2_replica_n4] o.a.s.u.PeerSync PeerSync: core=SearchRateTriggerTest-collection1_shard2_replica_n4 url=http://127.0.0.1:47293/solr DONE.  We have no versions.  sync failed.
   [junit4]   2> 127680 INFO  (qtp948898168-621) [n:127.0.0.1:47293_solr c:SearchRateTriggerTest-collection1 s:shard2 r:core_node7 x:SearchRateTriggerTest-collection1_shard2_replica_n4] o.a.s.c.SyncStrategy Leader's attempt to sync with shard failed, moving to the next candidate
   [junit4]   2> 127680 INFO  (qtp948898168-621) [n:127.0.0.1:47293_solr c:SearchRateTriggerTest-collection1 s:shard2 r:core_node7 x:SearchRateTriggerTest-collection1_shard2_replica_n4] o.a.s.c.ShardLeaderElectionContext We failed sync, but we have no versions - we can't sync in that case - we were active before, so become leader anyway
   [junit4]   2> 127680 INFO  (qtp948898168-621) [n:127.0.0.1:47293_solr c:SearchRateTriggerTest-collection1 s:shard2 r:core_node7 x:SearchRateTriggerTest-collection1_shard2_replica_n4] o.a.s.c.ShardLeaderElectionContext Found all replicas participating in election, clear LIR
   [junit4]   2> 127692 INFO  (qtp948898168-621) [n:127.0.0.1:47293_solr c:SearchRateTriggerTest-collection1 s:shard2 r:core_node7 x:SearchRateTriggerTest-collection1_shard2_replica_n4] o.a.s.c.ShardLeaderElectionContext I am the new leader: http://127.0.0.1:47293/solr/SearchRateTriggerTest-collection1_shard2_replica_n4/ shard2
   [junit4]   2> 127795 INFO  (zkCallback-165-thread-1) [    ] o.a.s.c.c.ZkStateReader A cluster state change: [WatchedEvent state:SyncConnected type:NodeDataChanged path:/collections/SearchRateTriggerTest-collection1/state.json] for collection [SearchRateTriggerTest-collection1] has occurred - updating... (live nodes size: [4])
   [junit4]   2> 127798 INFO  (qtp948898168-621) [n:127.0.0.1:47293_solr c:SearchRateTriggerTest-collection1 s:shard2 r:core_node7 x:SearchRateTriggerTest-collection1_shard2_replica_n4] o.a.s.c.ZkController I am the leader, no recovery necessary
   [junit4]   2> 127802 INFO  (qtp948898168-621) [n:127.0.0.1:47293_solr c:SearchRateTriggerTest-collection1 s:shard2 r:core_node7 x:SearchRateTriggerTest-collection1_shard2_replica_n4] o.a.s.s.HttpSolrCall [admin] webapp=null path=/admin/cores params={qt=/admin/cores&coreNodeName=core_node7&collection.configName=conf&newCollection=true&name=SearchRateTriggerTest-collection1_shard2_replica_n4&action=CREATE&numShards=2&collection=SearchRateTriggerTest-collection1&shard=shard2&wt=javabin&version=2&replicaType=NRT} status=0 QTime=2997
   [junit4]   2> 127867 INFO  (qtp921154396-639) [n:127.0.0.1:43387_solr c:SearchRateTriggerTest-collection1 s:shard1 r:core_node5 x:SearchRateTriggerTest-collection1_shard1_replica_n2] o.a.s.s.HttpSolrCall [admin] webapp=null path=/admin/cores params={qt=/admin/cores&coreNodeName=core_node5&collection.configName=conf&newCollection=true&name=SearchRateTriggerTest-collection1_shard1_replica_n2&action=CREATE&numShards=2&collection=SearchRateTriggerTest-collection1&shard=shard1&wt=javabin&version=2&replicaType=NRT} status=0 QTime=3117
   [junit4]   2> 127897 INFO  (qtp1164797472-627) [n:127.0.0.1:34142_solr c:SearchRateTriggerTest-collection1 s:shard2 r:core_node8 x:SearchRateTriggerTest-collection1_shard2_replica_n6] o.a.s.s.HttpSolrCall [admin] webapp=null path=/admin/cores params={qt=/admin/cores&coreNodeName=core_node8&collection.configName=conf&newCollection=true&name=SearchRateTriggerTest-collection1_shard2_replica_n6&action=CREATE&numShards=2&collection=SearchRateTriggerTest-collection1&shard=shard2&wt=javabin&version=2&replicaType=NRT} status=0 QTime=3111
   [junit4]   2> 127941 INFO  (qtp1164797472-634) [n:127.0.0.1:34142_solr    ] o.a.s.h.a.CollectionsHandler Wait for new collection to be active for at most 30 seconds. Check all shard replicas
   [junit4]   2> 127943 INFO  (OverseerCollectionConfigSetProcessor-73809301804875787-127.0.0.1:47293_solr-n_0000000000) [    ] o.a.s.c.OverseerTaskQueue Response ZK path: /overseer/collection-queue-work/qnr-0000000000 doesn't exist.  Requestor may have disconnected from ZooKeeper
   [junit4]   2> 128000 INFO  (zkCallback-165-thread-1) [    ] o.a.s.c.c.ZkStateReader A cluster state change: [WatchedEvent state:SyncConnected type:NodeDataChanged path:/collections/SearchRateTriggerTest-collection1/state.json] for collection [SearchRateTriggerTest-collection1] has occurred - updating... (live nodes size: [4])
   [junit4]   2> 128001 INFO  (zkCallback-174-thread-1) [    ] o.a.s.c.c.ZkStateReader A cluster state change: [WatchedEvent state:SyncConnected type:NodeDataChanged path:/collections/SearchRateTriggerTest-collection1/state.json] for collection [SearchRateTriggerTest-collection1] has occurred - updating... (live nodes size: [4])
   [junit4]   2> 128001 INFO  (zkCallback-167-thread-2) [    ] o.a.s.c.c.ZkStateReader A cluster state change: [WatchedEvent state:SyncConnected type:NodeDataChanged path:/collections/SearchRateTriggerTest-collection1/state.json] for collection [SearchRateTriggerTest-collection1] has occurred - updating... (live nodes size: [4])
   [junit4]   2> 128002 INFO  (zkCallback-172-thread-2) [    ] o.a.s.c.c.ZkStateReader A cluster state change: [WatchedEvent state:SyncConnected type:NodeDataChanged path:/collections/SearchRateTriggerTest-collection1/state.json] for collection [SearchRateTriggerTest-collection1] has occurred - updating... (live nodes size: [4])
   [junit4]   2> 128942 INFO  (qtp1164797472-634) [n:127.0.0.1:34142_solr    ] o.a.s.s.HttpSolrCall [admin] webapp=null path=/admin/collections params={replicationFactor=2&collection.configName=conf&maxShardsPerNode=1&name=SearchRateTriggerTest-collection1&nrtReplicas=2&action=CREATE&numShards=2&wt=javabin&version=2} status=0 QTime=4705
   [junit4]   2> 128945 INFO  (qtp1164797472-631) [n:127.0.0.1:34142_solr    ] o.a.s.h.a.CollectionsHandler Invoked Collection Action :create with params replicationFactor=2&collection.configName=conf&maxShardsPerNode=1&name=SearchRateTriggerTest-collection2&nrtReplicas=2&action=CREATE&numShards=2&wt=javabin&version=2 and sendToOCPQueue=true
   [junit4]   2> 128967 INFO  (OverseerThreadFactory-295-thread-2) [    ] o.a.s.c.a.c.CreateCollectionCmd Create collection SearchRateTriggerTest-collection2
   [junit4]   2> 129188 INFO  (OverseerStateUpdate-73809301804875787-127.0.0.1:47293_solr-n_0000000000) [    ] o.a.s.c.o.SliceMutator createReplica() {
   [junit4]   2>   "operation":"ADDREPLICA",
   [junit4]   2>   "collection":"SearchRateTriggerTest-collection2",
   [junit4]   2>   "shard":"shard1",
   [junit4]   2>   "core":"SearchRateTriggerTest-collection2_shard1_replica_n1",
   [junit4]   2>   "state":"down",
   [junit4]   2>   "base_url":"http://127.0.0.1:34142/solr",
   [junit4]   2>   "type":"NRT",
   [junit4]   2>   "waitForFinalState":"false"} 
   [junit4]   2> 129193 INFO  (OverseerStateUpdate-73809301804875787-127.0.0.1:47293_solr-n_0000000000) [    ] o.a.s.c.o.SliceMutator createReplica() {
   [junit4]   2>   "operation":"ADDREPLICA",
   [junit4]   2>   "collection":"SearchRateTriggerTest-collection2",
   [junit4]   2>   "shard":"shard1",
   [junit4]   2>   "core":"SearchRateTriggerTest-collection2_shard1_replica_n3",
   [junit4]   2>   "state":"down",
   [junit4]   2>   "base_url":"http://127.0.0.1:43387/solr",
   [junit4]   2>   "type":"NRT",
   [junit4]   2>   "waitForFinalState":"false"} 
   [junit4]   2> 129198 INFO  (OverseerStateUpdate-73809301804875787-127.0.0.1:47293_solr-n_0000000000) [    ] o.a.s.c.o.SliceMutator createReplica() {
   [junit4]   2>   "operation":"ADDREPLICA",
   [junit4]   2>   "collection":"SearchRateTriggerTest-collection2",
   [junit4]   2>   "shard":"shard2",
   [junit4]   2>   "core":"SearchRateTriggerTest-collection2_shard2_replica_n5",
   [junit4]   2>   "state":"down",
   [junit4]   2>   "base_url":"http://127.0.0.1:40409/solr",
   [junit4]   2>   "type":"NRT",
   [junit4]   2>   "waitForFinalState":"false"} 
   [junit4]   2> 129204 INFO  (OverseerStateUpdate-73809301804875787-127.0.0.1:47293_solr-n_0000000000) [    ] o.a.s.c.o.SliceMutator createReplica() {
   [junit4]   2>   "operation":"ADDREPLICA",
   [junit4]   2>   "collection":"SearchRateTriggerTest-collection2",
   [junit4]   2>   "shard":"shard2",
   [junit4]   2>   "core":"SearchRateTriggerTest-collection2_shard2_replica_n7",
   [junit4]   2>   "state":"down",
   [junit4]   2>   "base_url":"http://127.0.0.1:47293/solr",
   [junit4]   2>   "type":"NRT",
   [junit4]   2>   "waitForFinalState":"false"} 
   [junit4]   2> 129537 INFO  (qtp921154396-615) [n:127.0.0.1:43387_solr    x:SearchRateTriggerTest-collection2_shard1_replica_n3] o.a.s.h.a.CoreAdminOperation core create command qt=/admin/cores&coreNodeName=core_node4&collection.configName=conf&newCollection=true&name=SearchRateTriggerTest-collection2_shard1_replica_n3&action=CREATE&numShards=2&collection=SearchRateTriggerTest-collection2&shard=shard1&wt=javabin&version=2&replicaType=NRT
   [junit4]   2> 129539 INFO  (qtp141453425-606) [n:127.0.0.1:40409_solr    x:SearchRateTriggerTest-collection2_shard2_replica_n5] o.a.s.h.a.CoreAdminOperation core create command qt=/admin/cores&coreNodeName=core_node6&collection.configName=conf&newCollection=true&name=SearchRateTriggerTest-collection2_shard2_replica_n5&action=CREATE&numShards=2&collection=SearchRateTriggerTest-collection2&shard=shard2&wt=javabin&version=2&replicaType=NRT
   [junit4]   2> 129545 INFO  (qtp1164797472-632) [n:127.0.0.1:34142_solr    x:SearchRateTriggerTest-collection2_shard1_replica_n1] o.a.s.h.a.CoreAdminOperation core create command qt=/admin/cores&coreNodeName=core_node2&collection.configName=conf&newCollection=true&name=SearchRateTriggerTest-collection2_shard1_replica_n1&action=CREATE&numShards=2&collection=SearchRateTriggerTest-collection2&shard=shard1&wt=javabin&version=2&replicaType=NRT
   [junit4]   2> 129551 INFO  (qtp948898168-617) [n:127.0.0.1:47293_solr    x:SearchRateTriggerTest-collection2_shard2_replica_n7] o.a.s.h.a.CoreAdminOperation core create command qt=/admin/cores&coreNodeName=core_node8&collection.configName=conf&newCollection=true&name=SearchRateTriggerTest-collection2_shard2_replica_n7&action=CREATE&numShards=2&collection=SearchRateTriggerTest-collection2&shard=shard2&wt=javabin&version=2&replicaType=NRT
   [junit4]   2> 130661 INFO  (qtp948898168-617) [n:127.0.0.1:47293_solr c:SearchRateTriggerTest-collection2 s:shard2 r:core_node8 x:SearchRateTriggerTest-collection2_shard2_replica_n7] o.a.s.c.SolrConfig Using Lucene MatchVersion: 7.4.0
   [junit4]   2> 130670 INFO  (qtp1164797472-632) [n:127.0.0.1:34142_solr c:SearchRateTriggerTest-collection2 s:shard1 r:core_node2 x:SearchRateTriggerTest-collection2_shard1_replica_n1] o.a.s.c.SolrConfig Using Lucene MatchVersion: 7.4.0
   [junit4]   2> 130674 INFO  (qtp921154396-615) [n:127.0.0.1:43387_solr c:SearchRateTriggerTest-collection2 s:shard1 r:core_node4 x:SearchRateTriggerTest-collection2_shard1_replica_n3] o.a.s.c.SolrConfig Using Lucene MatchVersion: 7.4.0
   [junit4]   2> 130679 INFO  (qtp141453425-606) [n:127.0.0.1:40409_solr c:SearchRateTriggerTest-collection2 s:shard2 r:core_node6 x:SearchRateTriggerTest-collection2_shard2_replica_n5] o.a.s.c.SolrConfig Using Lucene MatchVersion: 7.4.0
   [junit4]   2> 130705 INFO  (qtp141453425-606) [n:127.0.0.1:40409_solr c:SearchRateTriggerTest-collection2 s:shard2 r:core_node6 x:SearchRateTriggerTest-collection2_shard2_replica_n5] o.a.s.s.IndexSchema [SearchRateTriggerTest-collection2_shard2_replica_n5] Schema name=minimal
   [junit4]   2> 130760 INFO  (qtp141453425-606) [n:127.0.0.1:40409_solr c:SearchRateTriggerTest-collection2 s:shard2 r:core_node6 x:SearchRateTriggerTest-collection2_shard2_replica_n5] o.a.s.s.IndexSchema Loaded schema minimal/1.1 with uniqueid field id
   [junit4]   2> 130761 INFO  (qtp141453425-606) [n:127.0.0.1:40409_solr c:SearchRateTriggerTest-collection2 s:shard2 r:core_node6 x:SearchRateTriggerTest-collection2_shard2_replica_n5] o.a.s.c.CoreContainer Creating SolrCore 'SearchRateTriggerTest-collection2_shard2_replica_n5' using configuration from collection SearchRateTriggerTest-collection2, trusted=true
   [junit4]   2> 130761 INFO  (qtp141453425-606) [n:127.0.0.1:40409_solr c:SearchRateTriggerTest-collection2 s:shard2 r:core_node6 x:SearchRateTriggerTest-collection2_shard2_replica_n5] o.a.s.m.r.SolrJmxReporter JMX monitoring for 'solr_40409.solr.core.SearchRateTriggerTest-collection2.shard2.replica_n5' (registry 'solr.core.SearchRateTriggerTest-collection2.shard2.replica_n5') enabled at server: com.sun.jmx.mbeanserver.JmxMBeanServer@3b9d3c18
   [junit4]   2> 130762 INFO  (qtp141453425-606) [n:127.0.0.1:40409_solr c:SearchRateTriggerTest-collection2 s:shard2 r:core_node6 x:SearchRateTriggerTest-collection2_shard2_replica_n5] o.a.s.c.SolrCore solr.RecoveryStrategy.Builder
   [junit4]   2> 130762 INFO  (qtp141453425-606) [n:127.0.0.1:40409_solr c:SearchRateTriggerTest-collection2 s:shard2 r:core_node6 x:SearchRateTriggerTest-collection2_shard2_replica_n5] o.a.s.c.SolrCore [[SearchRateTriggerTest-collection2_shard2_replica_n5] ] Opening new SolrCore at [/x1/jenkins/jenkins-slave/workspace/Lucene-Solr-Tests-7.x/solr/build/solr-core/test/J2/temp/solr.cloud.autoscaling.SearchRateTriggerTest_EA90E50E2A63D089-001/tempDir-001/node1/SearchRateTriggerTest-collection2_shard2_replica_n5], dataDir=[/x1/jenkins/jenkins-slave/workspace/Lucene-Solr-Tests-7.x/solr/build/solr-core/test/J2/temp/solr.cloud.autoscaling.SearchRateTriggerTest_EA90E50E2A63D089-001/tempDir-001/node1/./SearchRateTriggerTest-collection2_shard2_replica_n5/data/]
   [junit4]   2> 130771 INFO  (qtp1164797472-632) [n:127.0.0.1:34142_solr c:SearchRateTriggerTest-collection2 s:shard1 r:core_node2 x:SearchRateTriggerTest-collection2_shard1_replica_n1] o.a.s.s.IndexSchema [SearchRateTriggerTest-collection2_shard1_replica_n1] Schema name=minimal
   [junit4]   2> 130782 INFO  (qtp948898168-617) [n:127.0.0.1:47293_solr c:SearchRateTriggerTest-collection2 s:shard2 r:core_node8 x:SearchRateTriggerTest-collection2_shard2_replica_n7] o.a.s.s.IndexSchema [SearchRateTriggerTest-collection2_shard2_replica_n7] Schema name=minimal
   [junit4]   2> 130784 INFO  (qtp921154396-615) [n:127.0.0.1:43387_solr c:SearchRateTriggerTest-collection2 s:shard1 r:core_node4 x:SearchRateTriggerTest-collection2_shard1_replica_n3] o.a.s.s.IndexSchema [SearchRateTriggerTest-collection2_shard1_replica_n3] Schema name=minimal
   [junit4]   2> 130787 INFO  (qtp921154396-615) [n:127.0.0.1:43387_solr c:SearchRateTriggerTest-collection2 s:shard1 r:core_node4 x:SearchRateTriggerTest-collection2_shard1_replica_n3] o.a.s.s.IndexSchema Loaded schema minimal/1.1 with uniqueid field id
   [junit4]   2> 130788 INFO  (qtp921154396-615) [n:127.0.0.1:43387_solr c:SearchRateTriggerTest-collection2 s:shard1 r:core_node4 x:SearchRateTriggerTest-collection2_shard1_replica_n3] o.a.s.c.CoreContainer Creating SolrCore 'SearchRateTriggerTest-collection2_shard1_replica_n3' using configuration from collection SearchRateTriggerTest-collection2, trusted=true
   [junit4]   2> 130790 INFO  (qtp1164797472-632) [n:127.0.0.1:34142_solr c:SearchRateTriggerTest-collection2 s:shard1 r:core_node2 x:SearchRateTriggerTest-collection2_shard1_replica_n1] o.a.s.s.IndexSchema Loaded schema minimal/1.1 with uniqueid field id
   [junit4]   2> 130790 INFO  (qtp1164797472-632) [n:127.0.0.1:34142_solr c:SearchRateTriggerTest-collection2 s:shard1 r:core_node2 x:SearchRateTriggerTest-collection2_shard1_replica_n1] o.a.s.c.CoreContainer Creating SolrCore 'SearchRateTriggerTest-collection2_shard1_replica_n1' using configuration from collection SearchRateTriggerTest-collection2, trusted=true
   [junit4]   2> 130791 INFO  (qtp1164797472-632) [n:127.0.0.1:34142_solr c:SearchRateTriggerTest-collection2 s:shard1 r:core_node2 x:SearchRateTriggerTest-collection2_shard1_replica_n1] o.a.s.m.r.SolrJmxReporter JMX monitoring for 'solr_34142.solr.core.SearchRateTriggerTest-collection2.shard1.replica_n1' (registry 'solr.core.SearchRateTriggerTest-collection2.shard1.replica_n1') enabled at server: com.sun.jmx.mbeanserver.JmxMBeanServer@3b9d3c18
   [junit4]   2> 130791 INFO  (qtp1164797472-632) [n:127.0.0.1:34142_solr c:SearchRateTriggerTest-collection2 s:shard1 r:core_node2 x:SearchRateTriggerTest-collection2_shard1_replica_n1] o.a.s.c.SolrCore solr.RecoveryStrategy.Builder
   [junit4]   2> 130791 INFO  (qtp1164797472-632) [n:127.0.0.1:34142_solr c:SearchRateTriggerTest-collection2 s:shard1 r:core_node2 x:SearchRateTriggerTest-collection2_shard1_replica_n1] o.a.s.c.SolrCore [[SearchRateTriggerTest-collection2_shard1_replica_n1] ] Opening new SolrCore at [/x1/jenkins/jenkins-slave/workspace/Lucene-Solr-Tests-7.x/solr/build/solr-core/test/J2/temp/solr.cloud.autoscaling.SearchRateTriggerTest_EA90E50E2A63D089-001/tempDir-001/node4/SearchRateTriggerTest-collection2_shard1_replica_n1], dataDir=[/x1/jenkins/jenkins-slave/workspace/Lucene-Solr-Tests-7.x/solr/build/solr-core/test/J2/temp/solr.cloud.autoscaling.SearchRateTriggerTest_EA90E50E2A63D089-001/tempDir-001/node4/./SearchRateTriggerTest-collection2_shard1_replica_n1/data/]
   [junit4]   2> 130795 INFO  (qtp948898168-617) [n:127.0.0.1:47293_solr c:SearchRateTriggerTest-collection2 s:shard2 r:core_node8 x:SearchRateTriggerTest-collection2_shard2_replica_n7] o.a.s.s.IndexSchema Loaded schema minimal/1.1 with uniqueid field id
   [junit4]   2> 130796 INFO  (qtp948898168-617) [n:127.0.0.1:47293_solr c:SearchRateTriggerTest-collection2 s:shard2 r:core_node8 x:SearchRateTriggerTest-collection2_shard2_replica_n7] o.a.s.c.CoreContainer Creating SolrCore 'SearchRateTriggerTest-collection2_shard2_replica_n7' using configuration from collection SearchRateTriggerTest-collection2, trusted=true
   [junit4]   2> 130796 INFO  (qtp948898168-617) [n:127.0.0.1:47293_solr c:SearchRateTriggerTest-collection2 s:shard2 r:core_node8 x:SearchRateTriggerTest-collection2_shard2_replica_n7] o.a.s.m.r.SolrJmxReporter JMX monitoring for 'solr_47293.solr.core.SearchRateTriggerTest-collection2.shard2.replica_n7' (registry 'solr.core.SearchRateTriggerTest-collection2.shard2.replica_n7') enabled at server: com.sun.jmx.mbeanserver.JmxMBeanServer@3b9d3c18
   [junit4]   2> 130797 INFO  (qtp948898168-617) [n:127.0.0.1:47293_solr c:SearchRateTriggerTest-collection2 s:shard2 r:core_node8 x:SearchRateTriggerTest-collection2_shard2_replica_n7] o.a.s.c.SolrCore solr.RecoveryStrategy.Builder
   [junit4]   2> 130797 INFO  (qtp948898168-617) [n:127.0.0.1:47293_solr c:SearchRateTriggerTest-collection2 s:shard2 r:core_node8 x:SearchRateTriggerTest-collection2_shard2_replica_n7] o.a.s.c.SolrCore [[SearchRateTriggerTest-collection2_shard2_replica_n7] ] Opening new SolrCore at [/x1/jenkins/jenkins-slave/workspace/Lucene-Solr-Tests-7.x/solr/build/solr-core/test/J2/temp/solr.cloud.autoscaling.SearchRateTriggerTest_EA90E50E2A63D089-001/tempDir-001/node2/SearchRateTriggerTest-collection2_shard2_replica_n7], dataDir=[/x1/jenkins/jenkins-slave/workspace/Lucene-Solr-Tests-7.x/solr/build/solr-core/test/J2/temp/solr.cloud.autoscaling.SearchRateTriggerTest_EA90E50E2A63D089-001/tempDir-001/node2/./SearchRateTriggerTest-collection2_shard2_replica_n7/data/]
   [junit4]   2> 130820 INFO  (qtp921154396-615) [n:127.0.0.1:43387_solr c:SearchRateTriggerTest-collection2 s:shard1 r:core_node4 x:SearchRateTriggerTest-collection2_shard1_replica_n3] o.a.s.m.r.SolrJmxReporter JMX monitoring for 'solr_43387.solr.core.SearchRateTriggerTest-collection2.shard1.replica_n3' (registry 'solr.core.SearchRateTriggerTest-collection2.shard1.replica_n3') enabled at server: com.sun.jmx.mbeanserver.JmxMBeanServer@3b9d3c18
   [junit4]   2> 130821 INFO  (qtp921154396-615) [n:127.0.0.1:43387_solr c:SearchRateTriggerTest-collection2 s:shard1 r:core_node4 x:SearchRateTriggerTest-collection2_shard1_replica_n3] o.a.s.c.SolrCore solr.RecoveryStrategy.Builder
   [junit4]   2> 130821 INFO  (qtp921154396-615) [n:127.0.0.1:43387_solr c:SearchRateTriggerTest-collection2 s:shard1 r:core_node4 x:SearchRateTriggerTest-collection2_shard1_replica_n3] o.a.s.c.SolrCore [[SearchRateTriggerTest-collection2_shard1_replica_n3] ] Opening new SolrCore at [/x1/jenkins/jenkins-slave/workspace/Lucene-Solr-Tests-7.x/solr/build/solr-core/test/J2/temp/solr.cloud.autoscaling.SearchRateTriggerTest_EA90E50E2A63D089-001/tempDir-001/node3/SearchRateTriggerTest-collection2_shard1_replica_n3], dataDir=[/x1/jenkins/jenkins-slave/workspace/Lucene-Solr-Tests-7.x/solr/build/solr-core/test/J2/temp/solr.cloud.autoscaling.SearchRateTriggerTest_EA90E50E2A63D089-001/tempDir-001/node3/./SearchRateTriggerTest-collection2_shard1_replica_n3/data/]
   [junit4]   2> 131292 INFO  (qtp141453425-606) [n:127.0.0.1:40409_solr c:SearchRateTriggerTest-collection2 s:shard2 r:core_node6 x:SearchRateTriggerTest-collection2_shard2_replica_n5] o.a.s.u.UpdateHandler Using UpdateLog implementation: org.apache.solr.update.UpdateLog
   [junit4]   2> 131292 INFO  (qtp141453425-606) [n:127.0.0.1:40409_solr c:SearchRateTriggerTest-collection2 s:shard2 r:core_node6 x:SearchRateTriggerTest-collection2_shard2_replica_n5] o.a.s.u.UpdateLog Initializing UpdateLog: dataDir=null defaultSyncLevel=FLUSH numRecordsToKeep=100 maxNumLogsToKeep=10 numVersionBuckets=65536
   [junit4]   2> 131304 INFO  (qtp141453425-606) [n:127.0.0.1:40409_solr c:SearchRateTriggerTest-collection2 s:shard2 r:core_node6 x:SearchRateTriggerTest-collection2_shard2_replica_n5] o.a.s.u.CommitTracker Hard AutoCommit: disabled
   [junit4]   2> 131304 INFO  (qtp141453425-606) [n:127.0.0.1:40409_solr c:SearchRateTriggerTest-collection2 s:shard2 r:core_node6 x:SearchRateTriggerTest-collection2_shard2_replica_n5] o.a.s.u.CommitTracker Soft AutoCommit: disabled
   [junit4]   2> 131335 INFO  (qtp141453425-606) [n:127.0.0.1:40409_solr c:SearchRateTriggerTest-collection2 s:shard2 r:core_node6 x:SearchRateTriggerTest-collection2_shard2_replica_n5] o.a.s.s.SolrIndexSearcher Opening [Searcher@67c730dd[SearchRateTriggerTest-collection2_shard2_replica_n5] main]
   [junit4]   2> 131341 INFO  (qtp141453425-606) [n:127.0.0.1:40409_solr c:SearchRateTriggerTest-collection2 s:shard2 r:core_node6 x:SearchRateTriggerTest-collection2_shard2_replica_n5] o.a.s.r.ManagedResourceStorage Configured ZooKeeperStorageIO with znodeBase: /configs/conf
   [junit4]   2> 131342 INFO  (qtp141453425-606) [n:127.0.0.1:40409_solr c:SearchRateTriggerTest-collection2 s:shard2 r:core_node6 x:SearchRateTriggerTest-collection2_shard2_replica_n5] o.a.s.r.ManagedResourceStorage Loaded null at path _rest_managed.json using ZooKeeperStorageIO:path=/configs/conf
   [junit4]   2> 131344 INFO  (qtp141453425-606) [n:127.0.0.1:40409_solr c:SearchRateTriggerTest-collection2 s:shard2 r:core_node6 x:SearchRateTriggerTest-collection2_shard2_replica_n5] o.a.s.h.ReplicationHandler Commits will be reserved for 10000ms.
   [junit4]   2> 131369 INFO  (searcherExecutor-324-thread-1-processing-n:127.0.0.1:40409_solr x:SearchRateTriggerTest-collection2_shard2_replica_n5 c:SearchRateTriggerTest-collection2 s:shard2 r:core_node6) [n:127.0.0.1:40409_solr c:SearchRateTriggerTest-collection2 s:shard2 r:core_node6 x:SearchRateTriggerTest-collection2_shard2_replica_n5] o.a.s.c.SolrCore [SearchRateTriggerTest-collection2_shard2_replica_n5] Registered new searcher Searcher@67c730dd[SearchRateTriggerTest-collection2_shard2_replica_n5] main{ExitableDirectoryReader(UninvertingDirectoryReader())}
   [junit4]   2> 131369 INFO  (qtp141453425-606) [n:127.0.0.1:40409_solr c:SearchRateTriggerTest-collection2 s:shard2 r:core_node6 x:SearchRateTriggerTest-collection2_shard2_replica_n5] o.a.s.u.UpdateLog Could not find max version in index or recent updates, using new clock 1600627203232497664
   [junit4]   2> 131386 INFO  (qtp141453425-606) [n:127.0.0.1:40409_solr c:SearchRateTriggerTest-collection2 s:shard2 r:core_node6 x:SearchRateTriggerTest-collection2_shard2_replica_n5] o.a.s.c.ZkShardTerms Successful update of terms at /collections/SearchRateTriggerTest-collection2/terms/shard2 to Terms{values={core_node6=0}, version=0}
   [junit4]   2> 131400 INFO  (qtp141453425-606) [n:127.0.0.1:40409_solr c:SearchRateTriggerTest-collection2 s:shard2 r:core_node6 x:SearchRateTriggerTest-collection2_shard2_replica_n5] o.a.s.c.ShardLeaderElectionContext Waiting until we see more replicas up for shard shard2: total=2 found=1 timeoutin=9999ms
   [junit4]   2> 131452 INFO  (qtp948898168-617) [n:127.0.0.1:47293_solr c:SearchRateTriggerTest-collection2 s:shard2 r:core_node8 x:SearchRateTriggerTest-collection2_shard2_replica_n7] o.a.s.u.UpdateHandler Using UpdateLog implementation: org.apache.solr.update.UpdateLog
   [junit4]   2> 131452 INFO  (qtp948898168-617) [n:127.0.0.1:47293_solr c:SearchRateTriggerTest-collection2 s:shard2 r:core_node8 x:SearchRateTriggerTest-collection2_shard2_replica_n7] o.a.s.u.UpdateLog Initializing UpdateLog: dataDir=null defaultSyncLevel=FLUSH numRecordsToKeep=100 maxNumLogsToKeep=10 numVersionBuckets=65536
   [junit4]   2> 131454 INFO  (qtp948898168-617) [n:127.0.0.1:47293_solr c:SearchRateTriggerTest-collection2 s:shard2 r:core_node8 x:SearchRateTriggerTest-collection2_shard2_replica_n7] o.a.s.u.CommitTracker Hard AutoCommit: disabled
   [junit4]   2> 131455 INFO  (qtp948898168-617) [n:127.0.0.1:47293_solr c:SearchRateTriggerTest-collection2 s:shard2 r:core_node8 x:SearchRateTriggerTest-collection2_shard2_replica_n7] o.a.s.u.Commi

[...truncated too long message...]

onfigure:
[ivy:configure] :: loading settings :: file = /x1/jenkins/jenkins-slave/workspace/Lucene-Solr-Tests-7.x/lucene/top-level-ivy-settings.xml

resolve:

ivy-availability-check:
[loadresource] Do not set property disallowed.ivy.jars.list as its length is 0.

-ivy-fail-disallowed-ivy-version:

ivy-fail:

ivy-configure:
[ivy:configure] :: loading settings :: file = /x1/jenkins/jenkins-slave/workspace/Lucene-Solr-Tests-7.x/lucene/top-level-ivy-settings.xml

resolve:

ivy-availability-check:
[loadresource] Do not set property disallowed.ivy.jars.list as its length is 0.

-ivy-fail-disallowed-ivy-version:

ivy-fail:

ivy-configure:
[ivy:configure] :: loading settings :: file = /x1/jenkins/jenkins-slave/workspace/Lucene-Solr-Tests-7.x/lucene/top-level-ivy-settings.xml

resolve:

ivy-availability-check:
[loadresource] Do not set property disallowed.ivy.jars.list as its length is 0.

-ivy-fail-disallowed-ivy-version:

ivy-fail:

ivy-configure:
[ivy:configure] :: loading settings :: file = /x1/jenkins/jenkins-slave/workspace/Lucene-Solr-Tests-7.x/lucene/top-level-ivy-settings.xml

resolve:

ivy-availability-check:
[loadresource] Do not set property disallowed.ivy.jars.list as its length is 0.

-ivy-fail-disallowed-ivy-version:

ivy-fail:

ivy-configure:
[ivy:configure] :: loading settings :: file = /x1/jenkins/jenkins-slave/workspace/Lucene-Solr-Tests-7.x/lucene/top-level-ivy-settings.xml

resolve:

jar-checksums:
    [mkdir] Created dir: /x1/jenkins/jenkins-slave/workspace/Lucene-Solr-Tests-7.x/lucene/null1127736643
     [copy] Copying 39 files to /x1/jenkins/jenkins-slave/workspace/Lucene-Solr-Tests-7.x/lucene/null1127736643
   [delete] Deleting directory /x1/jenkins/jenkins-slave/workspace/Lucene-Solr-Tests-7.x/lucene/null1127736643

resolve-example:

ivy-availability-check:
[loadresource] Do not set property disallowed.ivy.jars.list as its length is 0.

-ivy-fail-disallowed-ivy-version:

ivy-fail:

ivy-configure:
[ivy:configure] :: loading settings :: file = /x1/jenkins/jenkins-slave/workspace/Lucene-Solr-Tests-7.x/lucene/top-level-ivy-settings.xml

resolve:

resolve-server:

ivy-availability-check:
[loadresource] Do not set property disallowed.ivy.jars.list as its length is 0.

-ivy-fail-disallowed-ivy-version:

ivy-fail:

ivy-fail:

ivy-configure:
[ivy:configure] :: loading settings :: file = /x1/jenkins/jenkins-slave/workspace/Lucene-Solr-Tests-7.x/lucene/top-level-ivy-settings.xml

resolve:

resolve:

ivy-availability-check:
[loadresource] Do not set property disallowed.ivy.jars.list as its length is 0.

-ivy-fail-disallowed-ivy-version:

ivy-fail:

ivy-fail:

ivy-configure:
[ivy:configure] :: loading settings :: file = /x1/jenkins/jenkins-slave/workspace/Lucene-Solr-Tests-7.x/lucene/top-level-ivy-settings.xml

resolve:

ivy-availability-check:
[loadresource] Do not set property disallowed.ivy.jars.list as its length is 0.

-ivy-fail-disallowed-ivy-version:

ivy-fail:

ivy-fail:

ivy-configure:
[ivy:configure] :: loading settings :: file = /x1/jenkins/jenkins-slave/workspace/Lucene-Solr-Tests-7.x/lucene/top-level-ivy-settings.xml

resolve:

ivy-availability-check:
[loadresource] Do not set property disallowed.ivy.jars.list as its length is 0.

-ivy-fail-disallowed-ivy-version:

ivy-fail:

ivy-configure:
[ivy:configure] :: loading settings :: file = /x1/jenkins/jenkins-slave/workspace/Lucene-Solr-Tests-7.x/lucene/top-level-ivy-settings.xml

resolve:

ivy-availability-check:
[loadresource] Do not set property disallowed.ivy.jars.list as its length is 0.

-ivy-fail-disallowed-ivy-version:

ivy-fail:

ivy-fail:

ivy-configure:
[ivy:configure] :: loading settings :: file = /x1/jenkins/jenkins-slave/workspace/Lucene-Solr-Tests-7.x/lucene/top-level-ivy-settings.xml

resolve:

ivy-availability-check:
[loadresource] Do not set property disallowed.ivy.jars.list as its length is 0.

-ivy-fail-disallowed-ivy-version:

ivy-fail:

ivy-configure:
[ivy:configure] :: loading settings :: file = /x1/jenkins/jenkins-slave/workspace/Lucene-Solr-Tests-7.x/lucene/top-level-ivy-settings.xml

resolve:

ivy-availability-check:
[loadresource] Do not set property disallowed.ivy.jars.list as its length is 0.

-ivy-fail-disallowed-ivy-version:

ivy-fail:

ivy-fail:

ivy-configure:
[ivy:configure] :: loading settings :: file = /x1/jenkins/jenkins-slave/workspace/Lucene-Solr-Tests-7.x/lucene/top-level-ivy-settings.xml

resolve:

ivy-availability-check:
[loadresource] Do not set property disallowed.ivy.jars.list as its length is 0.

-ivy-fail-disallowed-ivy-version:

ivy-fail:

ivy-fail:

ivy-configure:
[ivy:configure] :: loading settings :: file = /x1/jenkins/jenkins-slave/workspace/Lucene-Solr-Tests-7.x/lucene/top-level-ivy-settings.xml

resolve:

ivy-availability-check:
[loadresource] Do not set property disallowed.ivy.jars.list as its length is 0.

-ivy-fail-disallowed-ivy-version:

ivy-fail:

ivy-fail:

ivy-configure:
[ivy:configure] :: loading settings :: file = /x1/jenkins/jenkins-slave/workspace/Lucene-Solr-Tests-7.x/lucene/top-level-ivy-settings.xml

resolve:

ivy-availability-check:
[loadresource] Do not set property disallowed.ivy.jars.list as its length is 0.

-ivy-fail-disallowed-ivy-version:

ivy-fail:

ivy-fail:

ivy-configure:
[ivy:configure] :: loading settings :: file = /x1/jenkins/jenkins-slave/workspace/Lucene-Solr-Tests-7.x/lucene/top-level-ivy-settings.xml

resolve:

ivy-availability-check:
[loadresource] Do not set property disallowed.ivy.jars.list as its length is 0.

-ivy-fail-disallowed-ivy-version:

ivy-fail:

ivy-fail:

ivy-configure:
[ivy:configure] :: loading settings :: file = /x1/jenkins/jenkins-slave/workspace/Lucene-Solr-Tests-7.x/lucene/top-level-ivy-settings.xml

resolve:

ivy-availability-check:
[loadresource] Do not set property disallowed.ivy.jars.list as its length is 0.

-ivy-fail-disallowed-ivy-version:

ivy-fail:

ivy-fail:

ivy-configure:
[ivy:configure] :: loading settings :: file = /x1/jenkins/jenkins-slave/workspace/Lucene-Solr-Tests-7.x/lucene/top-level-ivy-settings.xml

resolve:

ivy-availability-check:
[loadresource] Do not set property disallowed.ivy.jars.list as its length is 0.

-ivy-fail-disallowed-ivy-version:

ivy-fail:

ivy-fail:

ivy-configure:
[ivy:configure] :: loading settings :: file = /x1/jenkins/jenkins-slave/workspace/Lucene-Solr-Tests-7.x/lucene/top-level-ivy-settings.xml

resolve:

ivy-availability-check:
[loadresource] Do not set property disallowed.ivy.jars.list as its length is 0.

-ivy-fail-disallowed-ivy-version:

ivy-fail:

ivy-fail:

ivy-configure:
[ivy:configure] :: loading settings :: file = /x1/jenkins/jenkins-slave/workspace/Lucene-Solr-Tests-7.x/lucene/top-level-ivy-settings.xml

resolve:

ivy-availability-check:
[loadresource] Do not set property disallowed.ivy.jars.list as its length is 0.

-ivy-fail-disallowed-ivy-version:

ivy-fail:

ivy-fail:

ivy-configure:
[ivy:configure] :: loading settings :: file = /x1/jenkins/jenkins-slave/workspace/Lucene-Solr-Tests-7.x/lucene/top-level-ivy-settings.xml

resolve:

ivy-availability-check:
[loadresource] Do not set property disallowed.ivy.jars.list as its length is 0.

-ivy-fail-disallowed-ivy-version:

ivy-fail:

ivy-fail:

ivy-configure:
[ivy:configure] :: loading settings :: file = /x1/jenkins/jenkins-slave/workspace/Lucene-Solr-Tests-7.x/lucene/top-level-ivy-settings.xml

resolve:

ivy-availability-check:
[loadresource] Do not set property disallowed.ivy.jars.list as its length is 0.

-ivy-fail-disallowed-ivy-version:

ivy-fail:

ivy-fail:

ivy-configure:
[ivy:configure] :: loading settings :: file = /x1/jenkins/jenkins-slave/workspace/Lucene-Solr-Tests-7.x/lucene/top-level-ivy-settings.xml

resolve:

jar-checksums:
    [mkdir] Created dir: /x1/jenkins/jenkins-slave/workspace/Lucene-Solr-Tests-7.x/solr/null188713062
     [copy] Copying 246 files to /x1/jenkins/jenkins-slave/workspace/Lucene-Solr-Tests-7.x/solr/null188713062
   [delete] Deleting directory /x1/jenkins/jenkins-slave/workspace/Lucene-Solr-Tests-7.x/solr/null188713062

check-working-copy:
[ivy:cachepath] :: resolving dependencies :: org.eclipse.jgit#org.eclipse.jgit-caller;working
[ivy:cachepath] 	confs: [default]
[ivy:cachepath] 	found org.eclipse.jgit#org.eclipse.jgit;4.6.0.201612231935-r in public
[ivy:cachepath] 	found com.jcraft#jsch;0.1.53 in public
[ivy:cachepath] 	found com.googlecode.javaewah#JavaEWAH;1.1.6 in public
[ivy:cachepath] 	found org.apache.httpcomponents#httpclient;4.3.6 in public
[ivy:cachepath] 	found org.apache.httpcomponents#httpcore;4.3.3 in public
[ivy:cachepath] 	found commons-logging#commons-logging;1.1.3 in public
[ivy:cachepath] 	found commons-codec#commons-codec;1.6 in public
[ivy:cachepath] 	found org.slf4j#slf4j-api;1.7.2 in public
[ivy:cachepath] :: resolution report :: resolve 26ms :: artifacts dl 1ms
	---------------------------------------------------------------------
	|                  |            modules            ||   artifacts   |
	|       conf       | number| search|dwnlded|evicted|| number|dwnlded|
	---------------------------------------------------------------------
	|      default     |   8   |   0   |   0   |   0   ||   8   |   0   |
	---------------------------------------------------------------------
[wc-checker] Initializing working copy...
[wc-checker] SLF4J: Failed to load class "org.slf4j.impl.StaticLoggerBinder".
[wc-checker] SLF4J: Defaulting to no-operation (NOP) logger implementation
[wc-checker] SLF4J: See http://www.slf4j.org/codes.html#StaticLoggerBinder for further details.
[wc-checker] Checking working copy status...

-jenkins-base:

BUILD SUCCESSFUL
Total time: 151 minutes 17 seconds
Archiving artifacts
WARN: No artifacts found that match the file pattern "**/*.events,heapdumps/**,**/hs_err_pid*". Configuration error?
WARN: java.lang.InterruptedException: no matches found within 10000
Recording test results
Build step 'Publish JUnit test result report' changed build result to UNSTABLE
Email was triggered for: Unstable (Test Failures)
Sending email for trigger: Unstable (Test Failures)

Mime
View raw message