lucene-dev mailing list archives

Site index · List index
Message view « Date » · « Thread »
Top « Date » · « Thread »
From Policeman Jenkins Server <jenk...@thetaphi.de>
Subject [JENKINS] Lucene-Solr-master-Linux (32bit/jdk1.8.0_162) - Build # 22028 - Still Unstable!
Date Thu, 17 May 2018 14:49:11 GMT
Build: https://jenkins.thetaphi.de/job/Lucene-Solr-master-Linux/22028/
Java: 32bit/jdk1.8.0_162 -server -XX:+UseSerialGC

3 tests failed.
FAILED:  org.apache.solr.cloud.autoscaling.NodeAddedTriggerTest.testRestoreState

Error Message:
Did not expect the processor to fire on first run! event={   "id":"68458a51063c3T37uqtv7cvsjb0dyfvp6f5aphr",   "source":"node_added_trigger",   "eventTime":1834366121567171,   "eventType":"NODEADDED",   "properties":{     "eventTimes":[       1834366121567171,       1834366121570076,       1834366121570651,       1834366121571116],     "nodeNames":[       "127.0.0.1:39881_solr",       "127.0.0.1:44337_solr",       "127.0.0.1:44751_solr",       "127.0.0.1:38285_solr"]}}

Stack Trace:
java.lang.AssertionError: Did not expect the processor to fire on first run! event={
  "id":"68458a51063c3T37uqtv7cvsjb0dyfvp6f5aphr",
  "source":"node_added_trigger",
  "eventTime":1834366121567171,
  "eventType":"NODEADDED",
  "properties":{
    "eventTimes":[
      1834366121567171,
      1834366121570076,
      1834366121570651,
      1834366121571116],
    "nodeNames":[
      "127.0.0.1:39881_solr",
      "127.0.0.1:44337_solr",
      "127.0.0.1:44751_solr",
      "127.0.0.1:38285_solr"]}}
	at __randomizedtesting.SeedInfo.seed([B6F283E92F120591:785C277AD72B7D87]:0)
	at org.junit.Assert.fail(Assert.java:93)
	at org.apache.solr.cloud.autoscaling.NodeAddedTriggerTest.lambda$new$0(NodeAddedTriggerTest.java:49)
	at org.apache.solr.cloud.autoscaling.NodeAddedTrigger.run(NodeAddedTrigger.java:161)
	at org.apache.solr.cloud.autoscaling.NodeAddedTriggerTest.testRestoreState(NodeAddedTriggerTest.java:257)
	at sun.reflect.NativeMethodAccessorImpl.invoke0(Native Method)
	at sun.reflect.NativeMethodAccessorImpl.invoke(NativeMethodAccessorImpl.java:62)
	at sun.reflect.DelegatingMethodAccessorImpl.invoke(DelegatingMethodAccessorImpl.java:43)
	at java.lang.reflect.Method.invoke(Method.java:498)
	at com.carrotsearch.randomizedtesting.RandomizedRunner.invoke(RandomizedRunner.java:1737)
	at com.carrotsearch.randomizedtesting.RandomizedRunner$8.evaluate(RandomizedRunner.java:934)
	at com.carrotsearch.randomizedtesting.RandomizedRunner$9.evaluate(RandomizedRunner.java:970)
	at com.carrotsearch.randomizedtesting.RandomizedRunner$10.evaluate(RandomizedRunner.java:984)
	at com.carrotsearch.randomizedtesting.rules.SystemPropertiesRestoreRule$1.evaluate(SystemPropertiesRestoreRule.java:57)
	at org.apache.lucene.util.TestRuleSetupTeardownChained$1.evaluate(TestRuleSetupTeardownChained.java:49)
	at org.apache.lucene.util.AbstractBeforeAfterRule$1.evaluate(AbstractBeforeAfterRule.java:45)
	at org.apache.lucene.util.TestRuleThreadAndTestName$1.evaluate(TestRuleThreadAndTestName.java:48)
	at org.apache.lucene.util.TestRuleIgnoreAfterMaxFailures$1.evaluate(TestRuleIgnoreAfterMaxFailures.java:64)
	at org.apache.lucene.util.TestRuleMarkFailure$1.evaluate(TestRuleMarkFailure.java:47)
	at com.carrotsearch.randomizedtesting.rules.StatementAdapter.evaluate(StatementAdapter.java:36)
	at com.carrotsearch.randomizedtesting.ThreadLeakControl$StatementRunner.run(ThreadLeakControl.java:368)
	at com.carrotsearch.randomizedtesting.ThreadLeakControl.forkTimeoutingTask(ThreadLeakControl.java:817)
	at com.carrotsearch.randomizedtesting.ThreadLeakControl$3.evaluate(ThreadLeakControl.java:468)
	at com.carrotsearch.randomizedtesting.RandomizedRunner.runSingleTest(RandomizedRunner.java:943)
	at com.carrotsearch.randomizedtesting.RandomizedRunner$5.evaluate(RandomizedRunner.java:829)
	at com.carrotsearch.randomizedtesting.RandomizedRunner$6.evaluate(RandomizedRunner.java:879)
	at com.carrotsearch.randomizedtesting.RandomizedRunner$7.evaluate(RandomizedRunner.java:890)
	at com.carrotsearch.randomizedtesting.rules.StatementAdapter.evaluate(StatementAdapter.java:36)
	at com.carrotsearch.randomizedtesting.rules.SystemPropertiesRestoreRule$1.evaluate(SystemPropertiesRestoreRule.java:57)
	at org.apache.lucene.util.AbstractBeforeAfterRule$1.evaluate(AbstractBeforeAfterRule.java:45)
	at com.carrotsearch.randomizedtesting.rules.StatementAdapter.evaluate(StatementAdapter.java:36)
	at org.apache.lucene.util.TestRuleStoreClassName$1.evaluate(TestRuleStoreClassName.java:41)
	at com.carrotsearch.randomizedtesting.rules.NoShadowingOrOverridesOnMethodsRule$1.evaluate(NoShadowingOrOverridesOnMethodsRule.java:40)
	at com.carrotsearch.randomizedtesting.rules.NoShadowingOrOverridesOnMethodsRule$1.evaluate(NoShadowingOrOverridesOnMethodsRule.java:40)
	at com.carrotsearch.randomizedtesting.rules.StatementAdapter.evaluate(StatementAdapter.java:36)
	at com.carrotsearch.randomizedtesting.rules.StatementAdapter.evaluate(StatementAdapter.java:36)
	at com.carrotsearch.randomizedtesting.rules.StatementAdapter.evaluate(StatementAdapter.java:36)
	at org.apache.lucene.util.TestRuleAssertionsRequired$1.evaluate(TestRuleAssertionsRequired.java:53)
	at org.apache.lucene.util.TestRuleMarkFailure$1.evaluate(TestRuleMarkFailure.java:47)
	at org.apache.lucene.util.TestRuleIgnoreAfterMaxFailures$1.evaluate(TestRuleIgnoreAfterMaxFailures.java:64)
	at org.apache.lucene.util.TestRuleIgnoreTestSuites$1.evaluate(TestRuleIgnoreTestSuites.java:54)
	at com.carrotsearch.randomizedtesting.rules.StatementAdapter.evaluate(StatementAdapter.java:36)
	at com.carrotsearch.randomizedtesting.ThreadLeakControl$StatementRunner.run(ThreadLeakControl.java:368)
	at java.lang.Thread.run(Thread.java:748)


FAILED:  org.apache.solr.cloud.autoscaling.NodeAddedTriggerTest.testRestoreState

Error Message:
Did not expect the processor to fire on first run! event={   "id":"6845d176b7d52T37uqtv7cvsjb0dyfvp6f5aphv",   "source":"node_added_trigger",   "eventTime":1834385220009298,   "eventType":"NODEADDED",   "properties":{     "eventTimes":[       1834385220009298,       1834385220011258,       1834385220011710,       1834385220012136],     "nodeNames":[       "127.0.0.1:45173_solr",       "127.0.0.1:46351_solr",       "127.0.0.1:37009_solr",       "127.0.0.1:37487_solr"]}}

Stack Trace:
java.lang.AssertionError: Did not expect the processor to fire on first run! event={
  "id":"6845d176b7d52T37uqtv7cvsjb0dyfvp6f5aphv",
  "source":"node_added_trigger",
  "eventTime":1834385220009298,
  "eventType":"NODEADDED",
  "properties":{
    "eventTimes":[
      1834385220009298,
      1834385220011258,
      1834385220011710,
      1834385220012136],
    "nodeNames":[
      "127.0.0.1:45173_solr",
      "127.0.0.1:46351_solr",
      "127.0.0.1:37009_solr",
      "127.0.0.1:37487_solr"]}}
	at __randomizedtesting.SeedInfo.seed([B6F283E92F120591:785C277AD72B7D87]:0)
	at org.junit.Assert.fail(Assert.java:93)
	at org.apache.solr.cloud.autoscaling.NodeAddedTriggerTest.lambda$new$0(NodeAddedTriggerTest.java:49)
	at org.apache.solr.cloud.autoscaling.NodeAddedTrigger.run(NodeAddedTrigger.java:161)
	at org.apache.solr.cloud.autoscaling.NodeAddedTriggerTest.testRestoreState(NodeAddedTriggerTest.java:257)
	at sun.reflect.NativeMethodAccessorImpl.invoke0(Native Method)
	at sun.reflect.NativeMethodAccessorImpl.invoke(NativeMethodAccessorImpl.java:62)
	at sun.reflect.DelegatingMethodAccessorImpl.invoke(DelegatingMethodAccessorImpl.java:43)
	at java.lang.reflect.Method.invoke(Method.java:498)
	at com.carrotsearch.randomizedtesting.RandomizedRunner.invoke(RandomizedRunner.java:1737)
	at com.carrotsearch.randomizedtesting.RandomizedRunner$8.evaluate(RandomizedRunner.java:934)
	at com.carrotsearch.randomizedtesting.RandomizedRunner$9.evaluate(RandomizedRunner.java:970)
	at com.carrotsearch.randomizedtesting.RandomizedRunner$10.evaluate(RandomizedRunner.java:984)
	at com.carrotsearch.randomizedtesting.rules.SystemPropertiesRestoreRule$1.evaluate(SystemPropertiesRestoreRule.java:57)
	at org.apache.lucene.util.TestRuleSetupTeardownChained$1.evaluate(TestRuleSetupTeardownChained.java:49)
	at org.apache.lucene.util.AbstractBeforeAfterRule$1.evaluate(AbstractBeforeAfterRule.java:45)
	at org.apache.lucene.util.TestRuleThreadAndTestName$1.evaluate(TestRuleThreadAndTestName.java:48)
	at org.apache.lucene.util.TestRuleIgnoreAfterMaxFailures$1.evaluate(TestRuleIgnoreAfterMaxFailures.java:64)
	at org.apache.lucene.util.TestRuleMarkFailure$1.evaluate(TestRuleMarkFailure.java:47)
	at com.carrotsearch.randomizedtesting.rules.StatementAdapter.evaluate(StatementAdapter.java:36)
	at com.carrotsearch.randomizedtesting.ThreadLeakControl$StatementRunner.run(ThreadLeakControl.java:368)
	at com.carrotsearch.randomizedtesting.ThreadLeakControl.forkTimeoutingTask(ThreadLeakControl.java:817)
	at com.carrotsearch.randomizedtesting.ThreadLeakControl$3.evaluate(ThreadLeakControl.java:468)
	at com.carrotsearch.randomizedtesting.RandomizedRunner.runSingleTest(RandomizedRunner.java:943)
	at com.carrotsearch.randomizedtesting.RandomizedRunner$5.evaluate(RandomizedRunner.java:829)
	at com.carrotsearch.randomizedtesting.RandomizedRunner$6.evaluate(RandomizedRunner.java:879)
	at com.carrotsearch.randomizedtesting.RandomizedRunner$7.evaluate(RandomizedRunner.java:890)
	at com.carrotsearch.randomizedtesting.rules.StatementAdapter.evaluate(StatementAdapter.java:36)
	at com.carrotsearch.randomizedtesting.rules.SystemPropertiesRestoreRule$1.evaluate(SystemPropertiesRestoreRule.java:57)
	at org.apache.lucene.util.AbstractBeforeAfterRule$1.evaluate(AbstractBeforeAfterRule.java:45)
	at com.carrotsearch.randomizedtesting.rules.StatementAdapter.evaluate(StatementAdapter.java:36)
	at org.apache.lucene.util.TestRuleStoreClassName$1.evaluate(TestRuleStoreClassName.java:41)
	at com.carrotsearch.randomizedtesting.rules.NoShadowingOrOverridesOnMethodsRule$1.evaluate(NoShadowingOrOverridesOnMethodsRule.java:40)
	at com.carrotsearch.randomizedtesting.rules.NoShadowingOrOverridesOnMethodsRule$1.evaluate(NoShadowingOrOverridesOnMethodsRule.java:40)
	at com.carrotsearch.randomizedtesting.rules.StatementAdapter.evaluate(StatementAdapter.java:36)
	at com.carrotsearch.randomizedtesting.rules.StatementAdapter.evaluate(StatementAdapter.java:36)
	at com.carrotsearch.randomizedtesting.rules.StatementAdapter.evaluate(StatementAdapter.java:36)
	at org.apache.lucene.util.TestRuleAssertionsRequired$1.evaluate(TestRuleAssertionsRequired.java:53)
	at org.apache.lucene.util.TestRuleMarkFailure$1.evaluate(TestRuleMarkFailure.java:47)
	at org.apache.lucene.util.TestRuleIgnoreAfterMaxFailures$1.evaluate(TestRuleIgnoreAfterMaxFailures.java:64)
	at org.apache.lucene.util.TestRuleIgnoreTestSuites$1.evaluate(TestRuleIgnoreTestSuites.java:54)
	at com.carrotsearch.randomizedtesting.rules.StatementAdapter.evaluate(StatementAdapter.java:36)
	at com.carrotsearch.randomizedtesting.ThreadLeakControl$StatementRunner.run(ThreadLeakControl.java:368)
	at java.lang.Thread.run(Thread.java:748)


FAILED:  org.apache.solr.cloud.autoscaling.NodeAddedTriggerTest.testRestoreState

Error Message:
Did not expect the processor to fire on first run! event={   "id":"681c412bf4fc4T37uqtv7cvsjb0dyfvp6f5aphr",   "source":"node_added_trigger",   "eventTime":1831528988364740,   "eventType":"NODEADDED",   "properties":{     "eventTimes":[       1831528988364740,       1831528988367973,       1831528988368391,       1831528988368676],     "nodeNames":[       "127.0.0.1:33579_solr",       "127.0.0.1:36573_solr",       "127.0.0.1:34389_solr",       "127.0.0.1:40765_solr"]}}

Stack Trace:
java.lang.AssertionError: Did not expect the processor to fire on first run! event={
  "id":"681c412bf4fc4T37uqtv7cvsjb0dyfvp6f5aphr",
  "source":"node_added_trigger",
  "eventTime":1831528988364740,
  "eventType":"NODEADDED",
  "properties":{
    "eventTimes":[
      1831528988364740,
      1831528988367973,
      1831528988368391,
      1831528988368676],
    "nodeNames":[
      "127.0.0.1:33579_solr",
      "127.0.0.1:36573_solr",
      "127.0.0.1:34389_solr",
      "127.0.0.1:40765_solr"]}}
	at __randomizedtesting.SeedInfo.seed([B6F283E92F120591:785C277AD72B7D87]:0)
	at org.junit.Assert.fail(Assert.java:93)
	at org.apache.solr.cloud.autoscaling.NodeAddedTriggerTest.lambda$new$0(NodeAddedTriggerTest.java:49)
	at org.apache.solr.cloud.autoscaling.NodeAddedTrigger.run(NodeAddedTrigger.java:161)
	at org.apache.solr.cloud.autoscaling.NodeAddedTriggerTest.testRestoreState(NodeAddedTriggerTest.java:257)
	at sun.reflect.NativeMethodAccessorImpl.invoke0(Native Method)
	at sun.reflect.NativeMethodAccessorImpl.invoke(NativeMethodAccessorImpl.java:62)
	at sun.reflect.DelegatingMethodAccessorImpl.invoke(DelegatingMethodAccessorImpl.java:43)
	at java.lang.reflect.Method.invoke(Method.java:498)
	at com.carrotsearch.randomizedtesting.RandomizedRunner.invoke(RandomizedRunner.java:1737)
	at com.carrotsearch.randomizedtesting.RandomizedRunner$8.evaluate(RandomizedRunner.java:934)
	at com.carrotsearch.randomizedtesting.RandomizedRunner$9.evaluate(RandomizedRunner.java:970)
	at com.carrotsearch.randomizedtesting.RandomizedRunner$10.evaluate(RandomizedRunner.java:984)
	at com.carrotsearch.randomizedtesting.rules.SystemPropertiesRestoreRule$1.evaluate(SystemPropertiesRestoreRule.java:57)
	at org.apache.lucene.util.TestRuleSetupTeardownChained$1.evaluate(TestRuleSetupTeardownChained.java:49)
	at org.apache.lucene.util.AbstractBeforeAfterRule$1.evaluate(AbstractBeforeAfterRule.java:45)
	at org.apache.lucene.util.TestRuleThreadAndTestName$1.evaluate(TestRuleThreadAndTestName.java:48)
	at org.apache.lucene.util.TestRuleIgnoreAfterMaxFailures$1.evaluate(TestRuleIgnoreAfterMaxFailures.java:64)
	at org.apache.lucene.util.TestRuleMarkFailure$1.evaluate(TestRuleMarkFailure.java:47)
	at com.carrotsearch.randomizedtesting.rules.StatementAdapter.evaluate(StatementAdapter.java:36)
	at com.carrotsearch.randomizedtesting.ThreadLeakControl$StatementRunner.run(ThreadLeakControl.java:368)
	at com.carrotsearch.randomizedtesting.ThreadLeakControl.forkTimeoutingTask(ThreadLeakControl.java:817)
	at com.carrotsearch.randomizedtesting.ThreadLeakControl$3.evaluate(ThreadLeakControl.java:468)
	at com.carrotsearch.randomizedtesting.RandomizedRunner.runSingleTest(RandomizedRunner.java:943)
	at com.carrotsearch.randomizedtesting.RandomizedRunner$5.evaluate(RandomizedRunner.java:829)
	at com.carrotsearch.randomizedtesting.RandomizedRunner$6.evaluate(RandomizedRunner.java:879)
	at com.carrotsearch.randomizedtesting.RandomizedRunner$7.evaluate(RandomizedRunner.java:890)
	at com.carrotsearch.randomizedtesting.rules.StatementAdapter.evaluate(StatementAdapter.java:36)
	at com.carrotsearch.randomizedtesting.rules.SystemPropertiesRestoreRule$1.evaluate(SystemPropertiesRestoreRule.java:57)
	at org.apache.lucene.util.AbstractBeforeAfterRule$1.evaluate(AbstractBeforeAfterRule.java:45)
	at com.carrotsearch.randomizedtesting.rules.StatementAdapter.evaluate(StatementAdapter.java:36)
	at org.apache.lucene.util.TestRuleStoreClassName$1.evaluate(TestRuleStoreClassName.java:41)
	at com.carrotsearch.randomizedtesting.rules.NoShadowingOrOverridesOnMethodsRule$1.evaluate(NoShadowingOrOverridesOnMethodsRule.java:40)
	at com.carrotsearch.randomizedtesting.rules.NoShadowingOrOverridesOnMethodsRule$1.evaluate(NoShadowingOrOverridesOnMethodsRule.java:40)
	at com.carrotsearch.randomizedtesting.rules.StatementAdapter.evaluate(StatementAdapter.java:36)
	at com.carrotsearch.randomizedtesting.rules.StatementAdapter.evaluate(StatementAdapter.java:36)
	at com.carrotsearch.randomizedtesting.rules.StatementAdapter.evaluate(StatementAdapter.java:36)
	at org.apache.lucene.util.TestRuleAssertionsRequired$1.evaluate(TestRuleAssertionsRequired.java:53)
	at org.apache.lucene.util.TestRuleMarkFailure$1.evaluate(TestRuleMarkFailure.java:47)
	at org.apache.lucene.util.TestRuleIgnoreAfterMaxFailures$1.evaluate(TestRuleIgnoreAfterMaxFailures.java:64)
	at org.apache.lucene.util.TestRuleIgnoreTestSuites$1.evaluate(TestRuleIgnoreTestSuites.java:54)
	at com.carrotsearch.randomizedtesting.rules.StatementAdapter.evaluate(StatementAdapter.java:36)
	at com.carrotsearch.randomizedtesting.ThreadLeakControl$StatementRunner.run(ThreadLeakControl.java:368)
	at java.lang.Thread.run(Thread.java:748)




Build Log:
[...truncated 12354 lines...]
   [junit4] Suite: org.apache.solr.cloud.autoscaling.NodeAddedTriggerTest
   [junit4]   2> Creating dataDir: /home/jenkins/workspace/Lucene-Solr-master-Linux/solr/build/solr-core/test/J0/temp/solr.cloud.autoscaling.NodeAddedTriggerTest_B6F283E92F120591-001/init-core-data-001
   [junit4]   2> 2698 INFO  (SUITE-NodeAddedTriggerTest-seed#[B6F283E92F120591]-worker) [    ] o.a.s.SolrTestCaseJ4 Using TrieFields (NUMERIC_POINTS_SYSPROP=false) w/NUMERIC_DOCVALUES_SYSPROP=false
   [junit4]   2> 2775 INFO  (SUITE-NodeAddedTriggerTest-seed#[B6F283E92F120591]-worker) [    ] o.e.j.u.log Logging initialized @2798ms to org.eclipse.jetty.util.log.Slf4jLog
   [junit4]   2> 2786 INFO  (SUITE-NodeAddedTriggerTest-seed#[B6F283E92F120591]-worker) [    ] o.a.s.SolrTestCaseJ4 Randomized ssl (true) and clientAuth (true) via: @org.apache.solr.util.RandomizeSSL(reason=, ssl=NaN, value=NaN, clientAuth=NaN)
   [junit4]   2> 2972 INFO  (SUITE-NodeAddedTriggerTest-seed#[B6F283E92F120591]-worker) [    ] o.a.s.SolrTestCaseJ4 SecureRandom sanity checks: test.solr.allowed.securerandom=null & java.security.egd=file:/dev/./urandom
   [junit4]   2> 2980 INFO  (SUITE-NodeAddedTriggerTest-seed#[B6F283E92F120591]-worker) [    ] o.a.s.c.MiniSolrCloudCluster Starting cluster of 1 servers in /home/jenkins/workspace/Lucene-Solr-master-Linux/solr/build/solr-core/test/J0/temp/solr.cloud.autoscaling.NodeAddedTriggerTest_B6F283E92F120591-001/tempDir-001
   [junit4]   2> 2989 INFO  (SUITE-NodeAddedTriggerTest-seed#[B6F283E92F120591]-worker) [    ] o.a.s.c.ZkTestServer STARTING ZK TEST SERVER
   [junit4]   2> 2991 INFO  (Thread-1) [    ] o.a.s.c.ZkTestServer client port:0.0.0.0/0.0.0.0:0
   [junit4]   2> 2991 INFO  (Thread-1) [    ] o.a.s.c.ZkTestServer Starting server
   [junit4]   2> 3091 INFO  (SUITE-NodeAddedTriggerTest-seed#[B6F283E92F120591]-worker) [    ] o.a.s.c.ZkTestServer start zk server on port:37019
   [junit4]   2> 3109 ERROR (Thread-1) [    ] o.a.z.s.ZooKeeperServer ZKShutdownHandler is not registered, so ZooKeeper server won't take any action on ERROR or SHUTDOWN server state changes
   [junit4]   2> 3235 INFO  (zkConnectionManagerCallback-4-thread-1) [    ] o.a.s.c.c.ConnectionManager zkClient has connected
   [junit4]   2> 3286 WARN  (NIOServerCxn.Factory:0.0.0.0/0.0.0.0:0) [    ] o.a.z.s.NIOServerCnxn Unable to read additional data from client sessionid 0x1006d2a9c2a0000, likely client has closed socket
   [junit4]   2> 3616 INFO  (jetty-launcher-1-thread-1) [    ] o.e.j.s.Server jetty-9.4.10.v20180503; built: 2018-05-03T15:56:21.710Z; git: daa59876e6f384329b122929e70a80934569428c; jvm 1.8.0_162-b12
   [junit4]   2> 3660 INFO  (jetty-launcher-1-thread-1) [    ] o.e.j.s.session DefaultSessionIdManager workerName=node0
   [junit4]   2> 3660 INFO  (jetty-launcher-1-thread-1) [    ] o.e.j.s.session No SessionScavenger set, using defaults
   [junit4]   2> 3664 INFO  (jetty-launcher-1-thread-1) [    ] o.e.j.s.session node0 Scavenging every 660000ms
   [junit4]   2> 3683 INFO  (jetty-launcher-1-thread-1) [    ] o.e.j.s.h.ContextHandler Started o.e.j.s.ServletContextHandler@821eb6{/solr,null,AVAILABLE}
   [junit4]   2> 3734 INFO  (jetty-launcher-1-thread-1) [    ] o.e.j.s.AbstractConnector Started ServerConnector@a72088{SSL,[ssl, http/1.1]}{127.0.0.1:34389}
   [junit4]   2> 3734 INFO  (jetty-launcher-1-thread-1) [    ] o.e.j.s.Server Started @3761ms
   [junit4]   2> 3734 INFO  (jetty-launcher-1-thread-1) [    ] o.a.s.c.s.e.JettySolrRunner Jetty properties: {hostContext=/solr, hostPort=34389}
   [junit4]   2> 3810 INFO  (jetty-launcher-1-thread-1) [    ] o.a.s.u.c.SSLCredentialProviderFactory Processing SSL Credential Provider chain: env;sysprop
   [junit4]   2> 3854 ERROR (jetty-launcher-1-thread-1) [    ] o.a.s.u.StartupLoggingUtils Missing Java Option solr.log.dir. Logging may be missing or incomplete.
   [junit4]   2> 3854 INFO  (jetty-launcher-1-thread-1) [    ] o.a.s.s.SolrDispatchFilter Using logger factory org.apache.logging.slf4j.Log4jLoggerFactory
   [junit4]   2> 3854 INFO  (jetty-launcher-1-thread-1) [    ] o.a.s.s.SolrDispatchFilter  ___      _       Welcome to Apache Solr? version 8.0.0
   [junit4]   2> 3869 INFO  (jetty-launcher-1-thread-1) [    ] o.a.s.s.SolrDispatchFilter / __| ___| |_ _   Starting in cloud mode on port null
   [junit4]   2> 3869 INFO  (jetty-launcher-1-thread-1) [    ] o.a.s.s.SolrDispatchFilter \__ \/ _ \ | '_|  Install dir: null
   [junit4]   2> 3870 INFO  (jetty-launcher-1-thread-1) [    ] o.a.s.s.SolrDispatchFilter |___/\___/_|_|    Start time: 2018-05-17T13:58:36.891Z
   [junit4]   2> 3898 INFO  (jetty-launcher-1-thread-1) [    ] o.a.s.c.SolrResourceLoader solr home defaulted to 'solr/' (could not find system property or JNDI)
   [junit4]   2> 3901 INFO  (zkConnectionManagerCallback-6-thread-1) [    ] o.a.s.c.c.ConnectionManager zkClient has connected
   [junit4]   2> 3903 INFO  (jetty-launcher-1-thread-1) [    ] o.a.s.s.SolrDispatchFilter solr.xml found in ZooKeeper. Loading...
   [junit4]   2> 4300 INFO  (jetty-launcher-1-thread-1) [    ] o.a.s.c.ZkContainer Zookeeper client=127.0.0.1:37019/solr
   [junit4]   2> 4331 INFO  (zkConnectionManagerCallback-10-thread-1) [    ] o.a.s.c.c.ConnectionManager zkClient has connected
   [junit4]   2> 4353 INFO  (zkConnectionManagerCallback-12-thread-1) [    ] o.a.s.c.c.ConnectionManager zkClient has connected
   [junit4]   2> 4664 INFO  (jetty-launcher-1-thread-1) [n:127.0.0.1:34389_solr    ] o.a.s.c.Overseer Overseer (id=null) closing
   [junit4]   2> 4680 INFO  (jetty-launcher-1-thread-1) [n:127.0.0.1:34389_solr    ] o.a.s.c.OverseerElectionContext I am going to be the leader 127.0.0.1:34389_solr
   [junit4]   2> 4687 INFO  (jetty-launcher-1-thread-1) [n:127.0.0.1:34389_solr    ] o.a.s.c.Overseer Overseer (id=72177623813980163-127.0.0.1:34389_solr-n_0000000000) starting
   [junit4]   2> 4805 INFO  (zkConnectionManagerCallback-19-thread-1) [    ] o.a.s.c.c.ConnectionManager zkClient has connected
   [junit4]   2> 4812 INFO  (jetty-launcher-1-thread-1) [n:127.0.0.1:34389_solr    ] o.a.s.c.s.i.ZkClientClusterStateProvider Cluster at 127.0.0.1:37019/solr ready
   [junit4]   2> 4956 INFO  (jetty-launcher-1-thread-1) [n:127.0.0.1:34389_solr    ] o.a.s.c.ZkController Register node as live in ZooKeeper:/live_nodes/127.0.0.1:34389_solr
   [junit4]   2> 4979 INFO  (zkCallback-11-thread-1) [    ] o.a.s.c.c.ZkStateReader Updated live nodes from ZooKeeper... (0) -> (1)
   [junit4]   2> 5014 INFO  (zkCallback-18-thread-1) [    ] o.a.s.c.c.ZkStateReader Updated live nodes from ZooKeeper... (0) -> (1)
   [junit4]   2> 7081 INFO  (jetty-launcher-1-thread-1) [n:127.0.0.1:34389_solr    ] o.a.s.m.r.SolrJmxReporter JMX monitoring for 'solr_34389.solr.node' (registry 'solr.node') enabled at server: com.sun.jmx.mbeanserver.JmxMBeanServer@19a1a44
   [junit4]   2> 7082 INFO  (jetty-launcher-1-thread-1) [n:127.0.0.1:34389_solr    ] o.a.s.m.r.SolrJmxReporter JMX monitoring for 'solr_34389.solr.jvm' (registry 'solr.jvm') enabled at server: com.sun.jmx.mbeanserver.JmxMBeanServer@19a1a44
   [junit4]   2> 7083 INFO  (jetty-launcher-1-thread-1) [n:127.0.0.1:34389_solr    ] o.a.s.m.r.SolrJmxReporter JMX monitoring for 'solr_34389.solr.jetty' (registry 'solr.jetty') enabled at server: com.sun.jmx.mbeanserver.JmxMBeanServer@19a1a44
   [junit4]   2> 7099 INFO  (jetty-launcher-1-thread-1) [n:127.0.0.1:34389_solr    ] o.a.s.c.CorePropertiesLocator Found 0 core definitions underneath /home/jenkins/workspace/Lucene-Solr-master-Linux/solr/build/solr-core/test/J0/temp/solr.cloud.autoscaling.NodeAddedTriggerTest_B6F283E92F120591-001/tempDir-001/node1/.
   [junit4]   2> 7291 INFO  (zkConnectionManagerCallback-21-thread-1) [    ] o.a.s.c.c.ConnectionManager zkClient has connected
   [junit4]   2> 7315 INFO  (zkConnectionManagerCallback-26-thread-1) [    ] o.a.s.c.c.ConnectionManager zkClient has connected
   [junit4]   2> 7317 INFO  (SUITE-NodeAddedTriggerTest-seed#[B6F283E92F120591]-worker) [    ] o.a.s.c.c.ZkStateReader Updated live nodes from ZooKeeper... (0) -> (1)
   [junit4]   2> 7319 INFO  (SUITE-NodeAddedTriggerTest-seed#[B6F283E92F120591]-worker) [    ] o.a.s.c.s.i.ZkClientClusterStateProvider Cluster at 127.0.0.1:37019/solr ready
   [junit4]   2> 7343 INFO  (TEST-NodeAddedTriggerTest.testListenerAcceptance-seed#[B6F283E92F120591]) [    ] o.a.s.SolrTestCaseJ4 ###Starting testListenerAcceptance
   [junit4]   2> 7374 INFO  (TEST-NodeAddedTriggerTest.testListenerAcceptance-seed#[B6F283E92F120591]) [    ] o.e.j.s.Server jetty-9.4.10.v20180503; built: 2018-05-03T15:56:21.710Z; git: daa59876e6f384329b122929e70a80934569428c; jvm 1.8.0_162-b12
   [junit4]   2> 7407 INFO  (TEST-NodeAddedTriggerTest.testListenerAcceptance-seed#[B6F283E92F120591]) [    ] o.e.j.s.session DefaultSessionIdManager workerName=node0
   [junit4]   2> 7408 INFO  (TEST-NodeAddedTriggerTest.testListenerAcceptance-seed#[B6F283E92F120591]) [    ] o.e.j.s.session No SessionScavenger set, using defaults
   [junit4]   2> 7408 INFO  (TEST-NodeAddedTriggerTest.testListenerAcceptance-seed#[B6F283E92F120591]) [    ] o.e.j.s.session node0 Scavenging every 600000ms
   [junit4]   2> 7410 INFO  (TEST-NodeAddedTriggerTest.testListenerAcceptance-seed#[B6F283E92F120591]) [    ] o.e.j.s.h.ContextHandler Started o.e.j.s.ServletContextHandler@c95fd8{/solr,null,AVAILABLE}
   [junit4]   2> 7411 INFO  (TEST-NodeAddedTriggerTest.testListenerAcceptance-seed#[B6F283E92F120591]) [    ] o.e.j.s.AbstractConnector Started ServerConnector@13fa970{SSL,[ssl, http/1.1]}{127.0.0.1:40765}
   [junit4]   2> 7411 INFO  (TEST-NodeAddedTriggerTest.testListenerAcceptance-seed#[B6F283E92F120591]) [    ] o.e.j.s.Server Started @7439ms
   [junit4]   2> 7411 INFO  (TEST-NodeAddedTriggerTest.testListenerAcceptance-seed#[B6F283E92F120591]) [    ] o.a.s.c.s.e.JettySolrRunner Jetty properties: {hostContext=/solr, hostPort=40765}
   [junit4]   2> 7412 ERROR (TEST-NodeAddedTriggerTest.testListenerAcceptance-seed#[B6F283E92F120591]) [    ] o.a.s.u.StartupLoggingUtils Missing Java Option solr.log.dir. Logging may be missing or incomplete.
   [junit4]   2> 7412 INFO  (TEST-NodeAddedTriggerTest.testListenerAcceptance-seed#[B6F283E92F120591]) [    ] o.a.s.s.SolrDispatchFilter Using logger factory org.apache.logging.slf4j.Log4jLoggerFactory
   [junit4]   2> 7412 INFO  (TEST-NodeAddedTriggerTest.testListenerAcceptance-seed#[B6F283E92F120591]) [    ] o.a.s.s.SolrDispatchFilter  ___      _       Welcome to Apache Solr? version 8.0.0
   [junit4]   2> 7412 INFO  (TEST-NodeAddedTriggerTest.testListenerAcceptance-seed#[B6F283E92F120591]) [    ] o.a.s.s.SolrDispatchFilter / __| ___| |_ _   Starting in cloud mode on port null
   [junit4]   2> 7413 INFO  (TEST-NodeAddedTriggerTest.testListenerAcceptance-seed#[B6F283E92F120591]) [    ] o.a.s.s.SolrDispatchFilter \__ \/ _ \ | '_|  Install dir: null
   [junit4]   2> 7413 INFO  (TEST-NodeAddedTriggerTest.testListenerAcceptance-seed#[B6F283E92F120591]) [    ] o.a.s.s.SolrDispatchFilter |___/\___/_|_|    Start time: 2018-05-17T13:58:40.434Z
   [junit4]   2> 7435 INFO  (zkConnectionManagerCallback-28-thread-1) [    ] o.a.s.c.c.ConnectionManager zkClient has connected
   [junit4]   2> 7436 INFO  (TEST-NodeAddedTriggerTest.testListenerAcceptance-seed#[B6F283E92F120591]) [    ] o.a.s.s.SolrDispatchFilter solr.xml found in ZooKeeper. Loading...
   [junit4]   2> 7481 INFO  (TEST-NodeAddedTriggerTest.testListenerAcceptance-seed#[B6F283E92F120591]) [    ] o.a.s.c.ZkContainer Zookeeper client=127.0.0.1:37019/solr
   [junit4]   2> 7484 INFO  (zkConnectionManagerCallback-32-thread-1) [    ] o.a.s.c.c.ConnectionManager zkClient has connected
   [junit4]   2> 7492 INFO  (zkConnectionManagerCallback-34-thread-1) [    ] o.a.s.c.c.ConnectionManager zkClient has connected
   [junit4]   2> 7499 INFO  (TEST-NodeAddedTriggerTest.testListenerAcceptance-seed#[B6F283E92F120591]) [n:127.0.0.1:40765_solr    ] o.a.s.c.c.ZkStateReader Updated live nodes from ZooKeeper... (0) -> (1)
   [junit4]   2> 7512 INFO  (TEST-NodeAddedTriggerTest.testListenerAcceptance-seed#[B6F283E92F120591]) [n:127.0.0.1:40765_solr    ] o.a.s.c.Overseer Overseer (id=null) closing
   [junit4]   2> 7520 INFO  (TEST-NodeAddedTriggerTest.testListenerAcceptance-seed#[B6F283E92F120591]) [n:127.0.0.1:40765_solr    ] o.a.s.c.TransientSolrCoreCacheDefault Allocating transient cache for 2147483647 transient cores
   [junit4]   2> 7521 INFO  (TEST-NodeAddedTriggerTest.testListenerAcceptance-seed#[B6F283E92F120591]) [n:127.0.0.1:40765_solr    ] o.a.s.c.ZkController Register node as live in ZooKeeper:/live_nodes/127.0.0.1:40765_solr
   [junit4]   2> 7528 INFO  (zkCallback-11-thread-1) [    ] o.a.s.c.c.ZkStateReader Updated live nodes from ZooKeeper... (1) -> (2)
   [junit4]   2> 7528 INFO  (zkCallback-18-thread-1) [    ] o.a.s.c.c.ZkStateReader Updated live nodes from ZooKeeper... (1) -> (2)
   [junit4]   2> 7547 INFO  (zkCallback-25-thread-1) [    ] o.a.s.c.c.ZkStateReader Updated live nodes from ZooKeeper... (1) -> (2)
   [junit4]   2> 7551 INFO  (zkCallback-33-thread-1) [    ] o.a.s.c.c.ZkStateReader Updated live nodes from ZooKeeper... (1) -> (2)
   [junit4]   2> 7950 INFO  (TEST-NodeAddedTriggerTest.testListenerAcceptance-seed#[B6F283E92F120591]) [n:127.0.0.1:40765_solr    ] o.a.s.m.r.SolrJmxReporter JMX monitoring for 'solr_40765.solr.node' (registry 'solr.node') enabled at server: com.sun.jmx.mbeanserver.JmxMBeanServer@19a1a44
   [junit4]   2> 7966 INFO  (TEST-NodeAddedTriggerTest.testListenerAcceptance-seed#[B6F283E92F120591]) [n:127.0.0.1:40765_solr    ] o.a.s.m.r.SolrJmxReporter JMX monitoring for 'solr_40765.solr.jvm' (registry 'solr.jvm') enabled at server: com.sun.jmx.mbeanserver.JmxMBeanServer@19a1a44
   [junit4]   2> 7967 INFO  (TEST-NodeAddedTriggerTest.testListenerAcceptance-seed#[B6F283E92F120591]) [n:127.0.0.1:40765_solr    ] o.a.s.m.r.SolrJmxReporter JMX monitoring for 'solr_40765.solr.jetty' (registry 'solr.jetty') enabled at server: com.sun.jmx.mbeanserver.JmxMBeanServer@19a1a44
   [junit4]   2> 7969 INFO  (TEST-NodeAddedTriggerTest.testListenerAcceptance-seed#[B6F283E92F120591]) [n:127.0.0.1:40765_solr    ] o.a.s.c.CorePropertiesLocator Found 0 core definitions underneath /home/jenkins/workspace/Lucene-Solr-master-Linux/solr/build/solr-core/test/J0/temp/solr.cloud.autoscaling.NodeAddedTriggerTest_B6F283E92F120591-001/tempDir-001/node2/.
   [junit4]   2> 7988 INFO  (zkConnectionManagerCallback-41-thread-1) [    ] o.a.s.c.c.ConnectionManager zkClient has connected
   [junit4]   2> 7990 INFO  (TEST-NodeAddedTriggerTest.testListenerAcceptance-seed#[B6F283E92F120591]) [n:127.0.0.1:40765_solr    ] o.a.s.c.c.ZkStateReader Updated live nodes from ZooKeeper... (0) -> (2)
   [junit4]   2> 7992 INFO  (TEST-NodeAddedTriggerTest.testListenerAcceptance-seed#[B6F283E92F120591]) [n:127.0.0.1:40765_solr    ] o.a.s.c.s.i.ZkClientClusterStateProvider Cluster at 127.0.0.1:37019/solr ready
   [junit4]   2> 8089 INFO  (TEST-NodeAddedTriggerTest.testListenerAcceptance-seed#[B6F283E92F120591]) [    ] o.a.s.SolrTestCaseJ4 ###Ending testListenerAcceptance
   [junit4]   2> 8117 INFO  (TEST-NodeAddedTriggerTest.testTrigger-seed#[B6F283E92F120591]) [    ] o.a.s.SolrTestCaseJ4 ###Starting testTrigger
   [junit4]   2> 8119 INFO  (TEST-NodeAddedTriggerTest.testTrigger-seed#[B6F283E92F120591]) [    ] o.e.j.s.Server jetty-9.4.10.v20180503; built: 2018-05-03T15:56:21.710Z; git: daa59876e6f384329b122929e70a80934569428c; jvm 1.8.0_162-b12
   [junit4]   2> 8120 INFO  (TEST-NodeAddedTriggerTest.testTrigger-seed#[B6F283E92F120591]) [    ] o.e.j.s.session DefaultSessionIdManager workerName=node0
   [junit4]   2> 8120 INFO  (TEST-NodeAddedTriggerTest.testTrigger-seed#[B6F283E92F120591]) [    ] o.e.j.s.session No SessionScavenger set, using defaults
   [junit4]   2> 8120 INFO  (TEST-NodeAddedTriggerTest.testTrigger-seed#[B6F283E92F120591]) [    ] o.e.j.s.session node0 Scavenging every 600000ms
   [junit4]   2> 8123 INFO  (TEST-NodeAddedTriggerTest.testTrigger-seed#[B6F283E92F120591]) [    ] o.e.j.s.h.ContextHandler Started o.e.j.s.ServletContextHandler@10785ae{/solr,null,AVAILABLE}
   [junit4]   2> 8311 INFO  (TEST-NodeAddedTriggerTest.testTrigger-seed#[B6F283E92F120591]) [    ] o.e.j.s.AbstractConnector Started ServerConnector@60d8ba{SSL,[ssl, http/1.1]}{127.0.0.1:36573}
   [junit4]   2> 8311 INFO  (TEST-NodeAddedTriggerTest.testTrigger-seed#[B6F283E92F120591]) [    ] o.e.j.s.Server Started @8338ms
   [junit4]   2> 8311 INFO  (TEST-NodeAddedTriggerTest.testTrigger-seed#[B6F283E92F120591]) [    ] o.a.s.c.s.e.JettySolrRunner Jetty properties: {hostContext=/solr, hostPort=36573}
   [junit4]   2> 8312 ERROR (TEST-NodeAddedTriggerTest.testTrigger-seed#[B6F283E92F120591]) [    ] o.a.s.u.StartupLoggingUtils Missing Java Option solr.log.dir. Logging may be missing or incomplete.
   [junit4]   2> 8312 INFO  (TEST-NodeAddedTriggerTest.testTrigger-seed#[B6F283E92F120591]) [    ] o.a.s.s.SolrDispatchFilter Using logger factory org.apache.logging.slf4j.Log4jLoggerFactory
   [junit4]   2> 8312 INFO  (TEST-NodeAddedTriggerTest.testTrigger-seed#[B6F283E92F120591]) [    ] o.a.s.s.SolrDispatchFilter  ___      _       Welcome to Apache Solr? version 8.0.0
   [junit4]   2> 8312 INFO  (TEST-NodeAddedTriggerTest.testTrigger-seed#[B6F283E92F120591]) [    ] o.a.s.s.SolrDispatchFilter / __| ___| |_ _   Starting in cloud mode on port null
   [junit4]   2> 8312 INFO  (TEST-NodeAddedTriggerTest.testTrigger-seed#[B6F283E92F120591]) [    ] o.a.s.s.SolrDispatchFilter \__ \/ _ \ | '_|  Install dir: null
   [junit4]   2> 8312 INFO  (TEST-NodeAddedTriggerTest.testTrigger-seed#[B6F283E92F120591]) [    ] o.a.s.s.SolrDispatchFilter |___/\___/_|_|    Start time: 2018-05-17T13:58:41.333Z
   [junit4]   2> 8323 INFO  (zkConnectionManagerCallback-43-thread-1) [    ] o.a.s.c.c.ConnectionManager zkClient has connected
   [junit4]   2> 8324 INFO  (TEST-NodeAddedTriggerTest.testTrigger-seed#[B6F283E92F120591]) [    ] o.a.s.s.SolrDispatchFilter solr.xml found in ZooKeeper. Loading...
   [junit4]   2> 8373 INFO  (TEST-NodeAddedTriggerTest.testTrigger-seed#[B6F283E92F120591]) [    ] o.a.s.c.ZkContainer Zookeeper client=127.0.0.1:37019/solr
   [junit4]   2> 8376 INFO  (zkConnectionManagerCallback-47-thread-1) [    ] o.a.s.c.c.ConnectionManager zkClient has connected
   [junit4]   2> 8404 INFO  (zkConnectionManagerCallback-49-thread-1) [    ] o.a.s.c.c.ConnectionManager zkClient has connected
   [junit4]   2> 8412 INFO  (TEST-NodeAddedTriggerTest.testTrigger-seed#[B6F283E92F120591]) [n:127.0.0.1:36573_solr    ] o.a.s.c.c.ZkStateReader Updated live nodes from ZooKeeper... (0) -> (2)
   [junit4]   2> 8414 INFO  (TEST-NodeAddedTriggerTest.testTrigger-seed#[B6F283E92F120591]) [n:127.0.0.1:36573_solr    ] o.a.s.c.Overseer Overseer (id=null) closing
   [junit4]   2> 8416 INFO  (TEST-NodeAddedTriggerTest.testTrigger-seed#[B6F283E92F120591]) [n:127.0.0.1:36573_solr    ] o.a.s.c.TransientSolrCoreCacheDefault Allocating transient cache for 2147483647 transient cores
   [junit4]   2> 8416 INFO  (TEST-NodeAddedTriggerTest.testTrigger-seed#[B6F283E92F120591]) [n:127.0.0.1:36573_solr    ] o.a.s.c.ZkController Register node as live in ZooKeeper:/live_nodes/127.0.0.1:36573_solr
   [junit4]   2> 8418 INFO  (zkCallback-25-thread-1) [    ] o.a.s.c.c.ZkStateReader Updated live nodes from ZooKeeper... (2) -> (3)
   [junit4]   2> 8418 INFO  (zkCallback-11-thread-1) [    ] o.a.s.c.c.ZkStateReader Updated live nodes from ZooKeeper... (2) -> (3)
   [junit4]   2> 8418 INFO  (zkCallback-18-thread-1) [    ] o.a.s.c.c.ZkStateReader Updated live nodes from ZooKeeper... (2) -> (3)
   [junit4]   2> 8423 INFO  (zkCallback-33-thread-1) [    ] o.a.s.c.c.ZkStateReader Updated live nodes from ZooKeeper... (2) -> (3)
   [junit4]   2> 8434 INFO  (zkCallback-40-thread-1) [    ] o.a.s.c.c.ZkStateReader Updated live nodes from ZooKeeper... (2) -> (3)
   [junit4]   2> 8456 INFO  (zkCallback-48-thread-1) [    ] o.a.s.c.c.ZkStateReader Updated live nodes from ZooKeeper... (2) -> (3)
   [junit4]   2> 9350 INFO  (TEST-NodeAddedTriggerTest.testTrigger-seed#[B6F283E92F120591]) [n:127.0.0.1:36573_solr    ] o.a.s.m.r.SolrJmxReporter JMX monitoring for 'solr_36573.solr.node' (registry 'solr.node') enabled at server: com.sun.jmx.mbeanserver.JmxMBeanServer@19a1a44
   [junit4]   2> 9360 INFO  (TEST-NodeAddedTriggerTest.testTrigger-seed#[B6F283E92F120591]) [n:127.0.0.1:36573_solr    ] o.a.s.m.r.SolrJmxReporter JMX monitoring for 'solr_36573.solr.jvm' (registry 'solr.jvm') enabled at server: com.sun.jmx.mbeanserver.JmxMBeanServer@19a1a44
   [junit4]   2> 9360 INFO  (TEST-NodeAddedTriggerTest.testTrigger-seed#[B6F283E92F120591]) [n:127.0.0.1:36573_solr    ] o.a.s.m.r.SolrJmxReporter JMX monitoring for 'solr_36573.solr.jetty' (registry 'solr.jetty') enabled at server: com.sun.jmx.mbeanserver.JmxMBeanServer@19a1a44
   [junit4]   2> 9362 INFO  (TEST-NodeAddedTriggerTest.testTrigger-seed#[B6F283E92F120591]) [n:127.0.0.1:36573_solr    ] o.a.s.c.CorePropertiesLocator Found 0 core definitions underneath /home/jenkins/workspace/Lucene-Solr-master-Linux/solr/build/solr-core/test/J0/temp/solr.cloud.autoscaling.NodeAddedTriggerTest_B6F283E92F120591-001/tempDir-001/node3/.
   [junit4]   2> 9367 INFO  (zkConnectionManagerCallback-56-thread-1) [    ] o.a.s.c.c.ConnectionManager zkClient has connected
   [junit4]   2> 9368 INFO  (TEST-NodeAddedTriggerTest.testTrigger-seed#[B6F283E92F120591]) [n:127.0.0.1:36573_solr    ] o.a.s.c.c.ZkStateReader Updated live nodes from ZooKeeper... (0) -> (3)
   [junit4]   2> 9369 INFO  (TEST-NodeAddedTriggerTest.testTrigger-seed#[B6F283E92F120591]) [n:127.0.0.1:36573_solr    ] o.a.s.c.s.i.ZkClientClusterStateProvider Cluster at 127.0.0.1:37019/solr ready
   [junit4]   2> 10099 INFO  (TEST-NodeAddedTriggerTest.testTrigger-seed#[B6F283E92F120591]) [    ] o.e.j.s.Server jetty-9.4.10.v20180503; built: 2018-05-03T15:56:21.710Z; git: daa59876e6f384329b122929e70a80934569428c; jvm 1.8.0_162-b12
   [junit4]   2> 10109 INFO  (TEST-NodeAddedTriggerTest.testTrigger-seed#[B6F283E92F120591]) [    ] o.e.j.s.session DefaultSessionIdManager workerName=node0
   [junit4]   2> 10109 INFO  (TEST-NodeAddedTriggerTest.testTrigger-seed#[B6F283E92F120591]) [    ] o.e.j.s.session No SessionScavenger set, using defaults
   [junit4]   2> 10110 INFO  (TEST-NodeAddedTriggerTest.testTrigger-seed#[B6F283E92F120591]) [    ] o.e.j.s.session node0 Scavenging every 660000ms
   [junit4]   2> 10110 INFO  (TEST-NodeAddedTriggerTest.testTrigger-seed#[B6F283E92F120591]) [    ] o.e.j.s.h.ContextHandler Started o.e.j.s.ServletContextHandler@13fbb87{/solr,null,AVAILABLE}
   [junit4]   2> 10111 INFO  (TEST-NodeAddedTriggerTest.testTrigger-seed#[B6F283E92F120591]) [    ] o.e.j.s.AbstractConnector Started ServerConnector@9688a3{SSL,[ssl, http/1.1]}{127.0.0.1:33579}
   [junit4]   2> 10112 INFO  (TEST-NodeAddedTriggerTest.testTrigger-seed#[B6F283E92F120591]) [    ] o.e.j.s.Server Started @10139ms
   [junit4]   2> 10112 INFO  (TEST-NodeAddedTriggerTest.testTrigger-seed#[B6F283E92F120591]) [    ] o.a.s.c.s.e.JettySolrRunner Jetty properties: {hostContext=/solr, hostPort=33579}
   [junit4]   2> 10112 ERROR (TEST-NodeAddedTriggerTest.testTrigger-seed#[B6F283E92F120591]) [    ] o.a.s.u.StartupLoggingUtils Missing Java Option solr.log.dir. Logging may be missing or incomplete.
   [junit4]   2> 10112 INFO  (TEST-NodeAddedTriggerTest.testTrigger-seed#[B6F283E92F120591]) [    ] o.a.s.s.SolrDispatchFilter Using logger factory org.apache.logging.slf4j.Log4jLoggerFactory
   [junit4]   2> 10112 INFO  (TEST-NodeAddedTriggerTest.testTrigger-seed#[B6F283E92F120591]) [    ] o.a.s.s.SolrDispatchFilter  ___      _       Welcome to Apache Solr? version 8.0.0
   [junit4]   2> 10112 INFO  (TEST-NodeAddedTriggerTest.testTrigger-seed#[B6F283E92F120591]) [    ] o.a.s.s.SolrDispatchFilter / __| ___| |_ _   Starting in cloud mode on port null
   [junit4]   2> 10113 INFO  (TEST-NodeAddedTriggerTest.testTrigger-seed#[B6F283E92F120591]) [    ] o.a.s.s.SolrDispatchFilter \__ \/ _ \ | '_|  Install dir: null
   [junit4]   2> 10113 INFO  (TEST-NodeAddedTriggerTest.testTrigger-seed#[B6F283E92F120591]) [    ] o.a.s.s.SolrDispatchFilter |___/\___/_|_|    Start time: 2018-05-17T13:58:43.134Z
   [junit4]   2> 10116 INFO  (zkConnectionManagerCallback-58-thread-1) [    ] o.a.s.c.c.ConnectionManager zkClient has connected
   [junit4]   2> 10117 INFO  (TEST-NodeAddedTriggerTest.testTrigger-seed#[B6F283E92F120591]) [    ] o.a.s.s.SolrDispatchFilter solr.xml found in ZooKeeper. Loading...
   [junit4]   2> 10152 INFO  (TEST-NodeAddedTriggerTest.testTrigger-seed#[B6F283E92F120591]) [    ] o.a.s.c.ZkContainer Zookeeper client=127.0.0.1:37019/solr
   [junit4]   2> 10176 INFO  (zkConnectionManagerCallback-62-thread-1) [    ] o.a.s.c.c.ConnectionManager zkClient has connected
   [junit4]   2> 10191 INFO  (zkConnectionManagerCallback-64-thread-1) [    ] o.a.s.c.c.ConnectionManager zkClient has connected
   [junit4]   2> 10197 INFO  (TEST-NodeAddedTriggerTest.testTrigger-seed#[B6F283E92F120591]) [n:127.0.0.1:33579_solr    ] o.a.s.c.c.ZkStateReader Updated live nodes from ZooKeeper... (0) -> (3)
   [junit4]   2> 10199 INFO  (TEST-NodeAddedTriggerTest.testTrigger-seed#[B6F283E92F120591]) [n:127.0.0.1:33579_solr    ] o.a.s.c.Overseer Overseer (id=null) closing
   [junit4]   2> 10201 INFO  (TEST-NodeAddedTriggerTest.testTrigger-seed#[B6F283E92F120591]) [n:127.0.0.1:33579_solr    ] o.a.s.c.TransientSolrCoreCacheDefault Allocating transient cache for 2147483647 transient cores
   [junit4]   2> 10201 INFO  (TEST-NodeAddedTriggerTest.testTrigger-seed#[B6F283E92F120591]) [n:127.0.0.1:33579_solr    ] o.a.s.c.ZkController Register node as live in ZooKeeper:/live_nodes/127.0.0.1:33579_solr
   [junit4]   2> 10202 INFO  (zkCallback-48-thread-1) [    ] o.a.s.c.c.ZkStateReader Updated live nodes from ZooKeeper... (3) -> (4)
   [junit4]   2> 10202 INFO  (zkCallback-40-thread-1) [    ] o.a.s.c.c.ZkStateReader Updated live nodes from ZooKeeper... (3) -> (4)
   [junit4]   2> 10203 INFO  (zkCallback-33-thread-1) [    ] o.a.s.c.c.ZkStateReader Updated live nodes from ZooKeeper... (3) -> (4)
   [junit4]   2> 10203 INFO  (zkCallback-18-thread-1) [    ] o.a.s.c.c.ZkStateReader Updated live nodes from ZooKeeper... (3) -> (4)
   [junit4]   2> 10203 INFO  (zkCallback-25-thread-1) [    ] o.a.s.c.c.ZkStateReader Updated live nodes from ZooKeeper... (3) -> (4)
   [junit4]   2> 10203 INFO  (zkCallback-11-thread-1) [    ] o.a.s.c.c.ZkStateReader Updated live nodes from ZooKeeper... (3) -> (4)
   [junit4]   2> 10217 INFO  (zkCallback-55-thread-1) [    ] o.a.s.c.c.ZkStateReader Updated live nodes from ZooKeeper... (3) -> (4)
   [junit4]   2> 10219 INFO  (zkCallback-63-thread-1) [    ] o.a.s.c.c.ZkStateReader Updated live nodes from ZooKeeper... (3) -> (4)
   [junit4]   2> 10480 INFO  (TEST-NodeAddedTriggerTest.testTrigger-seed#[B6F283E92F120591]) [n:127.0.0.1:33579_solr    ] o.a.s.m.r.SolrJmxReporter JMX monitoring for 'solr_33579.solr.node' (registry 'solr.node') enabled at server: com.sun.jmx.mbeanserver.JmxMBeanServer@19a1a44
   [junit4]   2> 10492 INFO  (TEST-NodeAddedTriggerTest.testTrigger-seed#[B6F283E92F120591]) [n:127.0.0.1:33579_solr    ] o.a.s.m.r.SolrJmxReporter JMX monitoring for 'solr_33579.solr.jvm' (registry 'solr.jvm') enabled at server: com.sun.jmx.mbeanserver.JmxMBeanServer@19a1a44
   [junit4]   2> 10492 INFO  (TEST-NodeAddedTriggerTest.testTrigger-seed#[B6F283E92F120591]) [n:127.0.0.1:33579_solr    ] o.a.s.m.r.SolrJmxReporter JMX monitoring for 'solr_33579.solr.jetty' (registry 'solr.jetty') enabled at server: com.sun.jmx.mbeanserver.JmxMBeanServer@19a1a44
   [junit4]   2> 10494 INFO  (TEST-NodeAddedTriggerTest.testTrigger-seed#[B6F283E92F120591]) [n:127.0.0.1:33579_solr    ] o.a.s.c.CorePropertiesLocator Found 0 core definitions underneath /home/jenkins/workspace/Lucene-Solr-master-Linux/solr/build/solr-core/test/J0/temp/solr.cloud.autoscaling.NodeAddedTriggerTest_B6F283E92F120591-001/tempDir-001/node4/.
   [junit4]   2> 10506 INFO  (zkConnectionManagerCallback-71-thread-1) [    ] o.a.s.c.c.ConnectionManager zkClient has connected
   [junit4]   2> 10507 INFO  (TEST-NodeAddedTriggerTest.testTrigger-seed#[B6F283E92F120591]) [n:127.0.0.1:33579_solr    ] o.a.s.c.c.ZkStateReader Updated live nodes from ZooKeeper... (0) -> (4)
   [junit4]   2> 10508 INFO  (TEST-NodeAddedTriggerTest.testTrigger-seed#[B6F283E92F120591]) [n:127.0.0.1:33579_solr    ] o.a.s.c.s.i.ZkClientClusterStateProvider Cluster at 127.0.0.1:37019/solr ready
   [junit4]   2> 16574 INFO  (TEST-NodeAddedTriggerTest.testTrigger-seed#[B6F283E92F120591]) [    ] o.e.j.s.Server jetty-9.4.10.v20180503; built: 2018-05-03T15:56:21.710Z; git: daa59876e6f384329b122929e70a80934569428c; jvm 1.8.0_162-b12
   [junit4]   2> 16576 INFO  (TEST-NodeAddedTriggerTest.testTrigger-seed#[B6F283E92F120591]) [    ] o.e.j.s.session DefaultSessionIdManager workerName=node0
   [junit4]   2> 16576 INFO  (TEST-NodeAddedTriggerTest.testTrigger-seed#[B6F283E92F120591]) [    ] o.e.j.s.session No SessionScavenger set, using defaults
   [junit4]   2> 16576 INFO  (TEST-NodeAddedTriggerTest.testTrigger-seed#[B6F283E92F120591]) [    ] o.e.j.s.session node0 Scavenging every 600000ms
   [junit4]   2> 16577 INFO  (TEST-NodeAddedTriggerTest.testTrigger-seed#[B6F283E92F120591]) [    ] o.e.j.s.h.ContextHandler Started o.e.j.s.ServletContextHandler@9c2c2a{/solr,null,AVAILABLE}
   [junit4]   2> 16578 INFO  (TEST-NodeAddedTriggerTest.testTrigger-seed#[B6F283E92F120591]) [    ] o.e.j.s.AbstractConnector Started ServerConnector@1d87b57{SSL,[ssl, http/1.1]}{127.0.0.1:45751}
   [junit4]   2> 16579 INFO  (TEST-NodeAddedTriggerTest.testTrigger-seed#[B6F283E92F120591]) [    ] o.e.j.s.Server Started @16606ms
   [junit4]   2> 16579 INFO  (TEST-NodeAddedTriggerTest.testTrigger-seed#[B6F283E92F120591]) [    ] o.a.s.c.s.e.JettySolrRunner Jetty properties: {hostContext=/solr, hostPort=45751}
   [junit4]   2> 16579 ERROR (TEST-NodeAddedTriggerTest.testTrigger-seed#[B6F283E92F120591]) [    ] o.a.s.u.StartupLoggingUtils Missing Java Option solr.log.dir. Logging may be missing or incomplete.
   [junit4]   2> 16579 INFO  (TEST-NodeAddedTriggerTest.testTrigger-seed#[B6F283E92F120591]) [    ] o.a.s.s.SolrDispatchFilter Using logger factory org.apache.logging.slf4j.Log4jLoggerFactory
   [junit4]   2> 16579 INFO  (TEST-NodeAddedTriggerTest.testTrigger-seed#[B6F283E92F120591]) [    ] o.a.s.s.SolrDispatchFilter  ___      _       Welcome to Apache Solr? version 8.0.0
   [junit4]   2> 16579 INFO  (TEST-NodeAddedTriggerTest.testTrigger-seed#[B6F283E92F120591]) [    ] o.a.s.s.SolrDispatchFilter / __| ___| |_ _   Starting in cloud mode on port null
   [junit4]   2> 16579 INFO  (TEST-NodeAddedTriggerTest.testTrigger-seed#[B6F283E92F120591]) [    ] o.a.s.s.SolrDispatchFilter \__ \/ _ \ | '_|  Install dir: null
   [junit4]   2> 16580 INFO  (TEST-NodeAddedTriggerTest.testTrigger-seed#[B6F283E92F120591]) [    ] o.a.s.s.SolrDispatchFilter |___/\___/_|_|    Start time: 2018-05-17T13:58:49.601Z
   [junit4]   2> 16582 INFO  (zkConnectionManagerCallback-73-thread-1) [    ] o.a.s.c.c.ConnectionManager zkClient has connected
   [junit4]   2> 16584 INFO  (TEST-NodeAddedTriggerTest.testTrigger-seed#[B6F283E92F120591]) [    ] o.a.s.s.SolrDispatchFilter solr.xml found in ZooKeeper. Loading...
   [junit4]   2> 16605 INFO  (TEST-NodeAddedTriggerTest.testTrigger-seed#[B6F283E92F120591]) [    ] o.a.s.c.ZkContainer Zookeeper client=127.0.0.1:37019/solr
   [junit4]   2> 16608 INFO  (zkConnectionManagerCallback-77-thread-1) [    ] o.a.s.c.c.ConnectionManager zkClient has connected
   [junit4]   2> 16617 INFO  (zkConnectionManagerCallback-79-thread-1) [    ] o.a.s.c.c.ConnectionManager zkClient has connected
   [junit4]   2> 16630 INFO  (TEST-NodeAddedTriggerTest.testTrigger-seed#[B6F283E92F120591]) [n:127.0.0.1:45751_solr    ] o.a.s.c.c.ZkStateReader Updated live nodes from ZooKeeper... (0) -> (4)
   [junit4]   2> 16632 INFO  (TEST-NodeAddedTriggerTest.testTrigger-seed#[B6F283E92F120591]) [n:127.0.0.1:45751_solr    ] o.a.s.c.Overseer Overseer (id=null) closing
   [junit4]   2> 16634 INFO  (TEST-NodeAddedTriggerTest.testTrigger-seed#[B6F283E92F120591]) [n:127.0.0.1:45751_solr    ] o.a.s.c.TransientSolrCoreCacheDefault Allocating transient cache for 2147483647 transient cores
   [junit4]   2> 16634 INFO  (TEST-NodeAddedTriggerTest.testTrigger-seed#[B6F283E92F120591]) [n:127.0.0.1:45751_solr    ] o.a.s.c.ZkController Register node as live in ZooKeeper:/live_nodes/127.0.0.1:45751_solr
   [junit4]   2> 16636 INFO  (zkCallback-25-thread-1) [    ] o.a.s.c.c.ZkStateReader Updated live nodes from ZooKeeper... (4) -> (5)
   [junit4]   2> 16636 INFO  (zkCallback-48-thread-1) [    ] o.a.s.c.c.ZkStateReader Updated live nodes from ZooKeeper... (4) -> (5)
   [junit4]   2> 16636 INFO  (zkCallback-40-thread-1) [    ] o.a.s.c.c.ZkStateReader Updated live nodes from ZooKeeper... (4) -> (5)
   [junit4]   2> 16636 INFO  (zkCallback-33-thread-1) [    ] o.a.s.c.c.ZkStateReader Updated live nodes from ZooKeeper... (4) -> (5)
   [junit4]   2> 16636 INFO  (zkCallback-11-thread-1) [    ] o.a.s.c.c.ZkStateReader Updated live nodes from ZooKeeper... (4) -> (5)
   [junit4]   2> 16638 INFO  (zkCallback-55-thread-1) [    ] o.a.s.c.c.ZkStateReader Updated live nodes from ZooKeeper... (4) -> (5)
   [junit4]   2> 16638 INFO  (zkCallback-63-thread-1) [    ] o.a.s.c.c.ZkStateReader Updated live nodes from ZooKeeper... (4) -> (5)
   [junit4]   2> 16638 INFO  (zkCallback-18-thread-1) [    ] o.a.s.c.c.ZkStateReader Updated live nodes from ZooKeeper... (4) -> (5)
   [junit4]   2> 16643 INFO  (zkCallback-70-thread-1) [    ] o.a.s.c.c.ZkStateReader Updated live nodes from ZooKeeper... (4) -> (5)
   [junit4]   2> 16645 INFO  (zkCallback-78-thread-1) [    ] o.a.s.c.c.ZkStateReader Updated live nodes from ZooKeeper... (4) -> (5)
   [junit4]   2> 17833 INFO  (TEST-NodeAddedTriggerTest.testTrigger-seed#[B6F283E92F120591]) [n:127.0.0.1:45751_solr    ] o.a.s.m.r.SolrJmxReporter JMX monitoring for 'solr_45751.solr.node' (registry 'solr.node') enabled at server: com.sun.jmx.mbeanserver.JmxMBeanServer@19a1a44
   [junit4]   2> 17845 INFO  (TEST-NodeAddedTriggerTest.testTrigger-seed#[B6F283E92F120591]) [n:127.0.0.1:45751_solr    ] o.a.s.m.r.SolrJmxReporter JMX monitoring for 'solr_45751.solr.jvm' (registry 'solr.jvm') enabled at server: com.sun.jmx.mbeanserver.JmxMBeanServer@19a1a44
   [junit4]   2> 17845 INFO  (TEST-NodeAddedTriggerTest.testTrigger-seed#[B6F283E92F120591]) [n:127.0.0.1:45751_solr    ] o.a.s.m.r.SolrJmxReporter JMX monitoring for 'solr_45751.solr.jetty' (registry 'solr.jetty') enabled at server: com.sun.jmx.mbeanserver.JmxMBeanServer@19a1a44
   [junit4]   2> 17847 INFO  (TEST-NodeAddedTriggerTest.testTrigger-seed#[B6F283E92F120591]) [n:127.0.0.1:45751_solr    ] o.a.s.c.CorePropertiesLocator Found 0 core definitions underneath /home/jenkins/workspace/Lucene-Solr-master-Linux/solr/build/solr-core/test/J0/temp/solr.cloud.autoscaling.NodeAddedTriggerTest_B6F283E92F120591-001/tempDir-001/node5/.
   [junit4]   2> 17850 INFO  (zkConnectionManagerCallback-86-thread-1) [    ] o.a.s.c.c.ConnectionManager zkClient has connected
   [junit4]   2> 17852 INFO  (TEST-NodeAddedTriggerTest.testTrigger-seed#[B6F283E92F120591]) [n:127.0.0.1:45751_solr    ] o.a.s.c.c.ZkStateReader Updated live nodes from ZooKeeper... (0) -> (5)
   [junit4]   2> 17853 INFO  (TEST-NodeAddedTriggerTest.testTrigger-seed#[B6F283E92F120591]) [n:127.0.0.1:45751_solr    ] o.a.s.c.s.i.ZkClientClusterStateProvider Cluster at 127.0.0.1:37019/solr ready
   [junit4]   2> 17930 INFO  (TEST-NodeAddedTriggerTest.testTrigger-seed#[B6F283E92F120591]) [    ] o.e.j.s.AbstractConnector Stopped ServerConnector@1d87b57{SSL,[ssl, http/1.1]}{127.0.0.1:0}
   [junit4]   2> 17933 INFO  (TEST-NodeAddedTriggerTest.testTrigger-seed#[B6F283E92F120591]) [    ] o.a.s.c.CoreContainer Shutting down CoreContainer instance=17797992
   [junit4]   2> 17933 INFO  (TEST-NodeAddedTriggerTest.testTrigger-seed#[B6F283E92F120591]) [    ] o.a.s.m.SolrMetricManager Closing metric reporters for registry=solr.node, tag=null
   [junit4]   2> 17934 INFO  (TEST-NodeAddedTriggerTest.testTrigger-seed#[B6F283E92F120591]) [    ] o.a.s.m.r.SolrJmxReporter Closing reporter [org.apache.solr.metrics.reporters.SolrJmxReporter@1b19fa3: rootName = solr_45751, domain = solr.node, service url = null, agent id = null] for registry solr.node / com.codahale.metrics.MetricRegistry@15b9dcd
   [junit4]   2> 17943 INFO  (TEST-NodeAddedTriggerTest.testTrigger-seed#[B6F283E92F120591]) [    ] o.a.s.m.SolrMetricManager Closing metric reporters for registry=solr.jvm, tag=null
   [junit4]   2> 17943 INFO  (TEST-NodeAddedTriggerTest.testTrigger-seed#[B6F283E92F120591]) [    ] o.a.s.m.r.SolrJmxReporter Closing reporter [org.apache.solr.metrics.reporters.SolrJmxReporter@1cef3d6: rootName = solr_45751, domain = solr.jvm, service url = null, agent id = null] for registry solr.jvm / com.codahale.metrics.MetricRegistry@1f996ab
   [junit4]   2> 17948 INFO  (TEST-NodeAddedTriggerTest.testTrigger-seed#[B6F283E92F120591]) [    ] o.a.s.m.SolrMetricManager Closing metric reporters for registry=solr.jetty, tag=null
   [junit4]   2> 17949 INFO  (TEST-NodeAddedTriggerTest.testTrigger-seed#[B6F283E92F120591]) [    ] o.a.s.m.r.SolrJmxReporter Closing reporter [org.apache.solr.metrics.reporters.SolrJmxReporter@12b0f02: rootName = solr_45751, domain = solr.jetty, service url = null, agent id = null] for registry solr.jetty / com.codahale.metrics.MetricRegistry@e5d524
   [junit4]   2> 17951 INFO  (TEST-NodeAddedTriggerTest.testTrigger-seed#[B6F283E92F120591]) [    ] o.a.s.c.ZkController Remove node as live in ZooKeeper:/live_nodes/127.0.0.1:45751_solr
   [junit4]   2> 17952 INFO  (zkCallback-25-thread-1) [    ] o.a.s.c.c.ZkStateReader Updated live nodes from ZooKeeper... (5) -> (4)
   [junit4]   2> 17953 INFO  (zkCallback-48-thread-1) [    ] o.a.s.c.c.ZkStateReader Updated live nodes from ZooKeeper... (5) -> (4)
   [junit4]   2> 17953 INFO  (zkCallback-63-thread-1) [    ] o.a.s.c.c.ZkStateReader Updated live nodes from ZooKeeper... (5) -> (4)
   [junit4]   2> 17953 INFO  (zkCallback-18-thread-1) [    ] o.a.s.c.c.ZkStateReader Updated live nodes from ZooKeeper... (5) -> (4)
   [junit4]   2> 17953 INFO  (zkCallback-70-thread-1) [    ] o.a.s.c.c.ZkStateReader Updated live nodes from ZooKeeper... (5) -> (4)
   [junit4]   2> 17954 INFO  (zkCallback-55-thread-1) [    ] o.a.s.c.c.ZkStateReader Updated live nodes from ZooKeeper... (5) -> (4)
   [junit4]   2> 17954 INFO  (zkCallback-40-thread-1) [    ] o.a.s.c.c.ZkStateReader Updated live nodes from ZooKeeper... (5) -> (4)
   [junit4]   2> 17954 INFO  (TEST-NodeAddedTriggerTest.testTrigger-seed#[B6F283E92F120591]) [    ] o.a.s.m.SolrMetricManager Closing metric reporters for registry=solr.cluster, tag=null
   [junit4]   2> 17954 INFO  (zkCallback-33-thread-1) [    ] o.a.s.c.c.ZkStateReader Updated live nodes from ZooKeeper... (5) -> (4)
   [junit4]   2> 17954 INFO  (zkCallback-11-thread-1) [    ] o.a.s.c.c.ZkStateReader Updated live nodes from ZooKeeper... (5) -> (4)
   [junit4]   2> 17955 INFO  (zkCallback-78-thread-1) [    ] o.a.s.c.c.ZkStateReader Updated live nodes from ZooKeeper... (5) -> (4)
   [junit4]   2> 17966 INFO  (zkCallback-85-thread-1) [    ] o.a.s.c.c.ZkStateReader Updated live nodes from ZooKeeper... (5) -> (4)
   [junit4]   2> 17981 INFO  (TEST-NodeAddedTriggerTest.testTrigger-seed#[B6F283E92F120591]) [    ] o.e.j.s.h.ContextHandler Stopped o.e.j.s.ServletContextHandler@9c2c2a{/solr,null,UNAVAILABLE}
   [junit4]   2> 17982 INFO  (TEST-NodeAddedTriggerTest.testTrigger-seed#[B6F283E92F120591]) [    ] o.e.j.s.session node0 Stopped scavenging
   [junit4]   2> 22984 INFO  (TEST-NodeAddedTriggerTest.testTrigger-seed#[B6F283E92F120591]) [    ] o.a.s.SolrTestCaseJ4 ###Ending testTrigger
   [junit4]   2> 23005 INFO  (TEST-NodeAddedTriggerTest.testActionLifecycle-seed#[B6F283E92F120591]) [    ] o.a.s.SolrTestCaseJ4 ###Starting testActionLifecycle
   [junit4]   2> 23007 INFO  (TEST-NodeAddedTriggerTest.testActionLifecycle-seed#[B6F283E92F120591]) [    ] o.a.s.SolrTestCaseJ4 ###Ending testActionLifecycle
   [junit4]   2> 23027 INFO  (TEST-NodeAddedTriggerTest.testRestoreState-seed#[B6F283E92F120591]) [    ] o.a.s.SolrTestCaseJ4 ###Starting testRestoreState
   [junit4]   2> 23032 INFO  (TEST-NodeAddedTriggerTest.testRestoreState-seed#[B6F283E92F120591]) [    ] o.e.j.s.Server jetty-9.4.10.v20180503; built: 2018-05-03T15:56:21.710Z; git: daa59876e6f384329b122929e70a80934569428c; jvm 1.8.0_162-b12
   [junit4]   2> 23039 INFO  (TEST-NodeAddedTriggerTest.testRestoreState-seed#[B6F283E92F120591]) [    ] o.e.j.s.session DefaultSessionIdManager workerName=node0
   [junit4]   2> 23039 INFO  (TEST-NodeAddedTriggerTest.testRestoreState-seed#[B6F283E92F120591]) [    ] o.e.j.s.session No SessionScavenger set, using defaults
   [junit4]   2> 23039 INFO  (TEST-NodeAddedTriggerTest.testRestoreState-seed#[B6F283E92F120591]) [    ] o.e.j.s.session node0 Scavenging every 660000ms
   [junit4]   2> 23040 INFO  (TEST-NodeAddedTriggerTest.testRestoreState-seed#[B6F283E92F120591]) [    ] o.e.j.s.h.ContextHandler Started o.e.j.s.ServletContextHandler@154f7c4{/solr,null,AVAILABLE}
   [junit4]   2> 23043 INFO  (TEST-NodeAddedTriggerTest.testRestoreState-seed#[B6F283E92F120591]) [    ] o.e.j.s.AbstractConnector Started ServerConnector@1c30b48{SSL,[ssl, http/1.1]}{127.0.0.1:44717}
   [junit4]   2> 23047 INFO  (TEST-NodeAddedTriggerTest.testRestoreState-seed#[B6F283E92F120591]) [    ] o.e.j.s.Server Started @23074ms
   [junit4]   2> 23047 INFO  (TEST-NodeAddedTriggerTest.testRestoreState-seed#[B6F283E92F120591]) [    ] o.a.s.c.s.e.JettySolrRunner Jetty properties: {hostContext=/solr, hostPort=44717}
   [junit4]   2> 23047 ERROR (TEST-NodeAddedTriggerTest.testRestoreState-seed#[B6F283E92F120591]) [    ] o.a.s.u.StartupLoggingUtils Missing Java Option solr.log.dir. Logging may be missing or incomplete.
   [junit4]   2> 23047 INFO  (TEST-NodeAddedTriggerTest.testRestoreState-seed#[B6F283E92F120591]) [    ] o.a.s.s.SolrDispatchFilter Using logger factory org.apache.logging.slf4j.Log4jLoggerFactory
   [junit4]   2> 23047 INFO  (TEST-NodeAddedTriggerTest.testRestoreState-seed#[B6F283E92F120591]) [    ] o.a.s.s.SolrDispatchFilter  ___      _       Welcome to Apache Solr? version 8.0.0
   [junit4]   2> 23048 INFO  (TEST-NodeAddedTriggerTest.testRestoreState-seed#[B6F283E92F120591]) [    ] o.a.s.s.SolrDispatchFilter / __| ___| |_ _   Starting in cloud mode on port null
   [junit4]   2> 23048 INFO  (TEST-NodeAddedTriggerTest.testRestoreState-seed#[B6F283E92F120591]) [    ] o.a.s.s.SolrDispatchFilter \__ \/ _ \ | '_|  Install dir: null
   [junit4]   2> 23048 INFO  (TEST-NodeAddedTriggerTest.testRestoreState-seed#[B6F283E92F120591]) [    ] o.a.s.s.SolrDispatchFilter |___/\___/_|_|    Start time: 2018-05-17T13:58:56.069Z
   [junit4]   2> 23050 INFO  (zkConnectionManagerCallback-88-thread-1) [    ] o.a.s.c.c.ConnectionManager zkClient has connected
   [junit4]   2> 23051 INFO  (TEST-NodeAddedTriggerTest.testRestoreState-seed#[B6F283E92F120591]) [    ] o.a.s.s.SolrDispatchFilter solr.xml found in ZooKeeper. Loading...
   [junit4]   2> 23065 INFO  (TEST-NodeAddedTriggerTest.testRestoreState-seed#[B6F283E92F120591]) [    ] o.a.s.c.ZkContainer Zookeeper client=127.0.0.1:37019/solr
   [junit4]   2> 23067 INFO  (zkConnectionManagerCallback-92-thread-1) [    ] o.a.s.c.c.ConnectionManager zkClient has connected
   [junit4]   2> 23075 INFO  (zkConnectionManagerCallback-94-thread-1) [    ] o.a.s.c.c.ConnectionManager zkClient has connected
   [junit4]   2> 23081 INFO  (TEST-NodeAddedTriggerTest.testRestoreState-seed#[B6F283E92F120591]) [n:127.0.0.1:44717_solr    ] o.a.s.c.c.ZkStateReader Updated live nodes from ZooKeeper... (0) -> (4)
   [junit4]   2> 23084 INFO  (TEST-NodeAddedTriggerTest.testRestoreState-seed#[B6F283E92F120591]) [n:127.0.0.1:44717_solr    ] o.a.s.c.Overseer Overseer (id=null) closing
   [junit4]   2> 23086 INFO  (TEST-NodeAddedTriggerTest.testRestoreState-seed#[B6F283E92F120591]) [n:127.0.0.1:44717_solr    ] o.a.s.c.TransientSolrCoreCacheDefault Allocating transient cache for 2147483647 transient cores
   [junit4]   2> 23086 INFO  (TEST-NodeAddedTriggerTest.testRestoreState-seed#[B6F283E92F120591]) [n:127.0.0.1:44717_solr    ] o.a.s.c.ZkController Register node as live in ZooKeeper:/live_nodes/127.0.0.1:44717_solr
   [junit4]   2> 23088 INFO  (zkCallback-11-thread-1) [    ] o.a.s.c.c.ZkStateReader Updated live nodes from ZooKeeper... (4) -> (5)
   [junit4]   2> 23088 INFO  (zkCallback-18-thread-1) [    ] o.a.s.c.c.ZkStateReader Updated live nodes from ZooKeeper... (4) -> (5)
   [junit4]   2> 23088 INFO  (zkCallback-48-thread-1) [    ] o.a.s.c.c.ZkStateReader Updated live nodes from ZooKeeper... (4) -> (5)
   [junit4]   2> 23088 INFO  (zkCallback-55-thread-1) [    ] o.a.s.c.c.ZkStateReader Updated live nodes from ZooKeeper... (4) -> (5)
   [junit4]   2> 23088 INFO  (zkCallback-33-thread-1) [    ] o.a.s.c.c.ZkStateReader Updated live nodes from ZooKeeper... (4) -> (5)
   [junit4]   2> 23088 INFO  (zkCallback-70-thread-1) [    ] o.a.s.c.c.ZkStateReader Updated live nodes from ZooKeeper... (4) -> (5)
   [junit4]   2> 23088 INFO  (zkCallback-40-thread-1) [    ] o.a.s.c.c.ZkStateReader Updated live nodes from ZooKeeper... (4) -> (5)
   [junit4]   2> 23088 INFO  (zkCallback-63-thread-1) [    ] o.a.s.c.c.ZkStateReader Updated live nodes from ZooKeeper... (4) -> (5)
   [junit4]   2> 23088 INFO  (zkCallback-25-thread-1) [    ] o.a.s.c.c.ZkStateReader Updated live nodes from ZooKeeper... (4) -> (5)
   [junit4]   2> 23091 INFO  (zkCallback-93-thread-1) [    ] o.a.s.c.c.ZkStateReader Updated live nodes from ZooKeeper... (4) -> (5)
   [junit4]   2> 24301 INFO  (TEST-NodeAddedTriggerTest.testRestoreState-seed#[B6F283E92F120591]) [n:127.0.0.1:44717_solr    ] o.a.s.m.r.SolrJmxReporter JMX monitoring for 'solr_44717.solr.node' (registry 'solr.node') enabled at server: com.sun.jmx.mbeanserver.JmxMBeanServer@19a1a44
   [junit4]   2> 24311 INFO  (TEST-NodeAddedTriggerTest.testRestoreState-seed#[B6F283E92F120591]) [n:127.0.0.1:44717_solr    ] o.a.s.m.r.SolrJmxReporter JMX monitoring for 'solr_44717.solr.jvm' (registry 'solr.jvm') enabled at server: com.sun.jmx.mbeanserver.JmxMBeanServer@19a1a44
   [junit4]   2> 24312 INFO  (TEST-NodeAddedTriggerTest.testRestoreState-seed#[B6F283E92F120591]) [n:127.0.0.1:44717_solr    ] o.a.s.m.r.SolrJmxReporter JMX monitoring for 'solr_44717.solr.jetty' (registry 'solr.jetty') enabled at server: com.sun.jmx.mbeanserver.JmxMBeanServer@19a1a44
   [junit4]   2> 24313 INFO  (TEST-NodeAddedTriggerTest.testRestoreState-seed#[B6F283E92F120591]) [n:127.0.0.1:44717_solr    ] o.a.s.c.CorePropertiesLocator Found 0 core definitions underneath /home/jenkins/workspace/Lucene-Solr-master-Linux/solr/build/solr-core/test/J0/temp/solr.cloud.autoscaling.NodeAddedTriggerTest_B6F283E92F120591-001/tempDir-001/node6/.
   [junit4]   2> 24351 INFO  (zkConnectionManagerCallback-101-thread-1) [    ] o.a.s.c.c.ConnectionManager zkClient has connected
   [junit4]   2> 24356 INFO  (TEST-NodeAddedTriggerTest.testRestoreState-seed#[B6F283E92F120591]) [n:127.0.0.1:44717_solr    ] o.a.s.c.c.ZkStateReader Updated live nodes from ZooKeeper... (0) -> (5)
   [junit4]   2> 24357 INFO  (TEST-NodeAddedTriggerTest.testRestoreState-seed#[B6F283E92F120591]) [n:127.0.0.1:44717_solr    ] o.a.s.c.s.i.ZkClientClusterStateProvider Cluster at 127.0.0.1:37019/solr ready
   [junit4]   2> 24404 INFO  (TEST-NodeAddedTriggerTest.testRestoreState-seed#[B6F283E92F120591]) [    ] o.a.s.SolrTestCaseJ4 ###Ending testRestoreState
   [junit4]   2> NOTE: reproduce with: ant test  -Dtestcase=NodeAddedTriggerTest -Dtests.method=testRestoreState -Dtests.seed=B6F283E92F120591 -Dtests.multiplier=3 -Dtests.slow=true -Dtests.locale=it-IT -Dtests.timezone=Asia/Ulan_Bator -Dtests.asserts=true -Dtests.file.encoding=ISO-8859-1
   [junit4] FAILURE 1.40s J0 | NodeAddedTriggerTest.testRestoreState <<<
   [junit4]    > Throwable #1: java.lang.AssertionError: Did not expect the processor to fire on first run! event={
   [junit4]    >   "id":"681c412bf4fc4T37uqtv7cvsjb0dyfvp6f5aphr",
   [junit4]    >   "source":"node_added_trigger",
   [junit4]    >   "eventTime":1831528988364740,
   [junit4]    >   "eventType":"NODEADDED",
   [junit4]    >   "properties":{
   [junit4]    >     "eventTimes":[
   [junit4]    >       1831528988364740,
   [junit4]    >       1831528988367973,
   [junit4]    >       1831528988368391,
   [junit4]    >       1831528988368676],
   [junit4]    >     "nodeNames":[
   [junit4]    >       "127.0.0.1:33579_solr",
   [junit4]    >       "127.0.0.1:36573_solr",
   [junit4]    >       "127.0.0.1:34389_solr",
   [junit4]    >       "127.0.0.1:40765_solr"]}}
   [junit4]    > 	at __randomizedtesting.SeedInfo.seed([B6F283E92F120591:785C277AD72B7D87]:0)
   [junit4]    > 	at org.apache.solr.cloud.autoscaling.NodeAddedTriggerTest.lambda$new$0(NodeAddedTriggerTest.java:49)
   [junit4]    > 	at org.apache.solr.cloud.autoscaling.NodeAddedTrigger.run(NodeAddedTrigger.java:161)
   [junit4]    > 	at org.apache.solr.cloud.autoscaling.NodeAddedTriggerTest.testRestoreState(NodeAddedTriggerTest.java:257)
   [junit4]    > 	at java.lang.Thread.run(Thread.java:748)
   [junit4]   2> 24409 INFO  (jetty-closer-2-thread-1) [    ] o.e.j.s.AbstractConnector Stopped ServerConnector@a72088{SSL,[ssl, http/1.1]}{127.0.0.1:0}
   [junit4]   2> 24409 INFO  (jetty-closer-2-thread-1) [    ] o.a.s.c.CoreContainer Shutting down CoreContainer instance=15569281
   [junit4]   2> 24411 INFO  (jetty-closer-2-thread-1) [    ] o.a.s.m.SolrMetricManager Closing metric reporters for registry=solr.node, tag=null
   [junit4]   2> 24411 INFO  (jetty-closer-2-thread-1) [    ] o.a.s.m.r.SolrJmxReporter Closing reporter [org.apache.solr.metrics.reporters.SolrJmxReporter@709418: rootName = solr_34389, domain = solr.node, service url = null, agent id = null] for registry solr.node / com.codahale.metrics.MetricRegistry@e3bb9d
   [junit4]   2> 24412 INFO  (jetty-closer-2-thread-3) [    ] o.e.j.s.AbstractConnector Stopped ServerConnector@60d8ba{SSL,[ssl, http/1.1]}{127.0.0.1:0}
   [junit4]   2> 24415 INFO  (jetty-closer-2-thread-3) [    ] o.a.s.c.CoreContainer Shutting down CoreContainer instance=859905
   [junit4]   2> 24415 INFO  (jetty-closer-2-thread-2) [    ] o.e.j.s.AbstractConnector Stopped ServerConnector@13fa970{SSL,[ssl, http/1.1]}{127.0.0.1:0}
   [junit4]   2> 24419 INFO  (jetty-closer-2-thread-3) [    ] o.a.s.m.SolrMetricManager Closing metric reporters for registry=solr.node, tag=null
   [junit4]   2> 24419 INFO  (jetty-closer-2-thread-2) [    ] o.a.s.c.CoreContainer Shutting down CoreContainer instance=3688334
   [junit4]   2> 24419 INFO  (jetty-closer-2-thread-2) [    ] o.a.s.m.SolrMetricManager Closing metric reporters for registry=solr.node, tag=null
   [junit4]   2> 24422 INFO  (jetty-closer-2-thread-1) [    ] o.a.s.m.SolrMetricManager Closing metric reporters for registry=solr.jvm, tag=null
   [junit4]   2> 24422 INFO  (jetty-closer-2-thread-1) [    ] o.a.s.m.r.SolrJmxReporter Closing reporter [org.apache.solr.metrics.reporters.SolrJmxReporter@13533dc: rootName = solr_34389, domain = solr.jvm, service url = null, agent id = null] for registry solr.jvm / com.codahale.metrics.MetricRegistry@1f996ab
   [junit4]   2> 24423 INFO  (jetty-closer-2-thread-3) [    ] o.a.s.m.r.SolrJmxReporter Closing reporter [org.apache.solr.metrics.reporters.SolrJmxReporter@1e1077c: rootName = solr_36573, domain = solr.node, service url = null, agent id = null] for registry solr.node / com.codahale.metrics.MetricRegistry@d50395
   [junit4]   2> 24423 INFO  (jetty-closer-2-thread-2) [    ] o.a.s.m.r.SolrJmxReporter Closing reporter [org.apache.solr.metrics.reporters.SolrJmxReporter@19e82cb: rootName = solr_40765, domain = solr.node, service url = null, agent id = null] for registry solr.node / com.codahale.metrics.MetricRegistry@e73752
   [junit4]   2> 24425 INFO  (jetty-closer-2-thread-5) [    ] o.e.j.s.AbstractConnector Stopped ServerConnector@1c30b48{SSL,[ssl, http/1.1]}{127.0.0.1:0}
   [junit4]   2> 24425 INFO  (jetty-closer-2-thread-4) [    ] o.e.j.s.AbstractConnector Stopped ServerConnector@9688a3{SSL,[ssl, http/1.1]}{127.0.0.1:0}
   [junit4]   2> 24426 INFO  (jetty-closer-2-thread-4) [    ] o.a.s.c.CoreContainer Shutting down CoreContainer instance=13369376
   [junit4]   2> 24426 INFO  (jetty-closer-2-thread-4) [    ] o.a.s.m.SolrMetricManager Closing metric reporters for registry=solr.node, tag=null
   [junit4]   2> 24426 INFO  (jetty-closer-2-thread-4) [    ] o.a.s.m.r.SolrJmxReporter Closing reporter [org.apache.solr.metrics.reporters.SolrJmxReporter@8ef052: rootName = solr_33579, domain = solr.node, service url = null, agent id = null] for registry solr.node / com.codahale.metrics.MetricRegistry@13a3a35
   [junit4]   2> 24432 INFO  (jetty-closer-2-thread-5) [    ] o.a.s.c.CoreContainer Shutting down CoreContainer instance=15859268
   [junit4]   2> 24432 INFO  (jetty-closer-2-thread-5) [    ] o.a.s.m.SolrMetricManager Closing metric reporters for registry=solr.node, tag=null
   [junit4]   2> 24432 INFO  (jetty-closer-2-thread-5) [    ] o.a.s.m.r.SolrJmxReporter Closing reporter [org.apache.solr.metrics.reporters.SolrJmxReporter@1119104: rootName = solr_44717, domain = solr.node, service url = null, agent id = null] for registry solr.node / com.codahale.metrics.MetricRegistry@194b586
   [junit4]   2> 24446 INFO  (jetty-closer-2-thread-1) [    ] o.a.s.m.SolrMetricManager Closing metric reporters for registry=solr.jetty, tag=null
   [junit4]   2> 24446 INFO  (jetty-closer-2-thread-1) [    ] o.a.s.m.r.SolrJmxReporter Closing reporter [org.apache.solr.metrics.reporters.SolrJmxReporter@14c5a0e: rootName = solr_34389, domain = solr.jetty, service url = null, agent id = null] for registry solr.jetty / com.codahale.metrics.MetricRegistry@e5d524
   [junit4]   2> 24447 INFO  (jetty-closer-2-thread-1) [    ] o.a.s.c.ZkController Remove node as live in ZooKeeper:/live_nodes/127.0.0.1:34389_solr
   [junit4]   2> 24449 INFO  (zkCallback-48-thread-1) [    ] o.a.s.c.c.ZkStateReader Updated live nodes from ZooKeeper... (5) -> (4)
   [junit4]   2> 24449 INFO  (zkCallback-40-thread-1) [    ] o.a.s.c.c.ZkStateReader Updated live nodes from ZooKeeper... (5) -> (4)
   [junit4]   2> 24449 INFO  (zkCallback-63-thread-1) [    ] o.a.s.c.c.ZkStateReader Updated live nodes from ZooKeeper... (5) -> (4)
   [junit4]   2> 24449 INFO  (zkCallback-18-thread-1) [    ] o.a.s.c.c.ZkStateReader Updated live nodes from ZooKeeper... (5) -> (4)
   [junit4]   2> 24449 INFO  (zkCallback-70-thread-1) [    ] o.a.s.c.c.ZkStateReader Updated live nodes from ZooKeeper... (5) -> (4)
   [junit4]   2> 24449 INFO  (zkCallback-33-thread-1) [    ] o.a.s.c.c.ZkStateReader Updated live nodes from ZooKeeper... (5) -> (4)
   [junit4]   2> 24449 INFO  (jetty-closer-2-thread-1) [    ] o.a.s.m.SolrMetricManager Closing metric reporters for registry=solr.cluster, tag=null
   [junit4]   2> 24450 INFO  (jetty-closer-2-thread-1) [    ] o.a.s.c.TransientSolrCoreCacheDefault Allocating transient cache for 2147483647 transient cores
   [junit4]   2> 24450 INFO  (zkCallback-11-thread-1) [    ] o.a.s.c.c.ZkStateReader Updated live nodes from ZooKeeper... (5) -> (4)
   [junit4]   2> 24451 INFO  (zkCallback-55-thread-1) [    ] o.a.s.c.c.ZkStateReader Updated live nodes from ZooKeeper... (5) -> (4)
   [junit4]   2> 24455 INFO  (jetty-closer-2-thread-1) [    ] o.a.s.c.Overseer Overseer (id=72177623813980163-127.0.0.1:34389_solr-n_0000000000) closing
   [junit4]   2> 24455 INFO  (OverseerStateUpdate-72177623813980163-127.0.0.1:34389_solr-n_0000000000) [    ] o.a.s.c.Overseer Overseer Loop exiting : 127.0.0.1:34389_solr
   [junit4]   2> 24455 INFO  (zkCallback-93-thread-1) [    ] o.a.s.c.c.ZkStateReader Updated live nodes from ZooKeeper... (5) -> (4)
   [junit4]   2> 24461 INFO  (jetty-closer-2-thread-4) [    ] o.a.s.m.SolrMetricManager Closing metric reporters for registry=solr.jvm, tag=null
   [junit4]   2> 24461 INFO  (jetty-closer-2-thread-2) [    ] o.a.s.m.SolrMetricManager Closing metric reporters for registry=solr.jvm, tag=null
   [junit4]   2> 24461 INFO  (jetty-closer-2-thread-4) [    ] o.a.s.m.r.SolrJmxReporter Closing reporter [org.apache.solr.metrics.reporters.SolrJmxReporter@13a0e5b: rootName = solr_33579, domain = solr.jvm, service url = null, agent id = null] for registry solr.jvm / com.codahale.metrics.MetricRegistry@1f996ab
   [junit4]   2> 24461 INFO  (jetty-closer-2-thread-2) [    ] o.a.s.m.r.SolrJmxReporter Closing reporter [org.apache.solr.metrics.reporters.SolrJmxReporter@12cc89e: rootName = solr_40765, domain = solr.jvm, service url = null, agent id = null] for registry solr.jvm / com.codahale.metrics.MetricRegistry@1f996ab
   [junit4]   2> 24461 INFO  (jetty-closer-2-thread-3) [    ] o.a.s.m.SolrMetricManager Closing metric reporters for registry=solr.jvm, tag=null
   [junit4]   2> 24461 INFO  (jetty-closer-2-thread-3) [    ] o.a.s.m.r.SolrJmxReporter Closing reporter [org.apache.solr.metrics.reporters.SolrJmxReporter@71773a: rootName = solr_36573, domain = solr.jvm, service url = null, agent id = null] for registry solr.jvm / com.codahale.metrics.MetricRegistry@1f996ab
   [junit4]   2> 24463 INFO  (zkCallback-100-thread-1) [    ] o.a.s.c.c.ZkStateReader Updated live nodes from ZooKeeper... (5) -> (4)
   [junit4]   2> 24463 WARN  (OverseerAutoScalingTriggerThread-72177623813980163-127.0.0.1:34389_solr-n_0000000000) [    ] o.a.s.c.a.OverseerTriggerThread OverseerTriggerThread woken up but we are closed, exiting.
   [junit4]   2> 24472 INFO  (jetty-closer-2-thread-5) [    ] o.a.s.m.SolrMetricManager Closing metric reporters for registry=solr.jvm, tag=null
   [junit4]   2> 24472 INFO  (jetty-closer-2-thread-5) [    ] o.a.s.m.r.SolrJmxReporter Closing reporter [org.apache.solr.metrics.reporters.SolrJmxReporter@1bf0896: rootName = solr_44717, domain = solr.jvm, service url = null, agent id = null] for registry solr.jvm / com.codahale.metrics.MetricRegistry@1f996ab
   [junit4]   2> 24478 INFO  (jetty-closer-2-thread-1) [    ] o.e.j.s.h.ContextHandler Stopped o.e.j.s.ServletContextHandler@821eb6{/solr,null,UNAVAILABLE}
   [junit4]   2> 24478 INFO  (jetty-closer-2-thread-1) [    ] o.e.j.s.session node0 Stopped scavenging
   [junit4]   2> 24503 INFO  (zkCallback-33-thread-1) [    ] o.a.s.c.OverseerElectionContext I am going to be the leader 127.0.0.1:40765_solr
   [junit4]   2> 24511 INFO  (jetty-closer-2-thread-2) [    ] o.a.s.m.SolrMetricManager Closing metric reporters for registry=solr.jetty, tag=null
   [junit4]   2> 24511 INFO  (jetty-closer-2-thread-2) [    ] o.a.s.m.r.SolrJmxReporter Closing reporter [org.apache.solr.metrics.reporters.SolrJmxReporter@19dedf: rootName = solr_40765, domain = solr.jetty, service url = null, agent id = null] for registry solr.jetty / com.codahale.metrics.MetricRegistry@e5d524
   [junit4]   2> 24512 INFO  (jetty-closer-2-thread-4) [    ] o.a.s.m.SolrMetricManager Closing metric reporters for registry=solr.jetty, tag=null
   [junit4]   2> 24513 INFO  (jetty-closer-2-thread-4) [    ] o.a.s.m.r.SolrJmxReporter Closing reporter [org.apache.solr.metrics.reporters.SolrJmxReporter@19624ad: rootName = solr_33579, domain = solr.jetty, service url = null, agent id = null] for registry solr.jetty / com.codahale.metrics.MetricRegistry@e5d524
   [junit4]   2> 24514 INFO  (jetty-closer-2-thread-3) [    ] o.a.s.m.SolrMetricManager Closing metric reporters for registry=solr.jetty, tag=null
   [junit4]   2> 24514 INFO  (jetty-closer-2-thread-3) [    ] o.a.s.m.r.SolrJmxReporter Closing reporter [org.apache.solr.metrics.reporters.SolrJmxReporter@1da7a9b: rootName = solr_36573, domain = solr.jetty, service url = null, agent id = null] for registry solr.jetty / com.codahale.metrics.MetricRegistry@e5d524
   [junit4]   2> 24515 INFO  (jetty-closer-2-thread-2) [    ] o.a.s.c.ZkController Remove node as live in ZooKeeper:/live_nodes/127.0.0.1:40765_solr
   [junit4]   2> 24516 INFO  (jetty-closer-2-thread-5) [    ] o.a.s.m.SolrMetricManager Closing metric reporters for registry=solr.jetty, tag=null
   [junit4]   2> 24516 INFO  (jetty-closer-2-thread-5) [    ] o.a.s.m.r.SolrJmxReporter Closing reporter [org.apache.solr.metrics.reporters.SolrJmxReporter@172503: rootName = solr_44717, domain = solr.jetty, service url = null, agent id = null] for registry solr.jetty / com.codahale.metrics.MetricRegistry@e5d524
   [junit4]   2> 24519 INFO  (jetty-closer-2-thread-2) [    ] o.a.s.m.SolrMetricManager Closing metric reporters for registry=solr.cluster, tag=null
   [junit4]   2> 24523 INFO  (zkCallback-70-thread-1) [    ] o.a.s.c.c.ZkStateReader Updated live nodes from ZooKeeper... (4) -> (3)
   [junit4]   2> 24523 INFO  (zkCallback-55-thread-1) [    ] o.a.s.c.c.ZkStateReader Updated live nodes from ZooKeeper... (4) -> (3)
   [junit4]   2> 24524 INFO  (zkCallback-40-thread-1) [    ] o.a.s.c.c.ZkStateReader Updated live nodes from ZooKeeper... (4) -> (3)
   [junit4]   2> 24524 INFO  (zkCallback-100-thread-1) [    ] o.a.s.c.c.ZkStateReader Updated live nodes from ZooKeeper... (4) -> (3)
   [junit4]   2> 24524 INFO  (zkCallback-63-thread-1) [    ] o.a.s.c.c.ZkStateReader Updated live nodes from ZooKeeper... (4) -> (3)
   [junit4]   2> 24524 INFO  (zkCallback-48-thread-1) [    ] o.a.s.c.c.ZkStateReader Updated live nodes from ZooKeeper... (4) -> (3)
   [junit4]   2> 24524 INFO  (zkCallback-33-thread-1) [    ] o.a.s.c.c.ZkStateReader Updated live nodes from ZooKeeper... (4) -> (3)
   [junit4]   2> 24524 INFO  (zkCallback-93-thread-1) [    ] o.a.s.c.c.ZkStateReader Updated live nodes from ZooKeeper... (4) -> (3)
   [junit4]   2> 24528 INFO  (jetty-closer-2-thread-3) [    ] o.a.s.c.ZkController Remove node as live in ZooKeeper:/live_nodes/127.0.0.1:36573_solr
   [junit4]   2> 24534 INFO  (jetty-closer-2-thread-4) [    ] o.a.s.c.ZkController Remove node as live in ZooKeeper:/live_nodes/127.0.0.1:33579_solr
   [junit4]   2> 24537 INFO  (jetty-closer-2-thread-2) [    ] o.e.j.s.h.ContextHandler Stopped o.e.j.s.ServletContextHandler@c95fd8{/solr,null,UNAVAILABLE}
   [junit4]   2> 24538 INFO  (jetty-closer-2-thread-2) [    ] o.e.j.s.session node0 Stopped scavenging
   [junit4]   2> 24539 INFO  (jetty-closer-2-thread-3) [    ] o.a.s.m.SolrMetricManager Closing metric reporters for registry=solr.cluster, tag=null
   [junit4]   2> 24541 INFO  (zkCallback-93-thread-1) [    ] o.a.s.c.c.ZkStateReader Updated live nodes from ZooKeeper... (3) -> (1)
   [junit4]   2> 24541 INFO  (zkCallback-55-thread-1) [    ] o.a.s.c.c.ZkStateReader Updated live nodes from ZooKeeper... (3) -> (1)
   [junit4]   2> 24542 INFO  (zkCallback-100-thread-1) [    ] o.a.s.c.c.ZkStateReader Updated live nodes from ZooKeeper... (3) -> (1)
   [junit4]   2> 24542 INFO  (zkCallback-48-thread-1) [    ] o.a.s.c.OverseerElectionContext I am going to be the leader 127.0.0.1:36573_solr
   [junit4]   2> 24548 INFO  (jetty-closer-2-thread-4) [    ] o.a.s.m.SolrMetricManager Closing metric reporters for registry=solr.cluster, tag=null
   [junit4]   2> 24548 INFO  (zkCallback-70-thread-1) [    ] o.a.s.c.c.ZkStateReader Updated live nodes from ZooKeeper... (3) -> (1)
   [junit4]   2> 24548 INFO  (zkCallback-63-thread-1) [    ] o.a.s.c.c.ZkStateReader Updated live nodes from ZooKeeper... (3) -> (1)
   [junit4]   2> 24547 INFO  (zkCallback-48-thread-2) [    ] o.a.s.c.c.ZkStateReader Updated live nodes from ZooKeeper... (3) -> (1)
   [junit4]   2> 24552 INFO  (jetty-closer-2-thread-4) [    ] o.e.j.s.h.ContextHandler Stopped o.e.j.s.ServletContextHandler@13fbb87{/solr,null,UNAVAILABLE}
   [junit4]   2> 24553 INFO  (jetty-closer-2-thread-4) [    ] o.e.j.s.session node0 Stopped scavenging
   [junit4]   2> 24550 INFO  (jetty-closer-2-thread-5) [    ] o.a.s.c.ZkController Remove node as live in ZooKeeper:/live_nodes/127.0.0.1:44717_solr
   [junit4]   2> 24567 INFO  (zkCallback-93-thread-1) [    ] o.a.s.c.OverseerElectionContext I am going to be the leader 127.0.0.1:44717_solr
   [junit4]   2> 24569 INFO  (zkCallback-100-thread-1) [    ] o.a.s.c.c.ZkStateReader Updated live nodes from ZooKeeper... (1) -> (0)
   [junit4]   2> 24570 INFO  (zkCallback-93-thread-1) [    ] o.a.s.c.c.ZkStateReader Updated live nodes from ZooKeeper... (1) -> (0)
   [junit4]   2> 24571 INFO  (jetty-closer-2-thread-5) [    ] o.a.s.m.SolrMetricManager Closing metric reporters for registry=solr.cluster, tag=null
   [junit4]   2> 24574 INFO  (jetty-closer-2-thread-5) [    ] o.e.j.s.h.ContextHandler Stopped o.e.j.s.ServletContextHandler@154f7c4{/solr,null,UNAVAILABLE}
   [junit4]   2> 24574 INFO  (jetty-closer-2-thread-5) [    ] o.e.j.s.session node0 Stopped scavenging
   [junit4]   2> 24576 INFO  (jetty-closer-2-thread-3) [    ] o.e.j.s.h.ContextHandler Stopped o.e.j.s.ServletContextHandler@10785ae{/solr,null,UNAVAILABLE}
   [junit4]   2> 24576 INFO  (jetty-closer-2-thread-3) [    ] o.e.j.s.session node0 Stopped scavenging
   [junit4]   2> 24577 ERROR (SUITE-NodeAddedTriggerTest-seed#[B6F283E92F120591]-worker) [    ] o.a.z.s.ZooKeeperServer ZKShutdownHandler is not registered, so ZooKeeper server won't take any action on ERROR or SHUTDOWN server state changes
   [junit4]   2> 24579 INFO  (SUITE-NodeAddedTriggerTest-seed#[B6F283E92F120591]-worker) [    ] o.a.s.c.ZkTestServer connecting to 127.0.0.1:37019 37019
   [junit4]   2> 24701 INFO  (Thread-1) [    ] o.a.s.c.ZkTestServer connecting to 127.0.0.1:37019 37019
   [junit4]   2> 24702 WARN  (Thread-1) [    ] o.a.s.c.ZkTestServer Watch limit violations: 
   [junit4]   2> Maximum concurrent create/delete watches above limit:
   [junit4]   2> 
   [junit4]   2> 	13	/solr/aliases.json
   [junit4]   2> 	6	/solr/security.json
   [junit4]   2> 
   [junit4]   2> Maximum concurrent data watches above limit:
   [junit4]   2> 
   [junit4]   2> 	13	/solr/clusterstate.json
   [junit4]   2> 	13	/solr/clusterprops.json
   [junit4]   2> 	2	/solr/overseer_elect/election/72177623813980173-127.0.0.1:36573_solr-n_0000000002
   [junit4]   2> 	2	/solr/overseer_elect/election/72177623813980177-127.0.0.1:33579_solr-n_0000000003
   [junit4]   2> 
   [junit4]   2> Maximum concurrent children watches above limit:
   [junit4]   2> 
   [junit4]   2> 	13	/solr/live_nodes
   [junit4]   2> 	13	/solr/collections
   [junit4]   2> 
   [junit4]   2> NOTE: leaving temporary files on disk at: /home/jenkins/workspace/Lucene-Solr-master-Linux/solr/build/solr-core/test/J0/temp/solr.cloud.autoscaling.NodeAddedTriggerTest_B6F283E92F120591-001
   [junit4]   2> May 17, 2018 1:58:57 PM com.carrotsearch.randomizedtesting.ThreadLeakControl checkThreadLeaks
   [junit4]   2> WARNING: Will linger awaiting termination of 1 leaked thread(s).
   [junit4]   2> NOTE: test params are: codec=HighCompressionCompressingStoredFields(storedFieldsFormat=CompressingStoredFieldsFormat(compressionMode=HIGH_COMPRESSION, chunkSize=7, maxDocsPerChunk=571, blockSize=7), termVectorsFormat=CompressingTermVectorsFormat(compressionMode=HIGH_COMPRESSION, chunkSize=7, blockSize=7)), sim=Asserting(org.apache.lucene.search.similarities.AssertingSimilarity@1ca2ce8), locale=it-IT, timezone=Asia/Ulan_Bator
   [junit4]   2> NOTE: Linux 4.13.0-39-generic i386/Oracle Corporation 1.8.0_162 (32-bit)/cpus=8,threads=1,free=34505824,total=65011712
   [junit4]   2> NOTE: All tests run in this JVM: [NodeAddedTriggerTest]
   [junit4] Completed [1/806 (1!)] on J0 in 24.47s, 4 tests, 1 failure <<< FAILURES!

[...truncated 49036 lines...]
[repro] Jenkins log URL: https://jenkins.thetaphi.de/job/Lucene-Solr-master-Linux/22028/consoleText

[repro] Revision: 88f8718f1bfe0e5aeddc6f960cc74513a89c0610

[repro] Ant options: "-Dargs=-server -XX:+UseSerialGC"
[repro] Repro line:  ant test  -Dtestcase=NodeAddedTriggerTest -Dtests.method=testRestoreState -Dtests.seed=B6F283E92F120591 -Dtests.multiplier=3 -Dtests.slow=true -Dtests.locale=it-IT -Dtests.timezone=Asia/Ulan_Bator -Dtests.asserts=true -Dtests.file.encoding=ISO-8859-1

[repro] ant clean

[...truncated 6 lines...]
[repro] Test suites by module:
[repro]    solr/core
[repro]       NodeAddedTriggerTest
[repro] ant compile-test

[...truncated 3298 lines...]
[repro] ant test-nocompile -Dtests.dups=5 -Dtests.maxfailures=5 -Dtests.class="*.NodeAddedTriggerTest" -Dtests.showOutput=onerror "-Dargs=-server -XX:+UseSerialGC" -Dtests.seed=B6F283E92F120591 -Dtests.multiplier=3 -Dtests.slow=true -Dtests.locale=it-IT -Dtests.timezone=Asia/Ulan_Bator -Dtests.asserts=true -Dtests.file.encoding=ISO-8859-1

[...truncated 39 lines...]
   [junit4] Suite: org.apache.solr.cloud.autoscaling.NodeAddedTriggerTest
   [junit4]   2> Creating dataDir: /home/jenkins/workspace/Lucene-Solr-master-Linux/solr/build/solr-core/test/J1/temp/solr.cloud.autoscaling.NodeAddedTriggerTest_B6F283E92F120591-001/init-core-data-001
   [junit4]   2> 2274 INFO  (SUITE-NodeAddedTriggerTest-seed#[B6F283E92F120591]-worker) [    ] o.a.s.SolrTestCaseJ4 Using TrieFields (NUMERIC_POINTS_SYSPROP=false) w/NUMERIC_DOCVALUES_SYSPROP=false
   [junit4]   2> 2334 INFO  (SUITE-NodeAddedTriggerTest-seed#[B6F283E92F120591]-worker) [    ] o.e.j.u.log Logging initialized @2368ms to org.eclipse.jetty.util.log.Slf4jLog
   [junit4]   2> 2347 INFO  (SUITE-NodeAddedTriggerTest-seed#[B6F283E92F120591]-worker) [    ] o.a.s.SolrTestCaseJ4 Randomized ssl (true) and clientAuth (true) via: @org.apache.solr.util.RandomizeSSL(reason=, ssl=NaN, value=NaN, clientAuth=NaN)
   [junit4]   2> 2549 INFO  (SUITE-NodeAddedTriggerTest-seed#[B6F283E92F120591]-worker) [    ] o.a.s.SolrTestCaseJ4 SecureRandom sanity checks: test.solr.allowed.securerandom=null & java.security.egd=file:/dev/./urandom
   [junit4]   2> 2556 INFO  (SUITE-NodeAddedTriggerTest-seed#[B6F283E92F120591]-worker) [    ] o.a.s.c.MiniSolrCloudCluster Starting cluster of 1 servers in /home/jenkins/workspace/Lucene-Solr-master-Linux/solr/build/solr-core/test/J1/temp/solr.cloud.autoscaling.NodeAddedTriggerTest_B6F283E92F120591-001/tempDir-001
   [junit4]   2> 2563 INFO  (SUITE-NodeAddedTriggerTest-seed#[B6F283E92F120591]-worker) [    ] o.a.s.c.ZkTestServer STARTING ZK TEST SERVER
   [junit4]   2> 2565 INFO  (Thread-1) [    ] o.a.s.c.ZkTestServer client port:0.0.0.0/0.0.0.0:0
   [junit4]   2> 2565 INFO  (Thread-1) [    ] o.a.s.c.ZkTestServer Starting server
   [junit4]   2> 2651 ERROR (Thread-1) [    ] o.a.z.s.ZooKeeperServer ZKShutdownHandler is not registered, so ZooKeeper server won't take any action on ERROR or SHUTDOWN server state changes
   [junit4]   2> 2664 INFO  (SUITE-NodeAddedTriggerTest-seed#[B6F283E92F120591]-worker) [    ] o.a.s.c.ZkTestServer start zk server on port:41273
   [junit4]   2> 2764 INFO  (zkConnectionManagerCallback-4-thread-1) [    ] o.a.s.c.c.ConnectionManager zkClient has connected
   [junit4]   2> 2797 WARN  (NIOServerCxn.Factory:0.0.0.0/0.0.0.0:0) [    ] o.a.z.s.NIOServerCnxn Unable to read additional data from client sessionid 0x1006d55eb580000, likely client has closed socket
   [junit4]   2> 3041 INFO  (jetty-launcher-1-thread-1) [    ] o.e.j.s.Server jetty-9.4.10.v20180503; built: 2018-05-03T15:56:21.710Z; git: daa59876e6f384329b122929e70a80934569428c; jvm 1.8.0_162-b12
   [junit4]   2> 3067 INFO  (jetty-launcher-1-thread-1) [    ] o.e.j.s.session DefaultSessionIdManager workerName=node0
   [junit4]   2> 3068 INFO  (jetty-launcher-1-thread-1) [    ] o.e.j.s.session No SessionScavenger set, using defaults
   [junit4]   2> 3072 INFO  (jetty-launcher-1-thread-1) [    ] o.e.j.s.session node0 Scavenging every 600000ms
   [junit4]   2> 3094 INFO  (jetty-launcher-1-thread-1) [    ] o.e.j.s.h.ContextHandler Started o.e.j.s.ServletContextHandler@86c420{/solr,null,AVAILABLE}
   [junit4]   2> 3121 INFO  (jetty-launcher-1-thread-1) [    ] o.e.j.s.AbstractConnector Started ServerConnector@f735d9{SSL,[ssl, http/1.1]}{127.0.0.1:39881}
   [junit4]   2> 3121 INFO  (jetty-launcher-1-thread-1) [    ] o.e.j.s.Server Started @3159ms
   [junit4]   2> 3121 INFO  (jetty-launcher-1-thread-1) [    ] o.a.s.c.s.e.JettySolrRunner Jetty properties: {hostContext=/solr, hostPort=39881}
   [junit4]   2> 3196 INFO  (jetty-launcher-1-thread-1) [    ] o.a.s.u.c.SSLCredentialProviderFactory Processing SSL Credential Provider chain: env;sysprop
   [junit4]   2> 3245 ERROR (jetty-launcher-1-thread-1) [    ] o.a.s.u.StartupLoggingUtils Missing Java Option solr.log.dir. Logging may be missing or incomplete.
   [junit4]   2> 3245 INFO  (jetty-launcher-1-thread-1) [    ] o.a.s.s.SolrDispatchFilter Using logger factory org.apache.logging.slf4j.Log4jLoggerFactory
   [junit4]   2> 3245 INFO  (jetty-launcher-1-thread-1) [    ] o.a.s.s.SolrDispatchFilter  ___      _       Welcome to Apache Solr? version 8.0.0
   [junit4]   2> 3250 INFO  (jetty-launcher-1-thread-1) [    ] o.a.s.s.SolrDispatchFilter / __| ___| |_ _   Starting in cloud mode on port null
   [junit4]   2> 3251 INFO  (jetty-launcher-1-thread-1) [    ] o.a.s.s.SolrDispatchFilter \__ \/ _ \ | '_|  Install dir: null
   [junit4]   2> 3251 INFO  (jetty-launcher-1-thread-1) [    ] o.a.s.s.SolrDispatchFilter |___/\___/_|_|    Start time: 2018-05-17T14:45:55.035Z
   [junit4]   2> 3279 INFO  (jetty-launcher-1-thread-1) [    ] o.a.s.c.SolrResourceLoader solr home defaulted to 'solr/' (could not find system property or JNDI)
   [junit4]   2> 3285 INFO  (zkConnectionManagerCallback-6-thread-1) [    ] o.a.s.c.c.ConnectionManager zkClient has connected
   [junit4]   2> 3287 INFO  (jetty-launcher-1-thread-1) [    ] o.a.s.s.SolrDispatchFilter solr.xml found in ZooKeeper. Loading...
   [junit4]   2> 3666 INFO  (jetty-launcher-1-thread-1) [    ] o.a.s.c.ZkContainer Zookeeper client=127.0.0.1:41273/solr
   [junit4]   2> 3768 INFO  (zkConnectionManagerCallback-10-thread-1) [    ] o.a.s.c.c.ConnectionManager zkClient has connected
   [junit4]   2> 3816 INFO  (zkConnectionManagerCallback-12-thread-1) [    ] o.a.s.c.c.ConnectionManager zkClient has connected
   [junit4]   2> 4100 INFO  (jetty-launcher-1-thread-1) [n:127.0.0.1:39881_solr    ] o.a.s.c.Overseer Overseer (id=null) closing
   [junit4]   2> 4102 INFO  (jetty-launcher-1-thread-1) [n:127.0.0.1:39881_

[...truncated too long message...]

ata from client sessionid 0x1006d563d870019, likely client has closed socket
   [junit4]   2> 42039 INFO  (jetty-closer-103-thread-1) [    ] o.a.s.m.SolrMetricManager Closing metric reporters for registry=solr.jetty, tag=null
   [junit4]   2> 42039 INFO  (jetty-closer-103-thread-1) [    ] o.a.s.m.r.SolrJmxReporter Closing reporter [org.apache.solr.metrics.reporters.SolrJmxReporter@14d07d7: rootName = solr_46351, domain = solr.jetty, service url = null, agent id = null] for registry solr.jetty / com.codahale.metrics.MetricRegistry@10d7d25
   [junit4]   2> 42038 INFO  (jetty-closer-103-thread-6) [    ] o.e.j.s.h.ContextHandler Stopped o.e.j.s.ServletContextHandler@1baf323{/solr,null,UNAVAILABLE}
   [junit4]   2> 42040 INFO  (jetty-closer-103-thread-6) [    ] o.e.j.s.session node0 Stopped scavenging
   [junit4]   2> 42040 INFO  (zkCallback-171-thread-1) [    ] o.a.s.c.c.ZkStateReader Updated live nodes from ZooKeeper... (3) -> (2)
   [junit4]   2> 42040 INFO  (zkCallback-156-thread-1) [    ] o.a.s.c.c.ZkStateReader Updated live nodes from ZooKeeper... (3) -> (2)
   [junit4]   2> 42042 INFO  (jetty-closer-103-thread-2) [    ] o.e.j.s.h.ContextHandler Stopped o.e.j.s.ServletContextHandler@141320b{/solr,null,UNAVAILABLE}
   [junit4]   2> 42042 INFO  (jetty-closer-103-thread-2) [    ] o.e.j.s.session node0 Stopped scavenging
   [junit4]   2> 42042 INFO  (zkCallback-119-thread-1) [    ] o.a.s.c.c.ZkStateReader Updated live nodes from ZooKeeper... (3) -> (2)
   [junit4]   2> 42042 INFO  (jetty-closer-103-thread-3) [    ] o.a.s.m.SolrMetricManager Closing metric reporters for registry=solr.cluster, tag=null
   [junit4]   2> 42041 INFO  (zkCallback-164-thread-1) [    ] o.a.s.c.c.ZkStateReader Updated live nodes from ZooKeeper... (3) -> (2)
   [junit4]   2> 42045 INFO  (zkCallback-149-thread-2) [    ] o.a.s.c.c.ZkStateReader Updated live nodes from ZooKeeper... (3) -> (2)
   [junit4]   2> 42045 INFO  (zkCallback-112-thread-1) [    ] o.a.s.c.c.ZkStateReader Updated live nodes from ZooKeeper... (3) -> (2)
   [junit4]   2> 42045 INFO  (jetty-closer-103-thread-4) [    ] o.a.s.c.ZkController Remove node as live in ZooKeeper:/live_nodes/127.0.0.1:37487_solr
   [junit4]   2> 42046 INFO  (jetty-closer-103-thread-4) [    ] o.a.s.m.SolrMetricManager Closing metric reporters for registry=solr.cluster, tag=null
   [junit4]   2> 42046 INFO  (zkCallback-164-thread-1) [    ] o.a.s.c.c.ZkStateReader Updated live nodes from ZooKeeper... (2) -> (1)
   [junit4]   2> 42047 INFO  (zkCallback-119-thread-1) [    ] o.a.s.c.c.ZkStateReader Updated live nodes from ZooKeeper... (2) -> (1)
   [junit4]   2> 42047 INFO  (zkCallback-171-thread-1) [    ] o.a.s.c.c.ZkStateReader Updated live nodes from ZooKeeper... (2) -> (1)
   [junit4]   2> 42047 INFO  (zkCallback-149-thread-2) [    ] o.a.s.c.c.ZkStateReader Updated live nodes from ZooKeeper... (2) -> (1)
   [junit4]   2> 42047 INFO  (jetty-closer-103-thread-1) [    ] o.a.s.c.ZkController Remove node as live in ZooKeeper:/live_nodes/127.0.0.1:46351_solr
   [junit4]   2> 42047 INFO  (zkCallback-112-thread-2) [    ] o.a.s.c.c.ZkStateReader Updated live nodes from ZooKeeper... (2) -> (1)
   [junit4]   2> 42048 INFO  (jetty-closer-103-thread-1) [    ] o.a.s.m.SolrMetricManager Closing metric reporters for registry=solr.cluster, tag=null
   [junit4]   2> 42048 WARN  (zkCallback-164-thread-1) [    ] o.a.s.c.c.ZkStateReader ZooKeeper watch triggered, but Solr cannot talk to ZK: [KeeperErrorCode = Session expired for /live_nodes]
   [junit4]   2> 42048 INFO  (jetty-closer-103-thread-1) [    ] o.a.s.c.TransientSolrCoreCacheDefault Allocating transient cache for 2147483647 transient cores
   [junit4]   2> 42049 INFO  (zkCallback-119-thread-1) [    ] o.a.s.c.c.ZkStateReader Updated live nodes from ZooKeeper... (1) -> (0)
   [junit4]   2> 42049 INFO  (zkCallback-112-thread-1) [    ] o.a.s.c.c.ZkStateReader Updated live nodes from ZooKeeper... (1) -> (0)
   [junit4]   2> 42049 INFO  (jetty-closer-103-thread-1) [    ] o.a.s.c.Overseer Overseer (id=72177811204800515-127.0.0.1:46351_solr-n_0000000000) closing
   [junit4]   2> 42049 INFO  (OverseerStateUpdate-72177811204800515-127.0.0.1:46351_solr-n_0000000000) [    ] o.a.s.c.Overseer Overseer Loop exiting : 127.0.0.1:46351_solr
   [junit4]   2> 42049 INFO  (zkCallback-149-thread-2) [    ] o.a.s.c.c.ZkStateReader Updated live nodes from ZooKeeper... (1) -> (0)
   [junit4]   2> 42053 WARN  (OverseerAutoScalingTriggerThread-72177811204800515-127.0.0.1:46351_solr-n_0000000000) [    ] o.a.s.c.a.OverseerTriggerThread OverseerTriggerThread woken up but we are closed, exiting.
   [junit4]   2> 42054 INFO  (jetty-closer-103-thread-4) [    ] o.e.j.s.h.ContextHandler Stopped o.e.j.s.ServletContextHandler@181dc{/solr,null,UNAVAILABLE}
   [junit4]   2> 42054 INFO  (jetty-closer-103-thread-4) [    ] o.e.j.s.session node0 Stopped scavenging
   [junit4]   2> 42055 INFO  (jetty-closer-103-thread-1) [    ] o.e.j.s.h.ContextHandler Stopped o.e.j.s.ServletContextHandler@14ed934{/solr,null,UNAVAILABLE}
   [junit4]   2> 42056 INFO  (jetty-closer-103-thread-1) [    ] o.e.j.s.session node0 Stopped scavenging
   [junit4]   2> 42056 INFO  (zkCallback-149-thread-2) [    ] o.a.s.c.OverseerElectionContext I am going to be the leader 127.0.0.1:45173_solr
   [junit4]   2> 42062 INFO  (jetty-closer-103-thread-3) [    ] o.e.j.s.h.ContextHandler Stopped o.e.j.s.ServletContextHandler@8c372{/solr,null,UNAVAILABLE}
   [junit4]   2> 42062 INFO  (jetty-closer-103-thread-3) [    ] o.e.j.s.session node0 Stopped scavenging
   [junit4]   2> 42062 ERROR (SUITE-NodeAddedTriggerTest-seed#[B6F283E92F120591]-worker) [    ] o.a.z.s.ZooKeeperServer ZKShutdownHandler is not registered, so ZooKeeper server won't take any action on ERROR or SHUTDOWN server state changes
   [junit4]   2> 42062 INFO  (SUITE-NodeAddedTriggerTest-seed#[B6F283E92F120591]-worker) [    ] o.a.s.c.ZkTestServer connecting to 127.0.0.1:40457 40457
   [junit4]   2> 42261 INFO  (Thread-62) [    ] o.a.s.c.ZkTestServer connecting to 127.0.0.1:40457 40457
   [junit4]   2> 42262 WARN  (Thread-62) [    ] o.a.s.c.ZkTestServer Watch limit violations: 
   [junit4]   2> Maximum concurrent create/delete watches above limit:
   [junit4]   2> 
   [junit4]   2> 	13	/solr/aliases.json
   [junit4]   2> 	6	/solr/security.json
   [junit4]   2> 
   [junit4]   2> Maximum concurrent data watches above limit:
   [junit4]   2> 
   [junit4]   2> 	13	/solr/clusterstate.json
   [junit4]   2> 	13	/solr/clusterprops.json
   [junit4]   2> 	2	/solr/overseer_elect/election/72177811204800515-127.0.0.1:46351_solr-n_0000000000
   [junit4]   2> 	2	/solr/overseer_elect/election/72177811204800529-127.0.0.1:37487_solr-n_0000000003
   [junit4]   2> 
   [junit4]   2> Maximum concurrent children watches above limit:
   [junit4]   2> 
   [junit4]   2> 	13	/solr/collections
   [junit4]   2> 	12	/solr/live_nodes
   [junit4]   2> 
   [junit4]   2> NOTE: leaving temporary files on disk at: /home/jenkins/workspace/Lucene-Solr-master-Linux/solr/build/solr-core/test/J0/temp/solr.cloud.autoscaling.NodeAddedTriggerTest_B6F283E92F120591-001
   [junit4]   2> May 17, 2018 2:46:34 PM com.carrotsearch.randomizedtesting.ThreadLeakControl checkThreadLeaks
   [junit4]   2> WARNING: Will linger awaiting termination of 1 leaked thread(s).
   [junit4]   2> NOTE: test params are: codec=HighCompressionCompressingStoredFields(storedFieldsFormat=CompressingStoredFieldsFormat(compressionMode=HIGH_COMPRESSION, chunkSize=7, maxDocsPerChunk=571, blockSize=7), termVectorsFormat=CompressingTermVectorsFormat(compressionMode=HIGH_COMPRESSION, chunkSize=7, blockSize=7)), sim=Asserting(org.apache.lucene.search.similarities.AssertingSimilarity@54cac7), locale=it-IT, timezone=Asia/Ulan_Bator
   [junit4]   2> NOTE: Linux 4.13.0-39-generic i386/Oracle Corporation 1.8.0_162 (32-bit)/cpus=8,threads=1,free=25553280,total=65011712
   [junit4]   2> NOTE: All tests run in this JVM: [NodeAddedTriggerTest, NodeAddedTriggerTest]
   [junit4] Completed [4/5 (2!)] on J0 in 18.88s, 4 tests, 1 failure <<< FAILURES!

[...truncated 19 lines...]
BUILD FAILED
/home/jenkins/workspace/Lucene-Solr-master-Linux/lucene/common-build.xml:1568: The following error occurred while executing this line:
/home/jenkins/workspace/Lucene-Solr-master-Linux/lucene/common-build.xml:1092: There were test failures: 5 suites, 20 tests, 2 failures [seed: B6F283E92F120591]

Total time: 47 seconds

[repro] Setting last failure code to 256

[repro] Failures:
[repro]   2/5 failed: org.apache.solr.cloud.autoscaling.NodeAddedTriggerTest
[repro] Exiting with code 256
+ mv lucene/build lucene/build.repro
+ mv solr/build solr/build.repro
+ mv lucene/build.orig lucene/build
+ mv solr/build.orig solr/build
Archiving artifacts
Setting ANT_1_8_2_HOME=/var/lib/jenkins/tools/hudson.tasks.Ant_AntInstallation/ANT_1.8.2
[WARNINGS] Parsing warnings in console log with parser Java Compiler (javac)
Setting ANT_1_8_2_HOME=/var/lib/jenkins/tools/hudson.tasks.Ant_AntInstallation/ANT_1.8.2
Setting ANT_1_8_2_HOME=/var/lib/jenkins/tools/hudson.tasks.Ant_AntInstallation/ANT_1.8.2
<Git Blamer> Using GitBlamer to create author and commit information for all warnings.
<Git Blamer> GIT_COMMIT=88f8718f1bfe0e5aeddc6f960cc74513a89c0610, workspace=/var/lib/jenkins/workspace/Lucene-Solr-master-Linux
[WARNINGS] Computing warning deltas based on reference build #22027
Recording test results
Setting ANT_1_8_2_HOME=/var/lib/jenkins/tools/hudson.tasks.Ant_AntInstallation/ANT_1.8.2
Build step 'Publish JUnit test result report' changed build result to UNSTABLE
Email was triggered for: Unstable (Test Failures)
Sending email for trigger: Unstable (Test Failures)
Setting ANT_1_8_2_HOME=/var/lib/jenkins/tools/hudson.tasks.Ant_AntInstallation/ANT_1.8.2
Setting ANT_1_8_2_HOME=/var/lib/jenkins/tools/hudson.tasks.Ant_AntInstallation/ANT_1.8.2
Setting ANT_1_8_2_HOME=/var/lib/jenkins/tools/hudson.tasks.Ant_AntInstallation/ANT_1.8.2
Setting ANT_1_8_2_HOME=/var/lib/jenkins/tools/hudson.tasks.Ant_AntInstallation/ANT_1.8.2

Mime
View raw message