lucene-dev mailing list archives

Site index · List index
Message view « Date » · « Thread »
Top « Date » · « Thread »
From Apache Jenkins Server <jenk...@builds.apache.org>
Subject [JENKINS] Lucene-Solr-Tests-master - Build # 2544 - Unstable
Date Fri, 25 May 2018 09:49:06 GMT
Build: https://builds.apache.org/job/Lucene-Solr-Tests-master/2544/

4 tests failed.
FAILED:  org.apache.solr.cloud.TestStressCloudBlindAtomicUpdates.test_dv_stored_idx

Error Message:
java.lang.RuntimeException: Could not load collection from ZK: test_col

Stack Trace:
java.util.concurrent.ExecutionException: java.lang.RuntimeException: Could not load collection from ZK: test_col
	at __randomizedtesting.SeedInfo.seed([DF83F71514323302:D5A4A6356B449055]:0)
	at java.util.concurrent.FutureTask.report(FutureTask.java:122)
	at java.util.concurrent.FutureTask.get(FutureTask.java:192)
	at org.apache.solr.cloud.TestStressCloudBlindAtomicUpdates.checkField(TestStressCloudBlindAtomicUpdates.java:288)
	at org.apache.solr.cloud.TestStressCloudBlindAtomicUpdates.test_dv_stored_idx(TestStressCloudBlindAtomicUpdates.java:221)
	at sun.reflect.NativeMethodAccessorImpl.invoke0(Native Method)
	at sun.reflect.NativeMethodAccessorImpl.invoke(NativeMethodAccessorImpl.java:62)
	at sun.reflect.DelegatingMethodAccessorImpl.invoke(DelegatingMethodAccessorImpl.java:43)
	at java.lang.reflect.Method.invoke(Method.java:498)
	at com.carrotsearch.randomizedtesting.RandomizedRunner.invoke(RandomizedRunner.java:1737)
	at com.carrotsearch.randomizedtesting.RandomizedRunner$8.evaluate(RandomizedRunner.java:934)
	at com.carrotsearch.randomizedtesting.RandomizedRunner$9.evaluate(RandomizedRunner.java:970)
	at com.carrotsearch.randomizedtesting.RandomizedRunner$10.evaluate(RandomizedRunner.java:984)
	at com.carrotsearch.randomizedtesting.rules.SystemPropertiesRestoreRule$1.evaluate(SystemPropertiesRestoreRule.java:57)
	at org.apache.lucene.util.TestRuleSetupTeardownChained$1.evaluate(TestRuleSetupTeardownChained.java:49)
	at org.apache.lucene.util.AbstractBeforeAfterRule$1.evaluate(AbstractBeforeAfterRule.java:45)
	at org.apache.lucene.util.TestRuleThreadAndTestName$1.evaluate(TestRuleThreadAndTestName.java:48)
	at org.apache.lucene.util.TestRuleIgnoreAfterMaxFailures$1.evaluate(TestRuleIgnoreAfterMaxFailures.java:64)
	at org.apache.lucene.util.TestRuleMarkFailure$1.evaluate(TestRuleMarkFailure.java:47)
	at com.carrotsearch.randomizedtesting.rules.StatementAdapter.evaluate(StatementAdapter.java:36)
	at com.carrotsearch.randomizedtesting.ThreadLeakControl$StatementRunner.run(ThreadLeakControl.java:368)
	at com.carrotsearch.randomizedtesting.ThreadLeakControl.forkTimeoutingTask(ThreadLeakControl.java:817)
	at com.carrotsearch.randomizedtesting.ThreadLeakControl$3.evaluate(ThreadLeakControl.java:468)
	at com.carrotsearch.randomizedtesting.RandomizedRunner.runSingleTest(RandomizedRunner.java:943)
	at com.carrotsearch.randomizedtesting.RandomizedRunner$5.evaluate(RandomizedRunner.java:829)
	at com.carrotsearch.randomizedtesting.RandomizedRunner$6.evaluate(RandomizedRunner.java:879)
	at com.carrotsearch.randomizedtesting.RandomizedRunner$7.evaluate(RandomizedRunner.java:890)
	at com.carrotsearch.randomizedtesting.rules.StatementAdapter.evaluate(StatementAdapter.java:36)
	at com.carrotsearch.randomizedtesting.rules.SystemPropertiesRestoreRule$1.evaluate(SystemPropertiesRestoreRule.java:57)
	at org.apache.lucene.util.AbstractBeforeAfterRule$1.evaluate(AbstractBeforeAfterRule.java:45)
	at com.carrotsearch.randomizedtesting.rules.StatementAdapter.evaluate(StatementAdapter.java:36)
	at org.apache.lucene.util.TestRuleStoreClassName$1.evaluate(TestRuleStoreClassName.java:41)
	at com.carrotsearch.randomizedtesting.rules.NoShadowingOrOverridesOnMethodsRule$1.evaluate(NoShadowingOrOverridesOnMethodsRule.java:40)
	at com.carrotsearch.randomizedtesting.rules.NoShadowingOrOverridesOnMethodsRule$1.evaluate(NoShadowingOrOverridesOnMethodsRule.java:40)
	at com.carrotsearch.randomizedtesting.rules.StatementAdapter.evaluate(StatementAdapter.java:36)
	at com.carrotsearch.randomizedtesting.rules.StatementAdapter.evaluate(StatementAdapter.java:36)
	at com.carrotsearch.randomizedtesting.rules.StatementAdapter.evaluate(StatementAdapter.java:36)
	at org.apache.lucene.util.TestRuleAssertionsRequired$1.evaluate(TestRuleAssertionsRequired.java:53)
	at org.apache.lucene.util.TestRuleMarkFailure$1.evaluate(TestRuleMarkFailure.java:47)
	at org.apache.lucene.util.TestRuleIgnoreAfterMaxFailures$1.evaluate(TestRuleIgnoreAfterMaxFailures.java:64)
	at org.apache.lucene.util.TestRuleIgnoreTestSuites$1.evaluate(TestRuleIgnoreTestSuites.java:54)
	at com.carrotsearch.randomizedtesting.rules.StatementAdapter.evaluate(StatementAdapter.java:36)
	at com.carrotsearch.randomizedtesting.ThreadLeakControl$StatementRunner.run(ThreadLeakControl.java:368)
	at java.lang.Thread.run(Thread.java:748)
Caused by: java.lang.RuntimeException: Could not load collection from ZK: test_col
	at org.apache.solr.cloud.TestStressCloudBlindAtomicUpdates$Worker.run(TestStressCloudBlindAtomicUpdates.java:416)
	at java.util.concurrent.Executors$RunnableAdapter.call(Executors.java:511)
	at java.util.concurrent.FutureTask.run(FutureTask.java:266)
	at org.apache.solr.common.util.ExecutorUtil$MDCAwareThreadPoolExecutor.lambda$execute$0(ExecutorUtil.java:202)
	at java.util.concurrent.ThreadPoolExecutor.runWorker(ThreadPoolExecutor.java:1149)
	at java.util.concurrent.ThreadPoolExecutor$Worker.run(ThreadPoolExecutor.java:624)
	... 1 more
Caused by: org.apache.solr.common.SolrException: Could not load collection from ZK: test_col
	at org.apache.solr.common.cloud.ZkStateReader.getCollectionLive(ZkStateReader.java:1302)
	at org.apache.solr.common.cloud.ZkStateReader$LazyCollectionRef.get(ZkStateReader.java:731)
	at org.apache.solr.common.cloud.ClusterState$CollectionRef.get(ClusterState.java:386)
	at org.apache.solr.client.solrj.impl.CloudSolrClient.getDocCollection(CloudSolrClient.java:1208)
	at org.apache.solr.client.solrj.impl.CloudSolrClient.requestWithRetryOnStaleState(CloudSolrClient.java:851)
	at org.apache.solr.client.solrj.impl.CloudSolrClient.request(CloudSolrClient.java:819)
	at org.apache.solr.client.solrj.SolrRequest.process(SolrRequest.java:194)
	at org.apache.solr.client.solrj.SolrRequest.process(SolrRequest.java:211)
	at org.apache.solr.cloud.TestStressCloudBlindAtomicUpdates$Worker.doRandomAtomicUpdate(TestStressCloudBlindAtomicUpdates.java:375)
	at org.apache.solr.cloud.TestStressCloudBlindAtomicUpdates$Worker.run(TestStressCloudBlindAtomicUpdates.java:404)
	... 6 more
Caused by: org.apache.zookeeper.KeeperException$SessionExpiredException: KeeperErrorCode = Session expired for /collections/test_col/state.json
	at org.apache.zookeeper.KeeperException.create(KeeperException.java:130)
	at org.apache.zookeeper.KeeperException.create(KeeperException.java:54)
	at org.apache.zookeeper.ZooKeeper.getData(ZooKeeper.java:1215)
	at org.apache.solr.common.cloud.SolrZkClient.lambda$getData$5(SolrZkClient.java:340)
	at org.apache.solr.common.cloud.ZkCmdExecutor.retryOperation(ZkCmdExecutor.java:60)
	at org.apache.solr.common.cloud.SolrZkClient.getData(SolrZkClient.java:340)
	at org.apache.solr.common.cloud.ZkStateReader.fetchCollectionState(ZkStateReader.java:1314)
	at org.apache.solr.common.cloud.ZkStateReader.getCollectionLive(ZkStateReader.java:1300)
	... 15 more


FAILED:  org.apache.solr.cloud.autoscaling.IndexSizeTriggerTest.testTrigger

Error Message:
waitFor not elapsed but produced an event

Stack Trace:
java.lang.AssertionError: waitFor not elapsed but produced an event
	at __randomizedtesting.SeedInfo.seed([DF83F71514323302:BC48C1978DFD402F]:0)
	at org.junit.Assert.fail(Assert.java:93)
	at org.junit.Assert.assertTrue(Assert.java:43)
	at org.junit.Assert.assertNull(Assert.java:551)
	at org.apache.solr.cloud.autoscaling.IndexSizeTriggerTest.testTrigger(IndexSizeTriggerTest.java:180)
	at sun.reflect.NativeMethodAccessorImpl.invoke0(Native Method)
	at sun.reflect.NativeMethodAccessorImpl.invoke(NativeMethodAccessorImpl.java:62)
	at sun.reflect.DelegatingMethodAccessorImpl.invoke(DelegatingMethodAccessorImpl.java:43)
	at java.lang.reflect.Method.invoke(Method.java:498)
	at com.carrotsearch.randomizedtesting.RandomizedRunner.invoke(RandomizedRunner.java:1737)
	at com.carrotsearch.randomizedtesting.RandomizedRunner$8.evaluate(RandomizedRunner.java:934)
	at com.carrotsearch.randomizedtesting.RandomizedRunner$9.evaluate(RandomizedRunner.java:970)
	at com.carrotsearch.randomizedtesting.RandomizedRunner$10.evaluate(RandomizedRunner.java:984)
	at com.carrotsearch.randomizedtesting.rules.SystemPropertiesRestoreRule$1.evaluate(SystemPropertiesRestoreRule.java:57)
	at org.apache.lucene.util.TestRuleSetupTeardownChained$1.evaluate(TestRuleSetupTeardownChained.java:49)
	at org.apache.lucene.util.AbstractBeforeAfterRule$1.evaluate(AbstractBeforeAfterRule.java:45)
	at org.apache.lucene.util.TestRuleThreadAndTestName$1.evaluate(TestRuleThreadAndTestName.java:48)
	at org.apache.lucene.util.TestRuleIgnoreAfterMaxFailures$1.evaluate(TestRuleIgnoreAfterMaxFailures.java:64)
	at org.apache.lucene.util.TestRuleMarkFailure$1.evaluate(TestRuleMarkFailure.java:47)
	at com.carrotsearch.randomizedtesting.rules.StatementAdapter.evaluate(StatementAdapter.java:36)
	at com.carrotsearch.randomizedtesting.ThreadLeakControl$StatementRunner.run(ThreadLeakControl.java:368)
	at com.carrotsearch.randomizedtesting.ThreadLeakControl.forkTimeoutingTask(ThreadLeakControl.java:817)
	at com.carrotsearch.randomizedtesting.ThreadLeakControl$3.evaluate(ThreadLeakControl.java:468)
	at com.carrotsearch.randomizedtesting.RandomizedRunner.runSingleTest(RandomizedRunner.java:943)
	at com.carrotsearch.randomizedtesting.RandomizedRunner$5.evaluate(RandomizedRunner.java:829)
	at com.carrotsearch.randomizedtesting.RandomizedRunner$6.evaluate(RandomizedRunner.java:879)
	at com.carrotsearch.randomizedtesting.RandomizedRunner$7.evaluate(RandomizedRunner.java:890)
	at com.carrotsearch.randomizedtesting.rules.StatementAdapter.evaluate(StatementAdapter.java:36)
	at com.carrotsearch.randomizedtesting.rules.SystemPropertiesRestoreRule$1.evaluate(SystemPropertiesRestoreRule.java:57)
	at org.apache.lucene.util.AbstractBeforeAfterRule$1.evaluate(AbstractBeforeAfterRule.java:45)
	at com.carrotsearch.randomizedtesting.rules.StatementAdapter.evaluate(StatementAdapter.java:36)
	at org.apache.lucene.util.TestRuleStoreClassName$1.evaluate(TestRuleStoreClassName.java:41)
	at com.carrotsearch.randomizedtesting.rules.NoShadowingOrOverridesOnMethodsRule$1.evaluate(NoShadowingOrOverridesOnMethodsRule.java:40)
	at com.carrotsearch.randomizedtesting.rules.NoShadowingOrOverridesOnMethodsRule$1.evaluate(NoShadowingOrOverridesOnMethodsRule.java:40)
	at com.carrotsearch.randomizedtesting.rules.StatementAdapter.evaluate(StatementAdapter.java:36)
	at com.carrotsearch.randomizedtesting.rules.StatementAdapter.evaluate(StatementAdapter.java:36)
	at com.carrotsearch.randomizedtesting.rules.StatementAdapter.evaluate(StatementAdapter.java:36)
	at org.apache.lucene.util.TestRuleAssertionsRequired$1.evaluate(TestRuleAssertionsRequired.java:53)
	at org.apache.lucene.util.TestRuleMarkFailure$1.evaluate(TestRuleMarkFailure.java:47)
	at org.apache.lucene.util.TestRuleIgnoreAfterMaxFailures$1.evaluate(TestRuleIgnoreAfterMaxFailures.java:64)
	at org.apache.lucene.util.TestRuleIgnoreTestSuites$1.evaluate(TestRuleIgnoreTestSuites.java:54)
	at com.carrotsearch.randomizedtesting.rules.StatementAdapter.evaluate(StatementAdapter.java:36)
	at com.carrotsearch.randomizedtesting.ThreadLeakControl$StatementRunner.run(ThreadLeakControl.java:368)
	at java.lang.Thread.run(Thread.java:748)


FAILED:  org.apache.solr.cloud.autoscaling.SearchRateTriggerTest.testTrigger

Error Message:
expected:<1> but was:<2>

Stack Trace:
java.lang.AssertionError: expected:<1> but was:<2>
	at __randomizedtesting.SeedInfo.seed([DF83F71514323302:BC48C1978DFD402F]:0)
	at org.junit.Assert.fail(Assert.java:93)
	at org.junit.Assert.failNotEquals(Assert.java:647)
	at org.junit.Assert.assertEquals(Assert.java:128)
	at org.junit.Assert.assertEquals(Assert.java:472)
	at org.junit.Assert.assertEquals(Assert.java:456)
	at org.apache.solr.cloud.autoscaling.SearchRateTriggerTest.testTrigger(SearchRateTriggerTest.java:133)
	at sun.reflect.NativeMethodAccessorImpl.invoke0(Native Method)
	at sun.reflect.NativeMethodAccessorImpl.invoke(NativeMethodAccessorImpl.java:62)
	at sun.reflect.DelegatingMethodAccessorImpl.invoke(DelegatingMethodAccessorImpl.java:43)
	at java.lang.reflect.Method.invoke(Method.java:498)
	at com.carrotsearch.randomizedtesting.RandomizedRunner.invoke(RandomizedRunner.java:1737)
	at com.carrotsearch.randomizedtesting.RandomizedRunner$8.evaluate(RandomizedRunner.java:934)
	at com.carrotsearch.randomizedtesting.RandomizedRunner$9.evaluate(RandomizedRunner.java:970)
	at com.carrotsearch.randomizedtesting.RandomizedRunner$10.evaluate(RandomizedRunner.java:984)
	at com.carrotsearch.randomizedtesting.rules.SystemPropertiesRestoreRule$1.evaluate(SystemPropertiesRestoreRule.java:57)
	at org.apache.lucene.util.TestRuleSetupTeardownChained$1.evaluate(TestRuleSetupTeardownChained.java:49)
	at org.apache.lucene.util.AbstractBeforeAfterRule$1.evaluate(AbstractBeforeAfterRule.java:45)
	at org.apache.lucene.util.TestRuleThreadAndTestName$1.evaluate(TestRuleThreadAndTestName.java:48)
	at org.apache.lucene.util.TestRuleIgnoreAfterMaxFailures$1.evaluate(TestRuleIgnoreAfterMaxFailures.java:64)
	at org.apache.lucene.util.TestRuleMarkFailure$1.evaluate(TestRuleMarkFailure.java:47)
	at com.carrotsearch.randomizedtesting.rules.StatementAdapter.evaluate(StatementAdapter.java:36)
	at com.carrotsearch.randomizedtesting.ThreadLeakControl$StatementRunner.run(ThreadLeakControl.java:368)
	at com.carrotsearch.randomizedtesting.ThreadLeakControl.forkTimeoutingTask(ThreadLeakControl.java:817)
	at com.carrotsearch.randomizedtesting.ThreadLeakControl$3.evaluate(ThreadLeakControl.java:468)
	at com.carrotsearch.randomizedtesting.RandomizedRunner.runSingleTest(RandomizedRunner.java:943)
	at com.carrotsearch.randomizedtesting.RandomizedRunner$5.evaluate(RandomizedRunner.java:829)
	at com.carrotsearch.randomizedtesting.RandomizedRunner$6.evaluate(RandomizedRunner.java:879)
	at com.carrotsearch.randomizedtesting.RandomizedRunner$7.evaluate(RandomizedRunner.java:890)
	at com.carrotsearch.randomizedtesting.rules.StatementAdapter.evaluate(StatementAdapter.java:36)
	at com.carrotsearch.randomizedtesting.rules.SystemPropertiesRestoreRule$1.evaluate(SystemPropertiesRestoreRule.java:57)
	at org.apache.lucene.util.AbstractBeforeAfterRule$1.evaluate(AbstractBeforeAfterRule.java:45)
	at com.carrotsearch.randomizedtesting.rules.StatementAdapter.evaluate(StatementAdapter.java:36)
	at org.apache.lucene.util.TestRuleStoreClassName$1.evaluate(TestRuleStoreClassName.java:41)
	at com.carrotsearch.randomizedtesting.rules.NoShadowingOrOverridesOnMethodsRule$1.evaluate(NoShadowingOrOverridesOnMethodsRule.java:40)
	at com.carrotsearch.randomizedtesting.rules.NoShadowingOrOverridesOnMethodsRule$1.evaluate(NoShadowingOrOverridesOnMethodsRule.java:40)
	at com.carrotsearch.randomizedtesting.rules.StatementAdapter.evaluate(StatementAdapter.java:36)
	at com.carrotsearch.randomizedtesting.rules.StatementAdapter.evaluate(StatementAdapter.java:36)
	at com.carrotsearch.randomizedtesting.rules.StatementAdapter.evaluate(StatementAdapter.java:36)
	at org.apache.lucene.util.TestRuleAssertionsRequired$1.evaluate(TestRuleAssertionsRequired.java:53)
	at org.apache.lucene.util.TestRuleMarkFailure$1.evaluate(TestRuleMarkFailure.java:47)
	at org.apache.lucene.util.TestRuleIgnoreAfterMaxFailures$1.evaluate(TestRuleIgnoreAfterMaxFailures.java:64)
	at org.apache.lucene.util.TestRuleIgnoreTestSuites$1.evaluate(TestRuleIgnoreTestSuites.java:54)
	at com.carrotsearch.randomizedtesting.rules.StatementAdapter.evaluate(StatementAdapter.java:36)
	at com.carrotsearch.randomizedtesting.ThreadLeakControl$StatementRunner.run(ThreadLeakControl.java:368)
	at java.lang.Thread.run(Thread.java:748)


FAILED:  org.apache.solr.cloud.autoscaling.SystemLogListenerTest.test

Error Message:
Error from server at http://127.0.0.1:32774/solr: create the collection time out:180s

Stack Trace:
org.apache.solr.client.solrj.impl.HttpSolrClient$RemoteSolrException: Error from server at http://127.0.0.1:32774/solr: create the collection time out:180s
	at __randomizedtesting.SeedInfo.seed([DF83F71514323302:57D7C8CFBACE5EFA]:0)
	at org.apache.solr.client.solrj.impl.HttpSolrClient.executeMethod(HttpSolrClient.java:643)
	at org.apache.solr.client.solrj.impl.HttpSolrClient.request(HttpSolrClient.java:255)
	at org.apache.solr.client.solrj.impl.HttpSolrClient.request(HttpSolrClient.java:244)
	at org.apache.solr.client.solrj.impl.LBHttpSolrClient.doRequest(LBHttpSolrClient.java:483)
	at org.apache.solr.client.solrj.impl.LBHttpSolrClient.request(LBHttpSolrClient.java:413)
	at org.apache.solr.client.solrj.impl.CloudSolrClient.sendRequest(CloudSolrClient.java:1106)
	at org.apache.solr.client.solrj.impl.CloudSolrClient.requestWithRetryOnStaleState(CloudSolrClient.java:886)
	at org.apache.solr.client.solrj.impl.CloudSolrClient.request(CloudSolrClient.java:819)
	at org.apache.solr.client.solrj.SolrRequest.process(SolrRequest.java:194)
	at org.apache.solr.client.solrj.SolrRequest.process(SolrRequest.java:211)
	at org.apache.solr.cloud.autoscaling.SystemLogListenerTest.test(SystemLogListenerTest.java:118)
	at sun.reflect.NativeMethodAccessorImpl.invoke0(Native Method)
	at sun.reflect.NativeMethodAccessorImpl.invoke(NativeMethodAccessorImpl.java:62)
	at sun.reflect.DelegatingMethodAccessorImpl.invoke(DelegatingMethodAccessorImpl.java:43)
	at java.lang.reflect.Method.invoke(Method.java:498)
	at com.carrotsearch.randomizedtesting.RandomizedRunner.invoke(RandomizedRunner.java:1737)
	at com.carrotsearch.randomizedtesting.RandomizedRunner$8.evaluate(RandomizedRunner.java:934)
	at com.carrotsearch.randomizedtesting.RandomizedRunner$9.evaluate(RandomizedRunner.java:970)
	at com.carrotsearch.randomizedtesting.RandomizedRunner$10.evaluate(RandomizedRunner.java:984)
	at com.carrotsearch.randomizedtesting.rules.SystemPropertiesRestoreRule$1.evaluate(SystemPropertiesRestoreRule.java:57)
	at org.apache.lucene.util.TestRuleSetupTeardownChained$1.evaluate(TestRuleSetupTeardownChained.java:49)
	at org.apache.lucene.util.AbstractBeforeAfterRule$1.evaluate(AbstractBeforeAfterRule.java:45)
	at org.apache.lucene.util.TestRuleThreadAndTestName$1.evaluate(TestRuleThreadAndTestName.java:48)
	at org.apache.lucene.util.TestRuleIgnoreAfterMaxFailures$1.evaluate(TestRuleIgnoreAfterMaxFailures.java:64)
	at org.apache.lucene.util.TestRuleMarkFailure$1.evaluate(TestRuleMarkFailure.java:47)
	at com.carrotsearch.randomizedtesting.rules.StatementAdapter.evaluate(StatementAdapter.java:36)
	at com.carrotsearch.randomizedtesting.ThreadLeakControl$StatementRunner.run(ThreadLeakControl.java:368)
	at com.carrotsearch.randomizedtesting.ThreadLeakControl.forkTimeoutingTask(ThreadLeakControl.java:817)
	at com.carrotsearch.randomizedtesting.ThreadLeakControl$3.evaluate(ThreadLeakControl.java:468)
	at com.carrotsearch.randomizedtesting.RandomizedRunner.runSingleTest(RandomizedRunner.java:943)
	at com.carrotsearch.randomizedtesting.RandomizedRunner$5.evaluate(RandomizedRunner.java:829)
	at com.carrotsearch.randomizedtesting.RandomizedRunner$6.evaluate(RandomizedRunner.java:879)
	at com.carrotsearch.randomizedtesting.RandomizedRunner$7.evaluate(RandomizedRunner.java:890)
	at com.carrotsearch.randomizedtesting.rules.StatementAdapter.evaluate(StatementAdapter.java:36)
	at com.carrotsearch.randomizedtesting.rules.SystemPropertiesRestoreRule$1.evaluate(SystemPropertiesRestoreRule.java:57)
	at org.apache.lucene.util.AbstractBeforeAfterRule$1.evaluate(AbstractBeforeAfterRule.java:45)
	at com.carrotsearch.randomizedtesting.rules.StatementAdapter.evaluate(StatementAdapter.java:36)
	at org.apache.lucene.util.TestRuleStoreClassName$1.evaluate(TestRuleStoreClassName.java:41)
	at com.carrotsearch.randomizedtesting.rules.NoShadowingOrOverridesOnMethodsRule$1.evaluate(NoShadowingOrOverridesOnMethodsRule.java:40)
	at com.carrotsearch.randomizedtesting.rules.NoShadowingOrOverridesOnMethodsRule$1.evaluate(NoShadowingOrOverridesOnMethodsRule.java:40)
	at com.carrotsearch.randomizedtesting.rules.StatementAdapter.evaluate(StatementAdapter.java:36)
	at com.carrotsearch.randomizedtesting.rules.StatementAdapter.evaluate(StatementAdapter.java:36)
	at com.carrotsearch.randomizedtesting.rules.StatementAdapter.evaluate(StatementAdapter.java:36)
	at org.apache.lucene.util.TestRuleAssertionsRequired$1.evaluate(TestRuleAssertionsRequired.java:53)
	at org.apache.lucene.util.TestRuleMarkFailure$1.evaluate(TestRuleMarkFailure.java:47)
	at org.apache.lucene.util.TestRuleIgnoreAfterMaxFailures$1.evaluate(TestRuleIgnoreAfterMaxFailures.java:64)
	at org.apache.lucene.util.TestRuleIgnoreTestSuites$1.evaluate(TestRuleIgnoreTestSuites.java:54)
	at com.carrotsearch.randomizedtesting.rules.StatementAdapter.evaluate(StatementAdapter.java:36)
	at com.carrotsearch.randomizedtesting.ThreadLeakControl$StatementRunner.run(ThreadLeakControl.java:368)
	at java.lang.Thread.run(Thread.java:748)




Build Log:
[...truncated 12867 lines...]
   [junit4] Suite: org.apache.solr.cloud.autoscaling.SearchRateTriggerTest
   [junit4]   2> Creating dataDir: /home/jenkins/jenkins-slave/workspace/Lucene-Solr-Tests-master/solr/build/solr-core/test/J2/temp/solr.cloud.autoscaling.SearchRateTriggerTest_DF83F71514323302-001/init-core-data-001
   [junit4]   2> 1171740 WARN  (SUITE-SearchRateTriggerTest-seed#[DF83F71514323302]-worker) [    ] o.a.s.SolrTestCaseJ4 startTrackingSearchers: numOpens=7 numCloses=7
   [junit4]   2> 1171740 INFO  (SUITE-SearchRateTriggerTest-seed#[DF83F71514323302]-worker) [    ] o.a.s.SolrTestCaseJ4 Using TrieFields (NUMERIC_POINTS_SYSPROP=false) w/NUMERIC_DOCVALUES_SYSPROP=false
   [junit4]   2> 1171742 INFO  (SUITE-SearchRateTriggerTest-seed#[DF83F71514323302]-worker) [    ] o.a.s.SolrTestCaseJ4 Randomized ssl (false) and clientAuth (false) via: @org.apache.solr.util.RandomizeSSL(reason=, ssl=NaN, value=NaN, clientAuth=NaN)
   [junit4]   2> 1171742 INFO  (SUITE-SearchRateTriggerTest-seed#[DF83F71514323302]-worker) [    ] o.a.s.SolrTestCaseJ4 SecureRandom sanity checks: test.solr.allowed.securerandom=null & java.security.egd=file:/dev/./urandom
   [junit4]   2> 1171776 INFO  (SUITE-SearchRateTriggerTest-seed#[DF83F71514323302]-worker) [    ] o.a.s.c.MiniSolrCloudCluster Starting cluster of 4 servers in /home/jenkins/jenkins-slave/workspace/Lucene-Solr-Tests-master/solr/build/solr-core/test/J2/temp/solr.cloud.autoscaling.SearchRateTriggerTest_DF83F71514323302-001/tempDir-001
   [junit4]   2> 1171776 INFO  (SUITE-SearchRateTriggerTest-seed#[DF83F71514323302]-worker) [    ] o.a.s.c.ZkTestServer STARTING ZK TEST SERVER
   [junit4]   2> 1171800 INFO  (Thread-893) [    ] o.a.s.c.ZkTestServer client port:0.0.0.0/0.0.0.0:0
   [junit4]   2> 1171800 INFO  (Thread-893) [    ] o.a.s.c.ZkTestServer Starting server
   [junit4]   2> 1171902 INFO  (SUITE-SearchRateTriggerTest-seed#[DF83F71514323302]-worker) [    ] o.a.s.c.ZkTestServer start zk server on port:37400
   [junit4]   2> 1171914 ERROR (Thread-893) [    ] o.a.z.s.ZooKeeperServer ZKShutdownHandler is not registered, so ZooKeeper server won't take any action on ERROR or SHUTDOWN server state changes
   [junit4]   2> 1172085 INFO  (zkConnectionManagerCallback-3019-thread-1) [    ] o.a.s.c.c.ConnectionManager zkClient has connected
   [junit4]   2> 1172273 INFO  (jetty-launcher-3016-thread-2) [    ] o.e.j.s.Server jetty-9.4.10.v20180503; built: 2018-05-03T15:56:21.710Z; git: daa59876e6f384329b122929e70a80934569428c; jvm 1.8.0_172-b11
   [junit4]   2> 1172273 INFO  (jetty-launcher-3016-thread-3) [    ] o.e.j.s.Server jetty-9.4.10.v20180503; built: 2018-05-03T15:56:21.710Z; git: daa59876e6f384329b122929e70a80934569428c; jvm 1.8.0_172-b11
   [junit4]   2> 1172274 INFO  (jetty-launcher-3016-thread-4) [    ] o.e.j.s.Server jetty-9.4.10.v20180503; built: 2018-05-03T15:56:21.710Z; git: daa59876e6f384329b122929e70a80934569428c; jvm 1.8.0_172-b11
   [junit4]   2> 1172280 INFO  (jetty-launcher-3016-thread-1) [    ] o.e.j.s.Server jetty-9.4.10.v20180503; built: 2018-05-03T15:56:21.710Z; git: daa59876e6f384329b122929e70a80934569428c; jvm 1.8.0_172-b11
   [junit4]   2> 1172333 INFO  (jetty-launcher-3016-thread-2) [    ] o.e.j.s.session DefaultSessionIdManager workerName=node0
   [junit4]   2> 1172333 INFO  (jetty-launcher-3016-thread-2) [    ] o.e.j.s.session No SessionScavenger set, using defaults
   [junit4]   2> 1172333 INFO  (jetty-launcher-3016-thread-2) [    ] o.e.j.s.session node0 Scavenging every 660000ms
   [junit4]   2> 1172333 INFO  (jetty-launcher-3016-thread-2) [    ] o.e.j.s.h.ContextHandler Started o.e.j.s.ServletContextHandler@3c50ec67{/solr,null,AVAILABLE}
   [junit4]   2> 1172408 INFO  (jetty-launcher-3016-thread-2) [    ] o.e.j.s.AbstractConnector Started ServerConnector@6c432b8b{HTTP/1.1,[http/1.1]}{127.0.0.1:40984}
   [junit4]   2> 1172408 INFO  (jetty-launcher-3016-thread-2) [    ] o.e.j.s.Server Started @1172792ms
   [junit4]   2> 1172408 INFO  (jetty-launcher-3016-thread-2) [    ] o.a.s.c.s.e.JettySolrRunner Jetty properties: {hostContext=/solr, hostPort=40984}
   [junit4]   2> 1172408 ERROR (jetty-launcher-3016-thread-2) [    ] o.a.s.u.StartupLoggingUtils Missing Java Option solr.log.dir. Logging may be missing or incomplete.
   [junit4]   2> 1172408 INFO  (jetty-launcher-3016-thread-2) [    ] o.a.s.s.SolrDispatchFilter Using logger factory org.apache.logging.slf4j.Log4jLoggerFactory
   [junit4]   2> 1172422 INFO  (jetty-launcher-3016-thread-2) [    ] o.a.s.s.SolrDispatchFilter  ___      _       Welcome to Apache Solr? version 8.0.0
   [junit4]   2> 1172422 INFO  (jetty-launcher-3016-thread-2) [    ] o.a.s.s.SolrDispatchFilter / __| ___| |_ _   Starting in cloud mode on port null
   [junit4]   2> 1172422 INFO  (jetty-launcher-3016-thread-2) [    ] o.a.s.s.SolrDispatchFilter \__ \/ _ \ | '_|  Install dir: null
   [junit4]   2> 1172422 INFO  (jetty-launcher-3016-thread-2) [    ] o.a.s.s.SolrDispatchFilter |___/\___/_|_|    Start time: 2018-05-25T07:07:24.409Z
   [junit4]   2> 1172472 INFO  (jetty-launcher-3016-thread-1) [    ] o.e.j.s.session DefaultSessionIdManager workerName=node0
   [junit4]   2> 1172479 INFO  (jetty-launcher-3016-thread-1) [    ] o.e.j.s.session No SessionScavenger set, using defaults
   [junit4]   2> 1172479 INFO  (jetty-launcher-3016-thread-1) [    ] o.e.j.s.session node0 Scavenging every 660000ms
   [junit4]   2> 1172488 INFO  (jetty-launcher-3016-thread-4) [    ] o.e.j.s.session DefaultSessionIdManager workerName=node0
   [junit4]   2> 1172488 INFO  (jetty-launcher-3016-thread-4) [    ] o.e.j.s.session No SessionScavenger set, using defaults
   [junit4]   2> 1172488 INFO  (jetty-launcher-3016-thread-4) [    ] o.e.j.s.session node0 Scavenging every 600000ms
   [junit4]   2> 1172508 INFO  (jetty-launcher-3016-thread-4) [    ] o.e.j.s.h.ContextHandler Started o.e.j.s.ServletContextHandler@75c3314c{/solr,null,AVAILABLE}
   [junit4]   2> 1172508 INFO  (jetty-launcher-3016-thread-4) [    ] o.e.j.s.AbstractConnector Started ServerConnector@1e06c467{HTTP/1.1,[http/1.1]}{127.0.0.1:38115}
   [junit4]   2> 1172508 INFO  (jetty-launcher-3016-thread-4) [    ] o.e.j.s.Server Started @1172892ms
   [junit4]   2> 1172508 INFO  (jetty-launcher-3016-thread-4) [    ] o.a.s.c.s.e.JettySolrRunner Jetty properties: {hostContext=/solr, hostPort=38115}
   [junit4]   2> 1172509 ERROR (jetty-launcher-3016-thread-4) [    ] o.a.s.u.StartupLoggingUtils Missing Java Option solr.log.dir. Logging may be missing or incomplete.
   [junit4]   2> 1172509 INFO  (jetty-launcher-3016-thread-4) [    ] o.a.s.s.SolrDispatchFilter Using logger factory org.apache.logging.slf4j.Log4jLoggerFactory
   [junit4]   2> 1172509 INFO  (jetty-launcher-3016-thread-4) [    ] o.a.s.s.SolrDispatchFilter  ___      _       Welcome to Apache Solr? version 8.0.0
   [junit4]   2> 1172509 INFO  (jetty-launcher-3016-thread-4) [    ] o.a.s.s.SolrDispatchFilter / __| ___| |_ _   Starting in cloud mode on port null
   [junit4]   2> 1172509 INFO  (jetty-launcher-3016-thread-4) [    ] o.a.s.s.SolrDispatchFilter \__ \/ _ \ | '_|  Install dir: null
   [junit4]   2> 1172509 INFO  (jetty-launcher-3016-thread-4) [    ] o.a.s.s.SolrDispatchFilter |___/\___/_|_|    Start time: 2018-05-25T07:07:24.496Z
   [junit4]   2> 1172597 INFO  (zkConnectionManagerCallback-3023-thread-1) [    ] o.a.s.c.c.ConnectionManager zkClient has connected
   [junit4]   2> 1172605 INFO  (jetty-launcher-3016-thread-4) [    ] o.a.s.s.SolrDispatchFilter solr.xml found in ZooKeeper. Loading...
   [junit4]   2> 1172654 INFO  (jetty-launcher-3016-thread-3) [    ] o.e.j.s.session DefaultSessionIdManager workerName=node0
   [junit4]   2> 1172654 INFO  (jetty-launcher-3016-thread-3) [    ] o.e.j.s.session No SessionScavenger set, using defaults
   [junit4]   2> 1172654 INFO  (jetty-launcher-3016-thread-3) [    ] o.e.j.s.session node0 Scavenging every 600000ms
   [junit4]   2> 1172670 INFO  (jetty-launcher-3016-thread-3) [    ] o.e.j.s.h.ContextHandler Started o.e.j.s.ServletContextHandler@5a0b7fb7{/solr,null,AVAILABLE}
   [junit4]   2> 1172671 INFO  (jetty-launcher-3016-thread-3) [    ] o.e.j.s.AbstractConnector Started ServerConnector@1782587b{HTTP/1.1,[http/1.1]}{127.0.0.1:41222}
   [junit4]   2> 1172671 INFO  (jetty-launcher-3016-thread-3) [    ] o.e.j.s.Server Started @1173054ms
   [junit4]   2> 1172671 INFO  (jetty-launcher-3016-thread-3) [    ] o.a.s.c.s.e.JettySolrRunner Jetty properties: {hostContext=/solr, hostPort=41222}
   [junit4]   2> 1172671 ERROR (jetty-launcher-3016-thread-3) [    ] o.a.s.u.StartupLoggingUtils Missing Java Option solr.log.dir. Logging may be missing or incomplete.
   [junit4]   2> 1172671 INFO  (jetty-launcher-3016-thread-3) [    ] o.a.s.s.SolrDispatchFilter Using logger factory org.apache.logging.slf4j.Log4jLoggerFactory
   [junit4]   2> 1172671 INFO  (jetty-launcher-3016-thread-3) [    ] o.a.s.s.SolrDispatchFilter  ___      _       Welcome to Apache Solr? version 8.0.0
   [junit4]   2> 1172671 INFO  (jetty-launcher-3016-thread-3) [    ] o.a.s.s.SolrDispatchFilter / __| ___| |_ _   Starting in cloud mode on port null
   [junit4]   2> 1172671 INFO  (jetty-launcher-3016-thread-3) [    ] o.a.s.s.SolrDispatchFilter \__ \/ _ \ | '_|  Install dir: null
   [junit4]   2> 1172671 INFO  (jetty-launcher-3016-thread-3) [    ] o.a.s.s.SolrDispatchFilter |___/\___/_|_|    Start time: 2018-05-25T07:07:24.658Z
   [junit4]   2> 1172673 INFO  (jetty-launcher-3016-thread-1) [    ] o.e.j.s.h.ContextHandler Started o.e.j.s.ServletContextHandler@29869cf7{/solr,null,AVAILABLE}
   [junit4]   2> 1172673 INFO  (jetty-launcher-3016-thread-1) [    ] o.e.j.s.AbstractConnector Started ServerConnector@451ec95f{HTTP/1.1,[http/1.1]}{127.0.0.1:44299}
   [junit4]   2> 1172673 INFO  (jetty-launcher-3016-thread-1) [    ] o.e.j.s.Server Started @1173057ms
   [junit4]   2> 1172673 INFO  (jetty-launcher-3016-thread-1) [    ] o.a.s.c.s.e.JettySolrRunner Jetty properties: {hostContext=/solr, hostPort=44299}
   [junit4]   2> 1172673 ERROR (jetty-launcher-3016-thread-1) [    ] o.a.s.u.StartupLoggingUtils Missing Java Option solr.log.dir. Logging may be missing or incomplete.
   [junit4]   2> 1172673 INFO  (jetty-launcher-3016-thread-1) [    ] o.a.s.s.SolrDispatchFilter Using logger factory org.apache.logging.slf4j.Log4jLoggerFactory
   [junit4]   2> 1172673 INFO  (jetty-launcher-3016-thread-1) [    ] o.a.s.s.SolrDispatchFilter  ___      _       Welcome to Apache Solr? version 8.0.0
   [junit4]   2> 1172673 INFO  (jetty-launcher-3016-thread-1) [    ] o.a.s.s.SolrDispatchFilter / __| ___| |_ _   Starting in cloud mode on port null
   [junit4]   2> 1172673 INFO  (jetty-launcher-3016-thread-1) [    ] o.a.s.s.SolrDispatchFilter \__ \/ _ \ | '_|  Install dir: null
   [junit4]   2> 1172674 INFO  (jetty-launcher-3016-thread-1) [    ] o.a.s.s.SolrDispatchFilter |___/\___/_|_|    Start time: 2018-05-25T07:07:24.661Z
   [junit4]   2> 1172779 INFO  (zkConnectionManagerCallback-3025-thread-1) [    ] o.a.s.c.c.ConnectionManager zkClient has connected
   [junit4]   2> 1172780 INFO  (jetty-launcher-3016-thread-4) [    ] o.a.s.c.ZkContainer Zookeeper client=127.0.0.1:37400/solr
   [junit4]   2> 1172780 INFO  (jetty-launcher-3016-thread-3) [    ] o.a.s.s.SolrDispatchFilter solr.xml found in ZooKeeper. Loading...
   [junit4]   2> 1172800 INFO  (zkConnectionManagerCallback-3021-thread-1) [    ] o.a.s.c.c.ConnectionManager zkClient has connected
   [junit4]   2> 1172804 INFO  (jetty-launcher-3016-thread-2) [    ] o.a.s.s.SolrDispatchFilter solr.xml found in ZooKeeper. Loading...
   [junit4]   2> 1172852 WARN  (NIOServerCxn.Factory:0.0.0.0/0.0.0.0:0) [    ] o.a.z.s.NIOServerCnxn Unable to read additional data from client sessionid 0x1023a6223750002, likely client has closed socket
   [junit4]   2> 1172962 INFO  (zkConnectionManagerCallback-3031-thread-1) [    ] o.a.s.c.c.ConnectionManager zkClient has connected
   [junit4]   2> 1173007 INFO  (zkConnectionManagerCallback-3027-thread-1) [    ] o.a.s.c.c.ConnectionManager zkClient has connected
   [junit4]   2> 1173023 INFO  (jetty-launcher-3016-thread-1) [    ] o.a.s.s.SolrDispatchFilter solr.xml found in ZooKeeper. Loading...
   [junit4]   2> 1173109 INFO  (jetty-launcher-3016-thread-2) [    ] o.a.s.c.ZkContainer Zookeeper client=127.0.0.1:37400/solr
   [junit4]   2> 1173155 INFO  (jetty-launcher-3016-thread-3) [    ] o.a.s.c.ZkContainer Zookeeper client=127.0.0.1:37400/solr
   [junit4]   2> 1173280 INFO  (jetty-launcher-3016-thread-1) [    ] o.a.s.c.ZkContainer Zookeeper client=127.0.0.1:37400/solr
   [junit4]   2> 1173300 INFO  (zkConnectionManagerCallback-3034-thread-1) [    ] o.a.s.c.c.ConnectionManager zkClient has connected
   [junit4]   2> 1173348 INFO  (zkConnectionManagerCallback-3041-thread-1) [    ] o.a.s.c.c.ConnectionManager zkClient has connected
   [junit4]   2> 1173352 INFO  (zkConnectionManagerCallback-3038-thread-1) [    ] o.a.s.c.c.ConnectionManager zkClient has connected
   [junit4]   2> 1173352 INFO  (zkConnectionManagerCallback-3045-thread-1) [    ] o.a.s.c.c.ConnectionManager zkClient has connected
   [junit4]   2> 1173535 INFO  (zkConnectionManagerCallback-3047-thread-1) [    ] o.a.s.c.c.ConnectionManager zkClient has connected
   [junit4]   2> 1173584 INFO  (jetty-launcher-3016-thread-3) [n:127.0.0.1:41222_solr    ] o.a.s.c.Overseer Overseer (id=null) closing
   [junit4]   2> 1173585 INFO  (jetty-launcher-3016-thread-3) [n:127.0.0.1:41222_solr    ] o.a.s.c.OverseerElectionContext I am going to be the leader 127.0.0.1:41222_solr
   [junit4]   2> 1173587 INFO  (jetty-launcher-3016-thread-3) [n:127.0.0.1:41222_solr    ] o.a.s.c.Overseer Overseer (id=72684737167425546-127.0.0.1:41222_solr-n_0000000000) starting
   [junit4]   2> 1173610 INFO  (zkConnectionManagerCallback-3051-thread-1) [    ] o.a.s.c.c.ConnectionManager zkClient has connected
   [junit4]   2> 1173702 INFO  (zkConnectionManagerCallback-3055-thread-1) [    ] o.a.s.c.c.ConnectionManager zkClient has connected
   [junit4]   2> 1173923 INFO  (jetty-launcher-3016-thread-2) [n:127.0.0.1:40984_solr    ] o.a.s.c.Overseer Overseer (id=null) closing
   [junit4]   2> 1173975 INFO  (jetty-launcher-3016-thread-2) [n:127.0.0.1:40984_solr    ] o.a.s.c.ZkController Register node as live in ZooKeeper:/live_nodes/127.0.0.1:40984_solr
   [junit4]   2> 1173976 INFO  (jetty-launcher-3016-thread-1) [n:127.0.0.1:44299_solr    ] o.a.s.c.c.ZkStateReader Updated live nodes from ZooKeeper... (0) -> (1)
   [junit4]   2> 1174122 INFO  (zkCallback-3050-thread-1) [    ] o.a.s.c.c.ZkStateReader Updated live nodes from ZooKeeper... (0) -> (1)
   [junit4]   2> 1174232 INFO  (zkCallback-3046-thread-1) [    ] o.a.s.c.c.ZkStateReader Updated live nodes from ZooKeeper... (0) -> (1)
   [junit4]   2> 1174250 INFO  (jetty-launcher-3016-thread-1) [n:127.0.0.1:44299_solr    ] o.a.s.c.Overseer Overseer (id=null) closing
   [junit4]   2> 1174251 INFO  (jetty-launcher-3016-thread-1) [n:127.0.0.1:44299_solr    ] o.a.s.c.TransientSolrCoreCacheDefault Allocating transient cache for 2147483647 transient cores
   [junit4]   2> 1174252 INFO  (jetty-launcher-3016-thread-1) [n:127.0.0.1:44299_solr    ] o.a.s.c.ZkController Register node as live in ZooKeeper:/live_nodes/127.0.0.1:44299_solr
   [junit4]   2> 1174266 INFO  (zkConnectionManagerCallback-3064-thread-1) [    ] o.a.s.c.c.ConnectionManager zkClient has connected
   [junit4]   2> 1174267 INFO  (zkCallback-3050-thread-1) [    ] o.a.s.c.c.ZkStateReader Updated live nodes from ZooKeeper... (1) -> (2)
   [junit4]   2> 1174267 INFO  (zkCallback-3046-thread-1) [    ] o.a.s.c.c.ZkStateReader Updated live nodes from ZooKeeper... (1) -> (2)
   [junit4]   2> 1174340 INFO  (zkCallback-3054-thread-1) [    ] o.a.s.c.c.ZkStateReader Updated live nodes from ZooKeeper... (1) -> (2)
   [junit4]   2> 1174341 INFO  (jetty-launcher-3016-thread-3) [n:127.0.0.1:41222_solr    ] o.a.s.c.c.ZkStateReader Updated live nodes from ZooKeeper... (0) -> (2)
   [junit4]   2> 1174395 INFO  (jetty-launcher-3016-thread-3) [n:127.0.0.1:41222_solr    ] o.a.s.c.s.i.ZkClientClusterStateProvider Cluster at 127.0.0.1:37400/solr ready
   [junit4]   2> 1174522 INFO  (jetty-launcher-3016-thread-3) [n:127.0.0.1:41222_solr    ] o.a.s.c.TransientSolrCoreCacheDefault Allocating transient cache for 2147483647 transient cores
   [junit4]   2> 1174522 INFO  (jetty-launcher-3016-thread-3) [n:127.0.0.1:41222_solr    ] o.a.s.c.ZkController Register node as live in ZooKeeper:/live_nodes/127.0.0.1:41222_solr
   [junit4]   2> 1174580 INFO  (zkCallback-3054-thread-1) [    ] o.a.s.c.c.ZkStateReader Updated live nodes from ZooKeeper... (2) -> (3)
   [junit4]   2> 1174611 INFO  (zkCallback-3050-thread-1) [    ] o.a.s.c.c.ZkStateReader Updated live nodes from ZooKeeper... (2) -> (3)
   [junit4]   2> 1174611 INFO  (zkCallback-3046-thread-1) [    ] o.a.s.c.c.ZkStateReader Updated live nodes from ZooKeeper... (2) -> (3)
   [junit4]   2> 1174707 INFO  (zkCallback-3063-thread-1) [    ] o.a.s.c.c.ZkStateReader Updated live nodes from ZooKeeper... (2) -> (3)
   [junit4]   2> 1175512 INFO  (jetty-launcher-3016-thread-4) [n:127.0.0.1:38115_solr    ] o.a.s.c.c.ZkStateReader Updated live nodes from ZooKeeper... (0) -> (3)
   [junit4]   2> 1175547 INFO  (jetty-launcher-3016-thread-4) [n:127.0.0.1:38115_solr    ] o.a.s.c.Overseer Overseer (id=null) closing
   [junit4]   2> 1175550 INFO  (jetty-launcher-3016-thread-4) [n:127.0.0.1:38115_solr    ] o.a.s.c.TransientSolrCoreCacheDefault Allocating transient cache for 2147483647 transient cores
   [junit4]   2> 1175550 INFO  (jetty-launcher-3016-thread-4) [n:127.0.0.1:38115_solr    ] o.a.s.c.ZkController Register node as live in ZooKeeper:/live_nodes/127.0.0.1:38115_solr
   [junit4]   2> 1175584 INFO  (zkCallback-3054-thread-1) [    ] o.a.s.c.c.ZkStateReader Updated live nodes from ZooKeeper... (3) -> (4)
   [junit4]   2> 1175584 INFO  (zkCallback-3046-thread-1) [    ] o.a.s.c.c.ZkStateReader Updated live nodes from ZooKeeper... (3) -> (4)
   [junit4]   2> 1175604 INFO  (zkCallback-3050-thread-1) [    ] o.a.s.c.c.ZkStateReader Updated live nodes from ZooKeeper... (3) -> (4)
   [junit4]   2> 1175604 INFO  (zkCallback-3063-thread-1) [    ] o.a.s.c.c.ZkStateReader Updated live nodes from ZooKeeper... (3) -> (4)
   [junit4]   2> 1175693 INFO  (zkCallback-3033-thread-1) [    ] o.a.s.c.c.ZkStateReader Updated live nodes from ZooKeeper... (3) -> (4)
   [junit4]   2> 1175729 INFO  (jetty-launcher-3016-thread-1) [n:127.0.0.1:44299_solr    ] o.a.s.m.r.SolrJmxReporter JMX monitoring for 'solr_44299.solr.node' (registry 'solr.node') enabled at server: com.sun.jmx.mbeanserver.JmxMBeanServer@1705cf8
   [junit4]   2> 1176151 INFO  (jetty-launcher-3016-thread-3) [n:127.0.0.1:41222_solr    ] o.a.s.m.r.SolrJmxReporter JMX monitoring for 'solr_41222.solr.node' (registry 'solr.node') enabled at server: com.sun.jmx.mbeanserver.JmxMBeanServer@1705cf8
   [junit4]   2> 1176503 INFO  (jetty-launcher-3016-thread-1) [n:127.0.0.1:44299_solr    ] o.a.s.m.r.SolrJmxReporter JMX monitoring for 'solr_44299.solr.jvm' (registry 'solr.jvm') enabled at server: com.sun.jmx.mbeanserver.JmxMBeanServer@1705cf8
   [junit4]   2> 1176504 INFO  (jetty-launcher-3016-thread-1) [n:127.0.0.1:44299_solr    ] o.a.s.m.r.SolrJmxReporter JMX monitoring for 'solr_44299.solr.jetty' (registry 'solr.jetty') enabled at server: com.sun.jmx.mbeanserver.JmxMBeanServer@1705cf8
   [junit4]   2> 1176505 INFO  (jetty-launcher-3016-thread-1) [n:127.0.0.1:44299_solr    ] o.a.s.c.CorePropertiesLocator Found 0 core definitions underneath /home/jenkins/jenkins-slave/workspace/Lucene-Solr-Tests-master/solr/build/solr-core/test/J2/temp/solr.cloud.autoscaling.SearchRateTriggerTest_DF83F71514323302-001/tempDir-001/node4/.
   [junit4]   2> 1176556 INFO  (jetty-launcher-3016-thread-3) [n:127.0.0.1:41222_solr    ] o.a.s.m.r.SolrJmxReporter JMX monitoring for 'solr_41222.solr.jvm' (registry 'solr.jvm') enabled at server: com.sun.jmx.mbeanserver.JmxMBeanServer@1705cf8
   [junit4]   2> 1176556 INFO  (jetty-launcher-3016-thread-3) [n:127.0.0.1:41222_solr    ] o.a.s.m.r.SolrJmxReporter JMX monitoring for 'solr_41222.solr.jetty' (registry 'solr.jetty') enabled at server: com.sun.jmx.mbeanserver.JmxMBeanServer@1705cf8
   [junit4]   2> 1176557 INFO  (jetty-launcher-3016-thread-3) [n:127.0.0.1:41222_solr    ] o.a.s.c.CorePropertiesLocator Found 0 core definitions underneath /home/jenkins/jenkins-slave/workspace/Lucene-Solr-Tests-master/solr/build/solr-core/test/J2/temp/solr.cloud.autoscaling.SearchRateTriggerTest_DF83F71514323302-001/tempDir-001/node2/.
   [junit4]   2> 1176665 INFO  (zkConnectionManagerCallback-3069-thread-1) [    ] o.a.s.c.c.ConnectionManager zkClient has connected
   [junit4]   2> 1176775 INFO  (jetty-launcher-3016-thread-1) [n:127.0.0.1:44299_solr    ] o.a.s.c.c.ZkStateReader Updated live nodes from ZooKeeper... (0) -> (4)
   [junit4]   2> 1176848 INFO  (jetty-launcher-3016-thread-1) [n:127.0.0.1:44299_solr    ] o.a.s.c.s.i.ZkClientClusterStateProvider Cluster at 127.0.0.1:37400/solr ready
   [junit4]   2> 1177201 INFO  (jetty-launcher-3016-thread-4) [n:127.0.0.1:38115_solr    ] o.a.s.m.r.SolrJmxReporter JMX monitoring for 'solr_38115.solr.node' (registry 'solr.node') enabled at server: com.sun.jmx.mbeanserver.JmxMBeanServer@1705cf8
   [junit4]   2> 1177237 INFO  (jetty-launcher-3016-thread-4) [n:127.0.0.1:38115_solr    ] o.a.s.m.r.SolrJmxReporter JMX monitoring for 'solr_38115.solr.jvm' (registry 'solr.jvm') enabled at server: com.sun.jmx.mbeanserver.JmxMBeanServer@1705cf8
   [junit4]   2> 1177237 INFO  (jetty-launcher-3016-thread-4) [n:127.0.0.1:38115_solr    ] o.a.s.m.r.SolrJmxReporter JMX monitoring for 'solr_38115.solr.jetty' (registry 'solr.jetty') enabled at server: com.sun.jmx.mbeanserver.JmxMBeanServer@1705cf8
   [junit4]   2> 1177238 INFO  (jetty-launcher-3016-thread-4) [n:127.0.0.1:38115_solr    ] o.a.s.c.CorePropertiesLocator Found 0 core definitions underneath /home/jenkins/jenkins-slave/workspace/Lucene-Solr-Tests-master/solr/build/solr-core/test/J2/temp/solr.cloud.autoscaling.SearchRateTriggerTest_DF83F71514323302-001/tempDir-001/node3/.
   [junit4]   2> 1177357 INFO  (zkConnectionManagerCallback-3074-thread-1) [    ] o.a.s.c.c.ConnectionManager zkClient has connected
   [junit4]   2> 1177418 INFO  (jetty-launcher-3016-thread-4) [n:127.0.0.1:38115_solr    ] o.a.s.c.c.ZkStateReader Updated live nodes from ZooKeeper... (0) -> (4)
   [junit4]   2> 1177418 INFO  (jetty-launcher-3016-thread-4) [n:127.0.0.1:38115_solr    ] o.a.s.c.s.i.ZkClientClusterStateProvider Cluster at 127.0.0.1:37400/solr ready
   [junit4]   2> 1177749 INFO  (jetty-launcher-3016-thread-2) [n:127.0.0.1:40984_solr    ] o.a.s.m.r.SolrJmxReporter JMX monitoring for 'solr_40984.solr.node' (registry 'solr.node') enabled at server: com.sun.jmx.mbeanserver.JmxMBeanServer@1705cf8
   [junit4]   2> 1177784 INFO  (jetty-launcher-3016-thread-2) [n:127.0.0.1:40984_solr    ] o.a.s.m.r.SolrJmxReporter JMX monitoring for 'solr_40984.solr.jvm' (registry 'solr.jvm') enabled at server: com.sun.jmx.mbeanserver.JmxMBeanServer@1705cf8
   [junit4]   2> 1177784 INFO  (jetty-launcher-3016-thread-2) [n:127.0.0.1:40984_solr    ] o.a.s.m.r.SolrJmxReporter JMX monitoring for 'solr_40984.solr.jetty' (registry 'solr.jetty') enabled at server: com.sun.jmx.mbeanserver.JmxMBeanServer@1705cf8
   [junit4]   2> 1177785 INFO  (jetty-launcher-3016-thread-2) [n:127.0.0.1:40984_solr    ] o.a.s.c.CorePropertiesLocator Found 0 core definitions underneath /home/jenkins/jenkins-slave/workspace/Lucene-Solr-Tests-master/solr/build/solr-core/test/J2/temp/solr.cloud.autoscaling.SearchRateTriggerTest_DF83F71514323302-001/tempDir-001/node1/.
   [junit4]   2> 1177813 INFO  (zkConnectionManagerCallback-3079-thread-1) [    ] o.a.s.c.c.ConnectionManager zkClient has connected
   [junit4]   2> 1177815 INFO  (jetty-launcher-3016-thread-2) [n:127.0.0.1:40984_solr    ] o.a.s.c.c.ZkStateReader Updated live nodes from ZooKeeper... (0) -> (4)
   [junit4]   2> 1177815 INFO  (jetty-launcher-3016-thread-2) [n:127.0.0.1:40984_solr    ] o.a.s.c.s.i.ZkClientClusterStateProvider Cluster at 127.0.0.1:37400/solr ready
   [junit4]   2> 1177982 INFO  (zkConnectionManagerCallback-3081-thread-1) [    ] o.a.s.c.c.ConnectionManager zkClient has connected
   [junit4]   2> 1177996 WARN  (NIOServerCxn.Factory:0.0.0.0/0.0.0.0:0) [    ] o.a.z.s.NIOServerCnxn Unable to read additional data from client sessionid 0x1023a6223750011, likely client has closed socket
   [junit4]   2> 1178052 INFO  (zkConnectionManagerCallback-3086-thread-1) [    ] o.a.s.c.c.ConnectionManager zkClient has connected
   [junit4]   2> 1178053 INFO  (SUITE-SearchRateTriggerTest-seed#[DF83F71514323302]-worker) [    ] o.a.s.c.c.ZkStateReader Updated live nodes from ZooKeeper... (0) -> (4)
   [junit4]   2> 1178054 INFO  (SUITE-SearchRateTriggerTest-seed#[DF83F71514323302]-worker) [    ] o.a.s.c.s.i.ZkClientClusterStateProvider Cluster at 127.0.0.1:37400/solr ready
   [junit4]   2> 1179795 INFO  (TEST-SearchRateTriggerTest.testDefaultsAndBackcompat-seed#[DF83F71514323302]) [    ] o.a.s.SolrTestCaseJ4 ###Starting testDefaultsAndBackcompat
   [junit4]   2> 1179796 INFO  (TEST-SearchRateTriggerTest.testDefaultsAndBackcompat-seed#[DF83F71514323302]) [    ] o.a.s.c.c.ZkStateReader Updated live nodes from ZooKeeper... (0) -> (4)
   [junit4]   2> 1179852 INFO  (TEST-SearchRateTriggerTest.testDefaultsAndBackcompat-seed#[DF83F71514323302]) [    ] o.a.s.SolrTestCaseJ4 ###Ending testDefaultsAndBackcompat
   [junit4]   2> 1181011 INFO  (TEST-SearchRateTriggerTest.testTrigger-seed#[DF83F71514323302]) [    ] o.a.s.SolrTestCaseJ4 ###Starting testTrigger
   [junit4]   2> 1181013 INFO  (TEST-SearchRateTriggerTest.testTrigger-seed#[DF83F71514323302]) [    ] o.a.s.c.c.ZkStateReader Updated live nodes from ZooKeeper... (0) -> (4)
   [junit4]   2> 1181058 INFO  (qtp1196434725-5602) [n:127.0.0.1:41222_solr    ] o.a.s.h.a.CollectionsHandler Invoked Collection Action :create with params replicationFactor=2&collection.configName=conf&maxShardsPerNode=1&name=SearchRateTriggerTest-collection1&nrtReplicas=2&action=CREATE&numShards=2&wt=javabin&version=2 and sendToOCPQueue=true
   [junit4]   2> 1181130 INFO  (OverseerThreadFactory-700-thread-1) [    ] o.a.s.c.a.c.CreateCollectionCmd Create collection SearchRateTriggerTest-collection1
   [junit4]   2> 1181427 INFO  (OverseerStateUpdate-72684737167425546-127.0.0.1:41222_solr-n_0000000000) [    ] o.a.s.c.o.SliceMutator createReplica() {
   [junit4]   2>   "operation":"ADDREPLICA",
   [junit4]   2>   "collection":"SearchRateTriggerTest-collection1",
   [junit4]   2>   "shard":"shard1",
   [junit4]   2>   "core":"SearchRateTriggerTest-collection1_shard1_replica_n1",
   [junit4]   2>   "state":"down",
   [junit4]   2>   "base_url":"http://127.0.0.1:41222/solr",
   [junit4]   2>   "type":"NRT",
   [junit4]   2>   "waitForFinalState":"false"} 
   [junit4]   2> 1181500 INFO  (OverseerStateUpdate-72684737167425546-127.0.0.1:41222_solr-n_0000000000) [    ] o.a.s.c.o.SliceMutator createReplica() {
   [junit4]   2>   "operation":"ADDREPLICA",
   [junit4]   2>   "collection":"SearchRateTriggerTest-collection1",
   [junit4]   2>   "shard":"shard1",
   [junit4]   2>   "core":"SearchRateTriggerTest-collection1_shard1_replica_n2",
   [junit4]   2>   "state":"down",
   [junit4]   2>   "base_url":"http://127.0.0.1:44299/solr",
   [junit4]   2>   "type":"NRT",
   [junit4]   2>   "waitForFinalState":"false"} 
   [junit4]   2> 1181631 INFO  (OverseerStateUpdate-72684737167425546-127.0.0.1:41222_solr-n_0000000000) [    ] o.a.s.c.o.SliceMutator createReplica() {
   [junit4]   2>   "operation":"ADDREPLICA",
   [junit4]   2>   "collection":"SearchRateTriggerTest-collection1",
   [junit4]   2>   "shard":"shard2",
   [junit4]   2>   "core":"SearchRateTriggerTest-collection1_shard2_replica_n3",
   [junit4]   2>   "state":"down",
   [junit4]   2>   "base_url":"http://127.0.0.1:40984/solr",
   [junit4]   2>   "type":"NRT",
   [junit4]   2>   "waitForFinalState":"false"} 
   [junit4]   2> 1181657 INFO  (OverseerStateUpdate-72684737167425546-127.0.0.1:41222_solr-n_0000000000) [    ] o.a.s.c.o.SliceMutator createReplica() {
   [junit4]   2>   "operation":"ADDREPLICA",
   [junit4]   2>   "collection":"SearchRateTriggerTest-collection1",
   [junit4]   2>   "shard":"shard2",
   [junit4]   2>   "core":"SearchRateTriggerTest-collection1_shard2_replica_n4",
   [junit4]   2>   "state":"down",
   [junit4]   2>   "base_url":"http://127.0.0.1:38115/solr",
   [junit4]   2>   "type":"NRT",
   [junit4]   2>   "waitForFinalState":"false"} 
   [junit4]   2> 1181867 INFO  (qtp1196434725-5566) [n:127.0.0.1:41222_solr    x:SearchRateTriggerTest-collection1_shard1_replica_n1] o.a.s.h.a.CoreAdminOperation core create command qt=/admin/cores&coreNodeName=core_node5&collection.configName=conf&newCollection=true&name=SearchRateTriggerTest-collection1_shard1_replica_n1&action=CREATE&numShards=2&collection=SearchRateTriggerTest-collection1&shard=shard1&wt=javabin&version=2&replicaType=NRT
   [junit4]   2> 1181932 INFO  (qtp1701466030-5580) [n:127.0.0.1:44299_solr    x:SearchRateTriggerTest-collection1_shard1_replica_n2] o.a.s.h.a.CoreAdminOperation core create command qt=/admin/cores&coreNodeName=core_node6&collection.configName=conf&newCollection=true&name=SearchRateTriggerTest-collection1_shard1_replica_n2&action=CREATE&numShards=2&collection=SearchRateTriggerTest-collection1&shard=shard1&wt=javabin&version=2&replicaType=NRT
   [junit4]   2> 1181941 INFO  (qtp1297292340-5571) [n:127.0.0.1:40984_solr    x:SearchRateTriggerTest-collection1_shard2_replica_n3] o.a.s.h.a.CoreAdminOperation core create command qt=/admin/cores&coreNodeName=core_node7&collection.configName=conf&newCollection=true&name=SearchRateTriggerTest-collection1_shard2_replica_n3&action=CREATE&numShards=2&collection=SearchRateTriggerTest-collection1&shard=shard2&wt=javabin&version=2&replicaType=NRT
   [junit4]   2> 1181942 INFO  (qtp1297292340-5571) [n:127.0.0.1:40984_solr    x:SearchRateTriggerTest-collection1_shard2_replica_n3] o.a.s.c.TransientSolrCoreCacheDefault Allocating transient cache for 2147483647 transient cores
   [junit4]   2> 1182189 INFO  (qtp1393987523-5588) [n:127.0.0.1:38115_solr    x:SearchRateTriggerTest-collection1_shard2_replica_n4] o.a.s.h.a.CoreAdminOperation core create command qt=/admin/cores&coreNodeName=core_node8&collection.configName=conf&newCollection=true&name=SearchRateTriggerTest-collection1_shard2_replica_n4&action=CREATE&numShards=2&collection=SearchRateTriggerTest-collection1&shard=shard2&wt=javabin&version=2&replicaType=NRT
   [junit4]   2> 1183074 INFO  (qtp1701466030-5580) [n:127.0.0.1:44299_solr c:SearchRateTriggerTest-collection1 s:shard1 r:core_node6 x:SearchRateTriggerTest-collection1_shard1_replica_n2] o.a.s.c.SolrConfig Using Lucene MatchVersion: 8.0.0
   [junit4]   2> 1183217 INFO  (qtp1196434725-5566) [n:127.0.0.1:41222_solr c:SearchRateTriggerTest-collection1 s:shard1 r:core_node5 x:SearchRateTriggerTest-collection1_shard1_replica_n1] o.a.s.c.SolrConfig Using Lucene MatchVersion: 8.0.0
   [junit4]   2> 1183638 INFO  (qtp1701466030-5580) [n:127.0.0.1:44299_solr c:SearchRateTriggerTest-collection1 s:shard1 r:core_node6 x:SearchRateTriggerTest-collection1_shard1_replica_n2] o.a.s.s.IndexSchema [SearchRateTriggerTest-collection1_shard1_replica_n2] Schema name=minimal
   [junit4]   2> 1183666 INFO  (qtp1297292340-5571) [n:127.0.0.1:40984_solr c:SearchRateTriggerTest-collection1 s:shard2 r:core_node7 x:SearchRateTriggerTest-collection1_shard2_replica_n3] o.a.s.c.SolrConfig Using Lucene MatchVersion: 8.0.0
   [junit4]   2> 1183840 INFO  (qtp1701466030-5580) [n:127.0.0.1:44299_solr c:SearchRateTriggerTest-collection1 s:shard1 r:core_node6 x:SearchRateTriggerTest-collection1_shard1_replica_n2] o.a.s.s.IndexSchema Loaded schema minimal/1.1 with uniqueid field id
   [junit4]   2> 1183840 INFO  (qtp1701466030-5580) [n:127.0.0.1:44299_solr c:SearchRateTriggerTest-collection1 s:shard1 r:core_node6 x:SearchRateTriggerTest-collection1_shard1_replica_n2] o.a.s.c.CoreContainer Creating SolrCore 'SearchRateTriggerTest-collection1_shard1_replica_n2' using configuration from collection SearchRateTriggerTest-collection1, trusted=true
   [junit4]   2> 1183841 INFO  (qtp1701466030-5580) [n:127.0.0.1:44299_solr c:SearchRateTriggerTest-collection1 s:shard1 r:core_node6 x:SearchRateTriggerTest-collection1_shard1_replica_n2] o.a.s.m.r.SolrJmxReporter JMX monitoring for 'solr_44299.solr.core.SearchRateTriggerTest-collection1.shard1.replica_n2' (registry 'solr.core.SearchRateTriggerTest-collection1.shard1.replica_n2') enabled at server: com.sun.jmx.mbeanserver.JmxMBeanServer@1705cf8
   [junit4]   2> 1183841 INFO  (qtp1701466030-5580) [n:127.0.0.1:44299_solr c:SearchRateTriggerTest-collection1 s:shard1 r:core_node6 x:SearchRateTriggerTest-collection1_shard1_replica_n2] o.a.s.c.SolrCore solr.RecoveryStrategy.Builder
   [junit4]   2> 1183841 INFO  (qtp1701466030-5580) [n:127.0.0.1:44299_solr c:SearchRateTriggerTest-collection1 s:shard1 r:core_node6 x:SearchRateTriggerTest-collection1_shard1_replica_n2] o.a.s.c.SolrCore [[SearchRateTriggerTest-collection1_shard1_replica_n2] ] Opening new SolrCore at [/home/jenkins/jenkins-slave/workspace/Lucene-Solr-Tests-master/solr/build/solr-core/test/J2/temp/solr.cloud.autoscaling.SearchRateTriggerTest_DF83F71514323302-001/tempDir-001/node4/SearchRateTriggerTest-collection1_shard1_replica_n2], dataDir=[/home/jenkins/jenkins-slave/workspace/Lucene-Solr-Tests-master/solr/build/solr-core/test/J2/temp/solr.cloud.autoscaling.SearchRateTriggerTest_DF83F71514323302-001/tempDir-001/node4/./SearchRateTriggerTest-collection1_shard1_replica_n2/data/]
   [junit4]   2> 1183925 INFO  (qtp1297292340-5571) [n:127.0.0.1:40984_solr c:SearchRateTriggerTest-collection1 s:shard2 r:core_node7 x:SearchRateTriggerTest-collection1_shard2_replica_n3] o.a.s.s.IndexSchema [SearchRateTriggerTest-collection1_shard2_replica_n3] Schema name=minimal
   [junit4]   2> 1183930 INFO  (qtp1393987523-5588) [n:127.0.0.1:38115_solr c:SearchRateTriggerTest-collection1 s:shard2 r:core_node8 x:SearchRateTriggerTest-collection1_shard2_replica_n4] o.a.s.c.SolrConfig Using Lucene MatchVersion: 8.0.0
   [junit4]   2> 1183960 INFO  (qtp1196434725-5566) [n:127.0.0.1:41222_solr c:SearchRateTriggerTest-collection1 s:shard1 r:core_node5 x:SearchRateTriggerTest-collection1_shard1_replica_n1] o.a.s.s.IndexSchema [SearchRateTriggerTest-collection1_shard1_replica_n1] Schema name=minimal
   [junit4]   2> 1183976 INFO  (qtp1297292340-5571) [n:127.0.0.1:40984_solr c:SearchRateTriggerTest-collection1 s:shard2 r:core_node7 x:SearchRateTriggerTest-collection1_shard2_replica_n3] o.a.s.s.IndexSchema Loaded schema minimal/1.1 with uniqueid field id
   [junit4]   2> 1183976 INFO  (qtp1297292340-5571) [n:127.0.0.1:40984_solr c:SearchRateTriggerTest-collection1 s:shard2 r:core_node7 x:SearchRateTriggerTest-collection1_shard2_replica_n3] o.a.s.c.CoreContainer Creating SolrCore 'SearchRateTriggerTest-collection1_shard2_replica_n3' using configuration from collection SearchRateTriggerTest-collection1, trusted=true
   [junit4]   2> 1183976 INFO  (qtp1297292340-5571) [n:127.0.0.1:40984_solr c:SearchRateTriggerTest-collection1 s:shard2 r:core_node7 x:SearchRateTriggerTest-collection1_shard2_replica_n3] o.a.s.m.r.SolrJmxReporter JMX monitoring for 'solr_40984.solr.core.SearchRateTriggerTest-collection1.shard2.replica_n3' (registry 'solr.core.SearchRateTriggerTest-collection1.shard2.replica_n3') enabled at server: com.sun.jmx.mbeanserver.JmxMBeanServer@1705cf8
   [junit4]   2> 1183977 INFO  (qtp1297292340-5571) [n:127.0.0.1:40984_solr c:SearchRateTriggerTest-collection1 s:shard2 r:core_node7 x:SearchRateTriggerTest-collection1_shard2_replica_n3] o.a.s.c.SolrCore solr.RecoveryStrategy.Builder
   [junit4]   2> 1183977 INFO  (qtp1297292340-5571) [n:127.0.0.1:40984_solr c:SearchRateTriggerTest-collection1 s:shard2 r:core_node7 x:SearchRateTriggerTest-collection1_shard2_replica_n3] o.a.s.c.SolrCore [[SearchRateTriggerTest-collection1_shard2_replica_n3] ] Opening new SolrCore at [/home/jenkins/jenkins-slave/workspace/Lucene-Solr-Tests-master/solr/build/solr-core/test/J2/temp/solr.cloud.autoscaling.SearchRateTriggerTest_DF83F71514323302-001/tempDir-001/node1/SearchRateTriggerTest-collection1_shard2_replica_n3], dataDir=[/home/jenkins/jenkins-slave/workspace/Lucene-Solr-Tests-master/solr/build/solr-core/test/J2/temp/solr.cloud.autoscaling.SearchRateTriggerTest_DF83F71514323302-001/tempDir-001/node1/./SearchRateTriggerTest-collection1_shard2_replica_n3/data/]
   [junit4]   2> 1184012 INFO  (qtp1196434725-5566) [n:127.0.0.1:41222_solr c:SearchRateTriggerTest-collection1 s:shard1 r:core_node5 x:SearchRateTriggerTest-collection1_shard1_replica_n1] o.a.s.s.IndexSchema Loaded schema minimal/1.1 with uniqueid field id
   [junit4]   2> 1184012 INFO  (qtp1196434725-5566) [n:127.0.0.1:41222_solr c:SearchRateTriggerTest-collection1 s:shard1 r:core_node5 x:SearchRateTriggerTest-collection1_shard1_replica_n1] o.a.s.c.CoreContainer Creating SolrCore 'SearchRateTriggerTest-collection1_shard1_replica_n1' using configuration from collection SearchRateTriggerTest-collection1, trusted=true
   [junit4]   2> 1184012 INFO  (qtp1196434725-5566) [n:127.0.0.1:41222_solr c:SearchRateTriggerTest-collection1 s:shard1 r:core_node5 x:SearchRateTriggerTest-collection1_shard1_replica_n1] o.a.s.m.r.SolrJmxReporter JMX monitoring for 'solr_41222.solr.core.SearchRateTriggerTest-collection1.shard1.replica_n1' (registry 'solr.core.SearchRateTriggerTest-collection1.shard1.replica_n1') enabled at server: com.sun.jmx.mbeanserver.JmxMBeanServer@1705cf8
   [junit4]   2> 1184013 INFO  (qtp1196434725-5566) [n:127.0.0.1:41222_solr c:SearchRateTriggerTest-collection1 s:shard1 r:core_node5 x:SearchRateTriggerTest-collection1_shard1_replica_n1] o.a.s.c.SolrCore solr.RecoveryStrategy.Builder
   [junit4]   2> 1184013 INFO  (qtp1196434725-5566) [n:127.0.0.1:41222_solr c:SearchRateTriggerTest-collection1 s:shard1 r:core_node5 x:SearchRateTriggerTest-collection1_shard1_replica_n1] o.a.s.c.SolrCore [[SearchRateTriggerTest-collection1_shard1_replica_n1] ] Opening new SolrCore at [/home/jenkins/jenkins-slave/workspace/Lucene-Solr-Tests-master/solr/build/solr-core/test/J2/temp/solr.cloud.autoscaling.SearchRateTriggerTest_DF83F71514323302-001/tempDir-001/node2/SearchRateTriggerTest-collection1_shard1_replica_n1], dataDir=[/home/jenkins/jenkins-slave/workspace/Lucene-Solr-Tests-master/solr/build/solr-core/test/J2/temp/solr.cloud.autoscaling.SearchRateTriggerTest_DF83F71514323302-001/tempDir-001/node2/./SearchRateTriggerTest-collection1_shard1_replica_n1/data/]
   [junit4]   2> 1184061 INFO  (qtp1393987523-5588) [n:127.0.0.1:38115_solr c:SearchRateTriggerTest-collection1 s:shard2 r:core_node8 x:SearchRateTriggerTest-collection1_shard2_replica_n4] o.a.s.s.IndexSchema [SearchRateTriggerTest-collection1_shard2_replica_n4] Schema name=minimal
   [junit4]   2> 1184063 INFO  (qtp1393987523-5588) [n:127.0.0.1:38115_solr c:SearchRateTriggerTest-collection1 s:shard2 r:core_node8 x:SearchRateTriggerTest-collection1_shard2_replica_n4] o.a.s.s.IndexSchema Loaded schema minimal/1.1 with uniqueid field id
   [junit4]   2> 1184063 INFO  (qtp1393987523-5588) [n:127.0.0.1:38115_solr c:SearchRateTriggerTest-collection1 s:shard2 r:core_node8 x:SearchRateTriggerTest-collection1_shard2_replica_n4] o.a.s.c.CoreContainer Creating SolrCore 'SearchRateTriggerTest-collection1_shard2_replica_n4' using configuration from collection SearchRateTriggerTest-collection1, trusted=true
   [junit4]   2> 1184113 INFO  (qtp1393987523-5588) [n:127.0.0.1:38115_solr c:SearchRateTriggerTest-collection1 s:shard2 r:core_node8 x:SearchRateTriggerTest-collection1_shard2_replica_n4] o.a.s.m.r.SolrJmxReporter JMX monitoring for 'solr_38115.solr.core.SearchRateTriggerTest-collection1.shard2.replica_n4' (registry 'solr.core.SearchRateTriggerTest-collection1.shard2.replica_n4') enabled at server: com.sun.jmx.mbeanserver.JmxMBeanServer@1705cf8
   [junit4]   2> 1184113 INFO  (qtp1393987523-5588) [n:127.0.0.1:38115_solr c:SearchRateTriggerTest-collection1 s:shard2 r:core_node8 x:SearchRateTriggerTest-collection1_shard2_replica_n4] o.a.s.c.SolrCore solr.RecoveryStrategy.Builder
   [junit4]   2> 1184113 INFO  (qtp1393987523-5588) [n:127.0.0.1:38115_solr c:SearchRateTriggerTest-collection1 s:shard2 r:core_node8 x:SearchRateTriggerTest-collection1_shard2_replica_n4] o.a.s.c.SolrCore [[SearchRateTriggerTest-collection1_shard2_replica_n4] ] Opening new SolrCore at [/home/jenkins/jenkins-slave/workspace/Lucene-Solr-Tests-master/solr/build/solr-core/test/J2/temp/solr.cloud.autoscaling.SearchRateTriggerTest_DF83F71514323302-001/tempDir-001/node3/SearchRateTriggerTest-collection1_shard2_replica_n4], dataDir=[/home/jenkins/jenkins-slave/workspace/Lucene-Solr-Tests-master/solr/build/solr-core/test/J2/temp/solr.cloud.autoscaling.SearchRateTriggerTest_DF83F71514323302-001/tempDir-001/node3/./SearchRateTriggerTest-collection1_shard2_replica_n4/data/]
   [junit4]   2> 1185215 INFO  (qtp1701466030-5580) [n:127.0.0.1:44299_solr c:SearchRateTriggerTest-collection1 s:shard1 r:core_node6 x:SearchRateTriggerTest-collection1_shard1_replica_n2] o.a.s.u.UpdateHandler Using UpdateLog implementation: org.apache.solr.update.UpdateLog
   [junit4]   2> 1185215 INFO  (qtp1701466030-5580) [n:127.0.0.1:44299_solr c:SearchRateTriggerTest-collection1 s:shard1 r:core_node6 x:SearchRateTriggerTest-collection1_shard1_replica_n2] o.a.s.u.UpdateLog Initializing UpdateLog: dataDir=null defaultSyncLevel=FLUSH numRecordsToKeep=100 maxNumLogsToKeep=10 numVersionBuckets=65536
   [junit4]   2> 1185216 INFO  (qtp1701466030-5580) [n:127.0.0.1:44299_solr c:SearchRateTriggerTest-collection1 s:shard1 r:core_node6 x:SearchRateTriggerTest-collection1_shard1_replica_n2] o.a.s.u.CommitTracker Hard AutoCommit: disabled
   [junit4]   2> 1185216 INFO  (qtp1701466030-5580) [n:127.0.0.1:44299_solr c:SearchRateTriggerTest-collection1 s:shard1 r:core_node6 x:SearchRateTriggerTest-collection1_shard1_replica_n2] o.a.s.u.CommitTracker Soft AutoCommit: disabled
   [junit4]   2> 1185217 INFO  (qtp1701466030-5580) [n:127.0.0.1:44299_solr c:SearchRateTriggerTest-collection1 s:shard1 r:core_node6 x:SearchRateTriggerTest-collection1_shard1_replica_n2] o.a.s.s.SolrIndexSearcher Opening [Searcher@786bdcc2[SearchRateTriggerTest-collection1_shard1_replica_n2] main]
   [junit4]   2> 1185276 INFO  (qtp1297292340-5571) [n:127.0.0.1:40984_solr c:SearchRateTriggerTest-collection1 s:shard2 r:core_node7 x:SearchRateTriggerTest-collection1_shard2_replica_n3] o.a.s.u.UpdateHandler Using UpdateLog implementation: org.apache.solr.update.UpdateLog
   [junit4]   2> 1185276 INFO  (qtp1297292340-5571) [n:127.0.0.1:40984_solr c:SearchRateTriggerTest-collection1 s:shard2 r:core_node7 x:SearchRateTriggerTest-collection1_shard2_replica_n3] o.a.s.u.UpdateLog Initializing UpdateLog: dataDir=null defaultSyncLevel=FLUSH numRecordsToKeep=100 maxNumLogsToKeep=10 numVersionBuckets=65536
   [junit4]   2> 1185277 INFO  (qtp1297292340-5571) [n:127.0.0.1:40984_solr c:SearchRateTriggerTest-collection1 s:shard2 r:core_node7 x:SearchRateTriggerTest-collection1_shard2_replica_n3] o.a.s.u.CommitTracker Hard AutoCommit: disabled
   [junit4]   2> 1185277 INFO  (qtp1297292340-5571) [n:127.0.0.1:40984_solr c:SearchRateTriggerTest-collection1 s:shard2 r:core_node7 x:SearchRateTriggerTest-collection1_shard2_replica_n3] o.a.s.u.CommitTracker Soft AutoCommit: disabled
   [junit4]   2> 1185447 INFO  (qtp1701466030-5580) [n:127.0.0.1:44299_solr c:SearchRateTriggerTest-collection1 s:shard1 r:core_node6 x:SearchRateTriggerTest-collection1_shard1_replica_n2] o.a.s.r.ManagedResourceStorage Configured ZooKeeperStorageIO with znodeBase: /configs/conf
   [junit4]   2> 1185467 INFO  (qtp1701466030-5580) [n:127.0.0.1:44299_solr c:SearchRateTriggerTest-collection1 s:shard1 r:core_node6 x:SearchRateTriggerTest-collection1_shard1_replica_n2] o.a.s.r.ManagedResourceStorage Loaded null at path _rest_managed.json using ZooKeeperStorageIO:path=/configs/conf
   [junit4]   2> 1185467 INFO  (qtp1297292340-5571) [n:127.0.0.1:40984_solr c:SearchRateTriggerTest-collection1 s:shard2 r:core_node7 x:SearchRateTriggerTest-collection1_shard2_replica_n3] o.a.s.s.SolrIndexSearcher Opening [Searcher@6a90075e[SearchRateTriggerTest-collection1_shard2_replica_n3] main]
   [junit4]   2> 1185469 INFO  (qtp1297292340-5571) [n:127.0.0.1:40984_solr c:SearchRateTriggerTest-collection1 s:shard2 r:core_node7 x:SearchRateTriggerTest-collection1_shard2_replica_n3] o.a.s.r.ManagedResourceStorage Configured ZooKeeperStorageIO with znodeBase: /configs/conf
   [junit4]   2> 1185469 INFO  (qtp1701466030-5580) [n:127.0.0.1:44299_solr c:SearchRateTriggerTest-collection1 s:shard1 r:core_node6 x:SearchRateTriggerTest-collection1_shard1_replica_n2] o.a.s.h.ReplicationHandler Commits will be reserved for 10000ms.
   [junit4]   2> 1185469 INFO  (qtp1297292340-5571) [n:127.0.0.1:40984_solr c:SearchRateTriggerTest-collection1 s:shard2 r:core_node7 x:SearchRateTriggerTest-collection1_shard2_replica_n3] o.a.s.r.ManagedResourceStorage Loaded null at path _rest_managed.json using ZooKeeperStorageIO:path=/configs/conf
   [junit4]   2> 1185469 INFO  (qtp1701466030-5580) [n:127.0.0.1:44299_solr c:SearchRateTriggerTest-collection1 s:shard1 r:core_node6 x:SearchRateTriggerTest-collection1_shard1_replica_n2] o.a.s.u.UpdateLog Could not find max version in index or recent updates, using new clock 1601418881878982656
   [junit4]   2> 1185557 INFO  (qtp1297292340-5571) [n:127.0.0.1:40984_solr c:SearchRateTriggerTest-collection1 s:shard2 r:core_node7 x:SearchRateTriggerTest-collection1_shard2_replica_n3] o.a.s.h.ReplicationHandler Commits will be reserved for 10000ms.
   [junit4]   2> 1185558 INFO  (qtp1297292340-5571) [n:127.0.0.1:40984_solr c:SearchRateTriggerTest-collection1 s:shard2 r:core_node7 x:SearchRateTriggerTest-collection1_shard2_replica_n3] o.a.s.u.UpdateLog Could not find max version in index or recent updates, using new clock 1601418881972305920
   [junit4]   2> 1185568 INFO  (qtp1297292340-5571) [n:127.0.0.1:40984_solr c:SearchRateTriggerTest-collection1 s:shard2 r:core_node7 x:SearchRateTriggerTest-collection1_shard2_replica_n3] o.a.s.c.ZkShardTerms Successful update of terms at /collections/SearchRateTriggerTest-collection1/terms/shard2 to Terms{values={core_node7=0}, version=0}
   [junit4]   2> 1185597 INFO  (searcherExecutor-709-thread-1-processing-n:127.0.0.1:44299_solr x:SearchRateTriggerTest-collection1_shard1_replica_n2 c:SearchRateTriggerTest-collection1 s:shard1 r:core_node6) [n:127.0.0.1:44299_solr c:SearchRateTriggerTest-collection1 s:shard1 r:core_node6 x:SearchRateTriggerTest-collection1_shard1_replica_n2] o.a.s.c.SolrCore [SearchRateTriggerTest-collection1_shard1_replica_n2] Registered new searcher Searcher@786bdcc2[SearchRateTriggerTest-collection1_shard1_replica_n2] main{ExitableDirectoryReader(UninvertingDirectoryReader())}
   [junit4]   2> 1185703 INFO  (qtp1196434725-5566) [n:127.0.0.1:41222_solr c:SearchRateTriggerTest-collection1 s:shard1 r:core_node5 x:SearchRateTriggerTest-collection1_shard1_replica_n1] o.a.s.u.UpdateHandler Using UpdateLog implementation: org.apache.solr.update.UpdateLog
   [junit4]   2> 1185703 INFO  (qtp1196434725-5566) [n:127.0.0.1:41222_solr c:SearchRateTriggerTest-collection1 s:shard1 r:core_node5 x:SearchRateTriggerTest-collection1_shard1_replica_n1] o.a.s.u.UpdateLog Initializing UpdateLog: dataDir=null defaultSyncLevel=FLUSH numRecordsToKeep=100 maxNumLogsToKeep=10 numVersionBuckets=65536
   [junit4]   2> 1185704 INFO  (qtp1196434725-5566) [n:127.0.0.1:41222_solr c:SearchRateTriggerTest-collection1 s:shard1 r:core_node5 x:SearchRateTriggerTest-collection1_shard1_replica_n1] o.a.s.u.CommitTracker Hard AutoCommit: disabled
   [junit4]   2> 1185704 INFO  (qtp1196434725-5566) [n:127.0.0.1:41222_solr c:SearchRateTriggerTest-collection1 s:shard1 r:core_node5 x:SearchRateTriggerTest-collection1_shard1_replica_n1] o.a.s.u.CommitTracker Soft AutoCommit: disabled
   [junit4]   2> 1185706 INFO  (qtp1196434725-5566) [n:127.0.0.1:41222_solr c:SearchRateTriggerTest-collection1 s:shard1 r:core_node5 x:SearchRateTriggerTest-collection1_shard1_replica_n1] o.a.s.s.SolrIndexSearcher Opening [Searcher@55ba46ee[SearchRateTriggerTest-collection1_shard1_replica_n1] main]
   [junit4]   2> 1185740 INFO  (searcherExecutor-710-thread-1-processing-n:127.0.0.1:40984_solr x:SearchRateTriggerTest-collection1_shard2_replica_n3 c:SearchRateTriggerTest-collection1 s:shard2 r:core_node7) [n:127.0.0.1:40984_solr c:SearchRateTriggerTest-collection1 s:shard2 r:core_node7 x:SearchRateTriggerTest-collection1_shard2_replica_n3] o.a.s.c.SolrCore [SearchRateTriggerTest-collection1_shard2_replica_n3] Registered new searcher Searcher@6a90075e[SearchRateTriggerTest-collection1_shard2_replica_n3] main{ExitableDirectoryReader(UninvertingDirectoryReader())}
   [junit4]   2> 1185743 INFO  (qtp1701466030-5580) [n:127.0.0.1:44299_solr c:SearchRateTriggerTest-collection1 s:shard1 r:core_node6 x:SearchRateTriggerTest-collection1_shard1_replica_n2] o.a.s.c.ZkShardTerms Successful update of terms at /collections/SearchRateTriggerTest-collection1/terms/shard1 to Terms{values={core_node6=0}, version=0}
   [junit4]   2> 1185772 INFO  (qtp1393987523-5588) [n:127.0.0.1:38115_solr c:SearchRateTriggerTest-collection1 s:shard2 r:core_node8 x:SearchRateTriggerTest-collection1_shard2_replica_n4] o.a.s.u.UpdateHandler Using UpdateLog implementation: org.apache.solr.update.UpdateLog
   [junit4]   2> 1185772 INFO  (qtp1393987523-5588) [n:127.0.0.1:38115_solr c:SearchRateTriggerTest-collection1 s:shard2 r:core_node8 x:SearchRateTriggerTest-collection1_shard2_replica_n4] o.a.s.u.UpdateLog Initializing UpdateLog: dataDir=null defaultSyncLevel=FLUSH numRecordsToKeep=100 maxNumLogsToKeep=10 numVersionBuckets=65536
   [junit4]   2> 1185773 INFO  (qtp1393987523-5588) [n:127.0.0.1:38115_solr c:SearchRateTriggerTest-collection1 s:shard2 r:core_node8 x:SearchRateTriggerTest-collection1_shard2_replica_n4] o.a.s.u.CommitTracker Hard AutoCommit: disabled
   [junit4]   2> 1185773 INFO  (qtp1393987523-5588) [n:127.0.0.1:38115_solr c:SearchRateTriggerTest-collection1 s:shard2 r:core_node8 x:SearchRateTriggerTest-collection1_shard2_replica_n4] o.a.s.u.CommitTracker Soft AutoCommit: disabled
   [junit4]   2> 1185775 INFO  (qtp1393987523-5588) [n:127.0.0.1:38115_solr c:SearchRateTriggerTest-collection1 s:shard2 r:core_node8 x:SearchRateTriggerTest-collection1_shard2_replica_n4] o.a.s.s.SolrIndexSearcher Opening [Searcher@62761502[SearchRateTriggerTest-collection1_shard2_replica_n4] main]
   [junit4]   2> 1185789 INFO  (qtp1196434725-5566) [n:127.0.0.1:41222_solr c:SearchRateTriggerTest-collection1 s:shard1 r:core_node5 x:SearchRateTriggerTest-collection1_shard1_replica_n1] o.a.s.r.ManagedResourceStorage Configured ZooKeeperStorageIO with znodeBase: /configs/conf
   [junit4]   2> 1185790 INFO  (qtp1196434725-5566) [n:127.0.0.1:41222_solr c:SearchRateTriggerTest-collection1 s:shard1 r:core_node5 x:SearchRateTriggerTest-collection1_shard1_replica_n1] o.a.s.r.ManagedResourceStorage Loaded null at path _rest_managed.json using ZooKeeperStorageIO:path=/configs/conf
   [junit4]   2> 1185790 INFO  (qtp1196434725-5566) [n:127.0.0.1:41222_solr c:SearchRateTriggerTest-collection1 s:shard1 r:core_node5 x:SearchRateTriggerTest-collection1_shard1_replica_n1] o.a.s.h.ReplicationHandler Commits will be reserved for 10000ms.
   [junit4]   2> 1185791 INFO  (qtp1196434725-5566) [n:127.0.0.1:41222_solr c:SearchRateTriggerTest-collection1 s:shard1 r:core_node5 x:SearchRateTriggerTest-collection1_shard1_replica_n1] o.a.s.u.UpdateLog Could not find max version in index or recent updates, using new clock 1601418882216624128
   [junit4]   2> 1185980 INFO  (searcherExecutor-711-thread-1-processing-n:127.0.0.1:41222_solr x:SearchRateTriggerTest-collection1_shard1_replica_n1 c:SearchRateTriggerTest-collection1 s:shard1 r:core_node5) [n:127.0.0.1:41222_solr c:SearchRateTriggerTest-collection1 s:shard1 r:core_node5 x:SearchRateTriggerTest-collection1_shard1_replica_n1] o.a.s.c.SolrCore [SearchRateTriggerTest-collection1_shard1_replica_n1] Registered new searcher Searcher@55ba46ee[SearchRateTriggerTest-collection1_shard1_replica_n1] main{ExitableDirectoryReader(UninvertingDirectoryReader())}
   [junit4]   2> 1185996 INFO  (qtp1393987523-5588) [n:127.0.0.1:38115_solr c:SearchRateTriggerTest-collection1 s:shard2 r:core_node8 x:SearchRateTriggerTest-collection1_shard2_replica_n4] o.a.s.r.ManagedResourceStorage Configured ZooKeeperStorageIO with znodeBase: /configs/conf
   [junit4]   2> 1185997 INFO  (qtp1393987523-5588) [n:127.0.0.1:38115_solr c:SearchRateTriggerTest-collection1 s:shard2 r:core_node8 x:SearchRateTriggerTest-collection1_shard2_replica_n4] o.a.s.r.ManagedResourceStorage Loaded null at path _rest_managed.json using ZooKeeperStorageIO:path=/configs/conf
   [junit4]   2> 1185998 INFO  (qtp1393987523-5588) [n:127.0.0.1:38115_solr c:SearchRateTriggerTest-collection1 s:shard2 r:core_node8 x:SearchRateTriggerTest-collection1_shard2_replica_n4] o.a.s.h.ReplicationHandler Commits will be reserved for 10000ms.
   [junit4]   2> 1185998 INFO  (qtp1393987523-5588) [n:127.0.0.1:38115_solr c:SearchRateTriggerTest-collection1 s:shard2 r:core_node8 x:SearchRateTriggerTest-collection1_shard2_replica_n4] o.a.s.u.UpdateLog Could not find max version in index or recent updates, using new clock 1601418882433679360
   [junit4]   2> 1186127 INFO  (searcherExecutor-712-thread-1-processing-n:127.0.0.1:38115_solr x:SearchRateTriggerTest-collection1_shard2_replica_n4 c:SearchRateTriggerTest-collection1 s:shard2 r:core_node8) [n:127.0.0.1:38115_solr c:SearchRateTriggerTest-collection1 s:shard2 r:core_node8 x:SearchRateTriggerTest-collection1_shard2_replica_n4] o.a.s.c.SolrCore [SearchRateTriggerTest-collection1_shard2_replica_n4] Registered new searcher Searcher@62761502[SearchRateTriggerTest-collection1_shard2_replica_n4] main{ExitableDirectoryReader(UninvertingDirectoryReader())}
   [junit4]   2> 1186163 INFO  (qtp1196434725-5566) [n:127.0.0.1:41222_solr c:SearchRateTriggerTest-collection1 s:shard1 r:core_node5 x:SearchRateTriggerTest-collection1_shard1_replica_n1] o.a.s.c.ZkShardTerms Successful update of terms at /collections/SearchRateTriggerTest-collection1/terms/shard1 to Terms{values={core_node6=0, core_node5=0}, version=1}
   [junit4]   2> 1186165 INFO  (qtp1701466030-5580) [n:127.0.0.1:44299_solr c:SearchRateTriggerTest-collection1 s:shard1 r:core_node6 x:SearchRateTriggerTest-collection1_shard1_replica_n2] o.a.s.c.ShardLeaderElectionContext Waiting until we see more replicas up for shard shard1: total=2 found=1 timeoutin=9984ms
   [junit4]   2> 1186165 INFO  (qtp1297292340-5571) [n:127.0.0.1:40984_solr c:SearchRateTriggerTest-collection1 s:shard2 r:core_node7 x:SearchRateTriggerTest-collection1_shard2_replica_n3] o.a.s.c.ShardLeaderElectionContext Waiting until we see more replicas up for shard shard2: total=2 found=1 timeoutin=9996ms
   [junit4]   2> 1186180 INFO  (qtp1393987523-5588) [n:127.0.0.1:38115_solr c:SearchRateTriggerTest-collection1 s:shard2 r:core_node8 x:SearchRateTriggerTest-collection1_shard2_replica_n4] o.a.s.c.ZkShardTerms Successful update of terms at /collections/SearchRateTriggerTest-collection1/terms/shard2 to Terms{values={core_node7=0, core_node8=0}, version=1}
   [junit4]   2> 1186667 INFO  (qtp1297292340-5571) [n:127.0.0.1:40984_solr c:SearchRateTriggerTest-collection1 s:shard2 r:core_node7 x:SearchRateTriggerTest-collection1_shard2_replica_n3] o.a.s.c.ShardLeaderElectionContext Enough replicas found to continue.
   [junit4]   2> 1186667 INFO  (qtp1297292340-5571) [n:127.0.0.1:40984_solr c:SearchRateTriggerTest-collection1 s:shard2 r:core_node7 x:SearchRateTriggerTest-collection1_shard2_replica_n3] o.a.s.c.ShardLeaderElectionContext I may be the new leader - try and sync
   [junit4]   2> 1186667 INFO  (qtp1297292340-5571) [n:127.0.0.1:40984_solr c:SearchRateTriggerTest-collection1 s:shard2 r:core_node7 x:SearchRateTriggerTest-collection1_shard2_replica_n3] o.a.s.c.SyncStrategy Sync replicas to http://127.0.0.1:40984/solr/SearchRateTriggerTest-collection1_shard2_replica_n3/
   [junit4]   2> 1186667 INFO  (qtp1701466030-5580) [n:127.0.0.1:44299_solr c:SearchRateTriggerTest-collection1 s:shard1 r:core_node6 x:SearchRateTriggerTest-collection1_shard1_replica_n2] o.a.s.c.ShardLeaderElectionContext Enough replicas found to continue.
   [junit4]   2> 1186668 INFO  (qtp1701466030-5580) [n:127.0.0.1:44299_solr c:SearchRateTriggerTest-collection1 s:shard1 r:core_node6 x:SearchRateTriggerTest-collection1_shard1_replica_n2] o.a.s.c.ShardLeaderElectionContext I may be the new leader - try and sync
   [junit4]   2> 1186668 INFO  (qtp1701466030-5580) [n:127.0.0.1:44299_solr c:SearchRateTriggerTest-collection1 s:shard1 r:core_node6 x:SearchRateTriggerTest-collection1_shard1_replica_n2] o.a.s.c.SyncStrategy Sync replicas to http://127.0.0.1:44299/solr/SearchRateTriggerTest-collection1_shard1_replica_n2/
   [junit4]   2> 1186668 INFO  (qtp1701466030-5580) [n:127.0.0.1:44299_solr c:SearchRateTriggerTest-collection1 s:shard1 r:core_node6 x:SearchRateTriggerTest-collection1_shard1_replica_n2] o.a.s.u.PeerSync PeerSync: core=SearchRateTriggerTest-collection1_shard1_replica_n2 url=http://127.0.0.1:44299/solr START replicas=[http://127.0.0.1:41222/solr/SearchRateTriggerTest-collection1_shard1_replica_n1/] nUpdates=100
   [junit4]   2> 1186669 INFO  (qtp1297292340-5571) [n:127.0.0.1:40984_solr c:SearchRateTriggerTest-collection1 s:shard2 r:core_node7 x:SearchRateTriggerTest-collection1_shard2_replica_n3] o.a.s.u.PeerSync PeerSync: core=SearchRateTriggerTest-collection1_shard2_replica_n3 url=http://127.0.0.1:40984/solr START replicas=[http://127.0.0.1:38115/solr/SearchRateTriggerTest-collection1_shard2_replica_n4/] nUpdates=100
   [junit4]   2> 1186728 INFO  (qtp1196434725-5598) [n:127.0.0.1:41222_solr c:SearchRateTriggerTest-collection1 s:shard1 r:core_node5 x:SearchRateTriggerTest-collection1_shard1_replica_n1] o.a.s.c.S.Request [SearchRateTriggerTest-collection1_shard1_replica_n1]  webapp=/solr path=/get params={distrib=false&qt=/get&fingerprint=false&getVersions=100&wt=javabin&version=2} status=0 QTime=37
   [junit4]   2> 1186989 INFO  (qtp1297292340-5571) [n:127.0.0.1:40984_solr c:SearchRateTriggerTest-collection1 s:shard2 r:core_node7 x:SearchRateTriggerTest-collection1_shard2_replica_n3] o.a.s.u.PeerSync PeerSync: core=SearchRateTriggerTest-collection1_shard2_replica_n3 url=http://127.0.0.1:40984/solr DONE.  We have no versions.  sync failed.
   [junit4]   2> 1186990 INFO  (qtp1701466030-5580) [n:127.0.0.1:44299_solr c:SearchRateTriggerTest-collection1 s:shard1 r:core_node6 x:SearchRateTriggerTest-collection1_shard1_replica_n2] o.a.s.u.PeerSync PeerSync: core=SearchRateTriggerTest-collection1_shard1_replica_n2 url=http://127.0.0.1:44299/solr DONE.  We have no versions.  sync failed.
   [junit4]   2> 1186990 INFO  (qtp1701466030-5580) [n:127.0.0.1:44299_solr c:SearchRateTriggerTest-collection1 s:shard1 r:core_node6 x:SearchRateTriggerTest-collection1_shard1_replica_n2] o.a.s.c.SyncStrategy Leader's attempt to sync with shard failed, moving to the next candidate
   [junit4]   2> 1186990 INFO  (qtp1701466030-5580) [n:127.0.0.1:44299_solr c:SearchRateTriggerTest-collection1 s:shard1 r:core_node6 x:SearchRateTriggerTest-collection1_shard1_replica_n2] o.a.s.c.ShardLeaderElectionContext We failed sync, but we have no versions - we can't sync in that case - we were active before, so become leader anyway
   [junit4]   2> 1186990 INFO  (qtp1701466030-5580) [n:127.0.0.1:44299_solr c:SearchRateTriggerTest-collection1 s:shard1 r:core_node6 x:SearchRateTriggerTest-collection1_shard1_replica_n2] o.a.s.c.ShardLeaderElectionContext Found all replicas participating in election, clear LIR
   [junit4]   2> 1186998 INFO  (qtp1701466030-5580) [n:127.0.0.1:44299_solr c:SearchRateTriggerTest-collection1 s:shard1 r:core_node6 x:SearchRateTriggerTest-collection1_shard1_replica_n2] o.a.s.c.ShardLeaderElectionContext I am the new leader: http://127.0.0.1:44299/solr/SearchRateTriggerTest-collection1_shard1_replica_n2/ shard1
   [junit4]   2> 1187288 INFO  (qtp1393987523-5583) [n:127.0.0.1:38115_solr c:SearchRateTriggerTest-collection1 s:shard2 r:core_node8 x:SearchRateTriggerTest-collection1_shard2_replica_n4] o.a.s.c.S.Request [SearchRateTriggerTest-collection1_shard2_replica_n4]  webapp=/solr path=/get params={distrib=false&qt=/get&fingerprint=false&getVersions=100&wt=javabin&version=2} status=0 QTime=268
   [junit4]   2> 1187347 INFO  (qtp1701466030-5580) [n:127.0.0.1:44299_solr c:SearchRateTriggerTest-collection1 s:shard1 r:core_node6 x:SearchRateTriggerTest-collection1_shard1_replica_n2] o.a.s.c.ZkController I am the leader, no recovery necessary
   [junit4]   2> 1187369 INFO  (qtp1297292340-5571) [n:127.0.0.1:40984_solr c:SearchRateTriggerTest-collection1 s:shard2 r:core_node7 x:SearchRateTriggerTest-collection1_shard2_replica_n3] o.a.s.c.SyncStrategy Leader's attempt to sync with shard failed, moving to the next candidate
   [junit4]   2> 1187369 INFO  (qtp1297292340-5571) [n:127.0.0.1:40984_solr c:SearchRateTriggerTest-collection1 s:shard2 r:core_node7 x:SearchRateTriggerTest-collection1_shard2_replica_n3] o.a.s.c.ShardLeaderElectionContext We failed sync, but we have no versions - we can't sync in that case - we were active before, so become leader anyway
   [junit4]   2> 1187369 INFO  (qtp1297292340-5571) [n:127.0.0.1:40984_solr c:SearchRateTriggerTest-collection1 s:shard2 r:core_node7 x:SearchRateTriggerTest-collection1_shard2_replica_n3] o.a.s.c.ShardLeaderElectionContext Found all replicas participating in election, clear LIR
   [junit4]   2> 1187471 INFO  (qtp1701466030-5580) [n:127.0.0.1:44299_solr c:SearchRateTriggerTest-collection1 s:shard1 r:core_node6 x:SearchRateTriggerTest-collection1_shard1_replica_n2] o.a.s.s.HttpSolrCall [admin] webapp=null path=/admin/cores params={qt=/admin/cores&coreNodeName=core_node6&collection.configName=conf&newCollection=true&name=SearchRateTriggerTest-collection1_shard1_replica_n2&action=CREATE&numShards=2&collection=SearchRateTriggerTest-collection1&shard=shard1&wt=javabin&version=2&replicaType=NRT} status=0 QTime=5538
   [junit4]   2> 1187500 INFO  (qtp1196434725-5566) [n:127.0.0.1:41222_solr c:SearchRateTriggerTest-collection1 s:shard1 r:core_node5 x:SearchRateTriggerTest-collection1_shard1_replica_n1] o.a.s.s.HttpSolrCall [admin] webapp=null path=/admin/cores params={qt=/admin/cores&coreNodeName=core_node5&collection.configName=conf&newCollection=true&name=SearchRateTriggerTest-collection1_shard1_replica_n1&action=CREATE&numShards=2&collection=SearchRateTriggerTest-collection1&shard=shard1&wt=javabin&version=2&replicaType=NRT} status=0 QTime=5633
   [junit4]   2> 1187502 INFO  (qtp1297292340-5571) [n:127.0.0.1:40984_solr c:SearchRateTriggerTest-collection1 s:shard2 r:core_node7 x:SearchRateTriggerTest-collection1_shard2_replica_n3] o.a.s.c.ShardLeaderElectionContext I am the new leader: http://127.0.0.1:40984/solr/SearchRateTriggerTest-collection1_shard2_replica_n3/ shard2
   [junit4]   2> 1187755 INFO  (zkCallback-3046-thread-1) [    ] o.a.s.c.c.ZkStateReader A cluster state change: [WatchedEvent state:SyncConnected type:NodeDataChanged path:/collections/SearchRateTriggerTest-collection1/state.json] for collection [SearchRateTriggerTest-collection1] has occurred - updating... (live nodes size: [4])
   [junit4]   2> 1187767 INFO  (zkCallback-3054-thread-1) [    ] o.a.s.c.c.ZkStateReader A cluster state change: [WatchedEvent state:SyncConnected type:NodeDataChanged path:/collections/SearchRateTriggerTest-collection1/state.json] for collection [SearchRateTriggerTest-collection1] has occurred - updating... (live nodes size: [4])
   [junit4]   2> 1187773 INFO  (qtp1297292340-5571) [n:127.0.0.1:40984_solr c:SearchRateTriggerTest-collection1 s:shard2 r:core_node7 x:SearchRateTriggerTest-collection1_shard2_replica_n3] o.a.s.c.ZkController I am the leader, no recovery necessary
   [junit4]   2> 1187775 INFO  (qtp1297292340-5571) [n:127.0.0.1:40984_solr c:SearchRateTriggerTest-collection1 s:shard2 r:core_node7 x:SearchRateTriggerTest-collection1_shard2_replica_n3] o.a.s.s.HttpSolrCall [admin] webapp=null path=/admin/cores params={qt=/admin/cores&coreNodeName=core_node7&collection.configName=conf&newCollection=true&name=SearchRateTriggerTest-collection1_shard2_replica_n3&action=CREATE&numShards=2&collection=SearchRateTriggerTest-collection1&shard=shard2&wt=javabin&version=2&replicaType=NRT} status=0 QTime=5834
   [junit4]   2> 1187919 INFO  (zkCallback-3046-thread-1) [    ] o.a.s.c.c.ZkStateReader A cluster state change: [WatchedEvent state:SyncConnected type:NodeDataChanged path:/collections/SearchRateTriggerTest-collection1/state.json] for collection [SearchRateTriggerTest-collection1] has occurred - updating... (live nodes size: [4])
   [junit4]   2> 1187930 INFO  (zkCallback-3050-thread-1) [    ] o.a.s.c.c.ZkStateReader A cluster state change: [WatchedEvent state:SyncConnected type:NodeDataChanged path:/collections/SearchRateTriggerTest-collection1/state.json] for collection [SearchRateTriggerTest-collection1] has occurred - updating... (live nodes size: [4])
   [junit4]   2> 1187971 INFO  (zkCallback-3054-thread-1) [    ] o.a.s.c.c.ZkStateReader A cluster state change: [WatchedEvent state:SyncConnected type:NodeDataChanged path:/collections/SearchRateTriggerTest-collection1/state.json] for collection [SearchRateTriggerTest-collection1] has occurred - updating... (live nodes size: [4])
   [junit4]   2> 1188380 INFO  (qtp1393987523-5588) [n:127.0.0.1:38115_solr c:SearchRateTriggerTest-collection1 s:shard2 r:core_node8 x:SearchRateTriggerTest-collection1_shard2_replica_n4] o.a.s.s.HttpSolrCall [admin] webapp=null path=/admin/cores params={qt=/admin/cores&coreNodeName=core_node8&collection.configName=conf&newCollection=true&name=SearchRateTriggerTest-collection1_shard2_replica_n4&action=CREATE&numShards=2&collection=SearchRateTriggerTest-collection1&shard=shard2&wt=javabin&version=2&replicaType=NRT} status=0 QTime=6191
   [junit4]   2> 1188580 INFO  (zkCallback-3050-thread-1) [    ] o.a.s.c.c.ZkStateReader A cluster state change: [WatchedEvent state:SyncConnected type:NodeDataChanged path:/collections/SearchRateTriggerTest-collection1/state.json] for collection [SearchRateTriggerTest-collection1] has occurred - updating... (live nodes size: [4])
   [junit4]   2> 1188580 INFO  (zkCallback-3054-thread-1) [    ] o.a.s.c.c.ZkStateReader A cluster state change: [WatchedEvent state:SyncConnected type:NodeDataChanged path:/collections/SearchRateTriggerTest-collection1/state.json] for collection [SearchRateTriggerTest-collection1] has occurred - updating... (live nodes size: [4])
   [junit4]   2> 1188589 INFO  (zkCallback-3033-thread-2) [    ] o.a.s.c.c.ZkStateReader A cluster state change: [WatchedEvent state:SyncConnected type:NodeDataChanged path:/collections/SearchRateTriggerTest-collection1/state.json] for collection [SearchRateTriggerTest-collection1] has occurred - updating... (live nodes size: [4])
   [junit4]   2> 1188613 INFO  (zkCallback-3046-thread-2) [    ] o.a.s.c.c.ZkStateReader A cluster state change: [WatchedEvent state:SyncConnected type:NodeDataChanged path:/collections/SearchRateTriggerTest-collection1/state.json] for collection [SearchRateTriggerTest-collection1] has occurred - updating... (live nodes size: [4])
   [junit4]   2> 1188643 INFO  (qtp1196434725-5602) [n:127.0.0.1:41222_solr    ] o.a.s.h.a.CollectionsHandler Wait for new collection to be active for at most 30 seconds. Check all shard replicas
   [junit4]   2> 1188643 INFO  (qtp1196434725-5602) [n:127.0.0.1:41222_solr    ] o.a.s.s.HttpSolrCall [admin] webapp=null path=/admin/collections params={replicationFactor=2&collection.configName=conf&maxShardsPerNode=1&name=SearchRateTriggerTest-collection1&nrtReplicas=2&action=CREATE&numShards=2&wt=javabin&version=2} status=0 QTime=7584
   [junit4]   2> 1188644 INFO  (qtp1196434725-5604) [n:127.0.0.1:41222_solr    ] o.a.s.h.a.CollectionsHandler Invoked Collection Action :create with params replicationFactor=2&collection.configName=conf&maxShardsPerNode=1&name=SearchRateTriggerTest-collection2&nrtReplicas=2&action=CREATE&numShards=2&wt=javabin&version=2 and sendToOCPQueue=true
   [junit4]   2> 1188735 INFO  (OverseerThreadFactory-700-thread-2) [    ] o.a.s.c.a.c.CreateCollectionCmd Create collection SearchRateTriggerTest-collection2
   [junit4]   2> 1188776 INFO  (OverseerCollectionConfigSetProcessor-72684737167425546-127.0.0.1:41222_solr-n_0000000000) [    ] o.a.s.c.OverseerTaskQueue Response ZK path: /overseer/collection-queue-work/qnr-0000000000 doesn't exist.  Requestor may have disconnected from ZooKeeper
   [junit4]   2> 1189126 INFO  (OverseerStateUpdate-72684737167425546-127.0.0.1:41222_solr-n_0000000000) [    ] o.a.s.c.o.SliceMutator createReplica() {
   [junit4]   2>   "operation":"ADDREPLICA",
   [junit4]   2>   "collection":"SearchRateTriggerTest-collection2",
   [

[...truncated too long message...]

ttings.xml

resolve:

ivy-availability-check:
[loadresource] Do not set property disallowed.ivy.jars.list as its length is 0.

-ivy-fail-disallowed-ivy-version:

ivy-fail:

ivy-configure:
[ivy:configure] :: loading settings :: file = /home/jenkins/jenkins-slave/workspace/Lucene-Solr-Tests-master/lucene/top-level-ivy-settings.xml

resolve:

ivy-availability-check:
[loadresource] Do not set property disallowed.ivy.jars.list as its length is 0.

-ivy-fail-disallowed-ivy-version:

ivy-fail:

ivy-configure:
[ivy:configure] :: loading settings :: file = /home/jenkins/jenkins-slave/workspace/Lucene-Solr-Tests-master/lucene/top-level-ivy-settings.xml

resolve:

ivy-availability-check:
[loadresource] Do not set property disallowed.ivy.jars.list as its length is 0.

-ivy-fail-disallowed-ivy-version:

ivy-fail:

ivy-configure:
[ivy:configure] :: loading settings :: file = /home/jenkins/jenkins-slave/workspace/Lucene-Solr-Tests-master/lucene/top-level-ivy-settings.xml

resolve:

ivy-availability-check:
[loadresource] Do not set property disallowed.ivy.jars.list as its length is 0.

-ivy-fail-disallowed-ivy-version:

ivy-fail:

ivy-configure:
[ivy:configure] :: loading settings :: file = /home/jenkins/jenkins-slave/workspace/Lucene-Solr-Tests-master/lucene/top-level-ivy-settings.xml

resolve:

jar-checksums:
    [mkdir] Created dir: /home/jenkins/jenkins-slave/workspace/Lucene-Solr-Tests-master/lucene/null21968278
     [copy] Copying 39 files to /home/jenkins/jenkins-slave/workspace/Lucene-Solr-Tests-master/lucene/null21968278
   [delete] Deleting directory /home/jenkins/jenkins-slave/workspace/Lucene-Solr-Tests-master/lucene/null21968278

resolve-example:

ivy-availability-check:
[loadresource] Do not set property disallowed.ivy.jars.list as its length is 0.

-ivy-fail-disallowed-ivy-version:

ivy-fail:

ivy-configure:
[ivy:configure] :: loading settings :: file = /home/jenkins/jenkins-slave/workspace/Lucene-Solr-Tests-master/lucene/top-level-ivy-settings.xml

resolve:

resolve-server:

ivy-availability-check:
[loadresource] Do not set property disallowed.ivy.jars.list as its length is 0.

-ivy-fail-disallowed-ivy-version:

ivy-fail:

ivy-fail:

ivy-configure:
[ivy:configure] :: loading settings :: file = /home/jenkins/jenkins-slave/workspace/Lucene-Solr-Tests-master/lucene/top-level-ivy-settings.xml

resolve:

resolve:

ivy-availability-check:
[loadresource] Do not set property disallowed.ivy.jars.list as its length is 0.

-ivy-fail-disallowed-ivy-version:

ivy-fail:

ivy-fail:

ivy-configure:
[ivy:configure] :: loading settings :: file = /home/jenkins/jenkins-slave/workspace/Lucene-Solr-Tests-master/lucene/top-level-ivy-settings.xml

resolve:

ivy-availability-check:
[loadresource] Do not set property disallowed.ivy.jars.list as its length is 0.

-ivy-fail-disallowed-ivy-version:

ivy-fail:

ivy-fail:

ivy-configure:
[ivy:configure] :: loading settings :: file = /home/jenkins/jenkins-slave/workspace/Lucene-Solr-Tests-master/lucene/top-level-ivy-settings.xml

resolve:

ivy-availability-check:
[loadresource] Do not set property disallowed.ivy.jars.list as its length is 0.

-ivy-fail-disallowed-ivy-version:

ivy-fail:

ivy-configure:
[ivy:configure] :: loading settings :: file = /home/jenkins/jenkins-slave/workspace/Lucene-Solr-Tests-master/lucene/top-level-ivy-settings.xml

resolve:

ivy-availability-check:
[loadresource] Do not set property disallowed.ivy.jars.list as its length is 0.

-ivy-fail-disallowed-ivy-version:

ivy-fail:

ivy-fail:

ivy-configure:
[ivy:configure] :: loading settings :: file = /home/jenkins/jenkins-slave/workspace/Lucene-Solr-Tests-master/lucene/top-level-ivy-settings.xml

resolve:

ivy-availability-check:
[loadresource] Do not set property disallowed.ivy.jars.list as its length is 0.

-ivy-fail-disallowed-ivy-version:

ivy-fail:

ivy-configure:
[ivy:configure] :: loading settings :: file = /home/jenkins/jenkins-slave/workspace/Lucene-Solr-Tests-master/lucene/top-level-ivy-settings.xml

resolve:

ivy-availability-check:
[loadresource] Do not set property disallowed.ivy.jars.list as its length is 0.

-ivy-fail-disallowed-ivy-version:

ivy-fail:

ivy-fail:

ivy-configure:
[ivy:configure] :: loading settings :: file = /home/jenkins/jenkins-slave/workspace/Lucene-Solr-Tests-master/lucene/top-level-ivy-settings.xml

resolve:

ivy-availability-check:
[loadresource] Do not set property disallowed.ivy.jars.list as its length is 0.

-ivy-fail-disallowed-ivy-version:

ivy-fail:

ivy-fail:

ivy-configure:
[ivy:configure] :: loading settings :: file = /home/jenkins/jenkins-slave/workspace/Lucene-Solr-Tests-master/lucene/top-level-ivy-settings.xml

resolve:

ivy-availability-check:
[loadresource] Do not set property disallowed.ivy.jars.list as its length is 0.

-ivy-fail-disallowed-ivy-version:

ivy-fail:

ivy-fail:

ivy-configure:
[ivy:configure] :: loading settings :: file = /home/jenkins/jenkins-slave/workspace/Lucene-Solr-Tests-master/lucene/top-level-ivy-settings.xml

resolve:

ivy-availability-check:
[loadresource] Do not set property disallowed.ivy.jars.list as its length is 0.

-ivy-fail-disallowed-ivy-version:

ivy-fail:

ivy-fail:

ivy-configure:
[ivy:configure] :: loading settings :: file = /home/jenkins/jenkins-slave/workspace/Lucene-Solr-Tests-master/lucene/top-level-ivy-settings.xml

resolve:

ivy-availability-check:
[loadresource] Do not set property disallowed.ivy.jars.list as its length is 0.

-ivy-fail-disallowed-ivy-version:

ivy-fail:

ivy-fail:

ivy-configure:
[ivy:configure] :: loading settings :: file = /home/jenkins/jenkins-slave/workspace/Lucene-Solr-Tests-master/lucene/top-level-ivy-settings.xml

resolve:

ivy-availability-check:
[loadresource] Do not set property disallowed.ivy.jars.list as its length is 0.

-ivy-fail-disallowed-ivy-version:

ivy-fail:

ivy-fail:

ivy-configure:
[ivy:configure] :: loading settings :: file = /home/jenkins/jenkins-slave/workspace/Lucene-Solr-Tests-master/lucene/top-level-ivy-settings.xml

resolve:

ivy-availability-check:
[loadresource] Do not set property disallowed.ivy.jars.list as its length is 0.

-ivy-fail-disallowed-ivy-version:

ivy-fail:

ivy-fail:

ivy-configure:
[ivy:configure] :: loading settings :: file = /home/jenkins/jenkins-slave/workspace/Lucene-Solr-Tests-master/lucene/top-level-ivy-settings.xml

resolve:

ivy-availability-check:
[loadresource] Do not set property disallowed.ivy.jars.list as its length is 0.

-ivy-fail-disallowed-ivy-version:

ivy-fail:

ivy-fail:

ivy-configure:
[ivy:configure] :: loading settings :: file = /home/jenkins/jenkins-slave/workspace/Lucene-Solr-Tests-master/lucene/top-level-ivy-settings.xml

resolve:

ivy-availability-check:
[loadresource] Do not set property disallowed.ivy.jars.list as its length is 0.

-ivy-fail-disallowed-ivy-version:

ivy-fail:

ivy-fail:

ivy-configure:
[ivy:configure] :: loading settings :: file = /home/jenkins/jenkins-slave/workspace/Lucene-Solr-Tests-master/lucene/top-level-ivy-settings.xml

resolve:

ivy-availability-check:
[loadresource] Do not set property disallowed.ivy.jars.list as its length is 0.

-ivy-fail-disallowed-ivy-version:

ivy-fail:

ivy-fail:

ivy-configure:
[ivy:configure] :: loading settings :: file = /home/jenkins/jenkins-slave/workspace/Lucene-Solr-Tests-master/lucene/top-level-ivy-settings.xml

resolve:

ivy-availability-check:
[loadresource] Do not set property disallowed.ivy.jars.list as its length is 0.

-ivy-fail-disallowed-ivy-version:

ivy-fail:

ivy-fail:

ivy-configure:
[ivy:configure] :: loading settings :: file = /home/jenkins/jenkins-slave/workspace/Lucene-Solr-Tests-master/lucene/top-level-ivy-settings.xml

resolve:

jar-checksums:
    [mkdir] Created dir: /home/jenkins/jenkins-slave/workspace/Lucene-Solr-Tests-master/solr/null1689173226
     [copy] Copying 246 files to /home/jenkins/jenkins-slave/workspace/Lucene-Solr-Tests-master/solr/null1689173226
   [delete] Deleting directory /home/jenkins/jenkins-slave/workspace/Lucene-Solr-Tests-master/solr/null1689173226

check-working-copy:
[ivy:cachepath] :: resolving dependencies :: org.eclipse.jgit#org.eclipse.jgit-caller;working
[ivy:cachepath] 	confs: [default]
[ivy:cachepath] 	found org.eclipse.jgit#org.eclipse.jgit;4.6.0.201612231935-r in public
[ivy:cachepath] 	found com.jcraft#jsch;0.1.53 in public
[ivy:cachepath] 	found com.googlecode.javaewah#JavaEWAH;1.1.6 in public
[ivy:cachepath] 	found org.apache.httpcomponents#httpclient;4.3.6 in public
[ivy:cachepath] 	found org.apache.httpcomponents#httpcore;4.3.3 in public
[ivy:cachepath] 	found commons-logging#commons-logging;1.1.3 in public
[ivy:cachepath] 	found commons-codec#commons-codec;1.6 in public
[ivy:cachepath] 	found org.slf4j#slf4j-api;1.7.2 in public
[ivy:cachepath] :: resolution report :: resolve 50ms :: artifacts dl 1ms
	---------------------------------------------------------------------
	|                  |            modules            ||   artifacts   |
	|       conf       | number| search|dwnlded|evicted|| number|dwnlded|
	---------------------------------------------------------------------
	|      default     |   8   |   0   |   0   |   0   ||   8   |   0   |
	---------------------------------------------------------------------
[wc-checker] Initializing working copy...
[wc-checker] SLF4J: Failed to load class "org.slf4j.impl.StaticLoggerBinder".
[wc-checker] SLF4J: Defaulting to no-operation (NOP) logger implementation
[wc-checker] SLF4J: See http://www.slf4j.org/codes.html#StaticLoggerBinder for further details.
[wc-checker] Checking working copy status...

-jenkins-base:

BUILD SUCCESSFUL
Total time: 305 minutes 10 seconds
Archiving artifacts
WARN: No artifacts found that match the file pattern "**/*.events,heapdumps/**,**/hs_err_pid*". Configuration error?
WARN: java.lang.InterruptedException: no matches found within 10000
Recording test results
Build step 'Publish JUnit test result report' changed build result to UNSTABLE
Email was triggered for: Unstable (Test Failures)
Sending email for trigger: Unstable (Test Failures)

Mime
View raw message