lucene-dev mailing list archives

Site index · List index
Message view « Date » · « Thread »
Top « Date » · « Thread »
From Policeman Jenkins Server <jenk...@thetaphi.de>
Subject [JENKINS] Lucene-Solr-7.x-Solaris (64bit/jdk1.8.0) - Build # 609 - Still Unstable!
Date Thu, 10 May 2018 06:22:54 GMT
Build: https://jenkins.thetaphi.de/job/Lucene-Solr-7.x-Solaris/609/
Java: 64bit/jdk1.8.0 -XX:-UseCompressedOops -XX:+UseG1GC

1 tests failed.
FAILED:  org.apache.solr.cloud.autoscaling.NodeAddedTriggerTest.testRestoreState

Error Message:
Did not expect the processor to fire on first run! event={   "id":"43f27ccd80d9eT8untr5gz1g4qzeemf267qcxmf",   "source":"node_added_trigger",   "eventTime":1195340079828382,   "eventType":"NODEADDED",   "properties":{     "eventTimes":[       1195340079828382,       1195340079830958],     "nodeNames":[       "127.0.0.1:34588_solr",       "127.0.0.1:40211_solr"]}}

Stack Trace:
java.lang.AssertionError: Did not expect the processor to fire on first run! event={
  "id":"43f27ccd80d9eT8untr5gz1g4qzeemf267qcxmf",
  "source":"node_added_trigger",
  "eventTime":1195340079828382,
  "eventType":"NODEADDED",
  "properties":{
    "eventTimes":[
      1195340079828382,
      1195340079830958],
    "nodeNames":[
      "127.0.0.1:34588_solr",
      "127.0.0.1:40211_solr"]}}
	at __randomizedtesting.SeedInfo.seed([DDD51F2C421528A6:137BBBBFBA2C50B0]:0)
	at org.junit.Assert.fail(Assert.java:93)
	at org.apache.solr.cloud.autoscaling.NodeAddedTriggerTest.lambda$new$0(NodeAddedTriggerTest.java:49)
	at org.apache.solr.cloud.autoscaling.NodeAddedTrigger.run(NodeAddedTrigger.java:161)
	at org.apache.solr.cloud.autoscaling.NodeAddedTriggerTest.testRestoreState(NodeAddedTriggerTest.java:257)
	at sun.reflect.NativeMethodAccessorImpl.invoke0(Native Method)
	at sun.reflect.NativeMethodAccessorImpl.invoke(NativeMethodAccessorImpl.java:62)
	at sun.reflect.DelegatingMethodAccessorImpl.invoke(DelegatingMethodAccessorImpl.java:43)
	at java.lang.reflect.Method.invoke(Method.java:498)
	at com.carrotsearch.randomizedtesting.RandomizedRunner.invoke(RandomizedRunner.java:1737)
	at com.carrotsearch.randomizedtesting.RandomizedRunner$8.evaluate(RandomizedRunner.java:934)
	at com.carrotsearch.randomizedtesting.RandomizedRunner$9.evaluate(RandomizedRunner.java:970)
	at com.carrotsearch.randomizedtesting.RandomizedRunner$10.evaluate(RandomizedRunner.java:984)
	at com.carrotsearch.randomizedtesting.rules.SystemPropertiesRestoreRule$1.evaluate(SystemPropertiesRestoreRule.java:57)
	at org.apache.lucene.util.TestRuleSetupTeardownChained$1.evaluate(TestRuleSetupTeardownChained.java:49)
	at org.apache.lucene.util.AbstractBeforeAfterRule$1.evaluate(AbstractBeforeAfterRule.java:45)
	at org.apache.lucene.util.TestRuleThreadAndTestName$1.evaluate(TestRuleThreadAndTestName.java:48)
	at org.apache.lucene.util.TestRuleIgnoreAfterMaxFailures$1.evaluate(TestRuleIgnoreAfterMaxFailures.java:64)
	at org.apache.lucene.util.TestRuleMarkFailure$1.evaluate(TestRuleMarkFailure.java:47)
	at com.carrotsearch.randomizedtesting.rules.StatementAdapter.evaluate(StatementAdapter.java:36)
	at com.carrotsearch.randomizedtesting.ThreadLeakControl$StatementRunner.run(ThreadLeakControl.java:368)
	at com.carrotsearch.randomizedtesting.ThreadLeakControl.forkTimeoutingTask(ThreadLeakControl.java:817)
	at com.carrotsearch.randomizedtesting.ThreadLeakControl$3.evaluate(ThreadLeakControl.java:468)
	at com.carrotsearch.randomizedtesting.RandomizedRunner.runSingleTest(RandomizedRunner.java:943)
	at com.carrotsearch.randomizedtesting.RandomizedRunner$5.evaluate(RandomizedRunner.java:829)
	at com.carrotsearch.randomizedtesting.RandomizedRunner$6.evaluate(RandomizedRunner.java:879)
	at com.carrotsearch.randomizedtesting.RandomizedRunner$7.evaluate(RandomizedRunner.java:890)
	at com.carrotsearch.randomizedtesting.rules.StatementAdapter.evaluate(StatementAdapter.java:36)
	at com.carrotsearch.randomizedtesting.rules.SystemPropertiesRestoreRule$1.evaluate(SystemPropertiesRestoreRule.java:57)
	at org.apache.lucene.util.AbstractBeforeAfterRule$1.evaluate(AbstractBeforeAfterRule.java:45)
	at com.carrotsearch.randomizedtesting.rules.StatementAdapter.evaluate(StatementAdapter.java:36)
	at org.apache.lucene.util.TestRuleStoreClassName$1.evaluate(TestRuleStoreClassName.java:41)
	at com.carrotsearch.randomizedtesting.rules.NoShadowingOrOverridesOnMethodsRule$1.evaluate(NoShadowingOrOverridesOnMethodsRule.java:40)
	at com.carrotsearch.randomizedtesting.rules.NoShadowingOrOverridesOnMethodsRule$1.evaluate(NoShadowingOrOverridesOnMethodsRule.java:40)
	at com.carrotsearch.randomizedtesting.rules.StatementAdapter.evaluate(StatementAdapter.java:36)
	at com.carrotsearch.randomizedtesting.rules.StatementAdapter.evaluate(StatementAdapter.java:36)
	at com.carrotsearch.randomizedtesting.rules.StatementAdapter.evaluate(StatementAdapter.java:36)
	at org.apache.lucene.util.TestRuleAssertionsRequired$1.evaluate(TestRuleAssertionsRequired.java:53)
	at org.apache.lucene.util.TestRuleMarkFailure$1.evaluate(TestRuleMarkFailure.java:47)
	at org.apache.lucene.util.TestRuleIgnoreAfterMaxFailures$1.evaluate(TestRuleIgnoreAfterMaxFailures.java:64)
	at org.apache.lucene.util.TestRuleIgnoreTestSuites$1.evaluate(TestRuleIgnoreTestSuites.java:54)
	at com.carrotsearch.randomizedtesting.rules.StatementAdapter.evaluate(StatementAdapter.java:36)
	at com.carrotsearch.randomizedtesting.ThreadLeakControl$StatementRunner.run(ThreadLeakControl.java:368)
	at java.lang.Thread.run(Thread.java:748)




Build Log:
[...truncated 12559 lines...]
   [junit4] Suite: org.apache.solr.cloud.autoscaling.NodeAddedTriggerTest
   [junit4]   2> 279025 INFO  (SUITE-NodeAddedTriggerTest-seed#[DDD51F2C421528A6]-worker) [    ] o.a.s.SolrTestCaseJ4 SecureRandom sanity checks: test.solr.allowed.securerandom=null & java.security.egd=file:/dev/./urandom
   [junit4]   2> Creating dataDir: /export/home/jenkins/workspace/Lucene-Solr-7.x-Solaris/solr/build/solr-core/test/J0/temp/solr.cloud.autoscaling.NodeAddedTriggerTest_DDD51F2C421528A6-001/init-core-data-001
   [junit4]   2> 279025 WARN  (SUITE-NodeAddedTriggerTest-seed#[DDD51F2C421528A6]-worker) [    ] o.a.s.SolrTestCaseJ4 startTrackingSearchers: numOpens=1 numCloses=1
   [junit4]   2> 279026 INFO  (SUITE-NodeAddedTriggerTest-seed#[DDD51F2C421528A6]-worker) [    ] o.a.s.SolrTestCaseJ4 Using PointFields (NUMERIC_POINTS_SYSPROP=true) w/NUMERIC_DOCVALUES_SYSPROP=false
   [junit4]   2> 279028 INFO  (SUITE-NodeAddedTriggerTest-seed#[DDD51F2C421528A6]-worker) [    ] o.a.s.SolrTestCaseJ4 Randomized ssl (false) and clientAuth (false) via: @org.apache.solr.util.RandomizeSSL(reason=, value=NaN, ssl=NaN, clientAuth=NaN)
   [junit4]   2> 279028 INFO  (SUITE-NodeAddedTriggerTest-seed#[DDD51F2C421528A6]-worker) [    ] o.a.s.c.MiniSolrCloudCluster Starting cluster of 1 servers in /export/home/jenkins/workspace/Lucene-Solr-7.x-Solaris/solr/build/solr-core/test/J0/temp/solr.cloud.autoscaling.NodeAddedTriggerTest_DDD51F2C421528A6-001/tempDir-001
   [junit4]   2> 279028 INFO  (SUITE-NodeAddedTriggerTest-seed#[DDD51F2C421528A6]-worker) [    ] o.a.s.c.ZkTestServer STARTING ZK TEST SERVER
   [junit4]   2> 279028 INFO  (Thread-792) [    ] o.a.s.c.ZkTestServer client port:0.0.0.0/0.0.0.0:0
   [junit4]   2> 279029 INFO  (Thread-792) [    ] o.a.s.c.ZkTestServer Starting server
   [junit4]   2> 279042 ERROR (Thread-792) [    ] o.a.z.s.ZooKeeperServer ZKShutdownHandler is not registered, so ZooKeeper server won't take any action on ERROR or SHUTDOWN server state changes
   [junit4]   2> 279129 INFO  (SUITE-NodeAddedTriggerTest-seed#[DDD51F2C421528A6]-worker) [    ] o.a.s.c.ZkTestServer start zk server on port:63803
   [junit4]   2> 279132 INFO  (zkConnectionManagerCallback-557-thread-1) [    ] o.a.s.c.c.ConnectionManager zkClient has connected
   [junit4]   2> 279138 INFO  (jetty-launcher-554-thread-1) [    ] o.e.j.s.Server jetty-9.4.10.v20180503; built: 2018-05-03T15:56:21.710Z; git: daa59876e6f384329b122929e70a80934569428c; jvm 1.8.0_162-b12
   [junit4]   2> 279139 INFO  (jetty-launcher-554-thread-1) [    ] o.e.j.s.session DefaultSessionIdManager workerName=node0
   [junit4]   2> 279139 INFO  (jetty-launcher-554-thread-1) [    ] o.e.j.s.session No SessionScavenger set, using defaults
   [junit4]   2> 279139 INFO  (jetty-launcher-554-thread-1) [    ] o.e.j.s.session node0 Scavenging every 600000ms
   [junit4]   2> 279139 INFO  (jetty-launcher-554-thread-1) [    ] o.e.j.s.h.ContextHandler Started o.e.j.s.ServletContextHandler@58142dfe{/solr,null,AVAILABLE}
   [junit4]   2> 279139 INFO  (jetty-launcher-554-thread-1) [    ] o.e.j.s.AbstractConnector Started ServerConnector@4156d41{HTTP/1.1,[http/1.1]}{127.0.0.1:34588}
   [junit4]   2> 279139 INFO  (jetty-launcher-554-thread-1) [    ] o.e.j.s.Server Started @279279ms
   [junit4]   2> 279139 INFO  (jetty-launcher-554-thread-1) [    ] o.a.s.c.s.e.JettySolrRunner Jetty properties: {hostContext=/solr, hostPort=34588}
   [junit4]   2> 279139 ERROR (jetty-launcher-554-thread-1) [    ] o.a.s.u.StartupLoggingUtils Missing Java Option solr.log.dir. Logging may be missing or incomplete.
   [junit4]   2> 279139 INFO  (jetty-launcher-554-thread-1) [    ] o.a.s.s.SolrDispatchFilter Using logger factory org.apache.logging.slf4j.Log4jLoggerFactory
   [junit4]   2> 279139 INFO  (jetty-launcher-554-thread-1) [    ] o.a.s.s.SolrDispatchFilter  ___      _       Welcome to Apache Solr™ version 7.4.0
   [junit4]   2> 279139 INFO  (jetty-launcher-554-thread-1) [    ] o.a.s.s.SolrDispatchFilter / __| ___| |_ _   Starting in cloud mode on port null
   [junit4]   2> 279139 INFO  (jetty-launcher-554-thread-1) [    ] o.a.s.s.SolrDispatchFilter \__ \/ _ \ | '_|  Install dir: null
   [junit4]   2> 279139 INFO  (jetty-launcher-554-thread-1) [    ] o.a.s.s.SolrDispatchFilter |___/\___/_|_|    Start time: 2018-05-10T05:03:56.929Z
   [junit4]   2> 279147 INFO  (zkConnectionManagerCallback-559-thread-1) [    ] o.a.s.c.c.ConnectionManager zkClient has connected
   [junit4]   2> 279148 INFO  (jetty-launcher-554-thread-1) [    ] o.a.s.s.SolrDispatchFilter solr.xml found in ZooKeeper. Loading...
   [junit4]   2> 279158 INFO  (jetty-launcher-554-thread-1) [    ] o.a.s.c.ZkContainer Zookeeper client=127.0.0.1:63803/solr
   [junit4]   2> 279161 INFO  (zkConnectionManagerCallback-563-thread-1) [    ] o.a.s.c.c.ConnectionManager zkClient has connected
   [junit4]   2> 279170 INFO  (zkConnectionManagerCallback-565-thread-1) [    ] o.a.s.c.c.ConnectionManager zkClient has connected
   [junit4]   2> 279360 INFO  (jetty-launcher-554-thread-1) [n:127.0.0.1:34588_solr    ] o.a.s.c.Overseer Overseer (id=null) closing
   [junit4]   2> 279361 INFO  (jetty-launcher-554-thread-1) [n:127.0.0.1:34588_solr    ] o.a.s.c.OverseerElectionContext I am going to be the leader 127.0.0.1:34588_solr
   [junit4]   2> 279362 INFO  (jetty-launcher-554-thread-1) [n:127.0.0.1:34588_solr    ] o.a.s.c.Overseer Overseer (id=72135931660468227-127.0.0.1:34588_solr-n_0000000000) starting
   [junit4]   2> 279376 INFO  (zkConnectionManagerCallback-572-thread-1) [    ] o.a.s.c.c.ConnectionManager zkClient has connected
   [junit4]   2> 279381 INFO  (jetty-launcher-554-thread-1) [n:127.0.0.1:34588_solr    ] o.a.s.c.s.i.ZkClientClusterStateProvider Cluster at 127.0.0.1:63803/solr ready
   [junit4]   2> 279383 INFO  (jetty-launcher-554-thread-1) [n:127.0.0.1:34588_solr    ] o.a.s.c.ZkController Register node as live in ZooKeeper:/live_nodes/127.0.0.1:34588_solr
   [junit4]   2> 279388 INFO  (zkCallback-571-thread-1) [    ] o.a.s.c.c.ZkStateReader Updated live nodes from ZooKeeper... (0) -> (1)
   [junit4]   2> 279388 INFO  (OverseerStateUpdate-72135931660468227-127.0.0.1:34588_solr-n_0000000000) [    ] o.a.s.c.c.ZkStateReader Updated live nodes from ZooKeeper... (0) -> (1)
   [junit4]   2> 280800 INFO  (jetty-launcher-554-thread-1) [n:127.0.0.1:34588_solr    ] o.a.s.m.r.SolrJmxReporter JMX monitoring for 'solr_34588.solr.node' (registry 'solr.node') enabled at server: com.sun.jmx.mbeanserver.JmxMBeanServer@73d4021a
   [junit4]   2> 280807 INFO  (jetty-launcher-554-thread-1) [n:127.0.0.1:34588_solr    ] o.a.s.m.r.SolrJmxReporter JMX monitoring for 'solr_34588.solr.jvm' (registry 'solr.jvm') enabled at server: com.sun.jmx.mbeanserver.JmxMBeanServer@73d4021a
   [junit4]   2> 280807 INFO  (jetty-launcher-554-thread-1) [n:127.0.0.1:34588_solr    ] o.a.s.m.r.SolrJmxReporter JMX monitoring for 'solr_34588.solr.jetty' (registry 'solr.jetty') enabled at server: com.sun.jmx.mbeanserver.JmxMBeanServer@73d4021a
   [junit4]   2> 280809 INFO  (jetty-launcher-554-thread-1) [n:127.0.0.1:34588_solr    ] o.a.s.c.CorePropertiesLocator Found 0 core definitions underneath /export/home/jenkins/workspace/Lucene-Solr-7.x-Solaris/solr/build/solr-core/test/J0/temp/solr.cloud.autoscaling.NodeAddedTriggerTest_DDD51F2C421528A6-001/tempDir-001/node1/.
   [junit4]   2> 280836 INFO  (zkConnectionManagerCallback-574-thread-1) [    ] o.a.s.c.c.ConnectionManager zkClient has connected
   [junit4]   2> 280839 WARN  (NIOServerCxn.Factory:0.0.0.0/0.0.0.0:0) [    ] o.a.z.s.NIOServerCnxn Unable to read additional data from client sessionid 0x100473f662a0005, likely client has closed socket
   [junit4]   2> 280841 INFO  (zkConnectionManagerCallback-579-thread-1) [    ] o.a.s.c.c.ConnectionManager zkClient has connected
   [junit4]   2> 280843 INFO  (SUITE-NodeAddedTriggerTest-seed#[DDD51F2C421528A6]-worker) [    ] o.a.s.c.c.ZkStateReader Updated live nodes from ZooKeeper... (0) -> (1)
   [junit4]   2> 280845 INFO  (SUITE-NodeAddedTriggerTest-seed#[DDD51F2C421528A6]-worker) [    ] o.a.s.c.s.i.ZkClientClusterStateProvider Cluster at 127.0.0.1:63803/solr ready
   [junit4]   2> 280866 INFO  (TEST-NodeAddedTriggerTest.testListenerAcceptance-seed#[DDD51F2C421528A6]) [    ] o.a.s.SolrTestCaseJ4 ###Starting testListenerAcceptance
   [junit4]   2> 280886 INFO  (TEST-NodeAddedTriggerTest.testListenerAcceptance-seed#[DDD51F2C421528A6]) [    ] o.e.j.s.Server jetty-9.4.10.v20180503; built: 2018-05-03T15:56:21.710Z; git: daa59876e6f384329b122929e70a80934569428c; jvm 1.8.0_162-b12
   [junit4]   2> 280887 INFO  (TEST-NodeAddedTriggerTest.testListenerAcceptance-seed#[DDD51F2C421528A6]) [    ] o.e.j.s.session DefaultSessionIdManager workerName=node0
   [junit4]   2> 280887 INFO  (TEST-NodeAddedTriggerTest.testListenerAcceptance-seed#[DDD51F2C421528A6]) [    ] o.e.j.s.session No SessionScavenger set, using defaults
   [junit4]   2> 280887 INFO  (TEST-NodeAddedTriggerTest.testListenerAcceptance-seed#[DDD51F2C421528A6]) [    ] o.e.j.s.session node0 Scavenging every 600000ms
   [junit4]   2> 280887 INFO  (TEST-NodeAddedTriggerTest.testListenerAcceptance-seed#[DDD51F2C421528A6]) [    ] o.e.j.s.h.ContextHandler Started o.e.j.s.ServletContextHandler@7ef9b39e{/solr,null,AVAILABLE}
   [junit4]   2> 280888 INFO  (TEST-NodeAddedTriggerTest.testListenerAcceptance-seed#[DDD51F2C421528A6]) [    ] o.e.j.s.AbstractConnector Started ServerConnector@206d6f7f{HTTP/1.1,[http/1.1]}{127.0.0.1:40211}
   [junit4]   2> 280888 INFO  (TEST-NodeAddedTriggerTest.testListenerAcceptance-seed#[DDD51F2C421528A6]) [    ] o.e.j.s.Server Started @281028ms
   [junit4]   2> 280888 INFO  (TEST-NodeAddedTriggerTest.testListenerAcceptance-seed#[DDD51F2C421528A6]) [    ] o.a.s.c.s.e.JettySolrRunner Jetty properties: {hostContext=/solr, hostPort=40211}
   [junit4]   2> 280888 ERROR (TEST-NodeAddedTriggerTest.testListenerAcceptance-seed#[DDD51F2C421528A6]) [    ] o.a.s.u.StartupLoggingUtils Missing Java Option solr.log.dir. Logging may be missing or incomplete.
   [junit4]   2> 280890 INFO  (TEST-NodeAddedTriggerTest.testListenerAcceptance-seed#[DDD51F2C421528A6]) [    ] o.a.s.s.SolrDispatchFilter Using logger factory org.apache.logging.slf4j.Log4jLoggerFactory
   [junit4]   2> 280890 INFO  (TEST-NodeAddedTriggerTest.testListenerAcceptance-seed#[DDD51F2C421528A6]) [    ] o.a.s.s.SolrDispatchFilter  ___      _       Welcome to Apache Solr™ version 7.4.0
   [junit4]   2> 280890 INFO  (TEST-NodeAddedTriggerTest.testListenerAcceptance-seed#[DDD51F2C421528A6]) [    ] o.a.s.s.SolrDispatchFilter / __| ___| |_ _   Starting in cloud mode on port null
   [junit4]   2> 280890 INFO  (TEST-NodeAddedTriggerTest.testListenerAcceptance-seed#[DDD51F2C421528A6]) [    ] o.a.s.s.SolrDispatchFilter \__ \/ _ \ | '_|  Install dir: null
   [junit4]   2> 280890 INFO  (TEST-NodeAddedTriggerTest.testListenerAcceptance-seed#[DDD51F2C421528A6]) [    ] o.a.s.s.SolrDispatchFilter |___/\___/_|_|    Start time: 2018-05-10T05:03:58.680Z
   [junit4]   2> 280893 INFO  (zkConnectionManagerCallback-581-thread-1) [    ] o.a.s.c.c.ConnectionManager zkClient has connected
   [junit4]   2> 280894 INFO  (TEST-NodeAddedTriggerTest.testListenerAcceptance-seed#[DDD51F2C421528A6]) [    ] o.a.s.s.SolrDispatchFilter solr.xml found in ZooKeeper. Loading...
   [junit4]   2> 280903 INFO  (TEST-NodeAddedTriggerTest.testListenerAcceptance-seed#[DDD51F2C421528A6]) [    ] o.a.s.c.ZkContainer Zookeeper client=127.0.0.1:63803/solr
   [junit4]   2> 280907 INFO  (zkConnectionManagerCallback-585-thread-1) [    ] o.a.s.c.c.ConnectionManager zkClient has connected
   [junit4]   2> 280910 INFO  (zkConnectionManagerCallback-587-thread-1) [    ] o.a.s.c.c.ConnectionManager zkClient has connected
   [junit4]   2> 280919 INFO  (TEST-NodeAddedTriggerTest.testListenerAcceptance-seed#[DDD51F2C421528A6]) [n:127.0.0.1:40211_solr    ] o.a.s.c.c.ZkStateReader Updated live nodes from ZooKeeper... (0) -> (1)
   [junit4]   2> 280922 INFO  (TEST-NodeAddedTriggerTest.testListenerAcceptance-seed#[DDD51F2C421528A6]) [n:127.0.0.1:40211_solr    ] o.a.s.c.Overseer Overseer (id=null) closing
   [junit4]   2> 280925 INFO  (TEST-NodeAddedTriggerTest.testListenerAcceptance-seed#[DDD51F2C421528A6]) [n:127.0.0.1:40211_solr    ] o.a.s.c.TransientSolrCoreCacheDefault Allocating transient cache for 2147483647 transient cores
   [junit4]   2> 280925 INFO  (TEST-NodeAddedTriggerTest.testListenerAcceptance-seed#[DDD51F2C421528A6]) [n:127.0.0.1:40211_solr    ] o.a.s.c.ZkController Register node as live in ZooKeeper:/live_nodes/127.0.0.1:40211_solr
   [junit4]   2> 280927 INFO  (zkCallback-564-thread-1) [    ] o.a.s.c.c.ZkStateReader Updated live nodes from ZooKeeper... (1) -> (2)
   [junit4]   2> 280927 INFO  (zkCallback-571-thread-1) [    ] o.a.s.c.c.ZkStateReader Updated live nodes from ZooKeeper... (1) -> (2)
   [junit4]   2> 280962 INFO  (zkCallback-586-thread-1) [    ] o.a.s.c.c.ZkStateReader Updated live nodes from ZooKeeper... (1) -> (2)
   [junit4]   2> 280973 INFO  (zkCallback-578-thread-1) [    ] o.a.s.c.c.ZkStateReader Updated live nodes from ZooKeeper... (1) -> (2)
   [junit4]   2> 281723 INFO  (TEST-NodeAddedTriggerTest.testListenerAcceptance-seed#[DDD51F2C421528A6]) [n:127.0.0.1:40211_solr    ] o.a.s.m.r.SolrJmxReporter JMX monitoring for 'solr_40211.solr.node' (registry 'solr.node') enabled at server: com.sun.jmx.mbeanserver.JmxMBeanServer@73d4021a
   [junit4]   2> 281732 INFO  (TEST-NodeAddedTriggerTest.testListenerAcceptance-seed#[DDD51F2C421528A6]) [n:127.0.0.1:40211_solr    ] o.a.s.m.r.SolrJmxReporter JMX monitoring for 'solr_40211.solr.jvm' (registry 'solr.jvm') enabled at server: com.sun.jmx.mbeanserver.JmxMBeanServer@73d4021a
   [junit4]   2> 281732 INFO  (TEST-NodeAddedTriggerTest.testListenerAcceptance-seed#[DDD51F2C421528A6]) [n:127.0.0.1:40211_solr    ] o.a.s.m.r.SolrJmxReporter JMX monitoring for 'solr_40211.solr.jetty' (registry 'solr.jetty') enabled at server: com.sun.jmx.mbeanserver.JmxMBeanServer@73d4021a
   [junit4]   2> 281734 INFO  (TEST-NodeAddedTriggerTest.testListenerAcceptance-seed#[DDD51F2C421528A6]) [n:127.0.0.1:40211_solr    ] o.a.s.c.CorePropertiesLocator Found 0 core definitions underneath /export/home/jenkins/workspace/Lucene-Solr-7.x-Solaris/solr/build/solr-core/test/J0/temp/solr.cloud.autoscaling.NodeAddedTriggerTest_DDD51F2C421528A6-001/tempDir-001/node2/.
   [junit4]   2> 281739 INFO  (zkConnectionManagerCallback-594-thread-1) [    ] o.a.s.c.c.ConnectionManager zkClient has connected
   [junit4]   2> 281741 INFO  (TEST-NodeAddedTriggerTest.testListenerAcceptance-seed#[DDD51F2C421528A6]) [n:127.0.0.1:40211_solr    ] o.a.s.c.c.ZkStateReader Updated live nodes from ZooKeeper... (0) -> (2)
   [junit4]   2> 281743 INFO  (TEST-NodeAddedTriggerTest.testListenerAcceptance-seed#[DDD51F2C421528A6]) [n:127.0.0.1:40211_solr    ] o.a.s.c.s.i.ZkClientClusterStateProvider Cluster at 127.0.0.1:63803/solr ready
   [junit4]   2> 281784 INFO  (TEST-NodeAddedTriggerTest.testListenerAcceptance-seed#[DDD51F2C421528A6]) [    ] o.a.s.SolrTestCaseJ4 ###Ending testListenerAcceptance
   [junit4]   2> 281849 INFO  (TEST-NodeAddedTriggerTest.testRestoreState-seed#[DDD51F2C421528A6]) [    ] o.a.s.SolrTestCaseJ4 ###Starting testRestoreState
   [junit4]   2> 281851 INFO  (TEST-NodeAddedTriggerTest.testRestoreState-seed#[DDD51F2C421528A6]) [    ] o.e.j.s.Server jetty-9.4.10.v20180503; built: 2018-05-03T15:56:21.710Z; git: daa59876e6f384329b122929e70a80934569428c; jvm 1.8.0_162-b12
   [junit4]   2> 281852 INFO  (TEST-NodeAddedTriggerTest.testRestoreState-seed#[DDD51F2C421528A6]) [    ] o.e.j.s.session DefaultSessionIdManager workerName=node0
   [junit4]   2> 281852 INFO  (TEST-NodeAddedTriggerTest.testRestoreState-seed#[DDD51F2C421528A6]) [    ] o.e.j.s.session No SessionScavenger set, using defaults
   [junit4]   2> 281852 INFO  (TEST-NodeAddedTriggerTest.testRestoreState-seed#[DDD51F2C421528A6]) [    ] o.e.j.s.session node0 Scavenging every 660000ms
   [junit4]   2> 281852 INFO  (TEST-NodeAddedTriggerTest.testRestoreState-seed#[DDD51F2C421528A6]) [    ] o.e.j.s.h.ContextHandler Started o.e.j.s.ServletContextHandler@7e27de3c{/solr,null,AVAILABLE}
   [junit4]   2> 281852 INFO  (TEST-NodeAddedTriggerTest.testRestoreState-seed#[DDD51F2C421528A6]) [    ] o.e.j.s.AbstractConnector Started ServerConnector@2eb9ed58{HTTP/1.1,[http/1.1]}{127.0.0.1:56124}
   [junit4]   2> 281852 INFO  (TEST-NodeAddedTriggerTest.testRestoreState-seed#[DDD51F2C421528A6]) [    ] o.e.j.s.Server Started @281993ms
   [junit4]   2> 281852 INFO  (TEST-NodeAddedTriggerTest.testRestoreState-seed#[DDD51F2C421528A6]) [    ] o.a.s.c.s.e.JettySolrRunner Jetty properties: {hostContext=/solr, hostPort=56124}
   [junit4]   2> 281852 ERROR (TEST-NodeAddedTriggerTest.testRestoreState-seed#[DDD51F2C421528A6]) [    ] o.a.s.u.StartupLoggingUtils Missing Java Option solr.log.dir. Logging may be missing or incomplete.
   [junit4]   2> 281852 INFO  (TEST-NodeAddedTriggerTest.testRestoreState-seed#[DDD51F2C421528A6]) [    ] o.a.s.s.SolrDispatchFilter Using logger factory org.apache.logging.slf4j.Log4jLoggerFactory
   [junit4]   2> 281852 INFO  (TEST-NodeAddedTriggerTest.testRestoreState-seed#[DDD51F2C421528A6]) [    ] o.a.s.s.SolrDispatchFilter  ___      _       Welcome to Apache Solr™ version 7.4.0
   [junit4]   2> 281852 INFO  (TEST-NodeAddedTriggerTest.testRestoreState-seed#[DDD51F2C421528A6]) [    ] o.a.s.s.SolrDispatchFilter / __| ___| |_ _   Starting in cloud mode on port null
   [junit4]   2> 281852 INFO  (TEST-NodeAddedTriggerTest.testRestoreState-seed#[DDD51F2C421528A6]) [    ] o.a.s.s.SolrDispatchFilter \__ \/ _ \ | '_|  Install dir: null
   [junit4]   2> 281852 INFO  (TEST-NodeAddedTriggerTest.testRestoreState-seed#[DDD51F2C421528A6]) [    ] o.a.s.s.SolrDispatchFilter |___/\___/_|_|    Start time: 2018-05-10T05:03:59.642Z
   [junit4]   2> 281860 INFO  (zkConnectionManagerCallback-596-thread-1) [    ] o.a.s.c.c.ConnectionManager zkClient has connected
   [junit4]   2> 281861 INFO  (TEST-NodeAddedTriggerTest.testRestoreState-seed#[DDD51F2C421528A6]) [    ] o.a.s.s.SolrDispatchFilter solr.xml found in ZooKeeper. Loading...
   [junit4]   2> 281871 INFO  (TEST-NodeAddedTriggerTest.testRestoreState-seed#[DDD51F2C421528A6]) [    ] o.a.s.c.ZkContainer Zookeeper client=127.0.0.1:63803/solr
   [junit4]   2> 281876 INFO  (zkConnectionManagerCallback-600-thread-1) [    ] o.a.s.c.c.ConnectionManager zkClient has connected
   [junit4]   2> 281883 INFO  (zkConnectionManagerCallback-602-thread-1) [    ] o.a.s.c.c.ConnectionManager zkClient has connected
   [junit4]   2> 281904 INFO  (TEST-NodeAddedTriggerTest.testRestoreState-seed#[DDD51F2C421528A6]) [n:127.0.0.1:56124_solr    ] o.a.s.c.c.ZkStateReader Updated live nodes from ZooKeeper... (0) -> (2)
   [junit4]   2> 281907 INFO  (TEST-NodeAddedTriggerTest.testRestoreState-seed#[DDD51F2C421528A6]) [n:127.0.0.1:56124_solr    ] o.a.s.c.Overseer Overseer (id=null) closing
   [junit4]   2> 281915 INFO  (TEST-NodeAddedTriggerTest.testRestoreState-seed#[DDD51F2C421528A6]) [n:127.0.0.1:56124_solr    ] o.a.s.c.TransientSolrCoreCacheDefault Allocating transient cache for 2147483647 transient cores
   [junit4]   2> 281915 INFO  (TEST-NodeAddedTriggerTest.testRestoreState-seed#[DDD51F2C421528A6]) [n:127.0.0.1:56124_solr    ] o.a.s.c.ZkController Register node as live in ZooKeeper:/live_nodes/127.0.0.1:56124_solr
   [junit4]   2> 281917 INFO  (zkCallback-571-thread-1) [    ] o.a.s.c.c.ZkStateReader Updated live nodes from ZooKeeper... (2) -> (3)
   [junit4]   2> 281917 INFO  (zkCallback-564-thread-1) [    ] o.a.s.c.c.ZkStateReader Updated live nodes from ZooKeeper... (2) -> (3)
   [junit4]   2> 281920 INFO  (zkCallback-601-thread-1) [    ] o.a.s.c.c.ZkStateReader Updated live nodes from ZooKeeper... (2) -> (3)
   [junit4]   2> 281921 INFO  (zkCallback-578-thread-1) [    ] o.a.s.c.c.ZkStateReader Updated live nodes from ZooKeeper... (2) -> (3)
   [junit4]   2> 281921 INFO  (zkCallback-586-thread-1) [    ] o.a.s.c.c.ZkStateReader Updated live nodes from ZooKeeper... (2) -> (3)
   [junit4]   2> 281925 INFO  (zkCallback-593-thread-1) [    ] o.a.s.c.c.ZkStateReader Updated live nodes from ZooKeeper... (2) -> (3)
   [junit4]   2> 283369 INFO  (TEST-NodeAddedTriggerTest.testRestoreState-seed#[DDD51F2C421528A6]) [n:127.0.0.1:56124_solr    ] o.a.s.m.r.SolrJmxReporter JMX monitoring for 'solr_56124.solr.node' (registry 'solr.node') enabled at server: com.sun.jmx.mbeanserver.JmxMBeanServer@73d4021a
   [junit4]   2> 283379 INFO  (TEST-NodeAddedTriggerTest.testRestoreState-seed#[DDD51F2C421528A6]) [n:127.0.0.1:56124_solr    ] o.a.s.m.r.SolrJmxReporter JMX monitoring for 'solr_56124.solr.jvm' (registry 'solr.jvm') enabled at server: com.sun.jmx.mbeanserver.JmxMBeanServer@73d4021a
   [junit4]   2> 283379 INFO  (TEST-NodeAddedTriggerTest.testRestoreState-seed#[DDD51F2C421528A6]) [n:127.0.0.1:56124_solr    ] o.a.s.m.r.SolrJmxReporter JMX monitoring for 'solr_56124.solr.jetty' (registry 'solr.jetty') enabled at server: com.sun.jmx.mbeanserver.JmxMBeanServer@73d4021a
   [junit4]   2> 283381 INFO  (TEST-NodeAddedTriggerTest.testRestoreState-seed#[DDD51F2C421528A6]) [n:127.0.0.1:56124_solr    ] o.a.s.c.CorePropertiesLocator Found 0 core definitions underneath /export/home/jenkins/workspace/Lucene-Solr-7.x-Solaris/solr/build/solr-core/test/J0/temp/solr.cloud.autoscaling.NodeAddedTriggerTest_DDD51F2C421528A6-001/tempDir-001/node3/.
   [junit4]   2> 283498 INFO  (zkConnectionManagerCallback-609-thread-1) [    ] o.a.s.c.c.ConnectionManager zkClient has connected
   [junit4]   2> 283500 INFO  (TEST-NodeAddedTriggerTest.testRestoreState-seed#[DDD51F2C421528A6]) [n:127.0.0.1:56124_solr    ] o.a.s.c.c.ZkStateReader Updated live nodes from ZooKeeper... (0) -> (3)
   [junit4]   2> 283501 INFO  (TEST-NodeAddedTriggerTest.testRestoreState-seed#[DDD51F2C421528A6]) [n:127.0.0.1:56124_solr    ] o.a.s.c.s.i.ZkClientClusterStateProvider Cluster at 127.0.0.1:63803/solr ready
   [junit4]   2> 283601 INFO  (TEST-NodeAddedTriggerTest.testRestoreState-seed#[DDD51F2C421528A6]) [    ] o.a.s.SolrTestCaseJ4 ###Ending testRestoreState
   [junit4]   2> NOTE: reproduce with: ant test  -Dtestcase=NodeAddedTriggerTest -Dtests.method=testRestoreState -Dtests.seed=DDD51F2C421528A6 -Dtests.slow=true -Dtests.locale=en-MT -Dtests.timezone=Europe/Stockholm -Dtests.asserts=true -Dtests.file.encoding=UTF-8
   [junit4] FAILURE 1.81s J0 | NodeAddedTriggerTest.testRestoreState <<<
   [junit4]    > Throwable #1: java.lang.AssertionError: Did not expect the processor to fire on first run! event={
   [junit4]    >   "id":"43f27ccd80d9eT8untr5gz1g4qzeemf267qcxmf",
   [junit4]    >   "source":"node_added_trigger",
   [junit4]    >   "eventTime":1195340079828382,
   [junit4]    >   "eventType":"NODEADDED",
   [junit4]    >   "properties":{
   [junit4]    >     "eventTimes":[
   [junit4]    >       1195340079828382,
   [junit4]    >       1195340079830958],
   [junit4]    >     "nodeNames":[
   [junit4]    >       "127.0.0.1:34588_solr",
   [junit4]    >       "127.0.0.1:40211_solr"]}}
   [junit4]    > 	at __randomizedtesting.SeedInfo.seed([DDD51F2C421528A6:137BBBBFBA2C50B0]:0)
   [junit4]    > 	at org.apache.solr.cloud.autoscaling.NodeAddedTriggerTest.lambda$new$0(NodeAddedTriggerTest.java:49)
   [junit4]    > 	at org.apache.solr.cloud.autoscaling.NodeAddedTrigger.run(NodeAddedTrigger.java:161)
   [junit4]    > 	at org.apache.solr.cloud.autoscaling.NodeAddedTriggerTest.testRestoreState(NodeAddedTriggerTest.java:257)
   [junit4]    > 	at java.lang.Thread.run(Thread.java:748)
   [junit4]   2> 283624 INFO  (TEST-NodeAddedTriggerTest.testTrigger-seed#[DDD51F2C421528A6]) [    ] o.a.s.SolrTestCaseJ4 ###Starting testTrigger
   [junit4]   2> 283631 INFO  (TEST-NodeAddedTriggerTest.testTrigger-seed#[DDD51F2C421528A6]) [    ] o.e.j.s.Server jetty-9.4.10.v20180503; built: 2018-05-03T15:56:21.710Z; git: daa59876e6f384329b122929e70a80934569428c; jvm 1.8.0_162-b12
   [junit4]   2> 283637 INFO  (TEST-NodeAddedTriggerTest.testTrigger-seed#[DDD51F2C421528A6]) [    ] o.e.j.s.session DefaultSessionIdManager workerName=node0
   [junit4]   2> 283638 INFO  (TEST-NodeAddedTriggerTest.testTrigger-seed#[DDD51F2C421528A6]) [    ] o.e.j.s.session No SessionScavenger set, using defaults
   [junit4]   2> 283638 INFO  (TEST-NodeAddedTriggerTest.testTrigger-seed#[DDD51F2C421528A6]) [    ] o.e.j.s.session node0 Scavenging every 660000ms
   [junit4]   2> 283639 INFO  (TEST-NodeAddedTriggerTest.testTrigger-seed#[DDD51F2C421528A6]) [    ] o.e.j.s.h.ContextHandler Started o.e.j.s.ServletContextHandler@470de6a8{/solr,null,AVAILABLE}
   [junit4]   2> 283639 INFO  (TEST-NodeAddedTriggerTest.testTrigger-seed#[DDD51F2C421528A6]) [    ] o.e.j.s.AbstractConnector Started ServerConnector@4e2c883f{HTTP/1.1,[http/1.1]}{127.0.0.1:35649}
   [junit4]   2> 283639 INFO  (TEST-NodeAddedTriggerTest.testTrigger-seed#[DDD51F2C421528A6]) [    ] o.e.j.s.Server Started @283780ms
   [junit4]   2> 283639 INFO  (TEST-NodeAddedTriggerTest.testTrigger-seed#[DDD51F2C421528A6]) [    ] o.a.s.c.s.e.JettySolrRunner Jetty properties: {hostContext=/solr, hostPort=35649}
   [junit4]   2> 283640 ERROR (TEST-NodeAddedTriggerTest.testTrigger-seed#[DDD51F2C421528A6]) [    ] o.a.s.u.StartupLoggingUtils Missing Java Option solr.log.dir. Logging may be missing or incomplete.
   [junit4]   2> 283640 INFO  (TEST-NodeAddedTriggerTest.testTrigger-seed#[DDD51F2C421528A6]) [    ] o.a.s.s.SolrDispatchFilter Using logger factory org.apache.logging.slf4j.Log4jLoggerFactory
   [junit4]   2> 283640 INFO  (TEST-NodeAddedTriggerTest.testTrigger-seed#[DDD51F2C421528A6]) [    ] o.a.s.s.SolrDispatchFilter  ___      _       Welcome to Apache Solr™ version 7.4.0
   [junit4]   2> 283640 INFO  (TEST-NodeAddedTriggerTest.testTrigger-seed#[DDD51F2C421528A6]) [    ] o.a.s.s.SolrDispatchFilter / __| ___| |_ _   Starting in cloud mode on port null
   [junit4]   2> 283640 INFO  (TEST-NodeAddedTriggerTest.testTrigger-seed#[DDD51F2C421528A6]) [    ] o.a.s.s.SolrDispatchFilter \__ \/ _ \ | '_|  Install dir: null
   [junit4]   2> 283640 INFO  (TEST-NodeAddedTriggerTest.testTrigger-seed#[DDD51F2C421528A6]) [    ] o.a.s.s.SolrDispatchFilter |___/\___/_|_|    Start time: 2018-05-10T05:04:01.430Z
   [junit4]   2> 283662 INFO  (zkConnectionManagerCallback-611-thread-1) [    ] o.a.s.c.c.ConnectionManager zkClient has connected
   [junit4]   2> 283662 INFO  (TEST-NodeAddedTriggerTest.testTrigger-seed#[DDD51F2C421528A6]) [    ] o.a.s.s.SolrDispatchFilter solr.xml found in ZooKeeper. Loading...
   [junit4]   2> 283704 INFO  (TEST-NodeAddedTriggerTest.testTrigger-seed#[DDD51F2C421528A6]) [    ] o.a.s.c.ZkContainer Zookeeper client=127.0.0.1:63803/solr
   [junit4]   2> 283708 INFO  (zkConnectionManagerCallback-615-thread-1) [    ] o.a.s.c.c.ConnectionManager zkClient has connected
   [junit4]   2> 283713 INFO  (zkConnectionManagerCallback-617-thread-1) [    ] o.a.s.c.c.ConnectionManager zkClient has connected
   [junit4]   2> 283720 INFO  (TEST-NodeAddedTriggerTest.testTrigger-seed#[DDD51F2C421528A6]) [n:127.0.0.1:35649_solr    ] o.a.s.c.c.ZkStateReader Updated live nodes from ZooKeeper... (0) -> (3)
   [junit4]   2> 283722 INFO  (TEST-NodeAddedTriggerTest.testTrigger-seed#[DDD51F2C421528A6]) [n:127.0.0.1:35649_solr    ] o.a.s.c.Overseer Overseer (id=null) closing
   [junit4]   2> 283725 INFO  (TEST-NodeAddedTriggerTest.testTrigger-seed#[DDD51F2C421528A6]) [n:127.0.0.1:35649_solr    ] o.a.s.c.TransientSolrCoreCacheDefault Allocating transient cache for 2147483647 transient cores
   [junit4]   2> 283725 INFO  (TEST-NodeAddedTriggerTest.testTrigger-seed#[DDD51F2C421528A6]) [n:127.0.0.1:35649_solr    ] o.a.s.c.ZkController Register node as live in ZooKeeper:/live_nodes/127.0.0.1:35649_solr
   [junit4]   2> 283725 INFO  (zkCallback-564-thread-1) [    ] o.a.s.c.c.ZkStateReader Updated live nodes from ZooKeeper... (3) -> (4)
   [junit4]   2> 283725 INFO  (zkCallback-593-thread-1) [    ] o.a.s.c.c.ZkStateReader Updated live nodes from ZooKeeper... (3) -> (4)
   [junit4]   2> 283729 INFO  (zkCallback-586-thread-1) [    ] o.a.s.c.c.ZkStateReader Updated live nodes from ZooKeeper... (3) -> (4)
   [junit4]   2> 283734 INFO  (zkCallback-571-thread-1) [    ] o.a.s.c.c.ZkStateReader Updated live nodes from ZooKeeper... (3) -> (4)
   [junit4]   2> 283740 INFO  (zkCallback-578-thread-1) [    ] o.a.s.c.c.ZkStateReader Updated live nodes from ZooKeeper... (3) -> (4)
   [junit4]   2> 283741 INFO  (zkCallback-601-thread-1) [    ] o.a.s.c.c.ZkStateReader Updated live nodes from ZooKeeper... (3) -> (4)
   [junit4]   2> 283749 INFO  (zkCallback-608-thread-1) [    ] o.a.s.c.c.ZkStateReader Updated live nodes from ZooKeeper... (3) -> (4)
   [junit4]   2> 283765 INFO  (zkCallback-616-thread-1) [    ] o.a.s.c.c.ZkStateReader Updated live nodes from ZooKeeper... (3) -> (4)
   [junit4]   2> 284287 INFO  (TEST-NodeAddedTriggerTest.testTrigger-seed#[DDD51F2C421528A6]) [n:127.0.0.1:35649_solr    ] o.a.s.m.r.SolrJmxReporter JMX monitoring for 'solr_35649.solr.node' (registry 'solr.node') enabled at server: com.sun.jmx.mbeanserver.JmxMBeanServer@73d4021a
   [junit4]   2> 284293 INFO  (TEST-NodeAddedTriggerTest.testTrigger-seed#[DDD51F2C421528A6]) [n:127.0.0.1:35649_solr    ] o.a.s.m.r.SolrJmxReporter JMX monitoring for 'solr_35649.solr.jvm' (registry 'solr.jvm') enabled at server: com.sun.jmx.mbeanserver.JmxMBeanServer@73d4021a
   [junit4]   2> 284293 INFO  (TEST-NodeAddedTriggerTest.testTrigger-seed#[DDD51F2C421528A6]) [n:127.0.0.1:35649_solr    ] o.a.s.m.r.SolrJmxReporter JMX monitoring for 'solr_35649.solr.jetty' (registry 'solr.jetty') enabled at server: com.sun.jmx.mbeanserver.JmxMBeanServer@73d4021a
   [junit4]   2> 284294 INFO  (TEST-NodeAddedTriggerTest.testTrigger-seed#[DDD51F2C421528A6]) [n:127.0.0.1:35649_solr    ] o.a.s.c.CorePropertiesLocator Found 0 core definitions underneath /export/home/jenkins/workspace/Lucene-Solr-7.x-Solaris/solr/build/solr-core/test/J0/temp/solr.cloud.autoscaling.NodeAddedTriggerTest_DDD51F2C421528A6-001/tempDir-001/node4/.
   [junit4]   2> 284302 INFO  (zkConnectionManagerCallback-624-thread-1) [    ] o.a.s.c.c.ConnectionManager zkClient has connected
   [junit4]   2> 284304 INFO  (TEST-NodeAddedTriggerTest.testTrigger-seed#[DDD51F2C421528A6]) [n:127.0.0.1:35649_solr    ] o.a.s.c.c.ZkStateReader Updated live nodes from ZooKeeper... (0) -> (4)
   [junit4]   2> 284306 INFO  (TEST-NodeAddedTriggerTest.testTrigger-seed#[DDD51F2C421528A6]) [n:127.0.0.1:35649_solr    ] o.a.s.c.s.i.ZkClientClusterStateProvider Cluster at 127.0.0.1:63803/solr ready
   [junit4]   2> 284345 INFO  (TEST-NodeAddedTriggerTest.testTrigger-seed#[DDD51F2C421528A6]) [    ] o.e.j.s.Server jetty-9.4.10.v20180503; built: 2018-05-03T15:56:21.710Z; git: daa59876e6f384329b122929e70a80934569428c; jvm 1.8.0_162-b12
   [junit4]   2> 284348 INFO  (TEST-NodeAddedTriggerTest.testTrigger-seed#[DDD51F2C421528A6]) [    ] o.e.j.s.session DefaultSessionIdManager workerName=node0
   [junit4]   2> 284348 INFO  (TEST-NodeAddedTriggerTest.testTrigger-seed#[DDD51F2C421528A6]) [    ] o.e.j.s.session No SessionScavenger set, using defaults
   [junit4]   2> 284348 INFO  (TEST-NodeAddedTriggerTest.testTrigger-seed#[DDD51F2C421528A6]) [    ] o.e.j.s.session node0 Scavenging every 660000ms
   [junit4]   2> 284349 INFO  (TEST-NodeAddedTriggerTest.testTrigger-seed#[DDD51F2C421528A6]) [    ] o.e.j.s.h.ContextHandler Started o.e.j.s.ServletContextHandler@2481fa5a{/solr,null,AVAILABLE}
   [junit4]   2> 284351 INFO  (TEST-NodeAddedTriggerTest.testTrigger-seed#[DDD51F2C421528A6]) [    ] o.e.j.s.AbstractConnector Started ServerConnector@35449adc{HTTP/1.1,[http/1.1]}{127.0.0.1:44679}
   [junit4]   2> 284351 INFO  (TEST-NodeAddedTriggerTest.testTrigger-seed#[DDD51F2C421528A6]) [    ] o.e.j.s.Server Started @284492ms
   [junit4]   2> 284351 INFO  (TEST-NodeAddedTriggerTest.testTrigger-seed#[DDD51F2C421528A6]) [    ] o.a.s.c.s.e.JettySolrRunner Jetty properties: {hostContext=/solr, hostPort=44679}
   [junit4]   2> 284351 ERROR (TEST-NodeAddedTriggerTest.testTrigger-seed#[DDD51F2C421528A6]) [    ] o.a.s.u.StartupLoggingUtils Missing Java Option solr.log.dir. Logging may be missing or incomplete.
   [junit4]   2> 284351 INFO  (TEST-NodeAddedTriggerTest.testTrigger-seed#[DDD51F2C421528A6]) [    ] o.a.s.s.SolrDispatchFilter Using logger factory org.apache.logging.slf4j.Log4jLoggerFactory
   [junit4]   2> 284351 INFO  (TEST-NodeAddedTriggerTest.testTrigger-seed#[DDD51F2C421528A6]) [    ] o.a.s.s.SolrDispatchFilter  ___      _       Welcome to Apache Solr™ version 7.4.0
   [junit4]   2> 284352 INFO  (TEST-NodeAddedTriggerTest.testTrigger-seed#[DDD51F2C421528A6]) [    ] o.a.s.s.SolrDispatchFilter / __| ___| |_ _   Starting in cloud mode on port null
   [junit4]   2> 284352 INFO  (TEST-NodeAddedTriggerTest.testTrigger-seed#[DDD51F2C421528A6]) [    ] o.a.s.s.SolrDispatchFilter \__ \/ _ \ | '_|  Install dir: null
   [junit4]   2> 284352 INFO  (TEST-NodeAddedTriggerTest.testTrigger-seed#[DDD51F2C421528A6]) [    ] o.a.s.s.SolrDispatchFilter |___/\___/_|_|    Start time: 2018-05-10T05:04:02.142Z
   [junit4]   2> 284357 INFO  (zkConnectionManagerCallback-626-thread-1) [    ] o.a.s.c.c.ConnectionManager zkClient has connected
   [junit4]   2> 284358 INFO  (TEST-NodeAddedTriggerTest.testTrigger-seed#[DDD51F2C421528A6]) [    ] o.a.s.s.SolrDispatchFilter solr.xml found in ZooKeeper. Loading...
   [junit4]   2> 284366 INFO  (TEST-NodeAddedTriggerTest.testTrigger-seed#[DDD51F2C421528A6]) [    ] o.a.s.c.ZkContainer Zookeeper client=127.0.0.1:63803/solr
   [junit4]   2> 284373 INFO  (zkConnectionManagerCallback-630-thread-1) [    ] o.a.s.c.c.ConnectionManager zkClient has connected
   [junit4]   2> 284379 INFO  (zkConnectionManagerCallback-632-thread-1) [    ] o.a.s.c.c.ConnectionManager zkClient has connected
   [junit4]   2> 284393 INFO  (TEST-NodeAddedTriggerTest.testTrigger-seed#[DDD51F2C421528A6]) [n:127.0.0.1:44679_solr    ] o.a.s.c.c.ZkStateReader Updated live nodes from ZooKeeper... (0) -> (4)
   [junit4]   2> 284397 INFO  (TEST-NodeAddedTriggerTest.testTrigger-seed#[DDD51F2C421528A6]) [n:127.0.0.1:44679_solr    ] o.a.s.c.Overseer Overseer (id=null) closing
   [junit4]   2> 284400 INFO  (TEST-NodeAddedTriggerTest.testTrigger-seed#[DDD51F2C421528A6]) [n:127.0.0.1:44679_solr    ] o.a.s.c.TransientSolrCoreCacheDefault Allocating transient cache for 2147483647 transient cores
   [junit4]   2> 284400 INFO  (TEST-NodeAddedTriggerTest.testTrigger-seed#[DDD51F2C421528A6]) [n:127.0.0.1:44679_solr    ] o.a.s.c.ZkController Register node as live in ZooKeeper:/live_nodes/127.0.0.1:44679_solr
   [junit4]   2> 284402 INFO  (zkCallback-593-thread-1) [    ] o.a.s.c.c.ZkStateReader Updated live nodes from ZooKeeper... (4) -> (5)
   [junit4]   2> 284402 INFO  (zkCallback-571-thread-1) [    ] o.a.s.c.c.ZkStateReader Updated live nodes from ZooKeeper... (4) -> (5)
   [junit4]   2> 284402 INFO  (zkCallback-564-thread-1) [    ] o.a.s.c.c.ZkStateReader Updated live nodes from ZooKeeper... (4) -> (5)
   [junit4]   2> 284403 INFO  (zkCallback-586-thread-1) [    ] o.a.s.c.c.ZkStateReader Updated live nodes from ZooKeeper... (4) -> (5)
   [junit4]   2> 284403 INFO  (zkCallback-578-thread-1) [    ] o.a.s.c.c.ZkStateReader Updated live nodes from ZooKeeper... (4) -> (5)
   [junit4]   2> 284403 INFO  (zkCallback-601-thread-1) [    ] o.a.s.c.c.ZkStateReader Updated live nodes from ZooKeeper... (4) -> (5)
   [junit4]   2> 284403 INFO  (zkCallback-608-thread-1) [    ] o.a.s.c.c.ZkStateReader Updated live nodes from ZooKeeper... (4) -> (5)
   [junit4]   2> 284403 INFO  (zkCallback-616-thread-1) [    ] o.a.s.c.c.ZkStateReader Updated live nodes from ZooKeeper... (4) -> (5)
   [junit4]   2> 284405 INFO  (zkCallback-623-thread-1) [    ] o.a.s.c.c.ZkStateReader Updated live nodes from ZooKeeper... (4) -> (5)
   [junit4]   2> 284406 INFO  (zkCallback-631-thread-1) [    ] o.a.s.c.c.ZkStateReader Updated live nodes from ZooKeeper... (4) -> (5)
   [junit4]   2> 284794 INFO  (TEST-NodeAddedTriggerTest.testTrigger-seed#[DDD51F2C421528A6]) [n:127.0.0.1:44679_solr    ] o.a.s.m.r.SolrJmxReporter JMX monitoring for 'solr_44679.solr.node' (registry 'solr.node') enabled at server: com.sun.jmx.mbeanserver.JmxMBeanServer@73d4021a
   [junit4]   2> 284803 INFO  (TEST-NodeAddedTriggerTest.testTrigger-seed#[DDD51F2C421528A6]) [n:127.0.0.1:44679_solr    ] o.a.s.m.r.SolrJmxReporter JMX monitoring for 'solr_44679.solr.jvm' (registry 'solr.jvm') enabled at server: com.sun.jmx.mbeanserver.JmxMBeanServer@73d4021a
   [junit4]   2> 284804 INFO  (TEST-NodeAddedTriggerTest.testTrigger-seed#[DDD51F2C421528A6]) [n:127.0.0.1:44679_solr    ] o.a.s.m.r.SolrJmxReporter JMX monitoring for 'solr_44679.solr.jetty' (registry 'solr.jetty') enabled at server: com.sun.jmx.mbeanserver.JmxMBeanServer@73d4021a
   [junit4]   2> 284805 INFO  (TEST-NodeAddedTriggerTest.testTrigger-seed#[DDD51F2C421528A6]) [n:127.0.0.1:44679_solr    ] o.a.s.c.CorePropertiesLocator Found 0 core definitions underneath /export/home/jenkins/workspace/Lucene-Solr-7.x-Solaris/solr/build/solr-core/test/J0/temp/solr.cloud.autoscaling.NodeAddedTriggerTest_DDD51F2C421528A6-001/tempDir-001/node5/.
   [junit4]   2> 284815 INFO  (zkConnectionManagerCallback-639-thread-1) [    ] o.a.s.c.c.ConnectionManager zkClient has connected
   [junit4]   2> 284817 INFO  (TEST-NodeAddedTriggerTest.testTrigger-seed#[DDD51F2C421528A6]) [n:127.0.0.1:44679_solr    ] o.a.s.c.c.ZkStateReader Updated live nodes from ZooKeeper... (0) -> (5)
   [junit4]   2> 284819 INFO  (TEST-NodeAddedTriggerTest.testTrigger-seed#[DDD51F2C421528A6]) [n:127.0.0.1:44679_solr    ] o.a.s.c.s.i.ZkClientClusterStateProvider Cluster at 127.0.0.1:63803/solr ready
   [junit4]   2> 286862 INFO  (TEST-NodeAddedTriggerTest.testTrigger-seed#[DDD51F2C421528A6]) [    ] o.e.j.s.Server jetty-9.4.10.v20180503; built: 2018-05-03T15:56:21.710Z; git: daa59876e6f384329b122929e70a80934569428c; jvm 1.8.0_162-b12
   [junit4]   2> 286864 INFO  (TEST-NodeAddedTriggerTest.testTrigger-seed#[DDD51F2C421528A6]) [    ] o.e.j.s.session DefaultSessionIdManager workerName=node0
   [junit4]   2> 286864 INFO  (TEST-NodeAddedTriggerTest.testTrigger-seed#[DDD51F2C421528A6]) [    ] o.e.j.s.session No SessionScavenger set, using defaults
   [junit4]   2> 286864 INFO  (TEST-NodeAddedTriggerTest.testTrigger-seed#[DDD51F2C421528A6]) [    ] o.e.j.s.session node0 Scavenging every 660000ms
   [junit4]   2> 286865 INFO  (TEST-NodeAddedTriggerTest.testTrigger-seed#[DDD51F2C421528A6]) [    ] o.e.j.s.h.ContextHandler Started o.e.j.s.ServletContextHandler@79ce55d6{/solr,null,AVAILABLE}
   [junit4]   2> 286865 INFO  (TEST-NodeAddedTriggerTest.testTrigger-seed#[DDD51F2C421528A6]) [    ] o.e.j.s.AbstractConnector Started ServerConnector@aaa7db{HTTP/1.1,[http/1.1]}{127.0.0.1:52369}
   [junit4]   2> 286865 INFO  (TEST-NodeAddedTriggerTest.testTrigger-seed#[DDD51F2C421528A6]) [    ] o.e.j.s.Server Started @287007ms
   [junit4]   2> 286865 INFO  (TEST-NodeAddedTriggerTest.testTrigger-seed#[DDD51F2C421528A6]) [    ] o.a.s.c.s.e.JettySolrRunner Jetty properties: {hostContext=/solr, hostPort=52369}
   [junit4]   2> 286866 ERROR (TEST-NodeAddedTriggerTest.testTrigger-seed#[DDD51F2C421528A6]) [    ] o.a.s.u.StartupLoggingUtils Missing Java Option solr.log.dir. Logging may be missing or incomplete.
   [junit4]   2> 286866 INFO  (TEST-NodeAddedTriggerTest.testTrigger-seed#[DDD51F2C421528A6]) [    ] o.a.s.s.SolrDispatchFilter Using logger factory org.apache.logging.slf4j.Log4jLoggerFactory
   [junit4]   2> 286866 INFO  (TEST-NodeAddedTriggerTest.testTrigger-seed#[DDD51F2C421528A6]) [    ] o.a.s.s.SolrDispatchFilter  ___      _       Welcome to Apache Solr™ version 7.4.0
   [junit4]   2> 286866 INFO  (TEST-NodeAddedTriggerTest.testTrigger-seed#[DDD51F2C421528A6]) [    ] o.a.s.s.SolrDispatchFilter / __| ___| |_ _   Starting in cloud mode on port null
   [junit4]   2> 286866 INFO  (TEST-NodeAddedTriggerTest.testTrigger-seed#[DDD51F2C421528A6]) [    ] o.a.s.s.SolrDispatchFilter \__ \/ _ \ | '_|  Install dir: null
   [junit4]   2> 286866 INFO  (TEST-NodeAddedTriggerTest.testTrigger-seed#[DDD51F2C421528A6]) [    ] o.a.s.s.SolrDispatchFilter |___/\___/_|_|    Start time: 2018-05-10T05:04:04.656Z
   [junit4]   2> 286869 INFO  (zkConnectionManagerCallback-641-thread-1) [    ] o.a.s.c.c.ConnectionManager zkClient has connected
   [junit4]   2> 286872 INFO  (TEST-NodeAddedTriggerTest.testTrigger-seed#[DDD51F2C421528A6]) [    ] o.a.s.s.SolrDispatchFilter solr.xml found in ZooKeeper. Loading...
   [junit4]   2> 286884 INFO  (TEST-NodeAddedTriggerTest.testTrigger-seed#[DDD51F2C421528A6]) [    ] o.a.s.c.ZkContainer Zookeeper client=127.0.0.1:63803/solr
   [junit4]   2> 286890 INFO  (zkConnectionManagerCallback-645-thread-1) [    ] o.a.s.c.c.ConnectionManager zkClient has connected
   [junit4]   2> 286895 INFO  (zkConnectionManagerCallback-647-thread-1) [    ] o.a.s.c.c.ConnectionManager zkClient has connected
   [junit4]   2> 286903 INFO  (TEST-NodeAddedTriggerTest.testTrigger-seed#[DDD51F2C421528A6]) [n:127.0.0.1:52369_solr    ] o.a.s.c.c.ZkStateReader Updated live nodes from ZooKeeper... (0) -> (5)
   [junit4]   2> 286906 INFO  (TEST-NodeAddedTriggerTest.testTrigger-seed#[DDD51F2C421528A6]) [n:127.0.0.1:52369_solr    ] o.a.s.c.Overseer Overseer (id=null) closing
   [junit4]   2> 286910 INFO  (TEST-NodeAddedTriggerTest.testTrigger-seed#[DDD51F2C421528A6]) [n:127.0.0.1:52369_solr    ] o.a.s.c.TransientSolrCoreCacheDefault Allocating transient cache for 2147483647 transient cores
   [junit4]   2> 286910 INFO  (TEST-NodeAddedTriggerTest.testTrigger-seed#[DDD51F2C421528A6]) [n:127.0.0.1:52369_solr    ] o.a.s.c.ZkController Register node as live in ZooKeeper:/live_nodes/127.0.0.1:52369_solr
   [junit4]   2> 286921 INFO  (zkCallback-593-thread-1) [    ] o.a.s.c.c.ZkStateReader Updated live nodes from ZooKeeper... (5) -> (6)
   [junit4]   2> 286926 INFO  (zkCallback-578-thread-1) [    ] o.a.s.c.c.ZkStateReader Updated live nodes from ZooKeeper... (5) -> (6)
   [junit4]   2> 286928 INFO  (zkCallback-608-thread-1) [    ] o.a.s.c.c.ZkStateReader Updated live nodes from ZooKeeper... (5) -> (6)
   [junit4]   2> 286928 INFO  (zkCallback-631-thread-1) [    ] o.a.s.c.c.ZkStateReader Updated live nodes from ZooKeeper... (5) -> (6)
   [junit4]   2> 286928 INFO  (zkCallback-623-thread-1) [    ] o.a.s.c.c.ZkStateReader Updated live nodes from ZooKeeper... (5) -> (6)
   [junit4]   2> 286927 INFO  (zkCallback-564-thread-1) [    ] o.a.s.c.c.ZkStateReader Updated live nodes from ZooKeeper... (5) -> (6)
   [junit4]   2> 286927 INFO  (zkCallback-638-thread-1) [    ] o.a.s.c.c.ZkStateReader Updated live nodes from ZooKeeper... (5) -> (6)
   [junit4]   2> 286952 INFO  (zkCallback-586-thread-1) [    ] o.a.s.c.c.ZkStateReader Updated live nodes from ZooKeeper... (5) -> (6)
   [junit4]   2> 287033 INFO  (zkCallback-616-thread-1) [    ] o.a.s.c.c.ZkStateReader Updated live nodes from ZooKeeper... (5) -> (6)
   [junit4]   2> 287033 INFO  (zkCallback-571-thread-1) [    ] o.a.s.c.c.ZkStateReader Updated live nodes from ZooKeeper... (5) -> (6)
   [junit4]   2> 287033 INFO  (zkCallback-601-thread-1) [    ] o.a.s.c.c.ZkStateReader Updated live nodes from ZooKeeper... (5) -> (6)
   [junit4]   2> 287034 INFO  (zkCallback-646-thread-1) [    ] o.a.s.c.c.ZkStateReader Updated live nodes from ZooKeeper... (5) -> (6)
   [junit4]   2> 287168 INFO  (TEST-NodeAddedTriggerTest.testTrigger-seed#[DDD51F2C421528A6]) [n:127.0.0.1:52369_solr    ] o.a.s.m.r.SolrJmxReporter JMX monitoring for 'solr_52369.solr.node' (registry 'solr.node') enabled at server: com.sun.jmx.mbeanserver.JmxMBeanServer@73d4021a
   [junit4]   2> 287178 INFO  (TEST-NodeAddedTriggerTest.testTrigger-seed#[DDD51F2C421528A6]) [n:127.0.0.1:52369_solr    ] o.a.s.m.r.SolrJmxReporter JMX monitoring for 'solr_52369.solr.jvm' (registry 'solr.jvm') enabled at server: com.sun.jmx.mbeanserver.JmxMBeanServer@73d4021a
   [junit4]   2> 287178 INFO  (TEST-NodeAddedTriggerTest.testTrigger-seed#[DDD51F2C421528A6]) [n:127.0.0.1:52369_solr    ] o.a.s.m.r.SolrJmxReporter JMX monitoring for 'solr_52369.solr.jetty' (registry 'solr.jetty') enabled at server: com.sun.jmx.mbeanserver.JmxMBeanServer@73d4021a
   [junit4]   2> 287179 INFO  (TEST-NodeAddedTriggerTest.testTrigger-seed#[DDD51F2C421528A6]) [n:127.0.0.1:52369_solr    ] o.a.s.c.CorePropertiesLocator Found 0 core definitions underneath /export/home/jenkins/workspace/Lucene-Solr-7.x-Solaris/solr/build/solr-core/test/J0/temp/solr.cloud.autoscaling.NodeAddedTriggerTest_DDD51F2C421528A6-001/tempDir-001/node6/.
   [junit4]   2> 287183 INFO  (zkConnectionManagerCallback-654-thread-1) [    ] o.a.s.c.c.ConnectionManager zkClient has connected
   [junit4]   2> 287186 INFO  (TEST-NodeAddedTriggerTest.testTrigger-seed#[DDD51F2C421528A6]) [n:127.0.0.1:52369_solr    ] o.a.s.c.c.ZkStateReader Updated live nodes from ZooKeeper... (0) -> (6)
   [junit4]   2> 287188 INFO  (TEST-NodeAddedTriggerTest.testTrigger-seed#[DDD51F2C421528A6]) [n:127.0.0.1:52369_solr    ] o.a.s.c.s.i.ZkClientClusterStateProvider Cluster at 127.0.0.1:63803/solr ready
   [junit4]   2> 287242 INFO  (TEST-NodeAddedTriggerTest.testTrigger-seed#[DDD51F2C421528A6]) [    ] o.e.j.s.AbstractConnector Stopped ServerConnector@aaa7db{HTTP/1.1,[http/1.1]}{127.0.0.1:0}
   [junit4]   2> 287315 INFO  (TEST-NodeAddedTriggerTest.testTrigger-seed#[DDD51F2C421528A6]) [    ] o.a.s.c.CoreContainer Shutting down CoreContainer instance=1696668234
   [junit4]   2> 287316 INFO  (TEST-NodeAddedTriggerTest.testTrigger-seed#[DDD51F2C421528A6]) [    ] o.a.s.m.SolrMetricManager Closing metric reporters for registry=solr.node, tag=null
   [junit4]   2> 287316 INFO  (TEST-NodeAddedTriggerTest.testTrigger-seed#[DDD51F2C421528A6]) [    ] o.a.s.m.r.SolrJmxReporter Closing reporter [org.apache.solr.metrics.reporters.SolrJmxReporter@6dc39244: rootName = solr_52369, domain = solr.node, service url = null, agent id = null] for registry solr.node / com.codahale.metrics.MetricRegistry@353fb71b
   [junit4]   2> 287322 INFO  (TEST-NodeAddedTriggerTest.testTrigger-seed#[DDD51F2C421528A6]) [    ] o.a.s.m.SolrMetricManager Closing metric reporters for registry=solr.jvm, tag=null
   [junit4]   2> 287322 INFO  (TEST-NodeAddedTriggerTest.testTrigger-seed#[DDD51F2C421528A6]) [    ] o.a.s.m.r.SolrJmxReporter Closing reporter [org.apache.solr.metrics.reporters.SolrJmxReporter@716c93e: rootName = solr_52369, domain = solr.jvm, service url = null, agent id = null] for registry solr.jvm / com.codahale.metrics.MetricRegistry@7f36f00a
   [junit4]   2> 287326 INFO  (TEST-NodeAddedTriggerTest.testTrigger-seed#[DDD51F2C421528A6]) [    ] o.a.s.m.SolrMetricManager Closing metric reporters for registry=solr.jetty, tag=null
   [junit4]   2> 287326 INFO  (TEST-NodeAddedTriggerTest.testTrigger-seed#[DDD51F2C421528A6]) [    ] o.a.s.m.r.SolrJmxReporter Closing reporter [org.apache.solr.metrics.reporters.SolrJmxReporter@63dd9124: rootName = solr_52369, domain = solr.jetty, service url = null, agent id = null] for registry solr.jetty / com.codahale.metrics.MetricRegistry@7336a18e
   [junit4]   2> 287352 INFO  (TEST-NodeAddedTriggerTest.testTrigger-seed#[DDD51F2C421528A6]) [    ] o.a.s.c.ZkController Remove node as live in ZooKeeper:/live_nodes/127.0.0.1:52369_solr
   [junit4]   2> 287365 INFO  (zkCallback-564-thread-1) [    ] o.a.s.c.c.ZkStateReader Updated live nodes from ZooKeeper... (6) -> (5)
   [junit4]   2> 287365 INFO  (zkCallback-638-thread-1) [    ] o.a.s.c.c.ZkStateReader Updated live nodes from ZooKeeper... (6) -> (5)
   [junit4]   2> 287365 INFO  (zkCallback-646-thread-1) [    ] o.a.s.c.c.ZkStateReader Updated live nodes from ZooKeeper... (6) -> (5)
   [junit4]   2> 287365 INFO  (zkCallback-578-thread-1) [    ] o.a.s.c.c.ZkStateReader Updated live nodes from ZooKeeper... (6) -> (5)
   [junit4]   2> 287365 INFO  (zkCallback-616-thread-1) [    ] o.a.s.c.c.ZkStateReader Updated live nodes from ZooKeeper... (6) -> (5)
   [junit4]   2> 287365 INFO  (zkCallback-631-thread-1) [    ] o.a.s.c.c.ZkStateReader Updated live nodes from ZooKeeper... (6) -> (5)
   [junit4]   2> 287365 INFO  (zkCallback-571-thread-1) [    ] o.a.s.c.c.ZkStateReader Updated live nodes from ZooKeeper... (6) -> (5)
   [junit4]   2> 287366 INFO  (zkCallback-586-thread-1) [    ] o.a.s.c.c.ZkStateReader Updated live nodes from ZooKeeper... (6) -> (5)
   [junit4]   2> 287366 INFO  (zkCallback-623-thread-1) [    ] o.a.s.c.c.ZkStateReader Updated live nodes from ZooKeeper... (6) -> (5)
   [junit4]   2> 287366 INFO  (zkCallback-608-thread-1) [    ] o.a.s.c.c.ZkStateReader Updated live nodes from ZooKeeper... (6) -> (5)
   [junit4]   2> 287366 INFO  (TEST-NodeAddedTriggerTest.testTrigger-seed#[DDD51F2C421528A6]) [    ] o.a.s.m.SolrMetricManager Closing metric reporters for registry=solr.cluster, tag=null
   [junit4]   2> 287366 INFO  (zkCallback-601-thread-1) [    ] o.a.s.c.c.ZkStateReader Updated live nodes from ZooKeeper... (6) -> (5)
   [junit4]   2> 287366 INFO  (zkCallback-593-thread-1) [    ] o.a.s.c.c.ZkStateReader Updated live nodes from ZooKeeper... (6) -> (5)
   [junit4]   2> 288872 WARN  (zkCallback-653-thread-1) [    ] o.a.s.c.c.ZkStateReader ZooKeeper watch triggered, but Solr cannot talk to ZK: [KeeperErrorCode = Session expired for /live_nodes]
   [junit4]   2> 288881 INFO  (TEST-NodeAddedTriggerTest.testTrigger-seed#[DDD51F2C421528A6]) [    ] o.e.j.s.h.ContextHandler Stopped o.e.j.s.ServletContextHandler@79ce55d6{/solr,null,UNAVAILABLE}
   [junit4]   2> 288881 INFO  (TEST-NodeAddedTriggerTest.testTrigger-seed#[DDD51F2C421528A6]) [    ] o.e.j.s.session node0 Stopped scavenging
   [junit4]   2> 293890 INFO  (TEST-NodeAddedTriggerTest.testTrigger-seed#[DDD51F2C421528A6]) [    ] o.a.s.SolrTestCaseJ4 ###Ending testTrigger
   [junit4]   2> 293974 INFO  (TEST-NodeAddedTriggerTest.testActionLifecycle-seed#[DDD51F2C421528A6]) [    ] o.a.s.SolrTestCaseJ4 ###Starting testActionLifecycle
   [junit4]   2> 293976 INFO  (TEST-NodeAddedTriggerTest.testActionLifecycle-seed#[DDD51F2C421528A6]) [    ] o.a.s.SolrTestCaseJ4 ###Ending testActionLifecycle
   [junit4]   2> 293979 INFO  (jetty-closer-555-thread-4) [    ] o.e.j.s.AbstractConnector Stopped ServerConnector@4e2c883f{HTTP/1.1,[http/1.1]}{127.0.0.1:0}
   [junit4]   2> 293981 INFO  (jetty-closer-555-thread-4) [    ] o.a.s.c.CoreContainer Shutting down CoreContainer instance=2029175496
   [junit4]   2> 293981 INFO  (jetty-closer-555-thread-4) [    ] o.a.s.m.SolrMetricManager Closing metric reporters for registry=solr.node, tag=null
   [junit4]   2> 293981 INFO  (jetty-closer-555-thread-4) [    ] o.a.s.m.r.SolrJmxReporter Closing reporter [org.apache.solr.metrics.reporters.SolrJmxReporter@3f78b6b8: rootName = solr_35649, domain = solr.node, service url = null, agent id = null] for registry solr.node / com.codahale.metrics.MetricRegistry@fd5a039
   [junit4]   2> 293983 INFO  (jetty-closer-555-thread-2) [    ] o.e.j.s.AbstractConnector Stopped ServerConnector@206d6f7f{HTTP/1.1,[http/1.1]}{127.0.0.1:0}
   [junit4]   2> 293983 INFO  (jetty-closer-555-thread-5) [    ] o.e.j.s.AbstractConnector Stopped ServerConnector@35449adc{HTTP/1.1,[http/1.1]}{127.0.0.1:0}
   [junit4]   2> 293984 INFO  (jetty-closer-555-thread-3) [    ] o.e.j.s.AbstractConnector Stopped ServerConnector@2eb9ed58{HTTP/1.1,[http/1.1]}{127.0.0.1:0}
   [junit4]   2> 293984 INFO  (jetty-closer-555-thread-1) [    ] o.e.j.s.AbstractConnector Stopped ServerConnector@4156d41{HTTP/1.1,[http/1.1]}{127.0.0.1:0}
   [junit4]   2> 293988 INFO  (jetty-closer-555-thread-2) [    ] o.a.s.c.CoreContainer Shutting down CoreContainer instance=622583016
   [junit4]   2> 293988 INFO  (jetty-closer-555-thread-5) [    ] o.a.s.c.CoreContainer Shutting down CoreContainer instance=1563755926
   [junit4]   2> 293988 INFO  (jetty-closer-555-thread-2) [    ] o.a.s.m.SolrMetricManager Closing metric reporters for registry=solr.node, tag=null
   [junit4]   2> 293988 INFO  (jetty-closer-555-thread-2) [    ] o.a.s.m.r.SolrJmxReporter Closing reporter [org.apache.solr.metrics.reporters.SolrJmxReporter@3fa681ae: rootName = solr_40211, domain = solr.node, service url = null, agent id = null] for registry solr.node / com.codahale.metrics.MetricRegistry@2f2f7f43
   [junit4]   2> 293989 INFO  (jetty-closer-555-thread-4) [    ] o.a.s.m.SolrMetricManager Closing metric reporters for registry=solr.jvm, tag=null
   [junit4]   2> 293989 INFO  (jetty-closer-555-thread-4) [    ] o.a.s.m.r.SolrJmxReporter Closing reporter [org.apache.solr.metrics.reporters.SolrJmxReporter@1a4421ac: rootName = solr_35649, domain = solr.jvm, service url = null, agent id = null] for registry solr.jvm / com.codahale.metrics.MetricRegistry@7f36f00a
   [junit4]   2> 293990 INFO  (jetty-closer-555-thread-3) [    ] o.a.s.c.CoreContainer Shutting down CoreContainer instance=1730304108
   [junit4]   2> 293990 INFO  (jetty-closer-555-thread-3) [    ] o.a.s.m.SolrMetricManager Closing metric reporters for registry=solr.node, tag=null
   [junit4]   2> 293990 INFO  (jetty-closer-555-thread-3) [    ] o.a.s.m.r.SolrJmxReporter Closing reporter [org.apache.solr.metrics.reporters.SolrJmxReporter@416cdaa2: rootName = solr_56124, domain = solr.node, service url = null, agent id = null] for registry solr.node / com.codahale.metrics.MetricRegistry@28da7681
   [junit4]   2> 293990 INFO  (jetty-closer-555-thread-5) [    ] o.a.s.m.SolrMetricManager Closing metric reporters for registry=solr.node, tag=null
   [junit4]   2> 293990 INFO  (jetty-closer-555-thread-5) [    ] o.a.s.m.r.SolrJmxReporter Closing reporter [org.apache.solr.metrics.reporters.SolrJmxReporter@149498db: rootName = solr_44679, domain = solr.node, service url = null, agent id = null] for registry solr.node / com.codahale.metrics.MetricRegistry@6ab19d74
   [junit4]   2> 293990 INFO  (jetty-closer-555-thread-1) [    ] o.a.s.c.CoreContainer Shutting down CoreContainer instance=1027585542
   [junit4]   2> 293991 INFO  (jetty-closer-555-thread-1) [    ] o.a.s.m.SolrMetricManager Closing metric reporters for registry=solr.node, tag=null
   [junit4]   2> 293991 INFO  (jetty-closer-555-thread-1) [    ] o.a.s.m.r.SolrJmxReporter Closing reporter [org.apache.solr.metrics.reporters.SolrJmxReporter@644de632: rootName = solr_34588, domain = solr.node, service url = null, agent id = null] for registry solr.node / com.codahale.metrics.MetricRegistry@56cce8c3
   [junit4]   2> 294032 INFO  (jetty-closer-555-thread-4) [    ] o.a.s.m.SolrMetricManager Closing metric reporters for registry=solr.jetty, tag=null
   [junit4]   2> 294032 INFO  (jetty-closer-555-thread-4) [    ] o.a.s.m.r.SolrJmxReporter Closing reporter [org.apache.solr.metrics.reporters.SolrJmxReporter@fca3105: rootName = solr_35649, domain = solr.jetty, service url = null, agent id = null] for registry solr.jetty / com.codahale.metrics.MetricRegistry@7336a18e
   [junit4]   2> 294034 INFO  (jetty-closer-555-thread-4) [    ] o.a.s.c.ZkController Remove node as live in ZooKeeper:/live_nodes/127.0.0.1:35649_solr
   [junit4]   2> 294035 INFO  (jetty-closer-555-thread-4) [    ] o.a.s.m.SolrMetricManager Closing metric reporters for registry=solr.cluster, tag=null
   [junit4]   2> 294036 INFO  (zkCallback-564-thread-1) [    ] o.a.s.c.c.ZkStateReader Updated live nodes from ZooKeeper... (5) -> (4)
   [junit4]   2> 294036 INFO  (zkCallback-616-thread-1) [    ] o.a.s.c.c.ZkStateReader Updated live nodes from ZooKeeper... (5) -> (4)
   [junit4]   2> 294036 INFO  (zkCallback-586-thread-1) [    ] o.a.s.c.c.ZkStateReader Updated live nodes from ZooKeeper... (5) -> (4)
   [junit4]   2> 294036 INFO  (zkCallback-601-thread-1) [    ] o.a.s.c.c.ZkStateReader Updated live nodes from ZooKeeper... (5) -> (4)
   [junit4]   2> 294039 INFO  (zkCallback-571-thread-1) [    ] o.a.s.c.c.ZkStateReader Updated live nodes from ZooKeeper... (5) -> (4)
   [junit4]   2> 294042 INFO  (zkCallback-593-thread-1) [    ] o.a.s.c.c.ZkStateReader Updated live nodes from ZooKeeper... (5) -> (4)
   [junit4]   2> 294043 WARN  (NIOServerCxn.Factory:0.0.0.0/0.0.0.0:0) [    ] o.a.z.s.NIOServerCnxn Unable to read additional data from client sessionid 0x100473f662a0012, likely client has closed socket
   [junit4]   2> 294044 INFO  (zkCallback-608-thread-1) [    ] o.a.s.c.c.ZkStateReader Updated live nodes from ZooKeeper... (5) -> (4)
   [junit4]   2> 294048 INFO  (zkCallback-631-thread-1) [    ] o.a.s.c.c.ZkStateReader Updated live nodes from ZooKeeper... (5) -> (4)
   [junit4]   2> 294048 INFO  (zkCallback-638-thread-1) [    ] o.a.s.c.c.ZkStateReader Updated live nodes from ZooKeeper... (5) -> (4)
   [junit4]   2> 294049 INFO  (jetty-closer-555-thread-2) [    ] o.a.s.m.SolrMetricManager Closing metric reporters for registry=solr.jvm, tag=null
   [junit4]   2> 294049 INFO  (jetty-closer-555-thread-2) [    ] o.a.s.m.r.SolrJmxReporter Closing reporter [org.apache.solr.metrics.reporters.SolrJmxReporter@5b9d73a6: rootName = solr_40211, domain = solr.jvm, service url = null, agent id = null] for registry solr.jvm / com.codahale.metrics.MetricRegistry@7f36f00a
   [junit4]   2> 294049 INFO  (jetty-closer-555-thread-4) [    ] o.e.j.s.h.ContextHandler Stopped o.e.j.s.ServletContextHandler@470de6a8{/solr,null,UNAVAILABLE}
   [junit4]   2> 294050 INFO  (jetty-closer-555-thread-4) [    ] o.e.j.s.session node0 Stopped scavenging
   [junit4]   2> 294060 INFO  (jetty-closer-555-thread-5) [    ] o.a.s.m.SolrMetricManager Closing metric reporters for registry=solr.jvm, tag=null
   [junit4]   2> 294060 INFO  (jetty-closer-555-thread-5) [    ] o.a.s.m.r.SolrJmxReporter Closing reporter [org.apache.solr.metrics.reporters.SolrJmxReporter@2297d561: rootName = solr_44679, domain = solr.jvm, service url = null, agent id = null] for registry solr.jvm / com.codahale.metrics.MetricRegistry@7f36f00a
   [junit4]   2> 294069 INFO  (jetty-closer-555-thread-5) [    ] o.a.s.m.SolrMetricManager Closing metric reporters for registry=solr.jetty, tag=null
   [junit4]   2> 294070 INFO  (jetty-closer-555-thread-5) [    ] o.a.s.m.r.SolrJmxReporter Closing reporter [org.apache.solr.metrics.reporters.SolrJmxReporter@49136beb: rootName = solr_44679, domain = solr.jetty, service url = null, agent id = null] for registry solr.jetty / com.codahale.metrics.MetricRegistry@7336a18e
   [junit4]   2> 294070 INFO  (jetty-closer-555-thread-2) [    ] o.a.s.m.SolrMetricManager Closing metric reporters for registry=solr.jetty, tag=null
   [junit4]   2> 294070 INFO  (jetty-closer-555-thread-2) [    ] o.a.s.m.r.SolrJmxReporter Closing reporter [org.apache.solr.metrics.reporters.SolrJmxReporter@68361c22: rootName = solr_40211, domain = solr.jetty, service url = null, agent id = null] for registry solr.jetty / com.codahale.metrics.MetricRegistry@7336a18e
   [junit4]   2> 294071 INFO  (jetty-closer-555-thread-1) [    ] o.a.s.m.SolrMetricManager Closing metric reporters for registry=solr.jvm, tag=null
   [junit4]   2> 294072 INFO  (jetty-closer-555-thread-1) [    ] o.a.s.m.r.SolrJmxReporter Closing reporter [org.apache.solr.metrics.reporters.SolrJmxReporter@51c107b: rootName = solr_34588, domain = solr.jvm, service url = null, agent id = null] for registry solr.jvm / com.codahale.metrics.MetricRegistry@7f36f00a
   [junit4]   2> 294073 INFO  (jetty-closer-555-thread-5) [    ] o.a.s.c.ZkController Remove node as live in ZooKeeper:/live_nodes/127.0.0.1:44679_solr
   [junit4]   2> 294073 INFO  (jetty-closer-555-thread-2) [    ] o.a.s.c.ZkController Remove node as live in ZooKeeper:/live_nodes/127.0.0.1:40211_solr
   [junit4]   2> 294074 INFO  (jetty-closer-555-thread-5) [    ] o.a.s.m.SolrMetricManager Closing metric reporters for registry=solr.cluster, tag=null
   [junit4]   2> 294075 INFO  (zkCallback-638-thread-1) [    ] o.a.s.c.c.ZkStateReader Updated live nodes from ZooKeeper... (4) -> (2)
   [junit4]   2> 294075 INFO  (zkCallback-631-thread-2) [    ] o.a.s.c.c.ZkStateReader Updated live nodes from ZooKeeper... (4) -> (2)
   [junit4]   2> 294075 INFO  (zkCallback-593-thread-1) [    ] o.a.s.c.c.ZkStateReader Updated live nodes from ZooKeeper... (4) -> (2)
   [junit4]   2> 294075 INFO  (zkCallback-608-thread-1) [    ] o.a.s.c.c.ZkStateReader Updated live nodes from ZooKeeper... (4) -> (2)
   [junit4]   2> 294076 INFO  (jetty-closer-555-thread-2) [    ] o.a.s.m.SolrMetricManager Closing metric reporters for registry=solr.cluster, tag=null
   [junit4]   2> 294076 INFO  (zkCallback-571-thread-1) [    ] o.a.s.c.c.ZkStateReader Updated live nodes from ZooKeeper... (4) -> (2)
   [junit4]   2> 294076 INFO  (zkCallback-601-thread-1) [    ] o.a.s.c.c.ZkStateReader Updated live nodes from ZooKeeper... (4) -> (2)
   [junit4]   2> 294077 INFO  (zkCallback-586-thread-1) [    ] o.a.s.c.c.ZkStateReader Updated live nodes from ZooKeeper... (4) -> (2)
   [junit4]   2> 294079 INFO  (zkCallback-564-thread-1) [    ] o.a.s.c.c.ZkStateReader Updated live nodes from ZooKeeper... (4) -> (2)
   [junit4]   2> 294082 INFO  (jetty-closer-555-thread-1) [    ] o.a.s.m.SolrMetricManager Closing metric reporters for registry=solr.jetty, tag=null
   [junit4]   2> 294082 INFO  (jetty-closer-555-thread-1) [    ] o.a.s.m.r.SolrJmxReporter Closing reporter [org.apache.solr.metrics.reporters.SolrJmxReporter@db41702: rootName = solr_34588, domain = solr.jetty, service url = null, agent id = null] for registry solr.jetty / com.codahale.metrics.MetricRegistry@7336a18e
   [junit4]   2> 294085 INFO  (jetty-closer-555-thread-1) [    ] o.a.s.c.ZkController Remove node as live in ZooKeeper:/live_nodes/127.0.0.1:34588_solr
   [junit4]   2> 294087 INFO  (zkCallback-593-thread-1) [    ] o.a.s.c.c.ZkStateReader Updated live nodes from ZooKeeper... (2) -> (1)
   [junit4]   2> 294087 INFO  (zkCallback-631-thread-2) [    ] o.a.s.c.c.ZkStateReader Updated live nodes from ZooKeeper... (2) -> (1)
   [junit4]   2> 294087 INFO  (zkCallback-608-thread-1) [    ] o.a.s.c.c.ZkStateReader Updated live nodes from ZooKeeper... (2) -> (1)
   [junit4]   2> 294087 INFO  (zkCallback-586-thread-1) [    ] o.a.s.c.c.ZkStateReader Updated live nodes from ZooKeeper... (2) -> (1)
   [junit4]   2> 294088 INFO  (jetty-closer-555-thread-1) [    ] o.a.s.m.SolrMetricManager Closing metric reporters for registry=solr.cluster, tag=null
   [junit4]   2> 294088 INFO  (jetty-closer-555-thread-1) [    ] o.a.s.c.TransientSolrCoreCacheDefault Allocating transient cache for 2147483647 transient cores
   [junit4]   2> 294088 INFO  (jetty-closer-555-thread-1) [    ] o.a.s.c.Overseer Overseer (id=72135931660468227-127.0.0.1:34588_solr-n_0000000000) closing
   [junit4]   2> 294089 INFO  (OverseerStateUpdate-72135931660468227-127.0.0.1:34588_solr-n_0000000000) [    ] o.a.s.c.Overseer Overseer Loop exiting : 127.0.0.1:34588_solr
   [junit4]   2> 294089 WARN  (OverseerAutoScalingTriggerThread-72135931660468227-127.0.0.1:34588_solr-n_0000000000) [    ] o.a.s.c.a.OverseerTriggerThread OverseerTriggerThread woken up but we are closed, exiting.
   [junit4]   2> 294090 INFO  (zkCallback-564-thread-2) [    ] o.a.s.c.c.ZkStateReader Updated live nodes from ZooKeeper... (2) -> (1)
   [junit4]   2> 294096 INFO  (zkCallback-638-thread-1) [    ] o.a.s.c.c.ZkStateReader Updated live nodes from ZooKeeper... (2) -> (1)
   [junit4]   2> 294096 INFO  (zkCallback-601-thread-1) [    ] o.a.s.c.c.ZkStateReader Updated live nodes from ZooKeeper... (2) -> (1)
   [junit4]   2> 294097 INFO  (zkCallback-571-thread-1) [    ] o.a.s.c.c.ZkStateReader Updated live nodes from ZooKeeper... (2) -> (1)
   [junit4]   2> 294105 INFO  (jetty-closer-555-thread-3) [    ] o.a.s.m.SolrMetricManager Closing metric reporters for registry=solr.jvm, tag=null
   [junit4]   2> 294105 INFO  (jetty-closer-555-thread-3) [    ] o.a.s.m.r.SolrJmxReporter Closing reporter [org.apache.solr.metrics.reporters.SolrJmxReporter@5c3ae645: rootName = solr_56124, domain = solr.jvm, service url = null, agent id = null] for registry solr.jvm / com.codahale.metrics.MetricRegistry@7f36f00a
   [junit4]   2> 294117 INFO  (jetty-closer-555-thread-3) [    ] o.a.s.m.SolrMetricManager Closing metric reporters for registry=solr.jetty, tag=null
   [junit4]   2> 294117 INFO  (jetty-closer-555-thread-3) [    ] o.a.s.m.r.SolrJmxReporter Closing reporter [org.apache.solr.metrics.reporters.SolrJmxReporter@77a43942: rootName = solr_56124, domain = solr.jetty, service url = null, agent id = null] for registry solr.jetty / com.codahale.metrics.MetricRegistry@7336a18e
   [junit4]   2> 294118 WARN  (NIOServerCxn.Factory:0.0.0.0/0.0.0.0:0) [    ] o.a.z.s.NIOServerCnxn Unable to read additional data from client sessionid 0x100473f662a000a, likely client has closed socket
   [junit4]   2> 294121 INFO  (jetty-closer-555-thread-3) [    ] o.a.s.c.ZkController Remove node as live in ZooKeeper:/live_nodes/127.0.0.1:56124_solr
   [junit4]   2> 294123 INFO  (zkCallback-601-thread-1) [    ] o.a.s.c.c.ZkStateReader Updated live nodes from ZooKeeper... (1) -> (0)
   [junit4]   2> 294123 INFO  (zkCallback-564-thread-2) [    ] o.a.s.c.c.ZkStateReader Updated live nodes from ZooKeeper... (1) -> (0)
   [junit4]   2> 294123 INFO  (zkCallback-608-thread-1) [    ] o.a.s.c.c.ZkStateReader Updated live nodes from ZooKeeper... (1) -> (0)
   [junit4]   2> 294123 INFO  (zkCallback-586-thread-1) [    ] o.a.s.c.c.ZkStateReader Updated live nodes from ZooKeeper... (1) -> (0)
   [junit4]   2> 294124 INFO  (zkCallback-631-thread-2) [    ] o.a.s.c.c.ZkStateReader Updated live nodes from ZooKeeper... (1) -> (0)
   [junit4]   2> 294124 INFO  (zkCallback-571-thread-1) [    ] o.a.s.c.c.ZkStateReader Updated live nodes from ZooKeeper... (1) -> (0)
   [junit4]   2> 294124 INFO  (jetty-closer-555-thread-3) [    ] o.a.s.m.SolrMetricManager Closing metric reporters for registry=solr.cluster, tag=null
   [junit4]   2> 294130 INFO  (jetty-closer-555-thread-5) [    ] o.e.j.s.h.ContextHandler Stopped o.e.j.s.ServletContextHandler@2481fa5a{/solr,null,UNAVAILABLE}
   [junit4]   2> 294131 INFO  (jetty-closer-555-thread-2) [    ] o.e.j.s.h.ContextHandler Stopped o.e.j.s.ServletContextHandler@7ef9b39e{/solr,null,UNAVAILABLE}
   [junit4]   2> 294137 INFO  (jetty-closer-555-thread-5) [    ] o.e.j.s.session node0 Stopped scavenging
   [junit4]   2> 294137 INFO  (jetty-closer-555-thread-2) [    ] o.e.j.s.session node0 Stopped scavenging
   [junit4]   2> 294149 INFO  (jetty-closer-555-thread-1) [    ] o.e.j.s.h.ContextHandler Stopped o.e.j.s.ServletContextHandler@58142dfe{/solr,null,UNAVAILABLE}
   [junit4]   2> 294149 INFO  (jetty-closer-555-thread-3) [    ] o.e.j.s.h.ContextHandler Stopped o.e.j.s.ServletContextHandler@7e27de3c{/solr,null,UNAVAILABLE}
   [junit4]   2> 294150 INFO  (jetty-closer-555-thread-3) [    ] o.e.j.s.session node0 Stopped scavenging
   [junit4]   2> 294150 INFO  (jetty-closer-555-thread-1) [    ] o.e.j.s.session node0 Stopped scavenging
   [junit4]   2> 294154 ERROR (SUITE-NodeAddedTriggerTest-seed#[DDD51F2C421528A6]-worker) [    ] o.a.z.s.ZooKeeperServer ZKShutdownHandler is not registered, so ZooKeeper server won't take any action on ERROR or SHUTDOWN server state changes
   [junit4]   2> 294154 INFO  (SUITE-NodeAddedTriggerTest-seed#[DDD51F2C421528A6]-worker) [    ] o.a.s.c.ZkTestServer connecting to 127.0.0.1:63803 63803
   [junit4]   2> 294910 INFO  (Thread-792) [    ] o.a.s.c.ZkTestServer connecting to 127.0.0.1:63803 63803
   [junit4]   2> 294911 WARN  (Thread-792) [    ] o.a.s.c.ZkTestServer Watch limit violations: 
   [junit4]   2> Maximum concurrent create/delete watches above limit:
   [junit4]   2> 
   [junit4]   2> 	13	/solr/aliases.json
   [junit4]   2> 	13	/solr/clusterprops.json
   [junit4]   2> 	6	/solr/security.json
   [junit4]   2> 
   [junit4]   2> Maximum concurrent data watches above limit:
   [junit4]   2> 
   [junit4]   2> 	13	/solr/clusterstate.json
   [junit4]   2> 	2	/solr/overseer_elect/election/72135931660468227-127.0.0.1:34588_solr-n_0000000000
   [junit4]   2> 	2	/solr/overseer_elect/election/72135931660468237-127.0.0.1:56124_solr-n_0000000002
   [junit4]   2> 
   [junit4]   2> Maximum concurrent children watches above limit:
   [junit4]   2> 
   [junit4]   2> 	13	/solr/live_nodes
   [junit4]   2> 	13	/solr/collections
   [junit4]   2> 
   [junit4]   2> NOTE: leaving temporary files on disk at: /export/home/jenkins/workspace/Lucene-Solr-7.x-Solaris/solr/build/solr-core/test/J0/temp/solr.cloud.autoscaling.NodeAddedTriggerTest_DDD51F2C421528A6-001
   [junit4]   2> NOTE: test params are: codec=Asserting(Lucene70): {}, docValues:{}, maxPointsInLeafNode=40, maxMBSortInHeap=7.4264402857502585, sim=RandomSimilarity(queryNorm=false): {}, locale=en-MT, timezone=Europe/Stockholm
   [junit4]   2> NOTE: SunOS 5.11 amd64/Oracle Corporation 1.8.0_162 (64-bit)/cpus=3,threads=1,free=210837224,total=536870912
   [junit4]   2> NOTE: All tests run in this JVM: [RecoveryZkTest, SolrGraphiteReporterTest, TestLeaderElectionWithEmptyReplica, TestSolrCloudWithSecureImpersonation, SolrCoreTest, TestXIncludeConfig, HLLUtilTest, TestCloudRecovery, TestCoreAdminApis, TestEmbeddedSolrServerConstructors, TestStressUserVersions, InfixSuggestersTest, RequiredFieldsTest, TestPayloadScoreQParserPlugin, TestSolrJ, ReplicationFactorTest, TestStressInPlaceUpdates, AnalysisAfterCoreReloadTest, TestSolrXml, JSONWriterTest, TestPseudoReturnFields, MigrateRouteKeyTest, TestReplicationHandler, FieldMutatingUpdateProcessorTest, V2ApiIntegrationTest, TestManagedSynonymGraphFilterFactory, SolrIndexMetricsTest, TestTolerantSearch, TestConfigOverlay, TermsComponentTest, NumericFieldsTest, TestConfigSetsAPIExclusivity, ZkStateWriterTest, RegexBytesRefFilterTest, RuleEngineTest, TestInitParams, TestFoldingMultitermQuery, SecurityConfHandlerTest, LeaderFailoverAfterPartitionTest, TestSimDistributedQueue, SOLR749Test, TestRawTransformer, TestPerFieldSimilarityWithDefaultOverride, NodeAddedTriggerTest]
   [junit4] Completed [73/805 (1!)] on J0 in 15.91s, 4 tests, 1 failure <<< FAILURES!

[...truncated 52920 lines...]
[asciidoctor:convert] asciidoctor: ERROR: about-this-guide.adoc: line 1: invalid part, must have at least one section (e.g., chapter, appendix, etc.)
[asciidoctor:convert] asciidoctor: ERROR: solr-glossary.adoc: line 1: invalid part, must have at least one section (e.g., chapter, appendix, etc.)
     [java] Processed 2194 links (1751 relative) to 2949 anchors in 228 files
     [echo] Validated Links & Anchors via: /export/home/jenkins/workspace/Lucene-Solr-7.x-Solaris/solr/build/solr-ref-guide/bare-bones-html/

-documentation-lint:
    [jtidy] Checking for broken html (such as invalid tags)...
   [delete] Deleting directory /export/home/jenkins/workspace/Lucene-Solr-7.x-Solaris/lucene/build/jtidy_tmp
     [echo] Checking for broken links...
     [exec] 
     [exec] Crawl/parse...
     [exec] 
     [exec] Verify...
     [echo] Checking for malformed docs...

jar-checksums:

resolve:

ivy-availability-check:
[loadresource] Do not set property disallowed.ivy.jars.list as its length is 0.

-ivy-fail-disallowed-ivy-version:

ivy-fail:

ivy-configure:
[ivy:configure] :: loading settings :: file = /export/home/jenkins/workspace/Lucene-Solr-7.x-Solaris/lucene/top-level-ivy-settings.xml

resolve:

ivy-availability-check:
[loadresource] Do not set property disallowed.ivy.jars.list as its length is 0.

-ivy-fail-disallowed-ivy-version:

ivy-fail:

ivy-configure:
[ivy:configure] :: loading settings :: file = /export/home/jenkins/workspace/Lucene-Solr-7.x-Solaris/lucene/top-level-ivy-settings.xml

resolve:

resolve:

ivy-availability-check:
[loadresource] Do not set property disallowed.ivy.jars.list as its length is 0.

-ivy-fail-disallowed-ivy-version:

ivy-fail:

ivy-configure:
[ivy:configure] :: loading settings :: file = /export/home/jenkins/workspace/Lucene-Solr-7.x-Solaris/lucene/top-level-ivy-settings.xml

resolve:

ivy-availability-check:
[loadresource] Do not set property disallowed.ivy.jars.list as its length is 0.

-ivy-fail-disallowed-ivy-version:

ivy-fail:

ivy-configure:
[ivy:configure] :: loading settings :: file = /export/home/jenkins/workspace/Lucene-Solr-7.x-Solaris/lucene/top-level-ivy-settings.xml

resolve:

ivy-availability-check:
[loadresource] Do not set property disallowed.ivy.jars.list as its length is 0.

-ivy-fail-disallowed-ivy-version:

ivy-fail:

ivy-configure:
[ivy:configure] :: loading settings :: file = /export/home/jenkins/workspace/Lucene-Solr-7.x-Solaris/lucene/top-level-ivy-settings.xml

resolve:

ivy-availability-check:
[loadresource] Do not set property disallowed.ivy.jars.list as its length is 0.

-ivy-fail-disallowed-ivy-version:

ivy-fail:

ivy-configure:
[ivy:configure] :: loading settings :: file = /export/home/jenkins/workspace/Lucene-Solr-7.x-Solaris/lucene/top-level-ivy-settings.xml

resolve:

ivy-availability-check:
[loadresource] Do not set property disallowed.ivy.jars.list as its length is 0.

-ivy-fail-disallowed-ivy-version:

ivy-fail:

ivy-configure:
[ivy:configure] :: loading settings :: file = /export/home/jenkins/workspace/Lucene-Solr-7.x-Solaris/lucene/top-level-ivy-settings.xml

resolve:

ivy-availability-check:
[loadresource] Do not set property disallowed.ivy.jars.list as its length is 0.

-ivy-fail-disallowed-ivy-version:

ivy-fail:

ivy-configure:
[ivy:configure] :: loading settings :: file = /export/home/jenkins/workspace/Lucene-Solr-7.x-Solaris/lucene/top-level-ivy-settings.xml

resolve:

ivy-availability-check:
[loadresource] Do not set property disallowed.ivy.jars.list as its length is 0.

-ivy-fail-disallowed-ivy-version:

ivy-fail:

ivy-configure:
[ivy:configure] :: loading settings :: file = /export/home/jenkins/workspace/Lucene-Solr-7.x-Solaris/lucene/top-level-ivy-settings.xml

resolve:

ivy-availability-check:
[loadresource] Do not set property disallowed.ivy.jars.list as its length is 0.

-ivy-fail-disallowed-ivy-version:

ivy-fail:

ivy-configure:
[ivy:configure] :: loading settings :: file = /export/home/jenkins/workspace/Lucene-Solr-7.x-Solaris/lucene/top-level-ivy-settings.xml

resolve:

ivy-availability-check:
[loadresource] Do not set property disallowed.ivy.jars.list as its length is 0.

-ivy-fail-disallowed-ivy-version:

ivy-fail:

ivy-configure:
[ivy:configure] :: loading settings :: file = /export/home/jenkins/workspace/Lucene-Solr-7.x-Solaris/lucene/top-level-ivy-settings.xml

resolve:

ivy-availability-check:
[loadresource] Do not set property disallowed.ivy.jars.list as its length is 0.

-ivy-fail-disallowed-ivy-version:

ivy-fail:

ivy-configure:
[ivy:configure] :: loading settings :: file = /export/home/jenkins/workspace/Lucene-Solr-7.x-Solaris/lucene/top-level-ivy-settings.xml

resolve:

ivy-availability-check:
[loadresource] Do not set property disallowed.ivy.jars.list as its length is 0.

-ivy-fail-disallowed-ivy-version:

ivy-fail:

ivy-configure:
[ivy:configure] :: loading settings :: file = /export/home/jenkins/workspace/Lucene-Solr-7.x-Solaris/lucene/top-level-ivy-settings.xml

resolve:

ivy-availability-check:
[loadresource] Do not set property disallowed.ivy.jars.list as its length is 0.

-ivy-fail-disallowed-ivy-version:

ivy-fail:

ivy-configure:
[ivy:configure] :: loading settings :: file = /export/home/jenkins/workspace/Lucene-Solr-7.x-Solaris/lucene/top-level-ivy-settings.xml

resolve:

ivy-availability-check:
[loadresource] Do not set property disallowed.ivy.jars.list as its length is 0.

-ivy-fail-disallowed-ivy-version:

ivy-fail:

ivy-configure:
[ivy:configure] :: loading settings :: file = /export/home/jenkins/workspace/Lucene-Solr-7.x-Solaris/lucene/top-level-ivy-settings.xml

resolve:

ivy-availability-check:
[loadresource] Do not set property disallowed.ivy.jars.list as its length is 0.

-ivy-fail-disallowed-ivy-version:

ivy-fail:

ivy-configure:
[ivy:configure] :: loading settings :: file = /export/home/jenkins/workspace/Lucene-Solr-7.x-Solaris/lucene/top-level-ivy-settings.xml

resolve:

ivy-availability-check:
[loadresource] Do not set property disallowed.ivy.jars.list as its length is 0.

-ivy-fail-disallowed-ivy-version:

ivy-fail:

ivy-configure:
[ivy:configure] :: loading settings :: file = /export/home/jenkins/workspace/Lucene-Solr-7.x-Solaris/lucene/top-level-ivy-settings.xml

resolve:

ivy-availability-check:
[loadresource] Do not set property disallowed.ivy.jars.list as its length is 0.

-ivy-fail-disallowed-ivy-version:

ivy-fail:

ivy-configure:
[ivy:configure] :: loading settings :: file = /export/home/jenkins/workspace/Lucene-Solr-7.x-Solaris/lucene/top-level-ivy-settings.xml

resolve:

ivy-availability-check:
[loadresource] Do not set property disallowed.ivy.jars.list as its length is 0.

-ivy-fail-disallowed-ivy-version:

ivy-fail:

ivy-configure:
[ivy:configure] :: loading settings :: file = /export/home/jenkins/workspace/Lucene-Solr-7.x-Solaris/lucene/top-level-ivy-settings.xml

resolve:

ivy-availability-check:
[loadresource] Do not set property disallowed.ivy.jars.list as its length is 0.

-ivy-fail-disallowed-ivy-version:

ivy-fail:

ivy-configure:
[ivy:configure] :: loading settings :: file = /export/home/jenkins/workspace/Lucene-Solr-7.x-Solaris/lucene/top-level-ivy-settings.xml

resolve:

ivy-availability-check:
[loadresource] Do not set property disallowed.ivy.jars.list as its length is 0.

-ivy-fail-disallowed-ivy-version:

ivy-fail:

ivy-configure:
[ivy:configure] :: loading settings :: file = /export/home/jenkins/workspace/Lucene-Solr-7.x-Solaris/lucene/top-level-ivy-settings.xml

resolve:

ivy-availability-check:
[loadresource] Do not set property disallowed.ivy.jars.list as its length is 0.

-ivy-fail-disallowed-ivy-version:

ivy-fail:

ivy-configure:
[ivy:configure] :: loading settings :: file = /export/home/jenkins/workspace/Lucene-Solr-7.x-Solaris/lucene/top-level-ivy-settings.xml

resolve:

ivy-availability-check:
[loadresource] Do not set property disallowed.ivy.jars.list as its length is 0.

-ivy-fail-disallowed-ivy-version:

ivy-fail:

ivy-configure:
[ivy:configure] :: loading settings :: file = /export/home/jenkins/workspace/Lucene-Solr-7.x-Solaris/lucene/top-level-ivy-settings.xml

resolve:

ivy-availability-check:
[loadresource] Do not set property disallowed.ivy.jars.list as its length is 0.

-ivy-fail-disallowed-ivy-version:

ivy-fail:

ivy-configure:
[ivy:configure] :: loading settings :: file = /export/home/jenkins/workspace/Lucene-Solr-7.x-Solaris/lucene/top-level-ivy-settings.xml

resolve:

ivy-availability-check:
[loadresource] Do not set property disallowed.ivy.jars.list as its length is 0.

-ivy-fail-disallowed-ivy-version:

ivy-fail:

ivy-configure:
[ivy:configure] :: loading settings :: file = /export/home/jenkins/workspace/Lucene-Solr-7.x-Solaris/lucene/top-level-ivy-settings.xml

resolve:

ivy-availability-check:
[loadresource] Do not set property disallowed.ivy.jars.list as its length is 0.

-ivy-fail-disallowed-ivy-version:

ivy-fail:

ivy-configure:
[ivy:configure] :: loading settings :: file = /export/home/jenkins/workspace/Lucene-Solr-7.x-Solaris/lucene/top-level-ivy-settings.xml

resolve:

ivy-availability-check:
[loadresource] Do not set property disallowed.ivy.jars.list as its length is 0.

-ivy-fail-disallowed-ivy-version:

ivy-fail:

ivy-configure:
[ivy:configure] :: loading settings :: file = /export/home/jenkins/workspace/Lucene-Solr-7.x-Solaris/lucene/top-level-ivy-settings.xml

common.resolve:

resolve:

ivy-availability-check:
[loadresource] Do not set property disallowed.ivy.jars.list as its length is 0.

-ivy-fail-disallowed-ivy-version:

ivy-fail:

ivy-configure:
[ivy:configure] :: loading settings :: file = /export/home/jenkins/workspace/Lucene-Solr-7.x-Solaris/lucene/top-level-ivy-settings.xml

resolve:

ivy-availability-check:
[loadresource] Do not set property disallowed.ivy.jars.list as its length is 0.

-ivy-fail-disallowed-ivy-version:

ivy-fail:

ivy-configure:
[ivy:configure] :: loading settings :: file = /export/home/jenkins/workspace/Lucene-Solr-7.x-Solaris/lucene/top-level-ivy-settings.xml

resolve:

ivy-availability-check:
[loadresource] Do not set property disallowed.ivy.jars.list as its length is 0.

-ivy-fail-disallowed-ivy-version:

ivy-fail:

ivy-configure:
[ivy:configure] :: loading settings :: file = /export/home/jenkins/workspace/Lucene-Solr-7.x-Solaris/lucene/top-level-ivy-settings.xml

resolve:

ivy-availability-check:
[loadresource] Do not set property disallowed.ivy.jars.list as its length is 0.

-ivy-fail-disallowed-ivy-version:

ivy-fail:

ivy-configure:
[ivy:configure] :: loading settings :: file = /export/home/jenkins/workspace/Lucene-Solr-7.x-Solaris/lucene/top-level-ivy-settings.xml

resolve:

ivy-availability-check:
[loadresource] Do not set property disallowed.ivy.jars.list as its length is 0.

-ivy-fail-disallowed-ivy-version:

ivy-fail:

ivy-configure:
[ivy:configure] :: loading settings :: file = /export/home/jenkins/workspace/Lucene-Solr-7.x-Solaris/lucene/top-level-ivy-settings.xml

resolve:

jar-checksums:
    [mkdir] Created dir: /export/home/jenkins/workspace/Lucene-Solr-7.x-Solaris/lucene/null1353274046
     [copy] Copying 40 files to /export/home/jenkins/workspace/Lucene-Solr-7.x-Solaris/lucene/null1353274046
   [delete] Deleting directory /export/home/jenkins/workspace/Lucene-Solr-7.x-Solaris/lucene/null1353274046

resolve-example:

ivy-availability-check:
[loadresource] Do not set property disallowed.ivy.jars.list as its length is 0.

-ivy-fail-disallowed-ivy-version:

ivy-fail:

ivy-configure:
[ivy:configure] :: loading settings :: file = /export/home/jenkins/workspace/Lucene-Solr-7.x-Solaris/lucene/top-level-ivy-settings.xml

resolve:

resolve-server:

ivy-availability-check:
[loadresource] Do not set property disallowed.ivy.jars.list as its length is 0.

-ivy-fail-disallowed-ivy-version:

ivy-fail:

ivy-fail:

ivy-configure:
[ivy:configure] :: loading settings :: file = /export/home/jenkins/workspace/Lucene-Solr-7.x-Solaris/lucene/top-level-ivy-settings.xml

resolve:

resolve:

ivy-availability-check:
[loadresource] Do not set property disallowed.ivy.jars.list as its length is 0.

-ivy-fail-disallowed-ivy-version:

ivy-fail:

ivy-fail:

ivy-configure:
[ivy:configure] :: loading settings :: file = /export/home/jenkins/workspace/Lucene-Solr-7.x-Solaris/lucene/top-level-ivy-settings.xml

resolve:

ivy-availability-check:
[loadresource] Do not set property disallowed.ivy.jars.list as its length is 0.

-ivy-fail-disallowed-ivy-version:

ivy-fail:

ivy-fail:

ivy-configure:
[ivy:configure] :: loading settings :: file = /export/home/jenkins/workspace/Lucene-Solr-7.x-Solaris/lucene/top-level-ivy-settings.xml

resolve:

ivy-availability-check:
[loadresource] Do not set property disallowed.ivy.jars.list as its length is 0.

-ivy-fail-disallowed-ivy-version:

ivy-fail:

ivy-configure:
[ivy:configure] :: loading settings :: file = /export/home/jenkins/workspace/Lucene-Solr-7.x-Solaris/lucene/top-level-ivy-settings.xml

resolve:

ivy-availability-check:
[loadresource] Do not set property disallowed.ivy.jars.list as its length is 0.

-ivy-fail-disallowed-ivy-version:

ivy-fail:

ivy-fail:

ivy-configure:
[ivy:configure] :: loading settings :: file = /export/home/jenkins/workspace/Lucene-Solr-7.x-Solaris/lucene/top-level-ivy-settings.xml

resolve:

ivy-availability-check:
[loadresource] Do not set property disallowed.ivy.jars.list as its length is 0.

-ivy-fail-disallowed-ivy-version:

ivy-fail:

ivy-configure:
[ivy:configure] :: loading settings :: file = /export/home/jenkins/workspace/Lucene-Solr-7.x-Solaris/lucene/top-level-ivy-settings.xml

resolve:

ivy-availability-check:
[loadresource] Do not set property disallowed.ivy.jars.list as its length is 0.

-ivy-fail-disallowed-ivy-version:

ivy-fail:

ivy-fail:

ivy-configure:
[ivy:configure] :: loading settings :: file = /export/home/jenkins/workspace/Lucene-Solr-7.x-Solaris/lucene/top-level-ivy-settings.xml

resolve:

ivy-availability-check:
[loadresource] Do not set property disallowed.ivy.jars.list as its length is 0.

-ivy-fail-disallowed-ivy-version:

ivy-fail:

ivy-fail:

ivy-configure:
[ivy:configure] :: loading settings :: file = /export/home/jenkins/workspace/Lucene-Solr-7.x-Solaris/lucene/top-level-ivy-settings.xml

resolve:

ivy-availability-check:
[loadresource] Do not set property disallowed.ivy.jars.list as its length is 0.

-ivy-fail-disallowed-ivy-version:

ivy-fail:

ivy-fail:

ivy-configure:
[ivy:configure] :: loading settings :: file = /export/home/jenkins/workspace/Lucene-Solr-7.x-Solaris/lucene/top-level-ivy-settings.xml

resolve:

ivy-availability-check:
[loadresource] Do not set property disallowed.ivy.jars.list as its length is 0.

-ivy-fail-disallowed-ivy-version:

ivy-fail:

ivy-fail:

ivy-configure:
[ivy:configure] :: loading settings :: file = /export/home/jenkins/workspace/Lucene-Solr-7.x-Solaris/lucene/top-level-ivy-settings.xml

resolve:

ivy-availability-check:
[loadresource] Do not set property disallowed.ivy.jars.list as its length is 0.

-ivy-fail-disallowed-ivy-version:

ivy-fail:

ivy-fail:

ivy-configure:
[ivy:configure] :: loading settings :: file = /export/home/jen

[...truncated too long message...]

eer (id=72136234640474115-127.0.0.1:34454_solr-n_0000000000) closing
   [junit4]   2> 16698 INFO  (OverseerStateUpdate-72136234640474115-127.0.0.1:34454_solr-n_0000000000) [    ] o.a.s.c.Overseer Overseer Loop exiting : 127.0.0.1:34454_solr
   [junit4]   2> 16699 WARN  (OverseerAutoScalingTriggerThread-72136234640474115-127.0.0.1:34454_solr-n_0000000000) [    ] o.a.s.c.a.OverseerTriggerThread OverseerTriggerThread woken up but we are closed, exiting.
   [junit4]   2> 16706 INFO  (jetty-closer-2-thread-4) [    ] o.a.s.c.ZkController Remove node as live in ZooKeeper:/live_nodes/127.0.0.1:63100_solr
   [junit4]   2> 16706 INFO  (jetty-closer-2-thread-5) [    ] o.a.s.c.ZkController Remove node as live in ZooKeeper:/live_nodes/127.0.0.1:64957_solr
   [junit4]   2> 16711 INFO  (zkCallback-85-thread-1) [    ] o.a.s.c.c.ZkStateReader Updated live nodes from ZooKeeper... (2) -> (1)
   [junit4]   2> 16712 INFO  (zkCallback-78-thread-1) [    ] o.a.s.c.c.ZkStateReader Updated live nodes from ZooKeeper... (2) -> (1)
   [junit4]   2> 16712 INFO  (jetty-closer-2-thread-5) [    ] o.a.s.m.SolrMetricManager Closing metric reporters for registry=solr.cluster, tag=null
   [junit4]   2> 16715 INFO  (zkCallback-11-thread-1) [    ] o.a.s.c.c.ZkStateReader Updated live nodes from ZooKeeper... (2) -> (1)
   [junit4]   2> 16716 INFO  (zkCallback-70-thread-1) [    ] o.a.s.c.c.ZkStateReader Updated live nodes from ZooKeeper... (2) -> (0)
   [junit4]   2> 16716 INFO  (zkCallback-85-thread-1) [    ] o.a.s.c.c.ZkStateReader Updated live nodes from ZooKeeper... (1) -> (0)
   [junit4]   2> 16717 INFO  (zkCallback-18-thread-1) [    ] o.a.s.c.c.ZkStateReader Updated live nodes from ZooKeeper... (2) -> (1)
   [junit4]   2> 16718 INFO  (jetty-closer-2-thread-2) [    ] o.e.j.s.h.ContextHandler Stopped o.e.j.s.ServletContextHandler@636d649{/solr,null,UNAVAILABLE}
   [junit4]   2> 16718 INFO  (jetty-closer-2-thread-4) [    ] o.a.s.m.SolrMetricManager Closing metric reporters for registry=solr.cluster, tag=null
   [junit4]   2> 16719 INFO  (zkCallback-63-thread-1) [    ] o.a.s.c.c.ZkStateReader Updated live nodes from ZooKeeper... (2) -> (0)
   [junit4]   2> 16719 INFO  (zkCallback-11-thread-1) [    ] o.a.s.c.c.ZkStateReader Updated live nodes from ZooKeeper... (1) -> (0)
   [junit4]   2> 16720 INFO  (jetty-closer-2-thread-2) [    ] o.e.j.s.session node0 Stopped scavenging
   [junit4]   2> 16722 WARN  (zkCallback-18-thread-1) [    ] o.a.s.c.c.ZkStateReader ZooKeeper watch triggered, but Solr cannot talk to ZK: [KeeperErrorCode = Session expired for /live_nodes]
   [junit4]   2> 16722 INFO  (zkCallback-78-thread-2) [    ] o.a.s.c.c.ZkStateReader Updated live nodes from ZooKeeper... (1) -> (0)
   [junit4]   2> 16734 INFO  (zkCallback-63-thread-1) [    ] o.a.s.c.OverseerElectionContext I am going to be the leader 127.0.0.1:63100_solr
   [junit4]   2> 16738 INFO  (jetty-closer-2-thread-1) [    ] o.e.j.s.h.ContextHandler Stopped o.e.j.s.ServletContextHandler@61139241{/solr,null,UNAVAILABLE}
   [junit4]   2> 16738 INFO  (jetty-closer-2-thread-1) [    ] o.e.j.s.session node0 Stopped scavenging
   [junit4]   2> 16748 INFO  (jetty-closer-2-thread-5) [    ] o.e.j.s.h.ContextHandler Stopped o.e.j.s.ServletContextHandler@5cf959ee{/solr,null,UNAVAILABLE}
   [junit4]   2> 16749 INFO  (jetty-closer-2-thread-5) [    ] o.e.j.s.session node0 Stopped scavenging
   [junit4]   2> 16757 INFO  (jetty-closer-2-thread-4) [    ] o.e.j.s.h.ContextHandler Stopped o.e.j.s.ServletContextHandler@57fe4aaa{/solr,null,UNAVAILABLE}
   [junit4]   2> 16757 INFO  (jetty-closer-2-thread-4) [    ] o.e.j.s.session node0 Stopped scavenging
   [junit4]   2> 16759 ERROR (SUITE-NodeAddedTriggerTest-seed#[DDD51F2C421528A6]-worker) [    ] o.a.z.s.ZooKeeperServer ZKShutdownHandler is not registered, so ZooKeeper server won't take any action on ERROR or SHUTDOWN server state changes
   [junit4]   2> 16764 INFO  (SUITE-NodeAddedTriggerTest-seed#[DDD51F2C421528A6]-worker) [    ] o.a.s.c.ZkTestServer connecting to 127.0.0.1:59487 59487
   [junit4]   2> 17585 INFO  (Thread-1) [    ] o.a.s.c.ZkTestServer connecting to 127.0.0.1:59487 59487
   [junit4]   2> 17586 WARN  (Thread-1) [    ] o.a.s.c.ZkTestServer Watch limit violations: 
   [junit4]   2> Maximum concurrent create/delete watches above limit:
   [junit4]   2> 
   [junit4]   2> 	13	/solr/aliases.json
   [junit4]   2> 	13	/solr/clusterprops.json
   [junit4]   2> 	6	/solr/security.json
   [junit4]   2> 
   [junit4]   2> Maximum concurrent data watches above limit:
   [junit4]   2> 
   [junit4]   2> 	13	/solr/clusterstate.json
   [junit4]   2> 	2	/solr/overseer_elect/election/72136234640474115-127.0.0.1:34454_solr-n_0000000000
   [junit4]   2> 	2	/solr/overseer_elect/election/72136234640474121-127.0.0.1:43875_solr-n_0000000001
   [junit4]   2> 
   [junit4]   2> Maximum concurrent children watches above limit:
   [junit4]   2> 
   [junit4]   2> 	13	/solr/live_nodes
   [junit4]   2> 	13	/solr/collections
   [junit4]   2> 
   [junit4]   2> NOTE: leaving temporary files on disk at: /export/home/jenkins/workspace/Lucene-Solr-7.x-Solaris/solr/build/solr-core/test/J0/temp/solr.cloud.autoscaling.NodeAddedTriggerTest_DDD51F2C421528A6-001
   [junit4]   2> NOTE: test params are: codec=Asserting(Lucene70): {}, docValues:{}, maxPointsInLeafNode=40, maxMBSortInHeap=7.4264402857502585, sim=RandomSimilarity(queryNorm=false): {}, locale=en-MT, timezone=Europe/Stockholm
   [junit4]   2> NOTE: SunOS 5.11 amd64/Oracle Corporation 1.8.0_162 (64-bit)/cpus=3,threads=1,free=29963256,total=100663296
   [junit4]   2> NOTE: All tests run in this JVM: [NodeAddedTriggerTest]
   [junit4] Completed [1/5 (1!)] on J0 in 16.67s, 4 tests, 1 failure <<< FAILURES!
   [junit4] 
   [junit4] Suite: org.apache.solr.cloud.autoscaling.NodeAddedTriggerTest
   [junit4] OK      1.04s J1 | NodeAddedTriggerTest.testListenerAcceptance
   [junit4] OK      2.46s J1 | NodeAddedTriggerTest.testRestoreState
   [junit4] OK      8.30s J1 | NodeAddedTriggerTest.testTrigger
   [junit4] OK      0.04s J1 | NodeAddedTriggerTest.testActionLifecycle
   [junit4] Completed [2/5 (1!)] on J1 in 21.23s, 4 tests
   [junit4] 
   [junit4] Duplicate suite name used with XML reports: org.apache.solr.cloud.autoscaling.NodeAddedTriggerTest. This may confuse tools that process XML reports. Set 'ignoreDuplicateSuites' to true to skip this message.
   [junit4] Suite: org.apache.solr.cloud.autoscaling.NodeAddedTriggerTest
   [junit4] OK      1.65s J0 | NodeAddedTriggerTest.testListenerAcceptance
   [junit4] OK      2.84s J0 | NodeAddedTriggerTest.testRestoreState
   [junit4] OK      9.33s J0 | NodeAddedTriggerTest.testTrigger
   [junit4] OK      0.04s J0 | NodeAddedTriggerTest.testActionLifecycle
   [junit4] Completed [3/5 (1!)] on J0 in 15.77s, 4 tests
   [junit4] 
   [junit4] Suite: org.apache.solr.cloud.autoscaling.NodeAddedTriggerTest
   [junit4] OK      0.80s J1 | NodeAddedTriggerTest.testListenerAcceptance
   [junit4] OK      2.53s J1 | NodeAddedTriggerTest.testRestoreState
   [junit4] OK      9.50s J1 | NodeAddedTriggerTest.testTrigger
   [junit4] OK      0.05s J1 | NodeAddedTriggerTest.testActionLifecycle
   [junit4] Completed [4/5 (1!)] on J1 in 16.69s, 4 tests
   [junit4] 
   [junit4] Suite: org.apache.solr.cloud.autoscaling.NodeAddedTriggerTest
   [junit4] OK      0.76s J0 | NodeAddedTriggerTest.testListenerAcceptance
   [junit4] OK      2.81s J0 | NodeAddedTriggerTest.testRestoreState
   [junit4] OK      9.29s J0 | NodeAddedTriggerTest.testTrigger
   [junit4] OK      0.05s J0 | NodeAddedTriggerTest.testActionLifecycle
   [junit4] Completed [5/5 (1!)] on J0 in 14.47s, 4 tests
   [junit4] 
   [junit4] 
   [junit4] Tests with failures [seed: DDD51F2C421528A6]:
   [junit4]   - org.apache.solr.cloud.autoscaling.NodeAddedTriggerTest.testRestoreState
   [junit4] 
   [junit4] 
   [junit4] JVM J0:     0.65 ..    48.49 =    47.83s
   [junit4] JVM J1:     0.65 ..    39.66 =    39.00s
   [junit4] Execution time total: 48 seconds
   [junit4] Tests summary: 5 suites, 20 tests, 1 failure

BUILD FAILED
/export/home/jenkins/workspace/Lucene-Solr-7.x-Solaris/lucene/common-build.xml:1568: The following error occurred while executing this line:
/export/home/jenkins/workspace/Lucene-Solr-7.x-Solaris/lucene/common-build.xml:1092: There were test failures: 5 suites, 20 tests, 1 failure [seed: DDD51F2C421528A6]

Total time: 50 seconds

[repro] Setting last failure code to 256

[repro] Failures:
[repro]   1/5 failed: org.apache.solr.cloud.autoscaling.NodeAddedTriggerTest
[repro] Exiting with code 256
+ mv lucene/build lucene/build.repro
+ mv solr/build solr/build.repro
+ mv lucene/build.orig lucene/build
+ mv solr/build.orig solr/build
Archiving artifacts
Setting ANT_1_8_2_HOME=/export/home/jenkins/tools/hudson.tasks.Ant_AntInstallation/ANT_1.8.2
[WARNINGS] Parsing warnings in console log with parser Java Compiler (javac)
Setting ANT_1_8_2_HOME=/export/home/jenkins/tools/hudson.tasks.Ant_AntInstallation/ANT_1.8.2
Setting ANT_1_8_2_HOME=/export/home/jenkins/tools/hudson.tasks.Ant_AntInstallation/ANT_1.8.2
<Git Blamer> Using GitBlamer to create author and commit information for all warnings.
<Git Blamer> GIT_COMMIT=9eea96ac053cd115da6373ba9d2ec0a1d2319781, workspace=/export/home/jenkins/workspace/Lucene-Solr-7.x-Solaris
[WARNINGS] Computing warning deltas based on reference build #608
Recording test results
Setting ANT_1_8_2_HOME=/export/home/jenkins/tools/hudson.tasks.Ant_AntInstallation/ANT_1.8.2
Build step 'Publish JUnit test result report' changed build result to UNSTABLE
Email was triggered for: Unstable (Test Failures)
Sending email for trigger: Unstable (Test Failures)
Setting ANT_1_8_2_HOME=/export/home/jenkins/tools/hudson.tasks.Ant_AntInstallation/ANT_1.8.2
Setting ANT_1_8_2_HOME=/export/home/jenkins/tools/hudson.tasks.Ant_AntInstallation/ANT_1.8.2
Setting ANT_1_8_2_HOME=/export/home/jenkins/tools/hudson.tasks.Ant_AntInstallation/ANT_1.8.2
Setting ANT_1_8_2_HOME=/export/home/jenkins/tools/hudson.tasks.Ant_AntInstallation/ANT_1.8.2

Mime
View raw message