lucene-dev mailing list archives

Site index · List index
Message view « Date » · « Thread »
Top « Date » · « Thread »
From Policeman Jenkins Server <jenk...@thetaphi.de>
Subject [JENKINS] Lucene-Solr-7.x-Linux (64bit/jdk1.8.0_172) - Build # 1965 - Unstable!
Date Wed, 23 May 2018 20:18:10 GMT
Build: https://jenkins.thetaphi.de/job/Lucene-Solr-7.x-Linux/1965/
Java: 64bit/jdk1.8.0_172 -XX:-UseCompressedOops -XX:+UseSerialGC

1 tests failed.
FAILED:  org.apache.solr.cloud.autoscaling.SearchRateTriggerTest.testTrigger

Error Message:
expected:<1> but was:<2>

Stack Trace:
java.lang.AssertionError: expected:<1> but was:<2>
	at __randomizedtesting.SeedInfo.seed([FFC5019095B77A82:9C0E37120C7809AF]:0)
	at org.junit.Assert.fail(Assert.java:93)
	at org.junit.Assert.failNotEquals(Assert.java:647)
	at org.junit.Assert.assertEquals(Assert.java:128)
	at org.junit.Assert.assertEquals(Assert.java:472)
	at org.junit.Assert.assertEquals(Assert.java:456)
	at org.apache.solr.cloud.autoscaling.SearchRateTriggerTest.testTrigger(SearchRateTriggerTest.java:133)
	at sun.reflect.NativeMethodAccessorImpl.invoke0(Native Method)
	at sun.reflect.NativeMethodAccessorImpl.invoke(NativeMethodAccessorImpl.java:62)
	at sun.reflect.DelegatingMethodAccessorImpl.invoke(DelegatingMethodAccessorImpl.java:43)
	at java.lang.reflect.Method.invoke(Method.java:498)
	at com.carrotsearch.randomizedtesting.RandomizedRunner.invoke(RandomizedRunner.java:1737)
	at com.carrotsearch.randomizedtesting.RandomizedRunner$8.evaluate(RandomizedRunner.java:934)
	at com.carrotsearch.randomizedtesting.RandomizedRunner$9.evaluate(RandomizedRunner.java:970)
	at com.carrotsearch.randomizedtesting.RandomizedRunner$10.evaluate(RandomizedRunner.java:984)
	at com.carrotsearch.randomizedtesting.rules.SystemPropertiesRestoreRule$1.evaluate(SystemPropertiesRestoreRule.java:57)
	at org.apache.lucene.util.TestRuleSetupTeardownChained$1.evaluate(TestRuleSetupTeardownChained.java:49)
	at org.apache.lucene.util.AbstractBeforeAfterRule$1.evaluate(AbstractBeforeAfterRule.java:45)
	at org.apache.lucene.util.TestRuleThreadAndTestName$1.evaluate(TestRuleThreadAndTestName.java:48)
	at org.apache.lucene.util.TestRuleIgnoreAfterMaxFailures$1.evaluate(TestRuleIgnoreAfterMaxFailures.java:64)
	at org.apache.lucene.util.TestRuleMarkFailure$1.evaluate(TestRuleMarkFailure.java:47)
	at com.carrotsearch.randomizedtesting.rules.StatementAdapter.evaluate(StatementAdapter.java:36)
	at com.carrotsearch.randomizedtesting.ThreadLeakControl$StatementRunner.run(ThreadLeakControl.java:368)
	at com.carrotsearch.randomizedtesting.ThreadLeakControl.forkTimeoutingTask(ThreadLeakControl.java:817)
	at com.carrotsearch.randomizedtesting.ThreadLeakControl$3.evaluate(ThreadLeakControl.java:468)
	at com.carrotsearch.randomizedtesting.RandomizedRunner.runSingleTest(RandomizedRunner.java:943)
	at com.carrotsearch.randomizedtesting.RandomizedRunner$5.evaluate(RandomizedRunner.java:829)
	at com.carrotsearch.randomizedtesting.RandomizedRunner$6.evaluate(RandomizedRunner.java:879)
	at com.carrotsearch.randomizedtesting.RandomizedRunner$7.evaluate(RandomizedRunner.java:890)
	at com.carrotsearch.randomizedtesting.rules.StatementAdapter.evaluate(StatementAdapter.java:36)
	at com.carrotsearch.randomizedtesting.rules.SystemPropertiesRestoreRule$1.evaluate(SystemPropertiesRestoreRule.java:57)
	at org.apache.lucene.util.AbstractBeforeAfterRule$1.evaluate(AbstractBeforeAfterRule.java:45)
	at com.carrotsearch.randomizedtesting.rules.StatementAdapter.evaluate(StatementAdapter.java:36)
	at org.apache.lucene.util.TestRuleStoreClassName$1.evaluate(TestRuleStoreClassName.java:41)
	at com.carrotsearch.randomizedtesting.rules.NoShadowingOrOverridesOnMethodsRule$1.evaluate(NoShadowingOrOverridesOnMethodsRule.java:40)
	at com.carrotsearch.randomizedtesting.rules.NoShadowingOrOverridesOnMethodsRule$1.evaluate(NoShadowingOrOverridesOnMethodsRule.java:40)
	at com.carrotsearch.randomizedtesting.rules.StatementAdapter.evaluate(StatementAdapter.java:36)
	at com.carrotsearch.randomizedtesting.rules.StatementAdapter.evaluate(StatementAdapter.java:36)
	at com.carrotsearch.randomizedtesting.rules.StatementAdapter.evaluate(StatementAdapter.java:36)
	at org.apache.lucene.util.TestRuleAssertionsRequired$1.evaluate(TestRuleAssertionsRequired.java:53)
	at org.apache.lucene.util.TestRuleMarkFailure$1.evaluate(TestRuleMarkFailure.java:47)
	at org.apache.lucene.util.TestRuleIgnoreAfterMaxFailures$1.evaluate(TestRuleIgnoreAfterMaxFailures.java:64)
	at org.apache.lucene.util.TestRuleIgnoreTestSuites$1.evaluate(TestRuleIgnoreTestSuites.java:54)
	at com.carrotsearch.randomizedtesting.rules.StatementAdapter.evaluate(StatementAdapter.java:36)
	at com.carrotsearch.randomizedtesting.ThreadLeakControl$StatementRunner.run(ThreadLeakControl.java:368)
	at java.lang.Thread.run(Thread.java:748)




Build Log:
[...truncated 14628 lines...]
   [junit4] Suite: org.apache.solr.cloud.autoscaling.SearchRateTriggerTest
   [junit4]   2> Creating dataDir: /home/jenkins/workspace/Lucene-Solr-7.x-Linux/solr/build/solr-core/test/J0/temp/solr.cloud.autoscaling.SearchRateTriggerTest_FFC5019095B77A82-001/init-core-data-001
   [junit4]   2> 1825927 INFO  (SUITE-SearchRateTriggerTest-seed#[FFC5019095B77A82]-worker) [    ] o.a.s.SolrTestCaseJ4 Using PointFields (NUMERIC_POINTS_SYSPROP=true) w/NUMERIC_DOCVALUES_SYSPROP=true
   [junit4]   2> 1825929 INFO  (SUITE-SearchRateTriggerTest-seed#[FFC5019095B77A82]-worker) [    ] o.a.s.SolrTestCaseJ4 Randomized ssl (true) and clientAuth (false) via: @org.apache.solr.util.RandomizeSSL(reason=, ssl=NaN, value=NaN, clientAuth=NaN)
   [junit4]   2> 1825929 INFO  (SUITE-SearchRateTriggerTest-seed#[FFC5019095B77A82]-worker) [    ] o.a.s.SolrTestCaseJ4 SecureRandom sanity checks: test.solr.allowed.securerandom=null & java.security.egd=file:/dev/./urandom
   [junit4]   2> 1825930 INFO  (SUITE-SearchRateTriggerTest-seed#[FFC5019095B77A82]-worker) [    ] o.a.s.c.MiniSolrCloudCluster Starting cluster of 4 servers in /home/jenkins/workspace/Lucene-Solr-7.x-Linux/solr/build/solr-core/test/J0/temp/solr.cloud.autoscaling.SearchRateTriggerTest_FFC5019095B77A82-001/tempDir-001
   [junit4]   2> 1825930 INFO  (SUITE-SearchRateTriggerTest-seed#[FFC5019095B77A82]-worker) [    ] o.a.s.c.ZkTestServer STARTING ZK TEST SERVER
   [junit4]   2> 1825930 INFO  (Thread-6766) [    ] o.a.s.c.ZkTestServer client port:0.0.0.0/0.0.0.0:0
   [junit4]   2> 1825930 INFO  (Thread-6766) [    ] o.a.s.c.ZkTestServer Starting server
   [junit4]   2> 1825932 ERROR (Thread-6766) [    ] o.a.z.s.ZooKeeperServer ZKShutdownHandler is not registered, so ZooKeeper server won't take any action on ERROR or SHUTDOWN server state changes
   [junit4]   2> 1826030 INFO  (SUITE-SearchRateTriggerTest-seed#[FFC5019095B77A82]-worker) [    ] o.a.s.c.ZkTestServer start zk server on port:46667
   [junit4]   2> 1826032 INFO  (zkConnectionManagerCallback-5045-thread-1) [    ] o.a.s.c.c.ConnectionManager zkClient has connected
   [junit4]   2> 1826036 INFO  (jetty-launcher-5042-thread-2) [    ] o.e.j.s.Server jetty-9.4.10.v20180503; built: 2018-05-03T15:56:21.710Z; git: daa59876e6f384329b122929e70a80934569428c; jvm 1.8.0_172-b11
   [junit4]   2> 1826036 INFO  (jetty-launcher-5042-thread-3) [    ] o.e.j.s.Server jetty-9.4.10.v20180503; built: 2018-05-03T15:56:21.710Z; git: daa59876e6f384329b122929e70a80934569428c; jvm 1.8.0_172-b11
   [junit4]   2> 1826037 INFO  (jetty-launcher-5042-thread-4) [    ] o.e.j.s.Server jetty-9.4.10.v20180503; built: 2018-05-03T15:56:21.710Z; git: daa59876e6f384329b122929e70a80934569428c; jvm 1.8.0_172-b11
   [junit4]   2> 1826037 INFO  (jetty-launcher-5042-thread-1) [    ] o.e.j.s.Server jetty-9.4.10.v20180503; built: 2018-05-03T15:56:21.710Z; git: daa59876e6f384329b122929e70a80934569428c; jvm 1.8.0_172-b11
   [junit4]   2> 1826039 INFO  (jetty-launcher-5042-thread-2) [    ] o.e.j.s.session DefaultSessionIdManager workerName=node0
   [junit4]   2> 1826039 INFO  (jetty-launcher-5042-thread-2) [    ] o.e.j.s.session No SessionScavenger set, using defaults
   [junit4]   2> 1826039 INFO  (jetty-launcher-5042-thread-2) [    ] o.e.j.s.session node0 Scavenging every 660000ms
   [junit4]   2> 1826039 INFO  (jetty-launcher-5042-thread-2) [    ] o.e.j.s.h.ContextHandler Started o.e.j.s.ServletContextHandler@383a1b0{/solr,null,AVAILABLE}
   [junit4]   2> 1826039 INFO  (jetty-launcher-5042-thread-3) [    ] o.e.j.s.session DefaultSessionIdManager workerName=node0
   [junit4]   2> 1826039 INFO  (jetty-launcher-5042-thread-3) [    ] o.e.j.s.session No SessionScavenger set, using defaults
   [junit4]   2> 1826039 INFO  (jetty-launcher-5042-thread-3) [    ] o.e.j.s.session node0 Scavenging every 660000ms
   [junit4]   2> 1826039 INFO  (jetty-launcher-5042-thread-4) [    ] o.e.j.s.session DefaultSessionIdManager workerName=node0
   [junit4]   2> 1826040 INFO  (jetty-launcher-5042-thread-4) [    ] o.e.j.s.session No SessionScavenger set, using defaults
   [junit4]   2> 1826040 INFO  (jetty-launcher-5042-thread-4) [    ] o.e.j.s.session node0 Scavenging every 600000ms
   [junit4]   2> 1826040 INFO  (jetty-launcher-5042-thread-3) [    ] o.e.j.s.h.ContextHandler Started o.e.j.s.ServletContextHandler@e3ae6cc{/solr,null,AVAILABLE}
   [junit4]   2> 1826040 INFO  (jetty-launcher-5042-thread-4) [    ] o.e.j.s.h.ContextHandler Started o.e.j.s.ServletContextHandler@4d664222{/solr,null,AVAILABLE}
   [junit4]   2> 1826041 INFO  (jetty-launcher-5042-thread-3) [    ] o.e.j.s.AbstractConnector Started ServerConnector@1d2f2655{SSL,[ssl, http/1.1]}{127.0.0.1:32939}
   [junit4]   2> 1826041 INFO  (jetty-launcher-5042-thread-2) [    ] o.e.j.s.AbstractConnector Started ServerConnector@44d5bcf6{SSL,[ssl, http/1.1]}{127.0.0.1:34621}
   [junit4]   2> 1826041 INFO  (jetty-launcher-5042-thread-3) [    ] o.e.j.s.Server Started @1826081ms
   [junit4]   2> 1826041 INFO  (jetty-launcher-5042-thread-2) [    ] o.e.j.s.Server Started @1826081ms
   [junit4]   2> 1826041 INFO  (jetty-launcher-5042-thread-1) [    ] o.e.j.s.session DefaultSessionIdManager workerName=node0
   [junit4]   2> 1826041 INFO  (jetty-launcher-5042-thread-3) [    ] o.a.s.c.s.e.JettySolrRunner Jetty properties: {hostContext=/solr, hostPort=32939}
   [junit4]   2> 1826041 INFO  (jetty-launcher-5042-thread-1) [    ] o.e.j.s.session No SessionScavenger set, using defaults
   [junit4]   2> 1826041 INFO  (jetty-launcher-5042-thread-2) [    ] o.a.s.c.s.e.JettySolrRunner Jetty properties: {hostContext=/solr, hostPort=34621}
   [junit4]   2> 1826041 INFO  (jetty-launcher-5042-thread-4) [    ] o.e.j.s.AbstractConnector Started ServerConnector@60da1a7c{SSL,[ssl, http/1.1]}{127.0.0.1:39885}
   [junit4]   2> 1826041 INFO  (jetty-launcher-5042-thread-1) [    ] o.e.j.s.session node0 Scavenging every 660000ms
   [junit4]   2> 1826041 INFO  (jetty-launcher-5042-thread-4) [    ] o.e.j.s.Server Started @1826081ms
   [junit4]   2> 1826041 INFO  (jetty-launcher-5042-thread-4) [    ] o.a.s.c.s.e.JettySolrRunner Jetty properties: {hostContext=/solr, hostPort=39885}
   [junit4]   2> 1826041 ERROR (jetty-launcher-5042-thread-3) [    ] o.a.s.u.StartupLoggingUtils Missing Java Option solr.log.dir. Logging may be missing or incomplete.
   [junit4]   2> 1826041 ERROR (jetty-launcher-5042-thread-2) [    ] o.a.s.u.StartupLoggingUtils Missing Java Option solr.log.dir. Logging may be missing or incomplete.
   [junit4]   2> 1826041 INFO  (jetty-launcher-5042-thread-3) [    ] o.a.s.s.SolrDispatchFilter Using logger factory org.apache.logging.slf4j.Log4jLoggerFactory
   [junit4]   2> 1826041 INFO  (jetty-launcher-5042-thread-2) [    ] o.a.s.s.SolrDispatchFilter Using logger factory org.apache.logging.slf4j.Log4jLoggerFactory
   [junit4]   2> 1826041 ERROR (jetty-launcher-5042-thread-4) [    ] o.a.s.u.StartupLoggingUtils Missing Java Option solr.log.dir. Logging may be missing or incomplete.
   [junit4]   2> 1826041 INFO  (jetty-launcher-5042-thread-4) [    ] o.a.s.s.SolrDispatchFilter Using logger factory org.apache.logging.slf4j.Log4jLoggerFactory
   [junit4]   2> 1826041 INFO  (jetty-launcher-5042-thread-1) [    ] o.e.j.s.h.ContextHandler Started o.e.j.s.ServletContextHandler@b7fddd1{/solr,null,AVAILABLE}
   [junit4]   2> 1826041 INFO  (jetty-launcher-5042-thread-4) [    ] o.a.s.s.SolrDispatchFilter  ___      _       Welcome to Apache Solr™ version 7.4.0
   [junit4]   2> 1826041 INFO  (jetty-launcher-5042-thread-4) [    ] o.a.s.s.SolrDispatchFilter / __| ___| |_ _   Starting in cloud mode on port null
   [junit4]   2> 1826041 INFO  (jetty-launcher-5042-thread-4) [    ] o.a.s.s.SolrDispatchFilter \__ \/ _ \ | '_|  Install dir: null
   [junit4]   2> 1826041 INFO  (jetty-launcher-5042-thread-4) [    ] o.a.s.s.SolrDispatchFilter |___/\___/_|_|    Start time: 2018-05-23T19:53:59.068Z
   [junit4]   2> 1826041 INFO  (jetty-launcher-5042-thread-1) [    ] o.e.j.s.AbstractConnector Started ServerConnector@1219fd39{SSL,[ssl, http/1.1]}{127.0.0.1:40779}
   [junit4]   2> 1826041 INFO  (jetty-launcher-5042-thread-1) [    ] o.e.j.s.Server Started @1826082ms
   [junit4]   2> 1826041 INFO  (jetty-launcher-5042-thread-1) [    ] o.a.s.c.s.e.JettySolrRunner Jetty properties: {hostContext=/solr, hostPort=40779}
   [junit4]   2> 1826041 ERROR (jetty-launcher-5042-thread-1) [    ] o.a.s.u.StartupLoggingUtils Missing Java Option solr.log.dir. Logging may be missing or incomplete.
   [junit4]   2> 1826041 INFO  (jetty-launcher-5042-thread-1) [    ] o.a.s.s.SolrDispatchFilter Using logger factory org.apache.logging.slf4j.Log4jLoggerFactory
   [junit4]   2> 1826041 INFO  (jetty-launcher-5042-thread-1) [    ] o.a.s.s.SolrDispatchFilter  ___      _       Welcome to Apache Solr™ version 7.4.0
   [junit4]   2> 1826041 INFO  (jetty-launcher-5042-thread-1) [    ] o.a.s.s.SolrDispatchFilter / __| ___| |_ _   Starting in cloud mode on port null
   [junit4]   2> 1826041 INFO  (jetty-launcher-5042-thread-1) [    ] o.a.s.s.SolrDispatchFilter \__ \/ _ \ | '_|  Install dir: null
   [junit4]   2> 1826041 INFO  (jetty-launcher-5042-thread-1) [    ] o.a.s.s.SolrDispatchFilter |___/\___/_|_|    Start time: 2018-05-23T19:53:59.068Z
   [junit4]   2> 1826041 INFO  (jetty-launcher-5042-thread-3) [    ] o.a.s.s.SolrDispatchFilter  ___      _       Welcome to Apache Solr™ version 7.4.0
   [junit4]   2> 1826041 INFO  (jetty-launcher-5042-thread-2) [    ] o.a.s.s.SolrDispatchFilter  ___      _       Welcome to Apache Solr™ version 7.4.0
   [junit4]   2> 1826042 INFO  (jetty-launcher-5042-thread-3) [    ] o.a.s.s.SolrDispatchFilter / __| ___| |_ _   Starting in cloud mode on port null
   [junit4]   2> 1826042 INFO  (jetty-launcher-5042-thread-2) [    ] o.a.s.s.SolrDispatchFilter / __| ___| |_ _   Starting in cloud mode on port null
   [junit4]   2> 1826042 INFO  (jetty-launcher-5042-thread-3) [    ] o.a.s.s.SolrDispatchFilter \__ \/ _ \ | '_|  Install dir: null
   [junit4]   2> 1826042 INFO  (jetty-launcher-5042-thread-2) [    ] o.a.s.s.SolrDispatchFilter \__ \/ _ \ | '_|  Install dir: null
   [junit4]   2> 1826042 INFO  (jetty-launcher-5042-thread-3) [    ] o.a.s.s.SolrDispatchFilter |___/\___/_|_|    Start time: 2018-05-23T19:53:59.069Z
   [junit4]   2> 1826042 INFO  (jetty-launcher-5042-thread-2) [    ] o.a.s.s.SolrDispatchFilter |___/\___/_|_|    Start time: 2018-05-23T19:53:59.069Z
   [junit4]   2> 1826043 INFO  (zkConnectionManagerCallback-5047-thread-1) [    ] o.a.s.c.c.ConnectionManager zkClient has connected
   [junit4]   2> 1826043 INFO  (zkConnectionManagerCallback-5049-thread-1) [    ] o.a.s.c.c.ConnectionManager zkClient has connected
   [junit4]   2> 1826043 INFO  (zkConnectionManagerCallback-5052-thread-1) [    ] o.a.s.c.c.ConnectionManager zkClient has connected
   [junit4]   2> 1826043 INFO  (zkConnectionManagerCallback-5053-thread-1) [    ] o.a.s.c.c.ConnectionManager zkClient has connected
   [junit4]   2> 1826043 INFO  (jetty-launcher-5042-thread-4) [    ] o.a.s.s.SolrDispatchFilter solr.xml found in ZooKeeper. Loading...
   [junit4]   2> 1826043 INFO  (jetty-launcher-5042-thread-2) [    ] o.a.s.s.SolrDispatchFilter solr.xml found in ZooKeeper. Loading...
   [junit4]   2> 1826043 INFO  (jetty-launcher-5042-thread-3) [    ] o.a.s.s.SolrDispatchFilter solr.xml found in ZooKeeper. Loading...
   [junit4]   2> 1826043 INFO  (jetty-launcher-5042-thread-1) [    ] o.a.s.s.SolrDispatchFilter solr.xml found in ZooKeeper. Loading...
   [junit4]   2> 1826050 INFO  (jetty-launcher-5042-thread-2) [    ] o.a.s.c.ZkContainer Zookeeper client=127.0.0.1:46667/solr
   [junit4]   2> 1826050 INFO  (jetty-launcher-5042-thread-1) [    ] o.a.s.c.ZkContainer Zookeeper client=127.0.0.1:46667/solr
   [junit4]   2> 1826051 INFO  (zkConnectionManagerCallback-5059-thread-1) [    ] o.a.s.c.c.ConnectionManager zkClient has connected
   [junit4]   2> 1826051 INFO  (zkConnectionManagerCallback-5061-thread-1) [    ] o.a.s.c.c.ConnectionManager zkClient has connected
   [junit4]   2> 1826052 INFO  (zkConnectionManagerCallback-5065-thread-1) [    ] o.a.s.c.c.ConnectionManager zkClient has connected
   [junit4]   2> 1826052 INFO  (zkConnectionManagerCallback-5063-thread-1) [    ] o.a.s.c.c.ConnectionManager zkClient has connected
   [junit4]   2> 1826054 INFO  (jetty-launcher-5042-thread-4) [    ] o.a.s.c.ZkContainer Zookeeper client=127.0.0.1:46667/solr
   [junit4]   2> 1826055 INFO  (zkConnectionManagerCallback-5070-thread-1) [    ] o.a.s.c.c.ConnectionManager zkClient has connected
   [junit4]   2> 1826056 INFO  (zkConnectionManagerCallback-5073-thread-1) [    ] o.a.s.c.c.ConnectionManager zkClient has connected
   [junit4]   2> 1826056 INFO  (jetty-launcher-5042-thread-3) [    ] o.a.s.c.ZkContainer Zookeeper client=127.0.0.1:46667/solr
   [junit4]   2> 1826056 INFO  (zkConnectionManagerCallback-5075-thread-1) [    ] o.a.s.c.c.ConnectionManager zkClient has connected
   [junit4]   2> 1826057 INFO  (zkConnectionManagerCallback-5081-thread-1) [    ] o.a.s.c.c.ConnectionManager zkClient has connected
   [junit4]   2> 1826100 INFO  (jetty-launcher-5042-thread-1) [n:127.0.0.1:40779_solr    ] o.a.s.c.Overseer Overseer (id=null) closing
   [junit4]   2> 1826100 INFO  (jetty-launcher-5042-thread-4) [n:127.0.0.1:39885_solr    ] o.a.s.c.Overseer Overseer (id=null) closing
   [junit4]   2> 1826101 INFO  (jetty-launcher-5042-thread-2) [n:127.0.0.1:34621_solr    ] o.a.s.c.Overseer Overseer (id=null) closing
   [junit4]   2> 1826101 INFO  (jetty-launcher-5042-thread-1) [n:127.0.0.1:40779_solr    ] o.a.s.c.OverseerElectionContext I am going to be the leader 127.0.0.1:40779_solr
   [junit4]   2> 1826102 INFO  (jetty-launcher-5042-thread-4) [n:127.0.0.1:39885_solr    ] o.a.s.c.ZkController Register node as live in ZooKeeper:/live_nodes/127.0.0.1:39885_solr
   [junit4]   2> 1826102 INFO  (jetty-launcher-5042-thread-2) [n:127.0.0.1:34621_solr    ] o.a.s.c.ZkController Register node as live in ZooKeeper:/live_nodes/127.0.0.1:34621_solr
   [junit4]   2> 1826102 INFO  (jetty-launcher-5042-thread-1) [n:127.0.0.1:40779_solr    ] o.a.s.c.Overseer Overseer (id=72076360313602055-127.0.0.1:40779_solr-n_0000000000) starting
   [junit4]   2> 1826103 INFO  (jetty-launcher-5042-thread-3) [n:127.0.0.1:32939_solr    ] o.a.s.c.Overseer Overseer (id=null) closing
   [junit4]   2> 1826104 INFO  (jetty-launcher-5042-thread-3) [n:127.0.0.1:32939_solr    ] o.a.s.c.TransientSolrCoreCacheDefault Allocating transient cache for 2147483647 transient cores
   [junit4]   2> 1826104 INFO  (jetty-launcher-5042-thread-3) [n:127.0.0.1:32939_solr    ] o.a.s.c.ZkController Register node as live in ZooKeeper:/live_nodes/127.0.0.1:32939_solr
   [junit4]   2> 1826120 INFO  (zkCallback-5062-thread-1) [    ] o.a.s.c.c.ZkStateReader Updated live nodes from ZooKeeper... (0) -> (2)
   [junit4]   2> 1826121 INFO  (zkCallback-5064-thread-1) [    ] o.a.s.c.c.ZkStateReader Updated live nodes from ZooKeeper... (0) -> (3)
   [junit4]   2> 1826129 INFO  (zkCallback-5072-thread-1) [    ] o.a.s.c.c.ZkStateReader Updated live nodes from ZooKeeper... (0) -> (3)
   [junit4]   2> 1826137 INFO  (zkCallback-5062-thread-2) [    ] o.a.s.c.c.ZkStateReader Updated live nodes from ZooKeeper... (2) -> (3)
   [junit4]   2> 1826140 INFO  (zkCallback-5080-thread-1) [    ] o.a.s.c.c.ZkStateReader Updated live nodes from ZooKeeper... (0) -> (3)
   [junit4]   2> 1826140 INFO  (zkConnectionManagerCallback-5090-thread-1) [    ] o.a.s.c.c.ConnectionManager zkClient has connected
   [junit4]   2> 1826141 INFO  (jetty-launcher-5042-thread-1) [n:127.0.0.1:40779_solr    ] o.a.s.c.c.ZkStateReader Updated live nodes from ZooKeeper... (0) -> (3)
   [junit4]   2> 1826141 INFO  (jetty-launcher-5042-thread-1) [n:127.0.0.1:40779_solr    ] o.a.s.c.s.i.ZkClientClusterStateProvider Cluster at 127.0.0.1:46667/solr ready
   [junit4]   2> 1826161 INFO  (jetty-launcher-5042-thread-1) [n:127.0.0.1:40779_solr    ] o.a.s.c.TransientSolrCoreCacheDefault Allocating transient cache for 2147483647 transient cores
   [junit4]   2> 1826161 INFO  (jetty-launcher-5042-thread-1) [n:127.0.0.1:40779_solr    ] o.a.s.c.ZkController Register node as live in ZooKeeper:/live_nodes/127.0.0.1:40779_solr
   [junit4]   2> 1826162 INFO  (zkCallback-5072-thread-1) [    ] o.a.s.c.c.ZkStateReader Updated live nodes from ZooKeeper... (3) -> (4)
   [junit4]   2> 1826164 INFO  (zkCallback-5064-thread-1) [    ] o.a.s.c.c.ZkStateReader Updated live nodes from ZooKeeper... (3) -> (4)
   [junit4]   2> 1826185 INFO  (zkCallback-5089-thread-1) [    ] o.a.s.c.c.ZkStateReader Updated live nodes from ZooKeeper... (3) -> (4)
   [junit4]   2> 1826185 INFO  (zkCallback-5062-thread-2) [    ] o.a.s.c.c.ZkStateReader Updated live nodes from ZooKeeper... (3) -> (4)
   [junit4]   2> 1826185 INFO  (zkCallback-5080-thread-1) [    ] o.a.s.c.c.ZkStateReader Updated live nodes from ZooKeeper... (3) -> (4)
   [junit4]   2> 1826223 INFO  (jetty-launcher-5042-thread-3) [n:127.0.0.1:32939_solr    ] o.a.s.m.r.SolrJmxReporter JMX monitoring for 'solr_32939.solr.node' (registry 'solr.node') enabled at server: com.sun.jmx.mbeanserver.JmxMBeanServer@6e401bf2
   [junit4]   2> 1826225 INFO  (jetty-launcher-5042-thread-4) [n:127.0.0.1:39885_solr    ] o.a.s.m.r.SolrJmxReporter JMX monitoring for 'solr_39885.solr.node' (registry 'solr.node') enabled at server: com.sun.jmx.mbeanserver.JmxMBeanServer@6e401bf2
   [junit4]   2> 1826227 INFO  (jetty-launcher-5042-thread-3) [n:127.0.0.1:32939_solr    ] o.a.s.m.r.SolrJmxReporter JMX monitoring for 'solr_32939.solr.jvm' (registry 'solr.jvm') enabled at server: com.sun.jmx.mbeanserver.JmxMBeanServer@6e401bf2
   [junit4]   2> 1826227 INFO  (jetty-launcher-5042-thread-3) [n:127.0.0.1:32939_solr    ] o.a.s.m.r.SolrJmxReporter JMX monitoring for 'solr_32939.solr.jetty' (registry 'solr.jetty') enabled at server: com.sun.jmx.mbeanserver.JmxMBeanServer@6e401bf2
   [junit4]   2> 1826228 INFO  (jetty-launcher-5042-thread-3) [n:127.0.0.1:32939_solr    ] o.a.s.c.CorePropertiesLocator Found 0 core definitions underneath /home/jenkins/workspace/Lucene-Solr-7.x-Linux/solr/build/solr-core/test/J0/temp/solr.cloud.autoscaling.SearchRateTriggerTest_FFC5019095B77A82-001/tempDir-001/node3/.
   [junit4]   2> 1826231 INFO  (jetty-launcher-5042-thread-4) [n:127.0.0.1:39885_solr    ] o.a.s.m.r.SolrJmxReporter JMX monitoring for 'solr_39885.solr.jvm' (registry 'solr.jvm') enabled at server: com.sun.jmx.mbeanserver.JmxMBeanServer@6e401bf2
   [junit4]   2> 1826231 INFO  (jetty-launcher-5042-thread-4) [n:127.0.0.1:39885_solr    ] o.a.s.m.r.SolrJmxReporter JMX monitoring for 'solr_39885.solr.jetty' (registry 'solr.jetty') enabled at server: com.sun.jmx.mbeanserver.JmxMBeanServer@6e401bf2
   [junit4]   2> 1826233 INFO  (jetty-launcher-5042-thread-4) [n:127.0.0.1:39885_solr    ] o.a.s.c.CorePropertiesLocator Found 0 core definitions underneath /home/jenkins/workspace/Lucene-Solr-7.x-Linux/solr/build/solr-core/test/J0/temp/solr.cloud.autoscaling.SearchRateTriggerTest_FFC5019095B77A82-001/tempDir-001/node4/.
   [junit4]   2> 1826248 INFO  (jetty-launcher-5042-thread-2) [n:127.0.0.1:34621_solr    ] o.a.s.m.r.SolrJmxReporter JMX monitoring for 'solr_34621.solr.node' (registry 'solr.node') enabled at server: com.sun.jmx.mbeanserver.JmxMBeanServer@6e401bf2
   [junit4]   2> 1826249 INFO  (jetty-launcher-5042-thread-1) [n:127.0.0.1:40779_solr    ] o.a.s.m.r.SolrJmxReporter JMX monitoring for 'solr_40779.solr.node' (registry 'solr.node') enabled at server: com.sun.jmx.mbeanserver.JmxMBeanServer@6e401bf2
   [junit4]   2> 1826255 INFO  (jetty-launcher-5042-thread-2) [n:127.0.0.1:34621_solr    ] o.a.s.m.r.SolrJmxReporter JMX monitoring for 'solr_34621.solr.jvm' (registry 'solr.jvm') enabled at server: com.sun.jmx.mbeanserver.JmxMBeanServer@6e401bf2
   [junit4]   2> 1826255 INFO  (jetty-launcher-5042-thread-2) [n:127.0.0.1:34621_solr    ] o.a.s.m.r.SolrJmxReporter JMX monitoring for 'solr_34621.solr.jetty' (registry 'solr.jetty') enabled at server: com.sun.jmx.mbeanserver.JmxMBeanServer@6e401bf2
   [junit4]   2> 1826256 INFO  (jetty-launcher-5042-thread-1) [n:127.0.0.1:40779_solr    ] o.a.s.m.r.SolrJmxReporter JMX monitoring for 'solr_40779.solr.jvm' (registry 'solr.jvm') enabled at server: com.sun.jmx.mbeanserver.JmxMBeanServer@6e401bf2
   [junit4]   2> 1826256 INFO  (jetty-launcher-5042-thread-1) [n:127.0.0.1:40779_solr    ] o.a.s.m.r.SolrJmxReporter JMX monitoring for 'solr_40779.solr.jetty' (registry 'solr.jetty') enabled at server: com.sun.jmx.mbeanserver.JmxMBeanServer@6e401bf2
   [junit4]   2> 1826256 INFO  (zkConnectionManagerCallback-5096-thread-1) [    ] o.a.s.c.c.ConnectionManager zkClient has connected
   [junit4]   2> 1826256 INFO  (zkConnectionManagerCallback-5100-thread-1) [    ] o.a.s.c.c.ConnectionManager zkClient has connected
   [junit4]   2> 1826256 INFO  (jetty-launcher-5042-thread-2) [n:127.0.0.1:34621_solr    ] o.a.s.c.CorePropertiesLocator Found 0 core definitions underneath /home/jenkins/workspace/Lucene-Solr-7.x-Linux/solr/build/solr-core/test/J0/temp/solr.cloud.autoscaling.SearchRateTriggerTest_FFC5019095B77A82-001/tempDir-001/node2/.
   [junit4]   2> 1826257 INFO  (jetty-launcher-5042-thread-3) [n:127.0.0.1:32939_solr    ] o.a.s.c.c.ZkStateReader Updated live nodes from ZooKeeper... (0) -> (4)
   [junit4]   2> 1826257 INFO  (jetty-launcher-5042-thread-4) [n:127.0.0.1:39885_solr    ] o.a.s.c.c.ZkStateReader Updated live nodes from ZooKeeper... (0) -> (4)
   [junit4]   2> 1826257 INFO  (jetty-launcher-5042-thread-1) [n:127.0.0.1:40779_solr    ] o.a.s.c.CorePropertiesLocator Found 0 core definitions underneath /home/jenkins/workspace/Lucene-Solr-7.x-Linux/solr/build/solr-core/test/J0/temp/solr.cloud.autoscaling.SearchRateTriggerTest_FFC5019095B77A82-001/tempDir-001/node1/.
   [junit4]   2> 1826257 INFO  (jetty-launcher-5042-thread-4) [n:127.0.0.1:39885_solr    ] o.a.s.c.s.i.ZkClientClusterStateProvider Cluster at 127.0.0.1:46667/solr ready
   [junit4]   2> 1826258 INFO  (jetty-launcher-5042-thread-3) [n:127.0.0.1:32939_solr    ] o.a.s.c.s.i.ZkClientClusterStateProvider Cluster at 127.0.0.1:46667/solr ready
   [junit4]   2> 1826258 INFO  (zkConnectionManagerCallback-5105-thread-1) [    ] o.a.s.c.c.ConnectionManager zkClient has connected
   [junit4]   2> 1826259 INFO  (jetty-launcher-5042-thread-2) [n:127.0.0.1:34621_solr    ] o.a.s.c.c.ZkStateReader Updated live nodes from ZooKeeper... (0) -> (4)
   [junit4]   2> 1826259 INFO  (jetty-launcher-5042-thread-2) [n:127.0.0.1:34621_solr    ] o.a.s.c.s.i.ZkClientClusterStateProvider Cluster at 127.0.0.1:46667/solr ready
   [junit4]   2> 1826373 INFO  (zkConnectionManagerCallback-5107-thread-1) [    ] o.a.s.c.c.ConnectionManager zkClient has connected
   [junit4]   2> 1826375 INFO  (zkConnectionManagerCallback-5112-thread-1) [    ] o.a.s.c.c.ConnectionManager zkClient has connected
   [junit4]   2> 1826375 INFO  (SUITE-SearchRateTriggerTest-seed#[FFC5019095B77A82]-worker) [    ] o.a.s.c.c.ZkStateReader Updated live nodes from ZooKeeper... (0) -> (4)
   [junit4]   2> 1826375 INFO  (SUITE-SearchRateTriggerTest-seed#[FFC5019095B77A82]-worker) [    ] o.a.s.c.s.i.ZkClientClusterStateProvider Cluster at 127.0.0.1:46667/solr ready
   [junit4]   2> 1826408 INFO  (TEST-SearchRateTriggerTest.testTrigger-seed#[FFC5019095B77A82]) [    ] o.a.s.SolrTestCaseJ4 ###Starting testTrigger
   [junit4]   2> 1826408 INFO  (TEST-SearchRateTriggerTest.testTrigger-seed#[FFC5019095B77A82]) [    ] o.a.s.c.c.ZkStateReader Updated live nodes from ZooKeeper... (0) -> (4)
   [junit4]   2> 1826419 INFO  (qtp1215692603-22025) [n:127.0.0.1:32939_solr    ] o.a.s.h.a.CollectionsHandler Invoked Collection Action :create with params replicationFactor=2&collection.configName=conf&maxShardsPerNode=1&name=SearchRateTriggerTest-collection1&nrtReplicas=2&action=CREATE&numShards=2&wt=javabin&version=2 and sendToOCPQueue=true
   [junit4]   2> 1826420 INFO  (OverseerThreadFactory-7222-thread-1) [    ] o.a.s.c.a.c.CreateCollectionCmd Create collection SearchRateTriggerTest-collection1
   [junit4]   2> 1826524 INFO  (OverseerStateUpdate-72076360313602055-127.0.0.1:40779_solr-n_0000000000) [    ] o.a.s.c.o.SliceMutator createReplica() {
   [junit4]   2>   "operation":"ADDREPLICA",
   [junit4]   2>   "collection":"SearchRateTriggerTest-collection1",
   [junit4]   2>   "shard":"shard1",
   [junit4]   2>   "core":"SearchRateTriggerTest-collection1_shard1_replica_n1",
   [junit4]   2>   "state":"down",
   [junit4]   2>   "base_url":"https://127.0.0.1:39885/solr",
   [junit4]   2>   "type":"NRT",
   [junit4]   2>   "waitForFinalState":"false"} 
   [junit4]   2> 1826525 INFO  (OverseerStateUpdate-72076360313602055-127.0.0.1:40779_solr-n_0000000000) [    ] o.a.s.c.o.SliceMutator createReplica() {
   [junit4]   2>   "operation":"ADDREPLICA",
   [junit4]   2>   "collection":"SearchRateTriggerTest-collection1",
   [junit4]   2>   "shard":"shard1",
   [junit4]   2>   "core":"SearchRateTriggerTest-collection1_shard1_replica_n2",
   [junit4]   2>   "state":"down",
   [junit4]   2>   "base_url":"https://127.0.0.1:34621/solr",
   [junit4]   2>   "type":"NRT",
   [junit4]   2>   "waitForFinalState":"false"} 
   [junit4]   2> 1826525 INFO  (OverseerStateUpdate-72076360313602055-127.0.0.1:40779_solr-n_0000000000) [    ] o.a.s.c.o.SliceMutator createReplica() {
   [junit4]   2>   "operation":"ADDREPLICA",
   [junit4]   2>   "collection":"SearchRateTriggerTest-collection1",
   [junit4]   2>   "shard":"shard2",
   [junit4]   2>   "core":"SearchRateTriggerTest-collection1_shard2_replica_n4",
   [junit4]   2>   "state":"down",
   [junit4]   2>   "base_url":"https://127.0.0.1:40779/solr",
   [junit4]   2>   "type":"NRT",
   [junit4]   2>   "waitForFinalState":"false"} 
   [junit4]   2> 1826526 INFO  (OverseerStateUpdate-72076360313602055-127.0.0.1:40779_solr-n_0000000000) [    ] o.a.s.c.o.SliceMutator createReplica() {
   [junit4]   2>   "operation":"ADDREPLICA",
   [junit4]   2>   "collection":"SearchRateTriggerTest-collection1",
   [junit4]   2>   "shard":"shard2",
   [junit4]   2>   "core":"SearchRateTriggerTest-collection1_shard2_replica_n6",
   [junit4]   2>   "state":"down",
   [junit4]   2>   "base_url":"https://127.0.0.1:32939/solr",
   [junit4]   2>   "type":"NRT",
   [junit4]   2>   "waitForFinalState":"false"} 
   [junit4]   2> 1826730 INFO  (qtp1215692603-22027) [n:127.0.0.1:32939_solr    x:SearchRateTriggerTest-collection1_shard2_replica_n6] o.a.s.h.a.CoreAdminOperation core create command qt=/admin/cores&coreNodeName=core_node8&collection.configName=conf&newCollection=true&name=SearchRateTriggerTest-collection1_shard2_replica_n6&action=CREATE&numShards=2&collection=SearchRateTriggerTest-collection1&shard=shard2&wt=javabin&version=2&replicaType=NRT
   [junit4]   2> 1826741 INFO  (qtp347588747-22009) [n:127.0.0.1:40779_solr    x:SearchRateTriggerTest-collection1_shard2_replica_n4] o.a.s.h.a.CoreAdminOperation core create command qt=/admin/cores&coreNodeName=core_node7&collection.configName=conf&newCollection=true&name=SearchRateTriggerTest-collection1_shard2_replica_n4&action=CREATE&numShards=2&collection=SearchRateTriggerTest-collection1&shard=shard2&wt=javabin&version=2&replicaType=NRT
   [junit4]   2> 1826741 INFO  (qtp2065065825-22012) [n:127.0.0.1:34621_solr    x:SearchRateTriggerTest-collection1_shard1_replica_n2] o.a.s.h.a.CoreAdminOperation core create command qt=/admin/cores&coreNodeName=core_node5&collection.configName=conf&newCollection=true&name=SearchRateTriggerTest-collection1_shard1_replica_n2&action=CREATE&numShards=2&collection=SearchRateTriggerTest-collection1&shard=shard1&wt=javabin&version=2&replicaType=NRT
   [junit4]   2> 1826741 INFO  (qtp160556686-22028) [n:127.0.0.1:39885_solr    x:SearchRateTriggerTest-collection1_shard1_replica_n1] o.a.s.h.a.CoreAdminOperation core create command qt=/admin/cores&coreNodeName=core_node3&collection.configName=conf&newCollection=true&name=SearchRateTriggerTest-collection1_shard1_replica_n1&action=CREATE&numShards=2&collection=SearchRateTriggerTest-collection1&shard=shard1&wt=javabin&version=2&replicaType=NRT
   [junit4]   2> 1826741 INFO  (qtp2065065825-22012) [n:127.0.0.1:34621_solr    x:SearchRateTriggerTest-collection1_shard1_replica_n2] o.a.s.c.TransientSolrCoreCacheDefault Allocating transient cache for 2147483647 transient cores
   [junit4]   2> 1826741 INFO  (qtp160556686-22028) [n:127.0.0.1:39885_solr    x:SearchRateTriggerTest-collection1_shard1_replica_n1] o.a.s.c.TransientSolrCoreCacheDefault Allocating transient cache for 2147483647 transient cores
   [junit4]   2> 1827748 INFO  (qtp1215692603-22027) [n:127.0.0.1:32939_solr c:SearchRateTriggerTest-collection1 s:shard2 r:core_node8 x:SearchRateTriggerTest-collection1_shard2_replica_n6] o.a.s.c.SolrConfig Using Lucene MatchVersion: 7.4.0
   [junit4]   2> 1827748 INFO  (qtp160556686-22028) [n:127.0.0.1:39885_solr c:SearchRateTriggerTest-collection1 s:shard1 r:core_node3 x:SearchRateTriggerTest-collection1_shard1_replica_n1] o.a.s.c.SolrConfig Using Lucene MatchVersion: 7.4.0
   [junit4]   2> 1827752 INFO  (qtp347588747-22009) [n:127.0.0.1:40779_solr c:SearchRateTriggerTest-collection1 s:shard2 r:core_node7 x:SearchRateTriggerTest-collection1_shard2_replica_n4] o.a.s.c.SolrConfig Using Lucene MatchVersion: 7.4.0
   [junit4]   2> 1827769 INFO  (qtp160556686-22028) [n:127.0.0.1:39885_solr c:SearchRateTriggerTest-collection1 s:shard1 r:core_node3 x:SearchRateTriggerTest-collection1_shard1_replica_n1] o.a.s.s.IndexSchema [SearchRateTriggerTest-collection1_shard1_replica_n1] Schema name=minimal
   [junit4]   2> 1827769 INFO  (qtp1215692603-22027) [n:127.0.0.1:32939_solr c:SearchRateTriggerTest-collection1 s:shard2 r:core_node8 x:SearchRateTriggerTest-collection1_shard2_replica_n6] o.a.s.s.IndexSchema [SearchRateTriggerTest-collection1_shard2_replica_n6] Schema name=minimal
   [junit4]   2> 1827771 INFO  (qtp1215692603-22027) [n:127.0.0.1:32939_solr c:SearchRateTriggerTest-collection1 s:shard2 r:core_node8 x:SearchRateTriggerTest-collection1_shard2_replica_n6] o.a.s.s.IndexSchema Loaded schema minimal/1.1 with uniqueid field id
   [junit4]   2> 1827771 INFO  (qtp160556686-22028) [n:127.0.0.1:39885_solr c:SearchRateTriggerTest-collection1 s:shard1 r:core_node3 x:SearchRateTriggerTest-collection1_shard1_replica_n1] o.a.s.s.IndexSchema Loaded schema minimal/1.1 with uniqueid field id
   [junit4]   2> 1827771 INFO  (qtp1215692603-22027) [n:127.0.0.1:32939_solr c:SearchRateTriggerTest-collection1 s:shard2 r:core_node8 x:SearchRateTriggerTest-collection1_shard2_replica_n6] o.a.s.c.CoreContainer Creating SolrCore 'SearchRateTriggerTest-collection1_shard2_replica_n6' using configuration from collection SearchRateTriggerTest-collection1, trusted=true
   [junit4]   2> 1827771 INFO  (qtp160556686-22028) [n:127.0.0.1:39885_solr c:SearchRateTriggerTest-collection1 s:shard1 r:core_node3 x:SearchRateTriggerTest-collection1_shard1_replica_n1] o.a.s.c.CoreContainer Creating SolrCore 'SearchRateTriggerTest-collection1_shard1_replica_n1' using configuration from collection SearchRateTriggerTest-collection1, trusted=true
   [junit4]   2> 1827772 INFO  (qtp2065065825-22012) [n:127.0.0.1:34621_solr c:SearchRateTriggerTest-collection1 s:shard1 r:core_node5 x:SearchRateTriggerTest-collection1_shard1_replica_n2] o.a.s.c.SolrConfig Using Lucene MatchVersion: 7.4.0
   [junit4]   2> 1827772 INFO  (qtp1215692603-22027) [n:127.0.0.1:32939_solr c:SearchRateTriggerTest-collection1 s:shard2 r:core_node8 x:SearchRateTriggerTest-collection1_shard2_replica_n6] o.a.s.m.r.SolrJmxReporter JMX monitoring for 'solr_32939.solr.core.SearchRateTriggerTest-collection1.shard2.replica_n6' (registry 'solr.core.SearchRateTriggerTest-collection1.shard2.replica_n6') enabled at server: com.sun.jmx.mbeanserver.JmxMBeanServer@6e401bf2
   [junit4]   2> 1827772 INFO  (qtp160556686-22028) [n:127.0.0.1:39885_solr c:SearchRateTriggerTest-collection1 s:shard1 r:core_node3 x:SearchRateTriggerTest-collection1_shard1_replica_n1] o.a.s.m.r.SolrJmxReporter JMX monitoring for 'solr_39885.solr.core.SearchRateTriggerTest-collection1.shard1.replica_n1' (registry 'solr.core.SearchRateTriggerTest-collection1.shard1.replica_n1') enabled at server: com.sun.jmx.mbeanserver.JmxMBeanServer@6e401bf2
   [junit4]   2> 1827772 INFO  (qtp1215692603-22027) [n:127.0.0.1:32939_solr c:SearchRateTriggerTest-collection1 s:shard2 r:core_node8 x:SearchRateTriggerTest-collection1_shard2_replica_n6] o.a.s.c.SolrCore solr.RecoveryStrategy.Builder
   [junit4]   2> 1827772 INFO  (qtp160556686-22028) [n:127.0.0.1:39885_solr c:SearchRateTriggerTest-collection1 s:shard1 r:core_node3 x:SearchRateTriggerTest-collection1_shard1_replica_n1] o.a.s.c.SolrCore solr.RecoveryStrategy.Builder
   [junit4]   2> 1827772 INFO  (qtp1215692603-22027) [n:127.0.0.1:32939_solr c:SearchRateTriggerTest-collection1 s:shard2 r:core_node8 x:SearchRateTriggerTest-collection1_shard2_replica_n6] o.a.s.c.SolrCore [[SearchRateTriggerTest-collection1_shard2_replica_n6] ] Opening new SolrCore at [/home/jenkins/workspace/Lucene-Solr-7.x-Linux/solr/build/solr-core/test/J0/temp/solr.cloud.autoscaling.SearchRateTriggerTest_FFC5019095B77A82-001/tempDir-001/node3/SearchRateTriggerTest-collection1_shard2_replica_n6], dataDir=[/home/jenkins/workspace/Lucene-Solr-7.x-Linux/solr/build/solr-core/test/J0/temp/solr.cloud.autoscaling.SearchRateTriggerTest_FFC5019095B77A82-001/tempDir-001/node3/./SearchRateTriggerTest-collection1_shard2_replica_n6/data/]
   [junit4]   2> 1827772 INFO  (qtp160556686-22028) [n:127.0.0.1:39885_solr c:SearchRateTriggerTest-collection1 s:shard1 r:core_node3 x:SearchRateTriggerTest-collection1_shard1_replica_n1] o.a.s.c.SolrCore [[SearchRateTriggerTest-collection1_shard1_replica_n1] ] Opening new SolrCore at [/home/jenkins/workspace/Lucene-Solr-7.x-Linux/solr/build/solr-core/test/J0/temp/solr.cloud.autoscaling.SearchRateTriggerTest_FFC5019095B77A82-001/tempDir-001/node4/SearchRateTriggerTest-collection1_shard1_replica_n1], dataDir=[/home/jenkins/workspace/Lucene-Solr-7.x-Linux/solr/build/solr-core/test/J0/temp/solr.cloud.autoscaling.SearchRateTriggerTest_FFC5019095B77A82-001/tempDir-001/node4/./SearchRateTriggerTest-collection1_shard1_replica_n1/data/]
   [junit4]   2> 1827773 INFO  (qtp347588747-22009) [n:127.0.0.1:40779_solr c:SearchRateTriggerTest-collection1 s:shard2 r:core_node7 x:SearchRateTriggerTest-collection1_shard2_replica_n4] o.a.s.s.IndexSchema [SearchRateTriggerTest-collection1_shard2_replica_n4] Schema name=minimal
   [junit4]   2> 1827775 INFO  (qtp347588747-22009) [n:127.0.0.1:40779_solr c:SearchRateTriggerTest-collection1 s:shard2 r:core_node7 x:SearchRateTriggerTest-collection1_shard2_replica_n4] o.a.s.s.IndexSchema Loaded schema minimal/1.1 with uniqueid field id
   [junit4]   2> 1827775 INFO  (qtp347588747-22009) [n:127.0.0.1:40779_solr c:SearchRateTriggerTest-collection1 s:shard2 r:core_node7 x:SearchRateTriggerTest-collection1_shard2_replica_n4] o.a.s.c.CoreContainer Creating SolrCore 'SearchRateTriggerTest-collection1_shard2_replica_n4' using configuration from collection SearchRateTriggerTest-collection1, trusted=true
   [junit4]   2> 1827775 INFO  (qtp347588747-22009) [n:127.0.0.1:40779_solr c:SearchRateTriggerTest-collection1 s:shard2 r:core_node7 x:SearchRateTriggerTest-collection1_shard2_replica_n4] o.a.s.m.r.SolrJmxReporter JMX monitoring for 'solr_40779.solr.core.SearchRateTriggerTest-collection1.shard2.replica_n4' (registry 'solr.core.SearchRateTriggerTest-collection1.shard2.replica_n4') enabled at server: com.sun.jmx.mbeanserver.JmxMBeanServer@6e401bf2
   [junit4]   2> 1827775 INFO  (qtp347588747-22009) [n:127.0.0.1:40779_solr c:SearchRateTriggerTest-collection1 s:shard2 r:core_node7 x:SearchRateTriggerTest-collection1_shard2_replica_n4] o.a.s.c.SolrCore solr.RecoveryStrategy.Builder
   [junit4]   2> 1827775 INFO  (qtp347588747-22009) [n:127.0.0.1:40779_solr c:SearchRateTriggerTest-collection1 s:shard2 r:core_node7 x:SearchRateTriggerTest-collection1_shard2_replica_n4] o.a.s.c.SolrCore [[SearchRateTriggerTest-collection1_shard2_replica_n4] ] Opening new SolrCore at [/home/jenkins/workspace/Lucene-Solr-7.x-Linux/solr/build/solr-core/test/J0/temp/solr.cloud.autoscaling.SearchRateTriggerTest_FFC5019095B77A82-001/tempDir-001/node1/SearchRateTriggerTest-collection1_shard2_replica_n4], dataDir=[/home/jenkins/workspace/Lucene-Solr-7.x-Linux/solr/build/solr-core/test/J0/temp/solr.cloud.autoscaling.SearchRateTriggerTest_FFC5019095B77A82-001/tempDir-001/node1/./SearchRateTriggerTest-collection1_shard2_replica_n4/data/]
   [junit4]   2> 1827778 INFO  (qtp2065065825-22012) [n:127.0.0.1:34621_solr c:SearchRateTriggerTest-collection1 s:shard1 r:core_node5 x:SearchRateTriggerTest-collection1_shard1_replica_n2] o.a.s.s.IndexSchema [SearchRateTriggerTest-collection1_shard1_replica_n2] Schema name=minimal
   [junit4]   2> 1827780 INFO  (qtp2065065825-22012) [n:127.0.0.1:34621_solr c:SearchRateTriggerTest-collection1 s:shard1 r:core_node5 x:SearchRateTriggerTest-collection1_shard1_replica_n2] o.a.s.s.IndexSchema Loaded schema minimal/1.1 with uniqueid field id
   [junit4]   2> 1827780 INFO  (qtp2065065825-22012) [n:127.0.0.1:34621_solr c:SearchRateTriggerTest-collection1 s:shard1 r:core_node5 x:SearchRateTriggerTest-collection1_shard1_replica_n2] o.a.s.c.CoreContainer Creating SolrCore 'SearchRateTriggerTest-collection1_shard1_replica_n2' using configuration from collection SearchRateTriggerTest-collection1, trusted=true
   [junit4]   2> 1827781 INFO  (qtp2065065825-22012) [n:127.0.0.1:34621_solr c:SearchRateTriggerTest-collection1 s:shard1 r:core_node5 x:SearchRateTriggerTest-collection1_shard1_replica_n2] o.a.s.m.r.SolrJmxReporter JMX monitoring for 'solr_34621.solr.core.SearchRateTriggerTest-collection1.shard1.replica_n2' (registry 'solr.core.SearchRateTriggerTest-collection1.shard1.replica_n2') enabled at server: com.sun.jmx.mbeanserver.JmxMBeanServer@6e401bf2
   [junit4]   2> 1827781 INFO  (qtp2065065825-22012) [n:127.0.0.1:34621_solr c:SearchRateTriggerTest-collection1 s:shard1 r:core_node5 x:SearchRateTriggerTest-collection1_shard1_replica_n2] o.a.s.c.SolrCore solr.RecoveryStrategy.Builder
   [junit4]   2> 1827781 INFO  (qtp2065065825-22012) [n:127.0.0.1:34621_solr c:SearchRateTriggerTest-collection1 s:shard1 r:core_node5 x:SearchRateTriggerTest-collection1_shard1_replica_n2] o.a.s.c.SolrCore [[SearchRateTriggerTest-collection1_shard1_replica_n2] ] Opening new SolrCore at [/home/jenkins/workspace/Lucene-Solr-7.x-Linux/solr/build/solr-core/test/J0/temp/solr.cloud.autoscaling.SearchRateTriggerTest_FFC5019095B77A82-001/tempDir-001/node2/SearchRateTriggerTest-collection1_shard1_replica_n2], dataDir=[/home/jenkins/workspace/Lucene-Solr-7.x-Linux/solr/build/solr-core/test/J0/temp/solr.cloud.autoscaling.SearchRateTriggerTest_FFC5019095B77A82-001/tempDir-001/node2/./SearchRateTriggerTest-collection1_shard1_replica_n2/data/]
   [junit4]   2> 1827820 INFO  (qtp1215692603-22027) [n:127.0.0.1:32939_solr c:SearchRateTriggerTest-collection1 s:shard2 r:core_node8 x:SearchRateTriggerTest-collection1_shard2_replica_n6] o.a.s.u.UpdateHandler Using UpdateLog implementation: org.apache.solr.update.UpdateLog
   [junit4]   2> 1827820 INFO  (qtp160556686-22028) [n:127.0.0.1:39885_solr c:SearchRateTriggerTest-collection1 s:shard1 r:core_node3 x:SearchRateTriggerTest-collection1_shard1_replica_n1] o.a.s.u.UpdateHandler Using UpdateLog implementation: org.apache.solr.update.UpdateLog
   [junit4]   2> 1827821 INFO  (qtp1215692603-22027) [n:127.0.0.1:32939_solr c:SearchRateTriggerTest-collection1 s:shard2 r:core_node8 x:SearchRateTriggerTest-collection1_shard2_replica_n6] o.a.s.u.UpdateLog Initializing UpdateLog: dataDir=null defaultSyncLevel=FLUSH numRecordsToKeep=100 maxNumLogsToKeep=10 numVersionBuckets=65536
   [junit4]   2> 1827821 INFO  (qtp160556686-22028) [n:127.0.0.1:39885_solr c:SearchRateTriggerTest-collection1 s:shard1 r:core_node3 x:SearchRateTriggerTest-collection1_shard1_replica_n1] o.a.s.u.UpdateLog Initializing UpdateLog: dataDir=null defaultSyncLevel=FLUSH numRecordsToKeep=100 maxNumLogsToKeep=10 numVersionBuckets=65536
   [junit4]   2> 1827822 INFO  (qtp1215692603-22027) [n:127.0.0.1:32939_solr c:SearchRateTriggerTest-collection1 s:shard2 r:core_node8 x:SearchRateTriggerTest-collection1_shard2_replica_n6] o.a.s.u.CommitTracker Hard AutoCommit: disabled
   [junit4]   2> 1827822 INFO  (qtp1215692603-22027) [n:127.0.0.1:32939_solr c:SearchRateTriggerTest-collection1 s:shard2 r:core_node8 x:SearchRateTriggerTest-collection1_shard2_replica_n6] o.a.s.u.CommitTracker Soft AutoCommit: disabled
   [junit4]   2> 1827822 INFO  (qtp160556686-22028) [n:127.0.0.1:39885_solr c:SearchRateTriggerTest-collection1 s:shard1 r:core_node3 x:SearchRateTriggerTest-collection1_shard1_replica_n1] o.a.s.u.CommitTracker Hard AutoCommit: disabled
   [junit4]   2> 1827822 INFO  (qtp160556686-22028) [n:127.0.0.1:39885_solr c:SearchRateTriggerTest-collection1 s:shard1 r:core_node3 x:SearchRateTriggerTest-collection1_shard1_replica_n1] o.a.s.u.CommitTracker Soft AutoCommit: disabled
   [junit4]   2> 1827823 INFO  (qtp160556686-22028) [n:127.0.0.1:39885_solr c:SearchRateTriggerTest-collection1 s:shard1 r:core_node3 x:SearchRateTriggerTest-collection1_shard1_replica_n1] o.a.s.s.SolrIndexSearcher Opening [Searcher@10a34462[SearchRateTriggerTest-collection1_shard1_replica_n1] main]
   [junit4]   2> 1827823 INFO  (qtp1215692603-22027) [n:127.0.0.1:32939_solr c:SearchRateTriggerTest-collection1 s:shard2 r:core_node8 x:SearchRateTriggerTest-collection1_shard2_replica_n6] o.a.s.s.SolrIndexSearcher Opening [Searcher@48400069[SearchRateTriggerTest-collection1_shard2_replica_n6] main]
   [junit4]   2> 1827824 INFO  (qtp160556686-22028) [n:127.0.0.1:39885_solr c:SearchRateTriggerTest-collection1 s:shard1 r:core_node3 x:SearchRateTriggerTest-collection1_shard1_replica_n1] o.a.s.r.ManagedResourceStorage Configured ZooKeeperStorageIO with znodeBase: /configs/conf
   [junit4]   2> 1827824 INFO  (qtp1215692603-22027) [n:127.0.0.1:32939_solr c:SearchRateTriggerTest-collection1 s:shard2 r:core_node8 x:SearchRateTriggerTest-collection1_shard2_replica_n6] o.a.s.r.ManagedResourceStorage Configured ZooKeeperStorageIO with znodeBase: /configs/conf
   [junit4]   2> 1827824 INFO  (qtp160556686-22028) [n:127.0.0.1:39885_solr c:SearchRateTriggerTest-collection1 s:shard1 r:core_node3 x:SearchRateTriggerTest-collection1_shard1_replica_n1] o.a.s.r.ManagedResourceStorage Loaded null at path _rest_managed.json using ZooKeeperStorageIO:path=/configs/conf
   [junit4]   2> 1827824 INFO  (qtp1215692603-22027) [n:127.0.0.1:32939_solr c:SearchRateTriggerTest-collection1 s:shard2 r:core_node8 x:SearchRateTriggerTest-collection1_shard2_replica_n6] o.a.s.r.ManagedResourceStorage Loaded null at path _rest_managed.json using ZooKeeperStorageIO:path=/configs/conf
   [junit4]   2> 1827825 INFO  (qtp160556686-22028) [n:127.0.0.1:39885_solr c:SearchRateTriggerTest-collection1 s:shard1 r:core_node3 x:SearchRateTriggerTest-collection1_shard1_replica_n1] o.a.s.h.ReplicationHandler Commits will be reserved for 10000ms.
   [junit4]   2> 1827825 INFO  (qtp1215692603-22027) [n:127.0.0.1:32939_solr c:SearchRateTriggerTest-collection1 s:shard2 r:core_node8 x:SearchRateTriggerTest-collection1_shard2_replica_n6] o.a.s.h.ReplicationHandler Commits will be reserved for 10000ms.
   [junit4]   2> 1827825 INFO  (qtp160556686-22028) [n:127.0.0.1:39885_solr c:SearchRateTriggerTest-collection1 s:shard1 r:core_node3 x:SearchRateTriggerTest-collection1_shard1_replica_n1] o.a.s.u.UpdateLog Could not find max version in index or recent updates, using new clock 1601285905031626752
   [junit4]   2> 1827825 INFO  (searcherExecutor-7231-thread-1-processing-n:127.0.0.1:32939_solr x:SearchRateTriggerTest-collection1_shard2_replica_n6 c:SearchRateTriggerTest-collection1 s:shard2 r:core_node8) [n:127.0.0.1:32939_solr c:SearchRateTriggerTest-collection1 s:shard2 r:core_node8 x:SearchRateTriggerTest-collection1_shard2_replica_n6] o.a.s.c.SolrCore [SearchRateTriggerTest-collection1_shard2_replica_n6] Registered new searcher Searcher@48400069[SearchRateTriggerTest-collection1_shard2_replica_n6] main{ExitableDirectoryReader(UninvertingDirectoryReader())}
   [junit4]   2> 1827825 INFO  (qtp1215692603-22027) [n:127.0.0.1:32939_solr c:SearchRateTriggerTest-collection1 s:shard2 r:core_node8 x:SearchRateTriggerTest-collection1_shard2_replica_n6] o.a.s.u.UpdateLog Could not find max version in index or recent updates, using new clock 1601285905031626752
   [junit4]   2> 1827826 INFO  (searcherExecutor-7232-thread-1-processing-n:127.0.0.1:39885_solr x:SearchRateTriggerTest-collection1_shard1_replica_n1 c:SearchRateTriggerTest-collection1 s:shard1 r:core_node3) [n:127.0.0.1:39885_solr c:SearchRateTriggerTest-collection1 s:shard1 r:core_node3 x:SearchRateTriggerTest-collection1_shard1_replica_n1] o.a.s.c.SolrCore [SearchRateTriggerTest-collection1_shard1_replica_n1] Registered new searcher Searcher@10a34462[SearchRateTriggerTest-collection1_shard1_replica_n1] main{ExitableDirectoryReader(UninvertingDirectoryReader())}
   [junit4]   2> 1827829 INFO  (qtp347588747-22009) [n:127.0.0.1:40779_solr c:SearchRateTriggerTest-collection1 s:shard2 r:core_node7 x:SearchRateTriggerTest-collection1_shard2_replica_n4] o.a.s.u.UpdateHandler Using UpdateLog implementation: org.apache.solr.update.UpdateLog
   [junit4]   2> 1827829 INFO  (qtp347588747-22009) [n:127.0.0.1:40779_solr c:SearchRateTriggerTest-collection1 s:shard2 r:core_node7 x:SearchRateTriggerTest-collection1_shard2_replica_n4] o.a.s.u.UpdateLog Initializing UpdateLog: dataDir=null defaultSyncLevel=FLUSH numRecordsToKeep=100 maxNumLogsToKeep=10 numVersionBuckets=65536
   [junit4]   2> 1827830 INFO  (qtp347588747-22009) [n:127.0.0.1:40779_solr c:SearchRateTriggerTest-collection1 s:shard2 r:core_node7 x:SearchRateTriggerTest-collection1_shard2_replica_n4] o.a.s.u.CommitTracker Hard AutoCommit: disabled
   [junit4]   2> 1827830 INFO  (qtp347588747-22009) [n:127.0.0.1:40779_solr c:SearchRateTriggerTest-collection1 s:shard2 r:core_node7 x:SearchRateTriggerTest-collection1_shard2_replica_n4] o.a.s.u.CommitTracker Soft AutoCommit: disabled
   [junit4]   2> 1827831 INFO  (qtp1215692603-22027) [n:127.0.0.1:32939_solr c:SearchRateTriggerTest-collection1 s:shard2 r:core_node8 x:SearchRateTriggerTest-collection1_shard2_replica_n6] o.a.s.c.ZkShardTerms Successful update of terms at /collections/SearchRateTriggerTest-collection1/terms/shard2 to Terms{values={core_node8=0}, version=0}
   [junit4]   2> 1827831 INFO  (qtp347588747-22009) [n:127.0.0.1:40779_solr c:SearchRateTriggerTest-collection1 s:shard2 r:core_node7 x:SearchRateTriggerTest-collection1_shard2_replica_n4] o.a.s.s.SolrIndexSearcher Opening [Searcher@5dfcd3e7[SearchRateTriggerTest-collection1_shard2_replica_n4] main]
   [junit4]   2> 1827831 INFO  (qtp160556686-22028) [n:127.0.0.1:39885_solr c:SearchRateTriggerTest-collection1 s:shard1 r:core_node3 x:SearchRateTriggerTest-collection1_shard1_replica_n1] o.a.s.c.ZkShardTerms Successful update of terms at /collections/SearchRateTriggerTest-collection1/terms/shard1 to Terms{values={core_node3=0}, version=0}
   [junit4]   2> 1827832 INFO  (qtp347588747-22009) [n:127.0.0.1:40779_solr c:SearchRateTriggerTest-collection1 s:shard2 r:core_node7 x:SearchRateTriggerTest-collection1_shard2_replica_n4] o.a.s.r.ManagedResourceStorage Configured ZooKeeperStorageIO with znodeBase: /configs/conf
   [junit4]   2> 1827832 INFO  (qtp347588747-22009) [n:127.0.0.1:40779_solr c:SearchRateTriggerTest-collection1 s:shard2 r:core_node7 x:SearchRateTriggerTest-collection1_shard2_replica_n4] o.a.s.r.ManagedResourceStorage Loaded null at path _rest_managed.json using ZooKeeperStorageIO:path=/configs/conf
   [junit4]   2> 1827833 INFO  (qtp347588747-22009) [n:127.0.0.1:40779_solr c:SearchRateTriggerTest-collection1 s:shard2 r:core_node7 x:SearchRateTriggerTest-collection1_shard2_replica_n4] o.a.s.h.ReplicationHandler Commits will be reserved for 10000ms.
   [junit4]   2> 1827833 INFO  (qtp2065065825-22012) [n:127.0.0.1:34621_solr c:SearchRateTriggerTest-collection1 s:shard1 r:core_node5 x:SearchRateTriggerTest-collection1_shard1_replica_n2] o.a.s.u.UpdateHandler Using UpdateLog implementation: org.apache.solr.update.UpdateLog
   [junit4]   2> 1827833 INFO  (qtp2065065825-22012) [n:127.0.0.1:34621_solr c:SearchRateTriggerTest-collection1 s:shard1 r:core_node5 x:SearchRateTriggerTest-collection1_shard1_replica_n2] o.a.s.u.UpdateLog Initializing UpdateLog: dataDir=null defaultSyncLevel=FLUSH numRecordsToKeep=100 maxNumLogsToKeep=10 numVersionBuckets=65536
   [junit4]   2> 1827833 INFO  (searcherExecutor-7233-thread-1-processing-n:127.0.0.1:40779_solr x:SearchRateTriggerTest-collection1_shard2_replica_n4 c:SearchRateTriggerTest-collection1 s:shard2 r:core_node7) [n:127.0.0.1:40779_solr c:SearchRateTriggerTest-collection1 s:shard2 r:core_node7 x:SearchRateTriggerTest-collection1_shard2_replica_n4] o.a.s.c.SolrCore [SearchRateTriggerTest-collection1_shard2_replica_n4] Registered new searcher Searcher@5dfcd3e7[SearchRateTriggerTest-collection1_shard2_replica_n4] main{ExitableDirectoryReader(UninvertingDirectoryReader())}
   [junit4]   2> 1827834 INFO  (qtp347588747-22009) [n:127.0.0.1:40779_solr c:SearchRateTriggerTest-collection1 s:shard2 r:core_node7 x:SearchRateTriggerTest-collection1_shard2_replica_n4] o.a.s.u.UpdateLog Could not find max version in index or recent updates, using new clock 1601285905041063936
   [junit4]   2> 1827834 INFO  (qtp2065065825-22012) [n:127.0.0.1:34621_solr c:SearchRateTriggerTest-collection1 s:shard1 r:core_node5 x:SearchRateTriggerTest-collection1_shard1_replica_n2] o.a.s.u.CommitTracker Hard AutoCommit: disabled
   [junit4]   2> 1827834 INFO  (qtp2065065825-22012) [n:127.0.0.1:34621_solr c:SearchRateTriggerTest-collection1 s:shard1 r:core_node5 x:SearchRateTriggerTest-collection1_shard1_replica_n2] o.a.s.u.CommitTracker Soft AutoCommit: disabled
   [junit4]   2> 1827834 INFO  (qtp1215692603-22027) [n:127.0.0.1:32939_solr c:SearchRateTriggerTest-collection1 s:shard2 r:core_node8 x:SearchRateTriggerTest-collection1_shard2_replica_n6] o.a.s.c.ShardLeaderElectionContext Waiting until we see more replicas up for shard shard2: total=2 found=1 timeoutin=9999ms
   [junit4]   2> 1827834 INFO  (qtp160556686-22028) [n:127.0.0.1:39885_solr c:SearchRateTriggerTest-collection1 s:shard1 r:core_node3 x:SearchRateTriggerTest-collection1_shard1_replica_n1] o.a.s.c.ShardLeaderElectionContext Waiting until we see more replicas up for shard shard1: total=2 found=1 timeoutin=9999ms
   [junit4]   2> 1827835 INFO  (qtp2065065825-22012) [n:127.0.0.1:34621_solr c:SearchRateTriggerTest-collection1 s:shard1 r:core_node5 x:SearchRateTriggerTest-collection1_shard1_replica_n2] o.a.s.s.SolrIndexSearcher Opening [Searcher@1b96e6f0[SearchRateTriggerTest-collection1_shard1_replica_n2] main]
   [junit4]   2> 1827836 INFO  (qtp2065065825-22012) [n:127.0.0.1:34621_solr c:SearchRateTriggerTest-collection1 s:shard1 r:core_node5 x:SearchRateTriggerTest-collection1_shard1_replica_n2] o.a.s.r.ManagedResourceStorage Configured ZooKeeperStorageIO with znodeBase: /configs/conf
   [junit4]   2> 1827836 INFO  (qtp2065065825-22012) [n:127.0.0.1:34621_solr c:SearchRateTriggerTest-collection1 s:shard1 r:core_node5 x:SearchRateTriggerTest-collection1_shard1_replica_n2] o.a.s.r.ManagedResourceStorage Loaded null at path _rest_managed.json using ZooKeeperStorageIO:path=/configs/conf
   [junit4]   2> 1827836 INFO  (qtp347588747-22009) [n:127.0.0.1:40779_solr c:SearchRateTriggerTest-collection1 s:shard2 r:core_node7 x:SearchRateTriggerTest-collection1_shard2_replica_n4] o.a.s.c.ZkShardTerms Successful update of terms at /collections/SearchRateTriggerTest-collection1/terms/shard2 to Terms{values={core_node7=0, core_node8=0}, version=1}
   [junit4]   2> 1827836 INFO  (qtp2065065825-22012) [n:127.0.0.1:34621_solr c:SearchRateTriggerTest-collection1 s:shard1 r:core_node5 x:SearchRateTriggerTest-collection1_shard1_replica_n2] o.a.s.h.ReplicationHandler Commits will be reserved for 10000ms.
   [junit4]   2> 1827837 INFO  (searcherExecutor-7234-thread-1-processing-n:127.0.0.1:34621_solr x:SearchRateTriggerTest-collection1_shard1_replica_n2 c:SearchRateTriggerTest-collection1 s:shard1 r:core_node5) [n:127.0.0.1:34621_solr c:SearchRateTriggerTest-collection1 s:shard1 r:core_node5 x:SearchRateTriggerTest-collection1_shard1_replica_n2] o.a.s.c.SolrCore [SearchRateTriggerTest-collection1_shard1_replica_n2] Registered new searcher Searcher@1b96e6f0[SearchRateTriggerTest-collection1_shard1_replica_n2] main{ExitableDirectoryReader(UninvertingDirectoryReader())}
   [junit4]   2> 1827837 INFO  (qtp2065065825-22012) [n:127.0.0.1:34621_solr c:SearchRateTriggerTest-collection1 s:shard1 r:core_node5 x:SearchRateTriggerTest-collection1_shard1_replica_n2] o.a.s.u.UpdateLog Could not find max version in index or recent updates, using new clock 1601285905044209664
   [junit4]   2> 1827839 INFO  (qtp2065065825-22012) [n:127.0.0.1:34621_solr c:SearchRateTriggerTest-collection1 s:shard1 r:core_node5 x:SearchRateTriggerTest-collection1_shard1_replica_n2] o.a.s.c.ZkShardTerms Successful update of terms at /collections/SearchRateTriggerTest-collection1/terms/shard1 to Terms{values={core_node3=0, core_node5=0}, version=1}
   [junit4]   2> 1828335 INFO  (qtp1215692603-22027) [n:127.0.0.1:32939_solr c:SearchRateTriggerTest-collection1 s:shard2 r:core_node8 x:SearchRateTriggerTest-collection1_shard2_replica_n6] o.a.s.c.ShardLeaderElectionContext Enough replicas found to continue.
   [junit4]   2> 1828335 INFO  (qtp160556686-22028) [n:127.0.0.1:39885_solr c:SearchRateTriggerTest-collection1 s:shard1 r:core_node3 x:SearchRateTriggerTest-collection1_shard1_replica_n1] o.a.s.c.ShardLeaderElectionContext Enough replicas found to continue.
   [junit4]   2> 1828335 INFO  (qtp1215692603-22027) [n:127.0.0.1:32939_solr c:SearchRateTriggerTest-collection1 s:shard2 r:core_node8 x:SearchRateTriggerTest-collection1_shard2_replica_n6] o.a.s.c.ShardLeaderElectionContext I may be the new leader - try and sync
   [junit4]   2> 1828335 INFO  (qtp160556686-22028) [n:127.0.0.1:39885_solr c:SearchRateTriggerTest-collection1 s:shard1 r:core_node3 x:SearchRateTriggerTest-collection1_shard1_replica_n1] o.a.s.c.ShardLeaderElectionContext I may be the new leader - try and sync
   [junit4]   2> 1828335 INFO  (qtp1215692603-22027) [n:127.0.0.1:32939_solr c:SearchRateTriggerTest-collection1 s:shard2 r:core_node8 x:SearchRateTriggerTest-collection1_shard2_replica_n6] o.a.s.c.SyncStrategy Sync replicas to https://127.0.0.1:32939/solr/SearchRateTriggerTest-collection1_shard2_replica_n6/
   [junit4]   2> 1828335 INFO  (qtp160556686-22028) [n:127.0.0.1:39885_solr c:SearchRateTriggerTest-collection1 s:shard1 r:core_node3 x:SearchRateTriggerTest-collection1_shard1_replica_n1] o.a.s.c.SyncStrategy Sync replicas to https://127.0.0.1:39885/solr/SearchRateTriggerTest-collection1_shard1_replica_n1/
   [junit4]   2> 1828335 INFO  (qtp160556686-22028) [n:127.0.0.1:39885_solr c:SearchRateTriggerTest-collection1 s:shard1 r:core_node3 x:SearchRateTriggerTest-collection1_shard1_replica_n1] o.a.s.u.PeerSync PeerSync: core=SearchRateTriggerTest-collection1_shard1_replica_n1 url=https://127.0.0.1:39885/solr START replicas=[https://127.0.0.1:34621/solr/SearchRateTriggerTest-collection1_shard1_replica_n2/] nUpdates=100
   [junit4]   2> 1828335 INFO  (qtp1215692603-22027) [n:127.0.0.1:32939_solr c:SearchRateTriggerTest-collection1 s:shard2 r:core_node8 x:SearchRateTriggerTest-collection1_shard2_replica_n6] o.a.s.u.PeerSync PeerSync: core=SearchRateTriggerTest-collection1_shard2_replica_n6 url=https://127.0.0.1:32939/solr START replicas=[https://127.0.0.1:40779/solr/SearchRateTriggerTest-collection1_shard2_replica_n4/] nUpdates=100
   [junit4]   2> 1828342 INFO  (qtp2065065825-22017) [n:127.0.0.1:34621_solr c:SearchRateTriggerTest-collection1 s:shard1 r:core_node5 x:SearchRateTriggerTest-collection1_shard1_replica_n2] o.a.s.c.S.Request [SearchRateTriggerTest-collection1_shard1_replica_n2]  webapp=/solr path=/get params={distrib=false&qt=/get&fingerprint=false&getVersions=100&wt=javabin&version=2} status=0 QTime=0
   [junit4]   2> 1828342 INFO  (qtp347588747-22034) [n:127.0.0.1:40779_solr c:SearchRateTriggerTest-collection1 s:shard2 r:core_node7 x:SearchRateTriggerTest-collection1_shard2_replica_n4] o.a.s.c.S.Request [SearchRateTriggerTest-collection1_shard2_replica_n4]  webapp=/solr path=/get params={distrib=false&qt=/get&fingerprint=false&getVersions=100&wt=javabin&version=2} status=0 QTime=0
   [junit4]   2> 1828636 INFO  (qtp160556686-22028) [n:127.0.0.1:39885_solr c:SearchRateTriggerTest-collection1 s:shard1 r:core_node3 x:SearchRateTriggerTest-collection1_shard1_replica_n1] o.a.s.u.PeerSync PeerSync: core=SearchRateTriggerTest-collection1_shard1_replica_n1 url=https://127.0.0.1:39885/solr DONE.  We have no versions.  sync failed.
   [junit4]   2> 1828636 INFO  (qtp1215692603-22027) [n:127.0.0.1:32939_solr c:SearchRateTriggerTest-collection1 s:shard2 r:core_node8 x:SearchRateTriggerTest-collection1_shard2_replica_n6] o.a.s.u.PeerSync PeerSync: core=SearchRateTriggerTest-collection1_shard2_replica_n6 url=https://127.0.0.1:32939/solr DONE.  We have no versions.  sync failed.
   [junit4]   2> 1828636 INFO  (qtp160556686-22028) [n:127.0.0.1:39885_solr c:SearchRateTriggerTest-collection1 s:shard1 r:core_node3 x:SearchRateTriggerTest-collection1_shard1_replica_n1] o.a.s.c.SyncStrategy Leader's attempt to sync with shard failed, moving to the next candidate
   [junit4]   2> 1828636 INFO  (qtp1215692603-22027) [n:127.0.0.1:32939_solr c:SearchRateTriggerTest-collection1 s:shard2 r:core_node8 x:SearchRateTriggerTest-collection1_shard2_replica_n6] o.a.s.c.SyncStrategy Leader's attempt to sync with shard failed, moving to the next candidate
   [junit4]   2> 1828636 INFO  (qtp160556686-22028) [n:127.0.0.1:39885_solr c:SearchRateTriggerTest-collection1 s:shard1 r:core_node3 x:SearchRateTriggerTest-collection1_shard1_replica_n1] o.a.s.c.ShardLeaderElectionContext We failed sync, but we have no versions - we can't sync in that case - we were active before, so become leader anyway
   [junit4]   2> 1828636 INFO  (qtp1215692603-22027) [n:127.0.0.1:32939_solr c:SearchRateTriggerTest-collection1 s:shard2 r:core_node8 x:SearchRateTriggerTest-collection1_shard2_replica_n6] o.a.s.c.ShardLeaderElectionContext We failed sync, but we have no versions - we can't sync in that case - we were active before, so become leader anyway
   [junit4]   2> 1828636 INFO  (qtp160556686-22028) [n:127.0.0.1:39885_solr c:SearchRateTriggerTest-collection1 s:shard1 r:core_node3 x:SearchRateTriggerTest-collection1_shard1_replica_n1] o.a.s.c.ShardLeaderElectionContext Found all replicas participating in election, clear LIR
   [junit4]   2> 1828636 INFO  (qtp1215692603-22027) [n:127.0.0.1:32939_solr c:SearchRateTriggerTest-collection1 s:shard2 r:core_node8 x:SearchRateTriggerTest-collection1_shard2_replica_n6] o.a.s.c.ShardLeaderElectionContext Found all replicas participating in election, clear LIR
   [junit4]   2> 1828638 INFO  (qtp1215692603-22027) [n:127.0.0.1:32939_solr c:SearchRateTriggerTest-collection1 s:shard2 r:core_node8 x:SearchRateTriggerTest-collection1_shard2_replica_n6] o.a.s.c.ShardLeaderElectionContext I am the new leader: https://127.0.0.1:32939/solr/SearchRateTriggerTest-collection1_shard2_replica_n6/ shard2
   [junit4]   2> 1828638 INFO  (qtp160556686-22028) [n:127.0.0.1:39885_solr c:SearchRateTriggerTest-collection1 s:shard1 r:core_node3 x:SearchRateTriggerTest-collection1_shard1_replica_n1] o.a.s.c.ShardLeaderElectionContext I am the new leader: https://127.0.0.1:39885/solr/SearchRateTriggerTest-collection1_shard1_replica_n1/ shard1
   [junit4]   2> 1828739 INFO  (qtp1215692603-22027) [n:127.0.0.1:32939_solr c:SearchRateTriggerTest-collection1 s:shard2 r:core_node8 x:SearchRateTriggerTest-collection1_shard2_replica_n6] o.a.s.c.ZkController I am the leader, no recovery necessary
   [junit4]   2> 1828745 INFO  (qtp1215692603-22027) [n:127.0.0.1:32939_solr c:SearchRateTriggerTest-collection1 s:shard2 r:core_node8 x:SearchRateTriggerTest-collection1_shard2_replica_n6] o.a.s.s.HttpSolrCall [admin] webapp=null path=/admin/cores params={qt=/admin/cores&coreNodeName=core_node8&collection.configName=conf&newCollection=true&name=SearchRateTriggerTest-collection1_shard2_replica_n6&action=CREATE&numShards=2&collection=SearchRateTriggerTest-collection1&shard=shard2&wt=javabin&version=2&replicaType=NRT} status=0 QTime=2014
   [junit4]   2> 1828789 INFO  (qtp160556686-22028) [n:127.0.0.1:39885_solr c:SearchRateTriggerTest-collection1 s:shard1 r:core_node3 x:SearchRateTriggerTest-collection1_shard1_replica_n1] o.a.s.c.ZkController I am the leader, no recovery necessary
   [junit4]   2> 1828795 INFO  (qtp160556686-22028) [n:127.0.0.1:39885_solr c:SearchRateTriggerTest-collection1 s:shard1 r:core_node3 x:SearchRateTriggerTest-collection1_shard1_replica_n1] o.a.s.s.HttpSolrCall [admin] webapp=null path=/admin/cores params={qt=/admin/cores&coreNodeName=core_node3&collection.configName=conf&newCollection=true&name=SearchRateTriggerTest-collection1_shard1_replica_n1&action=CREATE&numShards=2&collection=SearchRateTriggerTest-collection1&shard=shard1&wt=javabin&version=2&replicaType=NRT} status=0 QTime=2053
   [junit4]   2> 1828839 INFO  (qtp347588747-22009) [n:127.0.0.1:40779_solr c:SearchRateTriggerTest-collection1 s:shard2 r:core_node7 x:SearchRateTriggerTest-collection1_shard2_replica_n4] o.a.s.s.HttpSolrCall [admin] webapp=null path=/admin/cores params={qt=/admin/cores&coreNodeName=core_node7&collection.configName=conf&newCollection=true&name=SearchRateTriggerTest-collection1_shard2_replica_n4&action=CREATE&numShards=2&collection=SearchRateTriggerTest-collection1&shard=shard2&wt=javabin&version=2&replicaType=NRT} status=0 QTime=2098
   [junit4]   2> 1828841 INFO  (qtp2065065825-22012) [n:127.0.0.1:34621_solr c:SearchRateTriggerTest-collection1 s:shard1 r:core_node5 x:SearchRateTriggerTest-collection1_shard1_replica_n2] o.a.s.s.HttpSolrCall [admin] webapp=null path=/admin/cores params={qt=/admin/cores&coreNodeName=core_node5&collection.configName=conf&newCollection=true&name=SearchRateTriggerTest-collection1_shard1_replica_n2&action=CREATE&numShards=2&collection=SearchRateTriggerTest-collection1&shard=shard1&wt=javabin&version=2&replicaType=NRT} status=0 QTime=2099
   [junit4]   2> 1828842 INFO  (qtp1215692603-22025) [n:127.0.0.1:32939_solr    ] o.a.s.h.a.CollectionsHandler Wait for new collection to be active for at most 30 seconds. Check all shard replicas
   [junit4]   2> 1828941 INFO  (zkCallback-5062-thread-2) [    ] o.a.s.c.c.ZkStateReader A cluster state change: [WatchedEvent state:SyncConnected type:NodeDataChanged path:/collections/SearchRateTriggerTest-collection1/state.json] for collection [SearchRateTriggerTest-collection1] has occurred - updating... (live nodes size: [4])
   [junit4]   2> 1828941 INFO  (zkCallback-5072-thread-1) [    ] o.a.s.c.c.ZkStateReader A cluster state change: [WatchedEvent state:SyncConnected type:NodeDataChanged path:/collections/SearchRateTriggerTest-collection1/state.json] for collection [SearchRateTriggerTest-collection1] has occurred - updating... (live nodes size: [4])
   [junit4]   2> 1828941 INFO  (zkCallback-5064-thread-1) [    ] o.a.s.c.c.ZkStateReader A cluster state change: [WatchedEvent state:SyncConnected type:NodeDataChanged path:/collections/SearchRateTriggerTest-collection1/state.json] for collection [SearchRateTriggerTest-collection1] has occurred - updating... (live nodes size: [4])
   [junit4]   2> 1828941 INFO  (zkCallback-5080-thread-1) [    ] o.a.s.c.c.ZkStateReader A cluster state change: [WatchedEvent state:SyncConnected type:NodeDataChanged path:/collections/SearchRateTriggerTest-collection1/state.json] for collection [SearchRateTriggerTest-collection1] has occurred - updating... (live nodes size: [4])
   [junit4]   2> 1829842 INFO  (qtp1215692603-22025) [n:127.0.0.1:32939_solr    ] o.a.s.s.HttpSolrCall [admin] webapp=null path=/admin/collections params={replicationFactor=2&collection.configName=conf&maxShardsPerNode=1&name=SearchRateTriggerTest-collection1&nrtReplicas=2&action=CREATE&numShards=2&wt=javabin&version=2} status=0 QTime=3423
   [junit4]   2> 1829843 INFO  (qtp1215692603-22022) [n:127.0.0.1:32939_solr    ] o.a.s.h.a.CollectionsHandler Invoked Collection Action :create with params replicationFactor=2&collection.configName=conf&maxShardsPerNode=1&name=SearchRateTriggerTest-collection2&nrtReplicas=2&action=CREATE&numShards=2&wt=javabin&version=2 and sendToOCPQueue=true
   [junit4]   2> 1829844 INFO  (OverseerThreadFactory-7222-thread-2) [    ] o.a.s.c.a.c.CreateCollectionCmd Create collection SearchRateTriggerTest-collection2
   [junit4]   2> 1829844 INFO  (OverseerCollectionConfigSetProcessor-72076360313602055-127.0.0.1:40779_solr-n_0000000000) [    ] o.a.s.c.OverseerTaskQueue Response ZK path: /overseer/collection-queue-work/qnr-0000000000 doesn't exist.  Requestor may have disconnected from ZooKeeper
   [junit4]   2> 1830049 INFO  (OverseerStateUpdate-72076360313602055-127.0.0.1:40779_solr-n_0000000000) [    ] o.a.s.c.o.SliceMutator createReplica() {
   [junit4]   2>   "operation":"ADDREPLICA",
   [junit4]   2>   "collection":"SearchRateTriggerTest-collection2",
   [junit4]   2>   "shard":"shard1",
   [junit4]   2>   "core":"SearchRateTriggerTest-collection2_shard1_replica_n1",
   [junit4]   2>   "state":"down",
   [junit4]   2>   "base_url":"https://127.0.0.1:32939/solr",
   [junit4]   2>   "type":"NRT",
   [junit4]   2>   "waitForFinalState":"false"} 
   [junit4]   2> 1830050 INFO  (OverseerStateUpdate-72076360313602055-127.0.0.1:40779_solr-n_0000000000) [    ] o.a.s.c.o.SliceMutator createReplica() {
   [junit4]   2>   "operation":"ADDREPLICA",
   [junit4]   2>   "collection":"SearchRateTriggerTest-collection2",
   [junit4]   2>   "shard":"shard1",
   [junit4]   2>   "core":"SearchRateTriggerTest-collection2_shard1_replica_n2",
   [junit4]   2>   "state":"down",
   [junit4]   2>   "base_url":"https://127.0.0.1:34621/solr",
   [junit4]   2>   "type":"NRT",
   [junit4]   2>   "waitForFinalState":"false"} 
   [junit4]   2> 1830051 INFO  (OverseerStateUpdate-72076360313602055-127.0.0.1:40779_solr-n_0000000000) [    ] o.a.s.c.o.SliceMutator createReplica() {
   [junit4]   2>   "operation":"ADDREPLICA",
   [junit4]   2>   "collection":"SearchRateTriggerTest-collection2",
   [junit4]   2>   "shard":"shard2",
   [junit4]   2>   "core":"SearchRateTriggerTest-collection2_shard2_replica_n4",
   [junit4]   2>   "state":"down",
   [junit4]   2>   "base_url":"https://127.0.0.1:39885/solr",
   [junit4]   2>   "type":"NRT",
   [junit4]   2>   "waitForFinalState":"false"} 
   [junit4]   2> 1830052 INFO  (OverseerStateUpdate-72076360313602055-127.0.0.1:40779_solr-n_0000000000) [    ] o.a.s.c.o.SliceMutator createReplica() {
   [junit4]   2>   "operation":"ADDREPLICA",
   [junit4]   2>   "collection":"SearchRateTriggerTest-collection2",
   [junit4]   2>   "shard":"shard2",
   [junit4]   2>   "core":"SearchRateTriggerTest-collection2_shard2_replica_n6",
   [junit4]   2>   "state":"down",
   [junit4]   2>   "base_url":"https://127.0.0.1:40779/solr",
   [junit4]   2>   "type":"NRT",
   [junit4]   2>   "waitForFinalState":"false"} 
   [junit4]   2> 1830253 INFO  (qtp347588747-22033) [n:127.0.0.1:40779_solr    x:SearchRateTriggerTest-collection2_shard2_replica_n6] o.a.s.h.a.CoreAdminOperation core create command qt=/admin/cores&coreNodeName=core_node8&collection.configName=conf&newCollection=true&name=SearchRateTriggerTest-collection2_shard2_replica_n6&action=CREATE&numShards=2&collection=SearchRateTriggerTest-collection2&shard=shard2&wt=javabin&version=2&replicaType=NRT
   [junit4]   2> 1830253 INFO  (qtp2065065825-22013) [n:127.0.0.1:34621_solr    x:SearchRateTriggerTest-collection2_shard1_replica_n2] o.a.s.h.a.CoreAdminOperation core create command qt=/admin/cores&coreNodeName=core_node5&collection.configName=conf&newCollection=true&name=SearchRateTriggerTest-collection2_shard1_replica_n2&action=CREATE&numShards=2&collection=SearchRateTriggerTest-collection2&shard=shard1&wt=javabin&version=2&replicaType=NRT
   [junit4]   2> 1830253 INFO  (qtp160556686-22029) [n:127.0.0.1:39885_solr    x:SearchRateTriggerTest-collection2_shard2_replica_n4] o.a.s.h.a.CoreAdminOperation core create command qt=/admin/cores&coreNodeName=core_node7&collection.configName=conf&newCollection=true&name=SearchRateTriggerTest-collection2_shard2_replica_n4&action=CREATE&numShards=2&collection=SearchRateTriggerTest-collection2&shard=shard2&wt=javabin&version=2&replicaType=NRT
   [junit4]   2> 1830254 INFO  (qtp1215692603-22006) [n:127.0.0.1:32939_solr    x:SearchRateTriggerTest-collection2_shard1_replica_n1] o.a.s.h.a.CoreAdminOperation core create command qt=/admin/cores&coreNodeName=core_node3&collection.configName=conf&newCollection=true&name=SearchRateTriggerTest-collection2_shard1_replica_n1&action=CREATE&numShards=2&collection=SearchRateTriggerTest-collection2&shard=shard1&wt=javabin&version=2&replicaType=NRT
   [junit4]   2> 1831263 INFO  (qtp2065065825-22013) [n:127.0.0.1:34621_solr c:SearchRateTriggerTest-collection2 s:shard1 r:core_node5 x:SearchRateTriggerTest-collection2_shard1_replica_n2] o.a.s.c.SolrConfig Using Lucene MatchVersion: 7.4.0
   [junit4]   2> 1831263 INFO  (qtp1215692603-22006) [n:127.0.0.1:32939_solr c:SearchRateTriggerTest-collection2 s:shard1 r:core_node3 x:SearchRateTriggerTest-collection2_shard1_replica_n1] o.a.s.c.SolrConfig Using Lucene MatchVersion: 7.4.0
   [junit4]   2> 1831263 INFO  (qtp160556686-22029) [n:127.0.0.1:39885_solr c:SearchRateTriggerTest-collection2 s:shard2 r:core_node7 x:SearchRateTriggerTest-collection2_shard2_replica_n4] o.a.s.c.SolrConfig Using Lucene MatchVersion: 7.4.0
   [junit4]   2> 1831263 INFO  (qtp347588747-22033) [n:127.0.0.1:40779_solr c:SearchRateTriggerTest-collection2 s:shard2 r:core_node8 x:SearchRateTriggerTest-collection2_shard2_replica_n6] o.a.s.c.SolrConfig Using Lucene MatchVersion: 7.4.0
   [junit4]   2> 1831294 INFO  (qtp2065065825-22013) [n:127.0.0.1:34621_solr c:SearchRateTriggerTest-collection2 s:shard1 r:core_node5 x:SearchRateTriggerTest-collection2_shard1_replica_n2] o.a.s.s.IndexSchema [SearchRateTriggerTest-collection2_shard1_replica_n2] Schema name=minimal
   [junit4]   2> 1831295 INFO  (qtp1215692603-22006) [n:127.0.0.1:32939_solr c:SearchRateTriggerTest-collection2 s:shard1 r:core_node3 x:SearchRateTriggerTest-collection2_shard1_replica_n1] o.a.s.s.IndexSchema [SearchRateTriggerTest-collection2_shard1_replica_n1] Schema name=minimal
   [junit4]   2> 1831295 INFO  (qtp347588747-22033) [n:127.0.0.1:40779_solr c:SearchRateTriggerTest-collection2 s:shard2 r:core_node8 x:SearchRateTriggerTest-collection2_shard2_replica_n6] o.a.s.s.IndexSchema [SearchRateTriggerTest-collection2_shard2_replica_n6] Schema name=minimal
   [junit4]   2> 1831295 INFO  (qtp160556686-22029) [n:127.0.0.1:39885_solr c:SearchRateTriggerTest-collection2 s:shard2 r:core_node7 x:SearchRateTriggerTest-collection2_shard2_replica_n4] o.a.s.s.IndexSchema [SearchRateTriggerTest-collection2_shard2_replica_n4] Schema name=minimal
   [junit4]   2> 1831296 INFO  (qtp2065065825-22013) [n:127.0.0.1:34621_solr c:SearchRateTriggerTest-collection2 s:shard1 r:core_node5 x:SearchRateTriggerTest-collection2_shard1_replica_n2] o.a.s.s.IndexSchema Loaded schema minimal/1.1 with uniqueid field id
   [junit4]   2> 1831296 INFO  (qtp2065065825-22013) [n:127.0.0.1:34621_solr c:SearchRateTriggerTest-collection2 s:shard1 r:core_node5 x:SearchRateTriggerTest-collection2_shard1_replica_n2] o.a.s.c.CoreContainer Creating SolrCore 'SearchRateTriggerTest-collection2_shard1_replica_n2' using configuration from collection SearchRateTriggerTest-collection2, trusted=true
   [junit4]   2> 1831297 INFO  (qtp347588747-22033) [n:127.0.0.1:40779_solr c:SearchRateTriggerTest-collection2 s:shard2 r:core_node8 x:SearchRateTriggerTest-collection2_shard2_replica_n6] o.a.s.s.IndexSchema Loaded schema minimal/1.1 with uniqueid field id
   [junit4]   2> 1831297 INFO  (qtp160556686-22029) [n:127.0.0.1:39885_solr c:SearchRateTriggerTest-collection2 s:shard2 r:core_node7 x:SearchRateTriggerTest-collection2_shard2_replica_n4] o.a.s.s.IndexSchema Loaded schema minimal/1.1 with uniqueid field id
   [junit4]   2> 1831297 INFO  (qtp1215692603-22006) [n:127.0.0.1:32939_solr c:SearchRateTriggerTest-collection2 s:shard1 r:core_node3 x:SearchRateTriggerTest-collection2_shard1_replica_n1] o.a.s.s.IndexSchema Loaded schema minimal/1.1 with uniqueid field id
   [junit4]   2> 1831297 INFO  (qtp160556686-22029) [n:127.0.0.1:39885_solr c:SearchRateTriggerTest-collection2 s:shard2 r:core_node7 x:SearchRateTriggerTest-collection2_shard2_replica_n4] o.a.s.c.CoreContainer Creating SolrCore 'SearchRateTriggerTest-collection2_shard2_replica_n4' using configuration from collection SearchRateTriggerTest-collection2, trusted=true
   [junit4]   2> 1831297 INFO  (qtp1215692603-22006) [n:127.0.0.1:32939_solr c:SearchRateTriggerTest-collection2 s:shard1 r:core_node3 x:SearchRateTriggerTest-collection2_shard1_replica_n1] o.a.s.c.CoreContainer Creating SolrCore 'SearchRateTriggerTest-collection2_shard1_replica_n1' using configuration from collection SearchRateTriggerTest-collection2, trusted=true
   [junit4]   2> 1831297 INFO  (qtp2065065825-22013) [n:127.0.0.1:34621_solr c:SearchRateTriggerTest-collection2 s:shard1 r:core_node5 x:SearchRateTriggerTest-collection2_shard1_replica_n2] o.a.s.m.r.SolrJmxReporter JMX monitoring for 'solr_34621.solr.core.SearchRateTriggerTest-collection2.shard1.replica_n2' (registry 'solr.core.SearchRateTriggerTest-collection2.shard1.replica_n2') enabled at server: com.sun.jmx.mbeanserver.JmxMBeanServer@6e401bf2
   [junit4]   2> 1831297 INFO  (qtp347588747-22033) [n:127.0.0.1:40779_solr c:SearchRateTriggerTest-collection2 s:shard2 r:core_node8 x:SearchRateTriggerTest-collection2_shard2_replica_n6] o.a.s.c.CoreContainer Creating SolrCore 'SearchRateTriggerTest-collection2_shard2_replica_n6' using configuration from collection SearchRateTriggerTest-collection2, trusted=true
   [junit4]   2> 1831298 INFO  (qtp2065065825-22013) [n:127.0.0.1:34621_solr c:SearchRateTriggerTest-collection2 s:shard1 r:core_node5 x:SearchRateTriggerTest-collection2_shard1_replica_n2] o.a.s.c.SolrCore solr.RecoveryStrategy.Builder
   [junit4]   2> 1831298 INFO  (qtp2065065825-22013) [n:127.0.0.1:34621_solr c:SearchRateTriggerTest-collection2 s:shard1 r:core_node5 x:SearchRateTriggerTest-collection2_shard1_replica_n2] o.a.s.c.SolrCore [[SearchRateTriggerTest-collection2_shard1_replica_n2] ] Opening new SolrCore at [/home/jenkins/workspace/Lucene-Solr-7.x-Linux/solr/build/solr-core/test/J0/temp/solr.cloud.autoscaling.SearchRateTriggerTest_FFC5019095B77A82-001/tempDir-001/node2/SearchRateTriggerTest-collection2_shard1_replica_n2], dataDir=[/home/jenkins/workspace/Lucene-Solr-7.x-Linux/solr/build/solr-core/test/J0/temp/solr.cloud.autoscaling.SearchRateTriggerTest_FFC5019095B77A82-001/tempDir-001/node2/./SearchRateTriggerTest-collection2_shard1_replica_n2/data/]
   [junit4]   2> 1831298 INFO  (qtp347588747-22033) [n:127.0.0.1:40779_solr c:SearchRateTriggerTest-collection2 s:shard2 r:core_node8 x:SearchRateTriggerTest-collection2_shard2_replica_n6] o.a.s.m.r.SolrJmxReporter JMX monitoring for 'solr_40779.solr.core.SearchRateTriggerTest-collection2.shard2.replica_n6' (registry 'solr.core.SearchRateTriggerTest-collection2.shard2.replica_n6') enabled at server: com.sun.jmx.mbeanserver.JmxMBeanServer@6e401bf2
   [junit4]   2> 1831298 INFO  (qtp1215692603-22006) [n:127.0.0.1:32939_solr c:SearchRateTriggerTest-collection2 s:shard1 r:core_node3 x:SearchRateTriggerTest-collection2_shard1_replica_n1] o.a.s.m.r.SolrJmxReporter JMX monitoring for 'solr_32939.solr.core.SearchRateTriggerTest-collection2.shard1.replica_n1' (registry 'solr.core.SearchRateTriggerTest-collection2.shard1.replica_n1') enabled at server: com.sun.jmx.mbeanserver.JmxMBeanServer@6e401bf2
   [junit4]   2> 1831298 INFO  (qtp160556686-22029) [n:127.0.0.1:39885_solr c:SearchRateTriggerTest-collection2 s:shard2 r:core_node7 x:SearchRateTriggerTest-collection2_shard2_replica_n4] o.a.s.m.r.SolrJmxReporter JMX monitoring for 'solr_39885.solr.core.SearchRateTriggerTest-collection2.shard2.replica_n4' (registry 'solr.core.SearchRateTriggerTest-collection2.shard2.replica_n4') enabled at server: com.sun.jmx.mbeanserver.JmxMBeanServer@6e401bf2
   [junit4]   2> 1831298 INFO  (qtp347588747-22033) [n:127.0.0.1:40779_solr c:SearchRateTriggerTest-collection2 s:shard2 r:core_node8 x:SearchRateTriggerTest-collection2_shard2_replica_n6] o.a.s.c.SolrCore solr.RecoveryStrategy.Builder
   [junit4]   2> 1831298 INFO  (qtp1215692603-22006) [n:127.0.0.1:32939_solr c:SearchRateTriggerTest-collection2 s:shard1 r:core_node3 x:SearchRateTriggerTest-collection2_shard1_replica_n1] o.a.s.c.SolrCore solr.RecoveryStrategy.Builder
   [junit4]   2> 1831298 INFO  (qtp347588747-22033) [n:127.0.0.1:40779_solr c:SearchRateTriggerTest-collection2 s:shard2 r:core_node8 x:SearchRateTriggerTest-collection2_shard2_replica_n6] o.a.s.c.SolrCore [[SearchRateTriggerTest-collection2_shard2_replica_n6] ] Opening new SolrCore at [/home/jenkins/workspace/Lucene-Solr-7.x-Linux/solr/build/solr-core/test/J0/temp/solr.cloud.autoscaling.SearchRateTriggerTest_FFC5019095B77A82-001/tempDir-001/node1/SearchRateTriggerTest-collection2_shard2_replica_n6], dataDir=[/home/jenkins/workspace/Lucene-Solr-7.x-Linux/solr/build/solr-core/test/J0/temp/solr.cloud.autoscaling.SearchRateTriggerTest_FFC5019095B77A82-001/tempDir-001/node1/./SearchRateTriggerTest-collection2_shard2_replica_n6/data/]
   [junit4]   2> 1831298 INFO  (qtp1215692603-22006) [n:127.0.0.1:32939_solr c:SearchRateTriggerTest-collection2 s:shard1 r:core_node3 x:SearchRateTriggerTest-collection2_shard1_replica_n1] o.a.s.c.SolrCore [[SearchRateTriggerTest-collection2_shard1_replica_n1] ] Opening new SolrCore at [/home/jenkins/workspace/Lucene-Solr-7.x-Linux/solr/build/solr-core/test/J0/temp/solr.cloud.autoscaling.SearchRateTriggerTest_FFC5019095B77A82-001/tempDir-001/node3/SearchRateTriggerTest-collection2_shard1_replica_n1], dataDir=[/home/jenkins/workspace/Lucene-Solr-7.x-Linux/solr/build/solr-core/test/J0/temp/solr.cloud.autoscaling.SearchRateTriggerTest_FFC5019095B77A82-001/tempDir-001/node3/./SearchRateTriggerTest-collection2_shard1_replica_n1/data/]
   [junit4]   2> 1831298 INFO  (qtp160556686-22029) [n:127.0.0.1:39885_solr c:SearchRateTriggerTest-collection2 s:shard2 r:core_node7 x:SearchRateTriggerTest-collection2_shard2_replica_n4] o.a.s.c.SolrCore solr.RecoveryStrategy.Builder
   [junit4]   2> 1831298 INFO  (qtp160556686-22029) [n:127.0.0.1:39885_solr c:SearchRateTriggerTest-collection2 s:shard2 r:core_node7 x:SearchRateTriggerTest-collection2_shard2_replica_n4] o.a.s.c.SolrCore [[SearchRateTriggerTest-collection2_shard2_replica_n4] ] Opening new SolrCore at [/home/jenkins/workspace/Lucene-Solr-7.x-Linux/solr/build/solr-core/test/J0/temp/solr.cloud.autoscaling.SearchRateTriggerTest_FFC5019095B77A82-001/tempDir-001/node4/SearchRateTriggerTest-collection2_shard2_replica_n4], dataDir=[/home/jenkins/workspace/Lucene-Solr-7.x-Linux/solr/build/solr-core/test/J0/temp/solr.cloud.autoscaling.SearchRateTriggerTest_FFC5019095B77A82-001/tempDir-001/node4/./SearchRateTriggerTest-collection2_shard2_replica_n4/data/]
   [junit4]   2> 1831362 INFO  (qtp160556686-22029) [n:127.0.0.1:39885_solr c:SearchRateTriggerTest-collection2 s:shard2 r:core_node7 x:SearchRateTriggerTest-collection2_shard2_replica_n4] o.a.s.u.UpdateHandler Using UpdateLog implementation: org.apache.solr.update.UpdateLog
   [junit4]   2> 1831362 INFO  (qtp160556686-22029) [n:127.0.0.1:39885_solr c:SearchRateTriggerTest-collection2 s:shard2 r:core_node7 x:SearchRateTriggerTest-collection2_shard2_replica_n4] o.a.s.u.UpdateLog Initializing UpdateLog: dataDir=null defaultSyncLevel=FLUSH numRecordsToKeep=100 maxNumLogsToKeep=10 numVersionBuckets=65536
   [junit4]   2> 1831362 INFO  (qtp1215692603-22006) [n:127.0.0.1:32939_solr c:SearchRateTriggerTest-collection2 s:shard1 r:core_node3 x:SearchRateTriggerTest-collection2_shard1_replica_n1] o.a.s.u.UpdateHandler Using UpdateLog implementation: org.apache.solr.update.UpdateLog
   [junit4]   2> 1831362 INFO  (qtp1215692603-22006) [n:127.0.0.1:32939_solr c:SearchRateTriggerTest-collection2 s:shard1 r:core_node3 x:SearchRateTriggerTest-collection2_shard1_replica_n1] o.a.s.u.UpdateLog Initializing UpdateLog: dataDir=null defaultSyncLevel=FLUSH numRecordsToKeep=100 maxNumLogsToKeep=10 numVersionBuckets=65536
   [junit4]   2> 1831363 INFO  (qtp160556686-22029) [n:127.0.0.1:39885_solr c:SearchRateTriggerTest-collection2 s:shard2 r:core_node7 x:SearchRateTriggerTest-collection2_shard2_replica_n4] o.a.s.u.CommitTracker Hard AutoCommit: disabled
   [junit4]   2> 1831363 INFO  (qtp1215692603-22006) [n:127.0.0.1:32939_solr c:SearchRateTriggerTest-collection2 s:shard1 r:core_node3 x:SearchRateTriggerTest-collection2_shard1_replica_n1] o.a.s.u.CommitTracker Hard AutoCommit: disabled
   [junit4]   2> 1831363 INFO  (qtp160556686-22029) [n:127.0.0.1:39885_solr c:SearchRateTriggerTest-collection2 s:shard2 r:core_node7 x:SearchRateTriggerTest-collection2_shard2_replica_n4] o.a.s.u.CommitTracker Soft AutoCommit: disabled
   [junit4]   2> 1831363 INFO  (qtp1215692603-22006) [n:127.0.0.1:32939_solr c:SearchRateTriggerTest-collection2 s:shard1 r:core_node3 x:SearchRateTriggerTest-collection2_shard1_replica_n1] o.a.s.u.CommitTracker Soft AutoCommit: disabled
   [junit4]   2> 1831364 INFO  (qtp1215692603-22006) [n:127.0.0.1:32939_solr c:SearchRateTriggerTest-collection2 s:shard1 r:core_node3 x:SearchRateTriggerTest-collection2_shard1_replica_n1] o.a.s.s.SolrIndexSearcher Opening [Searcher@10425e76[SearchRateTriggerTest-collection2_shard1_replica_n1] main]
   [junit4]   2> 1831364 INFO  (qtp347588747-22033) [n:127.0.0.1:40779_solr c:SearchRateTriggerTest-collection2 s:shard2 r:core_node8 x:SearchRateTriggerTest-collection2_shard2_replica_n6] o.a.s.u.UpdateHandler Using UpdateLog implementation: org.apache.solr.update.UpdateLog
   [junit4]   2> 1831364 INFO  (qtp2065065825-22013) [n:127.0.0.1:34621_solr c:SearchRateTriggerTest-collection2 s:shard1 r:core_node5 x:SearchRateTriggerTest-collection2_shard1_replica_n2] o.a.s.u.UpdateHandler Using UpdateLog implementation: org.apache.solr.update.UpdateLog
   [junit4]   2> 1831364 INFO  (qtp347588747-22033) [n:127.0.0.1:40779_solr c:SearchRateTriggerTest-collection2 s:shard2 r:core_node8 x:SearchRateTriggerTest-collection2_shard2_replica_n6] o.a.s.u.UpdateLog Initializing UpdateLog: dataDir=null defaultSyncLevel=FLUSH numRecordsToKeep=100 maxNumLogsToKeep=10 numVersionBuckets=65536
   [junit4]   2> 1831364 INFO  (qtp1215692603-22006) [n:127.0.0.1:32939_solr c:SearchRateTriggerTest-collection2 s:shard1 r:core_node3 x:SearchRateTriggerTest-collection2_shard1_replica_n1] o.a.s.r.ManagedResourceStorage Configured ZooKeeperStorageIO with znodeBase: /configs/conf
   [junit4]   2> 1831364 INFO  (qtp2065065825-22013) [n:127.0.0.1:34621_solr c:SearchRateTriggerTest-collection2 s:shard1 r:core_node5 x:SearchRateTriggerTest-collection2_shard1_replica_n2] o.a.s.u.UpdateLog Initializing UpdateLog: dataDir=null defaultSyncLevel=FLUSH numRecordsToKeep=100 maxNumLogsToKeep=10 numVersionBuckets=65536
   [junit4]   2> 1831364 INFO  (qtp1215692603-22006) [n:127.0.0.1:32939_solr c:SearchRateTriggerTest-collection2 s:shard1 r:core_node3 x:SearchRateTriggerTest-collection2_shard1_replica_n1] o.a.s.r.ManagedResourceStorage Loaded null at path _rest_managed.json using ZooKeeperStorageIO:path=/configs/conf
   [junit4]   2> 1831365 INFO  (qtp1215692603-22006) [n:127.0.0.1:32939_solr c:SearchRateTriggerTest-collection2 s:shard1 r:core_node3 x:SearchRateTriggerTest-collection2_shard1_replica_n1] o.a.s.h.ReplicationHandler Commits will be reserved for 10000ms.
   [junit4]   2> 1831365 INFO  (qtp1215692603-22006) [n:127.0.0.1:32939_solr c:SearchRateTriggerTest-collection2 s:shard1 r:core_node3 x:SearchRateTriggerTest-collection2_shard1_replica_n1] o.a.s.u.UpdateLog Could not find max version in index or recent updates, using new clock 1601285908743585792
   [junit4]   2> 1831365 INFO  (qtp347588747-22033) [n:127.0.0.1:40779_solr c:SearchRateTriggerTest-collection2 s:shard2 r:core_node8 x:SearchRateTriggerTest-collection2_shard2_replica_n6] o.a.s.u.CommitTracker Hard AutoCommit: disabled
   [junit4]   2> 1831365 INFO  (qtp2065065825-22013) [n:127.0.0.1:34621_solr c:SearchRateTriggerTest-collection2 s:shard1 r:core_node5 x:SearchRateTriggerTest-collection2_shard1_replica_n2] o.a.s.u.CommitTracker Hard AutoCommit: disabled
   [junit4]   2> 1831366 INFO  (qtp347588747-22033) [n:127.0.0.1:40779_solr c:SearchRateTriggerTest-collection2 s:shard2 r:core_node8 x:SearchRateTriggerTest-collection2_shard2_replica_n6] o.a.s.u.CommitTracker Soft AutoCommit: disabled
   [junit4]   2> 1831366 INFO  (qtp2065065825-22013) [n:127.0.0.1:34621_solr c:SearchRateTriggerTest-collection2 s:shard1 r:core_node5 x:SearchRateTriggerTest-collection2_shard1_replica_n2] o.a.s.u.CommitTracker Soft AutoCommit: disabled
   [junit4]   2> 1831367 INFO  (qtp2065065825-22013) [n:127.0.0.1:34621_solr c:SearchRateTriggerTest-collection2 s:shard1 r:core_node5 x:SearchRateTriggerTest-collection2_shard1_replica_n2] o.a.s.s.SolrIndexSearcher Opening [Searcher@325fe412[SearchRateTriggerTest-collection2_shard1_replica_n2] 

[...truncated too long message...]


-git-cleanroot:

-copy-git-state:

git-autoclean:

ivy-availability-check:
[loadresource] Do not set property disallowed.ivy.jars.list as its length is 0.

-ivy-fail-disallowed-ivy-version:

ivy-fail:

ivy-configure:
[ivy:configure] :: loading settings :: file = /home/jenkins/workspace/Lucene-Solr-7.x-Linux/lucene/top-level-ivy-settings.xml

resolve:

common.init:

compile-lucene-core:

init:

-clover.disable:

-clover.load:

-clover.classpath:

-clover.setup:

clover:

compile-core:

-clover.disable:

-clover.load:

-clover.classpath:

-clover.setup:

clover:

common.compile-core:

compile-core:

common.compile-test:
    [mkdir] Created dir: /home/jenkins/workspace/Lucene-Solr-7.x-Linux/solr/build/solr-core/classes/test
    [javac] Compiling 900 source files to /home/jenkins/workspace/Lucene-Solr-7.x-Linux/solr/build/solr-core/classes/test
    [javac] Note: Some input files use or override a deprecated API.
    [javac] Note: Recompile with -Xlint:deprecation for details.
    [javac] Note: Some input files use unchecked or unsafe operations.
    [javac] Note: Recompile with -Xlint:unchecked for details.
    [javac] Creating empty /home/jenkins/workspace/Lucene-Solr-7.x-Linux/solr/build/solr-core/classes/test/org/apache/solr/cloud/autoscaling/sim/package-info.class
     [copy] Copying 1 file to /home/jenkins/workspace/Lucene-Solr-7.x-Linux/solr/build/solr-core/classes/test

common-solr.compile-test:

compile-test:

BUILD SUCCESSFUL
Total time: 54 seconds
[repro] ant test-nocompile -Dtests.dups=5 -Dtests.maxfailures=5 -Dtests.class="*.SearchRateTriggerTest" -Dtests.showOutput=onerror "-Dargs=-XX:-UseCompressedOops -XX:+UseSerialGC" -Dtests.seed=FFC5019095B77A82 -Dtests.multiplier=3 -Dtests.slow=true -Dtests.locale=pt-BR -Dtests.timezone=Asia/Kamchatka -Dtests.asserts=true -Dtests.file.encoding=UTF-8
Buildfile: /home/jenkins/workspace/Lucene-Solr-7.x-Linux/solr/core/build.xml

-clover.disable:

ivy-configure:
[ivy:configure] :: Apache Ivy 2.4.0 - 20141213170938 :: http://ant.apache.org/ivy/ ::
[ivy:configure] :: loading settings :: file = /home/jenkins/workspace/Lucene-Solr-7.x-Linux/lucene/top-level-ivy-settings.xml

install-junit4-taskdef:

ivy-availability-check:
[loadresource] Do not set property disallowed.ivy.jars.list as its length is 0.

-ivy-fail-disallowed-ivy-version:

ivy-fail:

resolve-groovy:
[ivy:cachepath] :: resolving dependencies :: org.codehaus.groovy#groovy-all-caller;working
[ivy:cachepath] 	confs: [default]
[ivy:cachepath] 	found org.codehaus.groovy#groovy-all;2.4.15 in public
[ivy:cachepath] :: resolution report :: resolve 15ms :: artifacts dl 1ms
	---------------------------------------------------------------------
	|                  |            modules            ||   artifacts   |
	|       conf       | number| search|dwnlded|evicted|| number|dwnlded|
	---------------------------------------------------------------------
	|      default     |   1   |   0   |   0   |   0   ||   1   |   0   |
	---------------------------------------------------------------------

-init-totals:

-test:
    [mkdir] Created dir: /home/jenkins/workspace/Lucene-Solr-7.x-Linux/solr/build/solr-core/test
[junit4:pickseed] Seed property 'tests.seed' already defined: FFC5019095B77A82
    [mkdir] Created dir: /home/jenkins/workspace/Lucene-Solr-7.x-Linux/solr/build/solr-core/test/temp
   [junit4] <JUnit4> says cześć! Master seed: FFC5019095B77A82
   [junit4] Executing 5 suites with 3 JVMs.
   [junit4] 
   [junit4] Started J2 PID(23976@serv1.sd-datasolutions.de).
   [junit4] Started J1 PID(23977@serv1.sd-datasolutions.de).
   [junit4] Started J0 PID(24012@serv1.sd-datasolutions.de).
   [junit4] Suite: org.apache.solr.cloud.autoscaling.SearchRateTriggerTest
   [junit4] OK      54.3s J2 | SearchRateTriggerTest.testTrigger
   [junit4] OK      21.6s J2 | SearchRateTriggerTest.testWaitForElapsed
   [junit4] OK      0.77s J2 | SearchRateTriggerTest.testDefaultsAndBackcompat
   [junit4] Completed [1/5] on J2 in 85.23s, 3 tests
   [junit4] 
   [junit4] Suite: org.apache.solr.cloud.autoscaling.SearchRateTriggerTest
   [junit4] OK      56.2s J1 | SearchRateTriggerTest.testTrigger
   [junit4] OK      21.6s J1 | SearchRateTriggerTest.testWaitForElapsed
   [junit4] OK      0.77s J1 | SearchRateTriggerTest.testDefaultsAndBackcompat
   [junit4] Completed [2/5] on J1 in 85.33s, 3 tests
   [junit4] 
   [junit4] Duplicate suite name used with XML reports: org.apache.solr.cloud.autoscaling.SearchRateTriggerTest. This may confuse tools that process XML reports. Set 'ignoreDuplicateSuites' to true to skip this message.
   [junit4] Suite: org.apache.solr.cloud.autoscaling.SearchRateTriggerTest
   [junit4] OK      55.9s J0 | SearchRateTriggerTest.testTrigger
   [junit4] OK      21.6s J0 | SearchRateTriggerTest.testWaitForElapsed
   [junit4] OK      0.78s J0 | SearchRateTriggerTest.testDefaultsAndBackcompat
   [junit4] Completed [3/5] on J0 in 86.79s, 3 tests
   [junit4] 
   [junit4] Suite: org.apache.solr.cloud.autoscaling.SearchRateTriggerTest
   [junit4] OK      47.0s J2 | SearchRateTriggerTest.testTrigger
   [junit4] OK      21.3s J2 | SearchRateTriggerTest.testWaitForElapsed
   [junit4] OK      0.77s J2 | SearchRateTriggerTest.testDefaultsAndBackcompat
   [junit4] Completed [4/5] on J2 in 71.84s, 3 tests
   [junit4] 
   [junit4] Suite: org.apache.solr.cloud.autoscaling.SearchRateTriggerTest
   [junit4] OK      47.2s J1 | SearchRateTriggerTest.testTrigger
   [junit4] OK      21.3s J1 | SearchRateTriggerTest.testWaitForElapsed
   [junit4] OK      0.77s J1 | SearchRateTriggerTest.testDefaultsAndBackcompat
   [junit4] Completed [5/5] on J1 in 72.65s, 3 tests
   [junit4] 
   [junit4] JVM J0:     0.76 ..    88.32 =    87.56s
   [junit4] JVM J1:     0.36 ..   159.64 =   159.27s
   [junit4] JVM J2:     0.36 ..   158.51 =   158.15s
   [junit4] Execution time total: 2 minutes 39 seconds
   [junit4] Tests summary: 5 suites, 15 tests
   [junit4] Could not remove temporary path: /home/jenkins/workspace/Lucene-Solr-7.x-Linux/solr/build/solr-core/test/J1 (java.nio.file.DirectoryNotEmptyException: Remaining files: [/home/jenkins/workspace/Lucene-Solr-7.x-Linux/solr/build/solr-core/test/J1/temp])
   [junit4] Could not remove temporary path: /home/jenkins/workspace/Lucene-Solr-7.x-Linux/solr/build/solr-core/test/J2 (java.nio.file.DirectoryNotEmptyException: Remaining files: [/home/jenkins/workspace/Lucene-Solr-7.x-Linux/solr/build/solr-core/test/J2/temp])
   [junit4] Could not remove temporary path: /home/jenkins/workspace/Lucene-Solr-7.x-Linux/solr/build/solr-core/test/J0 (java.nio.file.DirectoryNotEmptyException: Remaining files: [/home/jenkins/workspace/Lucene-Solr-7.x-Linux/solr/build/solr-core/test/J0/temp])
     [echo] 5 slowest tests:
[junit4:tophints] 186.14s | org.apache.solr.cloud.autoscaling.SearchRateTriggerIntegrationTest
[junit4:tophints] 124.96s | org.apache.solr.cloud.autoscaling.IndexSizeTriggerTest
[junit4:tophints] 117.61s | org.apache.solr.update.SoftAutoCommitTest
[junit4:tophints] 111.49s | org.apache.solr.cloud.ZkFailoverTest
[junit4:tophints] 106.28s | org.apache.solr.cloud.DeleteReplicaTest

-check-totals:

test-nocompile:

BUILD SUCCESSFUL
Total time: 2 minutes 43 seconds
[repro] Failures:
[repro]   0/5 failed: org.apache.solr.cloud.autoscaling.SearchRateTriggerTest
[repro] Exiting with code 0
+ mv lucene/build lucene/build.repro
+ mv solr/build solr/build.repro
+ mv lucene/build.orig lucene/build
+ mv solr/build.orig solr/build
Archiving artifacts
Setting ANT_1_8_2_HOME=/var/lib/jenkins/tools/hudson.tasks.Ant_AntInstallation/ANT_1.8.2
java.lang.InterruptedException: no matches found within 10000
	at hudson.FilePath$34.hasMatch(FilePath.java:2678)
	at hudson.FilePath$34.invoke(FilePath.java:2557)
	at hudson.FilePath$34.invoke(FilePath.java:2547)
	at hudson.FilePath.act(FilePath.java:1047)
	at hudson.FilePath.act(FilePath.java:1025)
	at hudson.FilePath.validateAntFileMask(FilePath.java:2547)
	at hudson.tasks.ArtifactArchiver.perform(ArtifactArchiver.java:243)
	at hudson.tasks.BuildStepCompatibilityLayer.perform(BuildStepCompatibilityLayer.java:81)
	at hudson.tasks.BuildStepMonitor$1.perform(BuildStepMonitor.java:20)
	at hudson.model.AbstractBuild$AbstractBuildExecution.perform(AbstractBuild.java:744)
	at hudson.model.AbstractBuild$AbstractBuildExecution.performAllBuildSteps(AbstractBuild.java:690)
	at hudson.model.Build$BuildExecution.post2(Build.java:186)
	at hudson.model.AbstractBuild$AbstractBuildExecution.post(AbstractBuild.java:635)
	at hudson.model.Run.execute(Run.java:1819)
	at hudson.model.FreeStyleBuild.run(FreeStyleBuild.java:43)
	at hudson.model.ResourceController.execute(ResourceController.java:97)
	at hudson.model.Executor.run(Executor.java:429)
No artifacts found that match the file pattern "**/*.events,heapdumps/**,**/*_pid*.log". Configuration error?
[WARNINGS] Parsing warnings in console log with parser Java Compiler (javac)
Setting ANT_1_8_2_HOME=/var/lib/jenkins/tools/hudson.tasks.Ant_AntInstallation/ANT_1.8.2
Setting ANT_1_8_2_HOME=/var/lib/jenkins/tools/hudson.tasks.Ant_AntInstallation/ANT_1.8.2
<Git Blamer> Using GitBlamer to create author and commit information for all warnings.
<Git Blamer> GIT_COMMIT=bc3926509002056a46efc579e175fe2c14ec1804, workspace=/var/lib/jenkins/workspace/Lucene-Solr-7.x-Linux
[WARNINGS] Computing warning deltas based on reference build #1964
Recording test results
Setting ANT_1_8_2_HOME=/var/lib/jenkins/tools/hudson.tasks.Ant_AntInstallation/ANT_1.8.2
Build step 'Publish JUnit test result report' changed build result to UNSTABLE
Email was triggered for: Unstable (Test Failures)
Sending email for trigger: Unstable (Test Failures)
Setting ANT_1_8_2_HOME=/var/lib/jenkins/tools/hudson.tasks.Ant_AntInstallation/ANT_1.8.2
Setting ANT_1_8_2_HOME=/var/lib/jenkins/tools/hudson.tasks.Ant_AntInstallation/ANT_1.8.2
Setting ANT_1_8_2_HOME=/var/lib/jenkins/tools/hudson.tasks.Ant_AntInstallation/ANT_1.8.2
Setting ANT_1_8_2_HOME=/var/lib/jenkins/tools/hudson.tasks.Ant_AntInstallation/ANT_1.8.2

Mime
View raw message