lucene-dev mailing list archives

Site index · List index
Message view « Date » · « Thread »
Top « Date » · « Thread »
From Policeman Jenkins Server <jenk...@thetaphi.de>
Subject [JENKINS] Lucene-Solr-master-Linux (64bit/jdk1.8.0_162) - Build # 22018 - Unstable!
Date Wed, 16 May 2018 07:53:48 GMT
Build: https://jenkins.thetaphi.de/job/Lucene-Solr-master-Linux/22018/
Java: 64bit/jdk1.8.0_162 -XX:-UseCompressedOops -XX:+UseSerialGC

1 tests failed.
FAILED:  org.apache.solr.client.solrj.embedded.LargeVolumeEmbeddedTest.testMultiThreaded

Error Message:
Captured an uncaught exception in thread: Thread[id=62, name=DocThread-1, state=RUNNABLE, group=TGRP-LargeVolumeEmbeddedTest]

Stack Trace:
com.carrotsearch.randomizedtesting.UncaughtExceptionError: Captured an uncaught exception in thread: Thread[id=62, name=DocThread-1, state=RUNNABLE, group=TGRP-LargeVolumeEmbeddedTest]
Caused by: java.lang.AssertionError: DocThread-1---Exception writing document id T1:86 to the index; possible analysis error.
	at __randomizedtesting.SeedInfo.seed([AD54FA5A09D362FA]:0)
	at org.junit.Assert.fail(Assert.java:93)
	at org.apache.solr.client.solrj.LargeVolumeTestBase$DocThread.run(LargeVolumeTestBase.java:128)




Build Log:
[...truncated 15723 lines...]
   [junit4] Suite: org.apache.solr.client.solrj.embedded.LargeVolumeEmbeddedTest
   [junit4]   2> Creating dataDir: /home/jenkins/workspace/Lucene-Solr-master-Linux/solr/build/solr-solrj/test/J0/temp/solr.client.solrj.embedded.LargeVolumeEmbeddedTest_AD54FA5A09D362FA-001/init-core-data-001
   [junit4]   2> 12666 WARN  (SUITE-LargeVolumeEmbeddedTest-seed#[AD54FA5A09D362FA]-worker) [    ] o.a.s.SolrTestCaseJ4 startTrackingSearchers: numOpens=22 numCloses=22
   [junit4]   2> 12667 INFO  (SUITE-LargeVolumeEmbeddedTest-seed#[AD54FA5A09D362FA]-worker) [    ] o.a.s.SolrTestCaseJ4 Using PointFields (NUMERIC_POINTS_SYSPROP=true) w/NUMERIC_DOCVALUES_SYSPROP=false
   [junit4]   2> 12668 INFO  (SUITE-LargeVolumeEmbeddedTest-seed#[AD54FA5A09D362FA]-worker) [    ] o.a.s.SolrTestCaseJ4 Randomized ssl (false) and clientAuth (true) via: @org.apache.solr.util.RandomizeSSL(reason=, ssl=NaN, value=NaN, clientAuth=NaN)
   [junit4]   2> 12668 INFO  (SUITE-LargeVolumeEmbeddedTest-seed#[AD54FA5A09D362FA]-worker) [    ] o.a.s.SolrTestCaseJ4 SecureRandom sanity checks: test.solr.allowed.securerandom=null & java.security.egd=file:/dev/./urandom
   [junit4]   2> 12685 INFO  (SUITE-LargeVolumeEmbeddedTest-seed#[AD54FA5A09D362FA]-worker) [    ] o.a.s.SolrTestCaseJ4 ####initCore
   [junit4]   2> 12699 WARN  (SUITE-LargeVolumeEmbeddedTest-seed#[AD54FA5A09D362FA]-worker) [    ] o.a.s.c.SolrConfig Couldn't add files from /home/jenkins/workspace/Lucene-Solr-master-Linux/solr/build/solr-solrj/test/J0/temp/solr.client.solrj.embedded.LargeVolumeEmbeddedTest_AD54FA5A09D362FA-001/tempDir-001/collection1/../../../../contrib/extraction/lib filtered by .*\.jar to classpath: /home/jenkins/workspace/Lucene-Solr-master-Linux/solr/build/solr-solrj/test/J0/temp/solr.client.solrj.embedded.LargeVolumeEmbeddedTest_AD54FA5A09D362FA-001/tempDir-001/collection1/../../../../contrib/extraction/lib
   [junit4]   2> 12699 WARN  (SUITE-LargeVolumeEmbeddedTest-seed#[AD54FA5A09D362FA]-worker) [    ] o.a.s.c.SolrConfig Couldn't add files from /home/jenkins/workspace/Lucene-Solr-master-Linux/solr/build/solr-solrj/test/J0/temp/solr.client.solrj.embedded.LargeVolumeEmbeddedTest_AD54FA5A09D362FA-001/tempDir-001/collection1/../../../../dist filtered by solr-cell-\d.*\.jar to classpath: /home/jenkins/workspace/Lucene-Solr-master-Linux/solr/build/solr-solrj/test/J0/temp/solr.client.solrj.embedded.LargeVolumeEmbeddedTest_AD54FA5A09D362FA-001/tempDir-001/collection1/../../../../dist
   [junit4]   2> 12699 WARN  (SUITE-LargeVolumeEmbeddedTest-seed#[AD54FA5A09D362FA]-worker) [    ] o.a.s.c.SolrConfig Couldn't add files from /home/jenkins/workspace/Lucene-Solr-master-Linux/solr/build/solr-solrj/test/J0/temp/solr.client.solrj.embedded.LargeVolumeEmbeddedTest_AD54FA5A09D362FA-001/tempDir-001/collection1/../../../../contrib/clustering/lib filtered by .*\.jar to classpath: /home/jenkins/workspace/Lucene-Solr-master-Linux/solr/build/solr-solrj/test/J0/temp/solr.client.solrj.embedded.LargeVolumeEmbeddedTest_AD54FA5A09D362FA-001/tempDir-001/collection1/../../../../contrib/clustering/lib
   [junit4]   2> 12699 WARN  (SUITE-LargeVolumeEmbeddedTest-seed#[AD54FA5A09D362FA]-worker) [    ] o.a.s.c.SolrConfig Couldn't add files from /home/jenkins/workspace/Lucene-Solr-master-Linux/solr/build/solr-solrj/test/J0/temp/solr.client.solrj.embedded.LargeVolumeEmbeddedTest_AD54FA5A09D362FA-001/tempDir-001/collection1/../../../../dist filtered by solr-clustering-\d.*\.jar to classpath: /home/jenkins/workspace/Lucene-Solr-master-Linux/solr/build/solr-solrj/test/J0/temp/solr.client.solrj.embedded.LargeVolumeEmbeddedTest_AD54FA5A09D362FA-001/tempDir-001/collection1/../../../../dist
   [junit4]   2> 12699 WARN  (SUITE-LargeVolumeEmbeddedTest-seed#[AD54FA5A09D362FA]-worker) [    ] o.a.s.c.SolrConfig Couldn't add files from /home/jenkins/workspace/Lucene-Solr-master-Linux/solr/build/solr-solrj/test/J0/temp/solr.client.solrj.embedded.LargeVolumeEmbeddedTest_AD54FA5A09D362FA-001/tempDir-001/collection1/../../../../contrib/langid/lib filtered by .*\.jar to classpath: /home/jenkins/workspace/Lucene-Solr-master-Linux/solr/build/solr-solrj/test/J0/temp/solr.client.solrj.embedded.LargeVolumeEmbeddedTest_AD54FA5A09D362FA-001/tempDir-001/collection1/../../../../contrib/langid/lib
   [junit4]   2> 12699 WARN  (SUITE-LargeVolumeEmbeddedTest-seed#[AD54FA5A09D362FA]-worker) [    ] o.a.s.c.SolrConfig Couldn't add files from /home/jenkins/workspace/Lucene-Solr-master-Linux/solr/build/solr-solrj/test/J0/temp/solr.client.solrj.embedded.LargeVolumeEmbeddedTest_AD54FA5A09D362FA-001/tempDir-001/collection1/../../../../dist filtered by solr-langid-\d.*\.jar to classpath: /home/jenkins/workspace/Lucene-Solr-master-Linux/solr/build/solr-solrj/test/J0/temp/solr.client.solrj.embedded.LargeVolumeEmbeddedTest_AD54FA5A09D362FA-001/tempDir-001/collection1/../../../../dist
   [junit4]   2> 12699 WARN  (SUITE-LargeVolumeEmbeddedTest-seed#[AD54FA5A09D362FA]-worker) [    ] o.a.s.c.SolrConfig Couldn't add files from /home/jenkins/workspace/Lucene-Solr-master-Linux/solr/build/solr-solrj/test/J0/temp/solr.client.solrj.embedded.LargeVolumeEmbeddedTest_AD54FA5A09D362FA-001/tempDir-001/collection1/../../../../dist filtered by solr-ltr-\d.*\.jar to classpath: /home/jenkins/workspace/Lucene-Solr-master-Linux/solr/build/solr-solrj/test/J0/temp/solr.client.solrj.embedded.LargeVolumeEmbeddedTest_AD54FA5A09D362FA-001/tempDir-001/collection1/../../../../dist
   [junit4]   2> 12700 WARN  (SUITE-LargeVolumeEmbeddedTest-seed#[AD54FA5A09D362FA]-worker) [    ] o.a.s.c.SolrConfig Couldn't add files from /home/jenkins/workspace/Lucene-Solr-master-Linux/solr/build/solr-solrj/test/J0/temp/solr.client.solrj.embedded.LargeVolumeEmbeddedTest_AD54FA5A09D362FA-001/tempDir-001/collection1/../../../../contrib/velocity/lib filtered by .*\.jar to classpath: /home/jenkins/workspace/Lucene-Solr-master-Linux/solr/build/solr-solrj/test/J0/temp/solr.client.solrj.embedded.LargeVolumeEmbeddedTest_AD54FA5A09D362FA-001/tempDir-001/collection1/../../../../contrib/velocity/lib
   [junit4]   2> 12700 WARN  (SUITE-LargeVolumeEmbeddedTest-seed#[AD54FA5A09D362FA]-worker) [    ] o.a.s.c.SolrConfig Couldn't add files from /home/jenkins/workspace/Lucene-Solr-master-Linux/solr/build/solr-solrj/test/J0/temp/solr.client.solrj.embedded.LargeVolumeEmbeddedTest_AD54FA5A09D362FA-001/tempDir-001/collection1/../../../../dist filtered by solr-velocity-\d.*\.jar to classpath: /home/jenkins/workspace/Lucene-Solr-master-Linux/solr/build/solr-solrj/test/J0/temp/solr.client.solrj.embedded.LargeVolumeEmbeddedTest_AD54FA5A09D362FA-001/tempDir-001/collection1/../../../../dist
   [junit4]   2> 12715 INFO  (SUITE-LargeVolumeEmbeddedTest-seed#[AD54FA5A09D362FA]-worker) [    ] o.a.s.u.SolrIndexConfig IndexWriter infoStream solr logging is enabled
   [junit4]   2> 12717 INFO  (SUITE-LargeVolumeEmbeddedTest-seed#[AD54FA5A09D362FA]-worker) [    ] o.a.s.c.SolrConfig Using Lucene MatchVersion: 8.0.0
   [junit4]   2> 12747 INFO  (SUITE-LargeVolumeEmbeddedTest-seed#[AD54FA5A09D362FA]-worker) [    ] o.a.s.s.IndexSchema [null] Schema name=example
   [junit4]   2> 12912 INFO  (SUITE-LargeVolumeEmbeddedTest-seed#[AD54FA5A09D362FA]-worker) [    ] o.a.s.r.RestManager Registered ManagedResource impl org.apache.solr.rest.schema.analysis.ManagedWordSetResource for path /schema/analysis/stopwords/english
   [junit4]   2> 12913 INFO  (SUITE-LargeVolumeEmbeddedTest-seed#[AD54FA5A09D362FA]-worker) [    ] o.a.s.r.RestManager Registered ManagedResource impl org.apache.solr.rest.schema.analysis.ManagedSynonymGraphFilterFactory$SynonymManager for path /schema/analysis/synonyms/english
   [junit4]   2> 12913 INFO  (SUITE-LargeVolumeEmbeddedTest-seed#[AD54FA5A09D362FA]-worker) [    ] o.a.s.r.RestManager Added observer of type org.apache.solr.rest.schema.analysis.ManagedStopFilterFactory to existing ManagedResource /schema/analysis/stopwords/english
   [junit4]   2> 12913 INFO  (SUITE-LargeVolumeEmbeddedTest-seed#[AD54FA5A09D362FA]-worker) [    ] o.a.s.r.RestManager Added observer of type org.apache.solr.rest.schema.analysis.ManagedSynonymGraphFilterFactory to existing ManagedResource /schema/analysis/synonyms/english
   [junit4]   2> 12914 INFO  (SUITE-LargeVolumeEmbeddedTest-seed#[AD54FA5A09D362FA]-worker) [    ] o.a.s.s.IndexSchema Loaded schema example/1.6 with uniqueid field id
   [junit4]   2> 12914 INFO  (SUITE-LargeVolumeEmbeddedTest-seed#[AD54FA5A09D362FA]-worker) [    ] o.a.s.r.RestManager Added observer of type org.apache.solr.rest.schema.analysis.ManagedStopFilterFactory to existing ManagedResource /schema/analysis/stopwords/english
   [junit4]   2> 12914 INFO  (SUITE-LargeVolumeEmbeddedTest-seed#[AD54FA5A09D362FA]-worker) [    ] o.a.s.r.RestManager Added observer of type org.apache.solr.rest.schema.analysis.ManagedSynonymGraphFilterFactory to existing ManagedResource /schema/analysis/synonyms/english
   [junit4]   2> 12914 INFO  (SUITE-LargeVolumeEmbeddedTest-seed#[AD54FA5A09D362FA]-worker) [    ] o.a.s.r.RestManager Added observer of type org.apache.solr.rest.schema.analysis.ManagedStopFilterFactory to existing ManagedResource /schema/analysis/stopwords/english
   [junit4]   2> 12914 INFO  (SUITE-LargeVolumeEmbeddedTest-seed#[AD54FA5A09D362FA]-worker) [    ] o.a.s.r.RestManager Added observer of type org.apache.solr.rest.schema.analysis.ManagedSynonymGraphFilterFactory to existing ManagedResource /schema/analysis/synonyms/english
   [junit4]   2> 12959 INFO  (SUITE-LargeVolumeEmbeddedTest-seed#[AD54FA5A09D362FA]-worker) [    ] o.a.s.m.r.SolrJmxReporter JMX monitoring for 'solr.node' (registry 'solr.node') enabled at server: com.sun.jmx.mbeanserver.JmxMBeanServer@5e64802b
   [junit4]   2> 12965 INFO  (SUITE-LargeVolumeEmbeddedTest-seed#[AD54FA5A09D362FA]-worker) [    ] o.a.s.m.r.SolrJmxReporter JMX monitoring for 'solr.jvm' (registry 'solr.jvm') enabled at server: com.sun.jmx.mbeanserver.JmxMBeanServer@5e64802b
   [junit4]   2> 12965 INFO  (SUITE-LargeVolumeEmbeddedTest-seed#[AD54FA5A09D362FA]-worker) [    ] o.a.s.m.r.SolrJmxReporter JMX monitoring for 'solr.jetty' (registry 'solr.jetty') enabled at server: com.sun.jmx.mbeanserver.JmxMBeanServer@5e64802b
   [junit4]   2> 12966 INFO  (coreLoadExecutor-19-thread-1) [    ] o.a.s.c.TransientSolrCoreCacheDefault Allocating transient cache for 2147483647 transient cores
   [junit4]   2> 12975 WARN  (coreLoadExecutor-19-thread-1) [    x:collection1] o.a.s.c.SolrConfig Couldn't add files from /home/jenkins/workspace/Lucene-Solr-master-Linux/solr/build/solr-solrj/test/J0/temp/solr.client.solrj.embedded.LargeVolumeEmbeddedTest_AD54FA5A09D362FA-001/tempDir-001/collection1/../../../../contrib/extraction/lib filtered by .*\.jar to classpath: /home/jenkins/workspace/Lucene-Solr-master-Linux/solr/build/solr-solrj/test/J0/temp/solr.client.solrj.embedded.LargeVolumeEmbeddedTest_AD54FA5A09D362FA-001/tempDir-001/collection1/../../../../contrib/extraction/lib
   [junit4]   2> 12975 WARN  (coreLoadExecutor-19-thread-1) [    x:collection1] o.a.s.c.SolrConfig Couldn't add files from /home/jenkins/workspace/Lucene-Solr-master-Linux/solr/build/solr-solrj/test/J0/temp/solr.client.solrj.embedded.LargeVolumeEmbeddedTest_AD54FA5A09D362FA-001/tempDir-001/collection1/../../../../dist filtered by solr-cell-\d.*\.jar to classpath: /home/jenkins/workspace/Lucene-Solr-master-Linux/solr/build/solr-solrj/test/J0/temp/solr.client.solrj.embedded.LargeVolumeEmbeddedTest_AD54FA5A09D362FA-001/tempDir-001/collection1/../../../../dist
   [junit4]   2> 12975 WARN  (coreLoadExecutor-19-thread-1) [    x:collection1] o.a.s.c.SolrConfig Couldn't add files from /home/jenkins/workspace/Lucene-Solr-master-Linux/solr/build/solr-solrj/test/J0/temp/solr.client.solrj.embedded.LargeVolumeEmbeddedTest_AD54FA5A09D362FA-001/tempDir-001/collection1/../../../../contrib/clustering/lib filtered by .*\.jar to classpath: /home/jenkins/workspace/Lucene-Solr-master-Linux/solr/build/solr-solrj/test/J0/temp/solr.client.solrj.embedded.LargeVolumeEmbeddedTest_AD54FA5A09D362FA-001/tempDir-001/collection1/../../../../contrib/clustering/lib
   [junit4]   2> 12975 WARN  (coreLoadExecutor-19-thread-1) [    x:collection1] o.a.s.c.SolrConfig Couldn't add files from /home/jenkins/workspace/Lucene-Solr-master-Linux/solr/build/solr-solrj/test/J0/temp/solr.client.solrj.embedded.LargeVolumeEmbeddedTest_AD54FA5A09D362FA-001/tempDir-001/collection1/../../../../dist filtered by solr-clustering-\d.*\.jar to classpath: /home/jenkins/workspace/Lucene-Solr-master-Linux/solr/build/solr-solrj/test/J0/temp/solr.client.solrj.embedded.LargeVolumeEmbeddedTest_AD54FA5A09D362FA-001/tempDir-001/collection1/../../../../dist
   [junit4]   2> 12976 WARN  (coreLoadExecutor-19-thread-1) [    x:collection1] o.a.s.c.SolrConfig Couldn't add files from /home/jenkins/workspace/Lucene-Solr-master-Linux/solr/build/solr-solrj/test/J0/temp/solr.client.solrj.embedded.LargeVolumeEmbeddedTest_AD54FA5A09D362FA-001/tempDir-001/collection1/../../../../contrib/langid/lib filtered by .*\.jar to classpath: /home/jenkins/workspace/Lucene-Solr-master-Linux/solr/build/solr-solrj/test/J0/temp/solr.client.solrj.embedded.LargeVolumeEmbeddedTest_AD54FA5A09D362FA-001/tempDir-001/collection1/../../../../contrib/langid/lib
   [junit4]   2> 12976 WARN  (coreLoadExecutor-19-thread-1) [    x:collection1] o.a.s.c.SolrConfig Couldn't add files from /home/jenkins/workspace/Lucene-Solr-master-Linux/solr/build/solr-solrj/test/J0/temp/solr.client.solrj.embedded.LargeVolumeEmbeddedTest_AD54FA5A09D362FA-001/tempDir-001/collection1/../../../../dist filtered by solr-langid-\d.*\.jar to classpath: /home/jenkins/workspace/Lucene-Solr-master-Linux/solr/build/solr-solrj/test/J0/temp/solr.client.solrj.embedded.LargeVolumeEmbeddedTest_AD54FA5A09D362FA-001/tempDir-001/collection1/../../../../dist
   [junit4]   2> 12976 WARN  (coreLoadExecutor-19-thread-1) [    x:collection1] o.a.s.c.SolrConfig Couldn't add files from /home/jenkins/workspace/Lucene-Solr-master-Linux/solr/build/solr-solrj/test/J0/temp/solr.client.solrj.embedded.LargeVolumeEmbeddedTest_AD54FA5A09D362FA-001/tempDir-001/collection1/../../../../dist filtered by solr-ltr-\d.*\.jar to classpath: /home/jenkins/workspace/Lucene-Solr-master-Linux/solr/build/solr-solrj/test/J0/temp/solr.client.solrj.embedded.LargeVolumeEmbeddedTest_AD54FA5A09D362FA-001/tempDir-001/collection1/../../../../dist
   [junit4]   2> 12976 WARN  (coreLoadExecutor-19-thread-1) [    x:collection1] o.a.s.c.SolrConfig Couldn't add files from /home/jenkins/workspace/Lucene-Solr-master-Linux/solr/build/solr-solrj/test/J0/temp/solr.client.solrj.embedded.LargeVolumeEmbeddedTest_AD54FA5A09D362FA-001/tempDir-001/collection1/../../../../contrib/velocity/lib filtered by .*\.jar to classpath: /home/jenkins/workspace/Lucene-Solr-master-Linux/solr/build/solr-solrj/test/J0/temp/solr.client.solrj.embedded.LargeVolumeEmbeddedTest_AD54FA5A09D362FA-001/tempDir-001/collection1/../../../../contrib/velocity/lib
   [junit4]   2> 12976 WARN  (coreLoadExecutor-19-thread-1) [    x:collection1] o.a.s.c.SolrConfig Couldn't add files from /home/jenkins/workspace/Lucene-Solr-master-Linux/solr/build/solr-solrj/test/J0/temp/solr.client.solrj.embedded.LargeVolumeEmbeddedTest_AD54FA5A09D362FA-001/tempDir-001/collection1/../../../../dist filtered by solr-velocity-\d.*\.jar to classpath: /home/jenkins/workspace/Lucene-Solr-master-Linux/solr/build/solr-solrj/test/J0/temp/solr.client.solrj.embedded.LargeVolumeEmbeddedTest_AD54FA5A09D362FA-001/tempDir-001/collection1/../../../../dist
   [junit4]   2> 12982 INFO  (coreLoadExecutor-19-thread-1) [    x:collection1] o.a.s.u.SolrIndexConfig IndexWriter infoStream solr logging is enabled
   [junit4]   2> 12983 INFO  (coreLoadExecutor-19-thread-1) [    x:collection1] o.a.s.c.SolrConfig Using Lucene MatchVersion: 8.0.0
   [junit4]   2> 13004 INFO  (coreLoadExecutor-19-thread-1) [    x:collection1] o.a.s.s.IndexSchema [collection1] Schema name=example
   [junit4]   2> 13135 INFO  (coreLoadExecutor-19-thread-1) [    x:collection1] o.a.s.r.RestManager Registered ManagedResource impl org.apache.solr.rest.schema.analysis.ManagedWordSetResource for path /schema/analysis/stopwords/english
   [junit4]   2> 13136 INFO  (coreLoadExecutor-19-thread-1) [    x:collection1] o.a.s.r.RestManager Registered ManagedResource impl org.apache.solr.rest.schema.analysis.ManagedSynonymGraphFilterFactory$SynonymManager for path /schema/analysis/synonyms/english
   [junit4]   2> 13136 INFO  (coreLoadExecutor-19-thread-1) [    x:collection1] o.a.s.r.RestManager Added observer of type org.apache.solr.rest.schema.analysis.ManagedStopFilterFactory to existing ManagedResource /schema/analysis/stopwords/english
   [junit4]   2> 13136 INFO  (coreLoadExecutor-19-thread-1) [    x:collection1] o.a.s.r.RestManager Added observer of type org.apache.solr.rest.schema.analysis.ManagedSynonymGraphFilterFactory to existing ManagedResource /schema/analysis/synonyms/english
   [junit4]   2> 13136 INFO  (coreLoadExecutor-19-thread-1) [    x:collection1] o.a.s.s.IndexSchema Loaded schema example/1.6 with uniqueid field id
   [junit4]   2> 13136 INFO  (coreLoadExecutor-19-thread-1) [    x:collection1] o.a.s.r.RestManager Added observer of type org.apache.solr.rest.schema.analysis.ManagedStopFilterFactory to existing ManagedResource /schema/analysis/stopwords/english
   [junit4]   2> 13136 INFO  (coreLoadExecutor-19-thread-1) [    x:collection1] o.a.s.r.RestManager Added observer of type org.apache.solr.rest.schema.analysis.ManagedSynonymGraphFilterFactory to existing ManagedResource /schema/analysis/synonyms/english
   [junit4]   2> 13136 INFO  (coreLoadExecutor-19-thread-1) [    x:collection1] o.a.s.r.RestManager Added observer of type org.apache.solr.rest.schema.analysis.ManagedStopFilterFactory to existing ManagedResource /schema/analysis/stopwords/english
   [junit4]   2> 13137 INFO  (coreLoadExecutor-19-thread-1) [    x:collection1] o.a.s.r.RestManager Added observer of type org.apache.solr.rest.schema.analysis.ManagedSynonymGraphFilterFactory to existing ManagedResource /schema/analysis/synonyms/english
   [junit4]   2> 13149 INFO  (coreLoadExecutor-19-thread-1) [    x:collection1] o.a.s.c.CoreContainer Creating SolrCore 'collection1' using configuration from instancedir /home/jenkins/workspace/Lucene-Solr-master-Linux/solr/build/solr-solrj/test/J0/temp/solr.client.solrj.embedded.LargeVolumeEmbeddedTest_AD54FA5A09D362FA-001/tempDir-001/collection1, trusted=true
   [junit4]   2> 13149 INFO  (coreLoadExecutor-19-thread-1) [    x:collection1] o.a.s.m.r.SolrJmxReporter JMX monitoring for 'solr.core.collection1' (registry 'solr.core.collection1') enabled at server: com.sun.jmx.mbeanserver.JmxMBeanServer@5e64802b
   [junit4]   2> 13149 INFO  (coreLoadExecutor-19-thread-1) [    x:collection1] o.a.s.c.SolrCore solr.RecoveryStrategy.Builder
   [junit4]   2> 13149 INFO  (coreLoadExecutor-19-thread-1) [    x:collection1] o.a.s.c.SolrCore [[collection1] ] Opening new SolrCore at [/home/jenkins/workspace/Lucene-Solr-master-Linux/solr/build/solr-solrj/test/J0/temp/solr.client.solrj.embedded.LargeVolumeEmbeddedTest_AD54FA5A09D362FA-001/tempDir-001/collection1], dataDir=[/home/jenkins/workspace/Lucene-Solr-master-Linux/solr/build/solr-solrj/test/J0/temp/solr.client.solrj.embedded.LargeVolumeEmbeddedTest_AD54FA5A09D362FA-001/init-core-data-001/]
   [junit4]   2> 13151 INFO  (coreLoadExecutor-19-thread-1) [    x:collection1] o.a.s.u.LoggingInfoStream [IFD][coreLoadExecutor-19-thread-1]: init: current segments file is "segments"; deletionPolicy=org.apache.solr.core.IndexDeletionPolicyWrapper@526d5c86
   [junit4]   2> 13151 INFO  (coreLoadExecutor-19-thread-1) [    x:collection1] o.a.s.u.LoggingInfoStream [IFD][coreLoadExecutor-19-thread-1]: now checkpoint "" [0 segments ; isCommit = false]
   [junit4]   2> 13152 INFO  (coreLoadExecutor-19-thread-1) [    x:collection1] o.a.s.u.LoggingInfoStream [IFD][coreLoadExecutor-19-thread-1]: 0 msec to checkpoint
   [junit4]   2> 13152 INFO  (coreLoadExecutor-19-thread-1) [    x:collection1] o.a.s.u.LoggingInfoStream [IW][coreLoadExecutor-19-thread-1]: init: create=true reader=null
   [junit4]   2> 13152 INFO  (coreLoadExecutor-19-thread-1) [    x:collection1] o.a.s.u.LoggingInfoStream [IW][coreLoadExecutor-19-thread-1]: 
   [junit4]   2> dir=RawDirectoryWrapper(RAMDirectory@4a8c74ff lockFactory=org.apache.lucene.store.SingleInstanceLockFactory@50d3147b)
   [junit4]   2> index=
   [junit4]   2> version=8.0.0
   [junit4]   2> analyzer=org.apache.solr.update.SolrIndexConfig$DelayedSchemaAnalyzer
   [junit4]   2> ramBufferSizeMB=100.0
   [junit4]   2> maxBufferedDocs=-1
   [junit4]   2> mergedSegmentWarmer=null
   [junit4]   2> delPolicy=org.apache.solr.core.IndexDeletionPolicyWrapper
   [junit4]   2> commit=null
   [junit4]   2> openMode=CREATE
   [junit4]   2> similarity=org.apache.solr.search.similarities.SchemaSimilarityFactory$SchemaSimilarity
   [junit4]   2> mergeScheduler=ConcurrentMergeScheduler: maxThreadCount=-1, maxMergeCount=-1, ioThrottle=true
   [junit4]   2> codec=Lucene70
   [junit4]   2> infoStream=org.apache.solr.update.LoggingInfoStream
   [junit4]   2> mergePolicy=[TieredMergePolicy: maxMergeAtOnce=10, maxMergeAtOnceExplicit=30, maxMergedSegmentMB=5120.0, floorSegmentMB=2.0, forceMergeDeletesPctAllowed=10.0, segmentsPerTier=10.0, maxCFSSegmentSizeMB=8.796093022207999E12, noCFSRatio=0.1
   [junit4]   2> indexerThreadPool=org.apache.lucene.index.DocumentsWriterPerThreadPool@2e26edd5
   [junit4]   2> readerPooling=true
   [junit4]   2> perThreadHardLimitMB=1945
   [junit4]   2> useCompoundFile=false
   [junit4]   2> commitOnClose=true
   [junit4]   2> indexSort=null
   [junit4]   2> checkPendingFlushOnUpdate=true
   [junit4]   2> softDeletesField=null
   [junit4]   2> writer=org.apache.solr.update.SolrIndexWriter@7a44f62
   [junit4]   2> 
   [junit4]   2> 13160 INFO  (coreLoadExecutor-19-thread-1) [    x:collection1] o.a.s.u.LoggingInfoStream [IW][coreLoadExecutor-19-thread-1]: MMapDirectory.UNMAP_SUPPORTED=true
   [junit4]   2> 13160 INFO  (coreLoadExecutor-19-thread-1) [    x:collection1] o.a.s.u.LoggingInfoStream [IW][coreLoadExecutor-19-thread-1]: now flush at close
   [junit4]   2> 13160 INFO  (coreLoadExecutor-19-thread-1) [    x:collection1] o.a.s.u.LoggingInfoStream [IW][coreLoadExecutor-19-thread-1]:   start flush: applyAllDeletes=true
   [junit4]   2> 13160 INFO  (coreLoadExecutor-19-thread-1) [    x:collection1] o.a.s.u.LoggingInfoStream [IW][coreLoadExecutor-19-thread-1]:   index before flush 
   [junit4]   2> 13160 INFO  (coreLoadExecutor-19-thread-1) [    x:collection1] o.a.s.u.LoggingInfoStream [DW][coreLoadExecutor-19-thread-1]: startFullFlush
   [junit4]   2> 13160 INFO  (coreLoadExecutor-19-thread-1) [    x:collection1] o.a.s.u.LoggingInfoStream [DW][coreLoadExecutor-19-thread-1]: coreLoadExecutor-19-thread-1 finishFullFlush success=true
   [junit4]   2> 13160 INFO  (coreLoadExecutor-19-thread-1) [    x:collection1] o.a.s.u.LoggingInfoStream [IW][coreLoadExecutor-19-thread-1]: now apply all deletes for all segments buffered updates bytesUsed=0 reader pool bytesUsed=0
   [junit4]   2> 13160 INFO  (coreLoadExecutor-19-thread-1) [    x:collection1] o.a.s.u.LoggingInfoStream [BD][coreLoadExecutor-19-thread-1]: waitApply: no deletes to apply
   [junit4]   2> 13160 INFO  (coreLoadExecutor-19-thread-1) [    x:collection1] o.a.s.u.LoggingInfoStream [MS][coreLoadExecutor-19-thread-1]: initDynamicDefaults spins=true maxThreadCount=1 maxMergeCount=6
   [junit4]   2> 13161 INFO  (coreLoadExecutor-19-thread-1) [    x:collection1] o.a.s.u.LoggingInfoStream [MS][coreLoadExecutor-19-thread-1]: updateMergeThreads ioThrottle=true targetMBPerSec=10240.0 MB/sec
   [junit4]   2> 13161 INFO  (coreLoadExecutor-19-thread-1) [    x:collection1] o.a.s.u.LoggingInfoStream [MS][coreLoadExecutor-19-thread-1]: now merge
   [junit4]   2> 13161 INFO  (coreLoadExecutor-19-thread-1) [    x:collection1] o.a.s.u.LoggingInfoStream [MS][coreLoadExecutor-19-thread-1]:   index: 
   [junit4]   2> 13161 INFO  (coreLoadExecutor-19-thread-1) [    x:collection1] o.a.s.u.LoggingInfoStream [MS][coreLoadExecutor-19-thread-1]:   no more merges pending; now return
   [junit4]   2> 13161 INFO  (coreLoadExecutor-19-thread-1) [    x:collection1] o.a.s.u.LoggingInfoStream [IW][coreLoadExecutor-19-thread-1]: waitForMerges
   [junit4]   2> 13161 INFO  (coreLoadExecutor-19-thread-1) [    x:collection1] o.a.s.u.LoggingInfoStream [IW][coreLoadExecutor-19-thread-1]: waitForMerges done
   [junit4]   2> 13161 INFO  (coreLoadExecutor-19-thread-1) [    x:collection1] o.a.s.u.LoggingInfoStream [IW][coreLoadExecutor-19-thread-1]: commit: start
   [junit4]   2> 13161 INFO  (coreLoadExecutor-19-thread-1) [    x:collection1] o.a.s.u.LoggingInfoStream [IW][coreLoadExecutor-19-thread-1]: commit: enter lock
   [junit4]   2> 13161 INFO  (coreLoadExecutor-19-thread-1) [    x:collection1] o.a.s.u.LoggingInfoStream [IW][coreLoadExecutor-19-thread-1]: commit: now prepare
   [junit4]   2> 13161 INFO  (coreLoadExecutor-19-thread-1) [    x:collection1] o.a.s.u.LoggingInfoStream [IW][coreLoadExecutor-19-thread-1]: prepareCommit: flush
   [junit4]   2> 13162 INFO  (coreLoadExecutor-19-thread-1) [    x:collection1] o.a.s.u.LoggingInfoStream [IW][coreLoadExecutor-19-thread-1]:   index before flush 
   [junit4]   2> 13162 INFO  (coreLoadExecutor-19-thread-1) [    x:collection1] o.a.s.u.LoggingInfoStream [DW][coreLoadExecutor-19-thread-1]: startFullFlush
   [junit4]   2> 13162 INFO  (coreLoadExecutor-19-thread-1) [    x:collection1] o.a.s.u.LoggingInfoStream [IW][coreLoadExecutor-19-thread-1]: now apply all deletes for all segments buffered updates bytesUsed=0 reader pool bytesUsed=0
   [junit4]   2> 13162 INFO  (coreLoadExecutor-19-thread-1) [    x:collection1] o.a.s.u.LoggingInfoStream [BD][coreLoadExecutor-19-thread-1]: waitApply: no deletes to apply
   [junit4]   2> 13162 INFO  (coreLoadExecutor-19-thread-1) [    x:collection1] o.a.s.u.LoggingInfoStream [DW][coreLoadExecutor-19-thread-1]: coreLoadExecutor-19-thread-1 finishFullFlush success=true
   [junit4]   2> 13162 INFO  (coreLoadExecutor-19-thread-1) [    x:collection1] o.a.s.u.LoggingInfoStream [IW][coreLoadExecutor-19-thread-1]: startCommit(): start
   [junit4]   2> 13162 INFO  (coreLoadExecutor-19-thread-1) [    x:collection1] o.a.s.u.LoggingInfoStream [IW][coreLoadExecutor-19-thread-1]: startCommit index= changeCount=2
   [junit4]   2> 13162 INFO  (coreLoadExecutor-19-thread-1) [    x:collection1] o.a.s.u.LoggingInfoStream [IW][coreLoadExecutor-19-thread-1]: startCommit: wrote pending segments file "pending_segments_1"
   [junit4]   2> 13162 INFO  (coreLoadExecutor-19-thread-1) [    x:collection1] o.a.s.u.LoggingInfoStream [IW][coreLoadExecutor-19-thread-1]: done all syncs: []
   [junit4]   2> 13162 INFO  (coreLoadExecutor-19-thread-1) [    x:collection1] o.a.s.u.LoggingInfoStream [IW][coreLoadExecutor-19-thread-1]: commit: pendingCommit != null
   [junit4]   2> 13162 INFO  (coreLoadExecutor-19-thread-1) [    x:collection1] o.a.s.u.LoggingInfoStream [IW][coreLoadExecutor-19-thread-1]: commit: done writing segments file "segments_1"
   [junit4]   2> 13162 INFO  (coreLoadExecutor-19-thread-1) [    x:collection1] o.a.s.u.LoggingInfoStream [IFD][coreLoadExecutor-19-thread-1]: now checkpoint "" [0 segments ; isCommit = true]
   [junit4]   2> 13163 INFO  (coreLoadExecutor-19-thread-1) [    x:collection1] o.a.s.u.LoggingInfoStream [IFD][coreLoadExecutor-19-thread-1]: 0 msec to checkpoint
   [junit4]   2> 13163 INFO  (coreLoadExecutor-19-thread-1) [    x:collection1] o.a.s.u.LoggingInfoStream [IW][coreLoadExecutor-19-thread-1]: commit: took 1.2 msec
   [junit4]   2> 13163 INFO  (coreLoadExecutor-19-thread-1) [    x:collection1] o.a.s.u.LoggingInfoStream [IW][coreLoadExecutor-19-thread-1]: commit: done
   [junit4]   2> 13163 INFO  (coreLoadExecutor-19-thread-1) [    x:collection1] o.a.s.u.LoggingInfoStream [IW][coreLoadExecutor-19-thread-1]: rollback
   [junit4]   2> 13163 INFO  (coreLoadExecutor-19-thread-1) [    x:collection1] o.a.s.u.LoggingInfoStream [IW][coreLoadExecutor-19-thread-1]: all running merges have aborted
   [junit4]   2> 13163 INFO  (coreLoadExecutor-19-thread-1) [    x:collection1] o.a.s.u.LoggingInfoStream [IW][coreLoadExecutor-19-thread-1]: rollback: done finish merges
   [junit4]   2> 13163 INFO  (coreLoadExecutor-19-thread-1) [    x:collection1] o.a.s.u.LoggingInfoStream [DW][coreLoadExecutor-19-thread-1]: abort
   [junit4]   2> 13163 INFO  (coreLoadExecutor-19-thread-1) [    x:collection1] o.a.s.u.LoggingInfoStream [DW][coreLoadExecutor-19-thread-1]: done abort success=true
   [junit4]   2> 13163 INFO  (coreLoadExecutor-19-thread-1) [    x:collection1] o.a.s.u.LoggingInfoStream [IW][coreLoadExecutor-19-thread-1]: rollback: infos=
   [junit4]   2> 13163 INFO  (coreLoadExecutor-19-thread-1) [    x:collection1] o.a.s.u.LoggingInfoStream [IFD][coreLoadExecutor-19-thread-1]: now checkpoint "" [0 segments ; isCommit = false]
   [junit4]   2> 13163 INFO  (coreLoadExecutor-19-thread-1) [    x:collection1] o.a.s.u.LoggingInfoStream [IFD][coreLoadExecutor-19-thread-1]: 0 msec to checkpoint
   [junit4]   2> 13164 INFO  (coreLoadExecutor-19-thread-1) [    x:collection1] o.a.s.r.XSLTResponseWriter xsltCacheLifetimeSeconds=5
   [junit4]   2> 13209 INFO  (coreLoadExecutor-19-thread-1) [    x:collection1] o.a.s.u.UpdateHandler Using UpdateLog implementation: org.apache.solr.update.UpdateLog
   [junit4]   2> 13209 INFO  (coreLoadExecutor-19-thread-1) [    x:collection1] o.a.s.u.UpdateLog Initializing UpdateLog: dataDir= defaultSyncLevel=FLUSH numRecordsToKeep=100 maxNumLogsToKeep=10 numVersionBuckets=65536
   [junit4]   2> 13210 INFO  (coreLoadExecutor-19-thread-1) [    x:collection1] o.a.s.u.CommitTracker Hard AutoCommit: if uncommited for 15000ms; 
   [junit4]   2> 13210 INFO  (coreLoadExecutor-19-thread-1) [    x:collection1] o.a.s.u.CommitTracker Soft AutoCommit: disabled
   [junit4]   2> 13211 INFO  (coreLoadExecutor-19-thread-1) [    x:collection1] o.a.s.u.LoggingInfoStream [IFD][coreLoadExecutor-19-thread-1]: init: current segments file is "segments_1"; deletionPolicy=org.apache.solr.core.IndexDeletionPolicyWrapper@526d5c86
   [junit4]   2> 13212 INFO  (coreLoadExecutor-19-thread-1) [    x:collection1] o.a.s.u.LoggingInfoStream [IFD][coreLoadExecutor-19-thread-1]: init: load commit "segments_1"
   [junit4]   2> 13212 INFO  (coreLoadExecutor-19-thread-1) [    x:collection1] o.a.s.u.LoggingInfoStream [IFD][coreLoadExecutor-19-thread-1]: now checkpoint "" [0 segments ; isCommit = false]
   [junit4]   2> 13212 INFO  (coreLoadExecutor-19-thread-1) [    x:collection1] o.a.s.u.LoggingInfoStream [IFD][coreLoadExecutor-19-thread-1]: 0 msec to checkpoint
   [junit4]   2> 13212 INFO  (coreLoadExecutor-19-thread-1) [    x:collection1] o.a.s.u.LoggingInfoStream [IW][coreLoadExecutor-19-thread-1]: init: create=false reader=null
   [junit4]   2> 13212 INFO  (coreLoadExecutor-19-thread-1) [    x:collection1] o.a.s.u.LoggingInfoStream [IW][coreLoadExecutor-19-thread-1]: 
   [junit4]   2> dir=RawDirectoryWrapper(RAMDirectory@4a8c74ff lockFactory=org.apache.lucene.store.SingleInstanceLockFactory@50d3147b)
   [junit4]   2> index=
   [junit4]   2> version=8.0.0
   [junit4]   2> analyzer=org.apache.solr.update.SolrIndexConfig$DelayedSchemaAnalyzer
   [junit4]   2> ramBufferSizeMB=100.0
   [junit4]   2> maxBufferedDocs=-1
   [junit4]   2> mergedSegmentWarmer=null
   [junit4]   2> delPolicy=org.apache.solr.core.IndexDeletionPolicyWrapper
   [junit4]   2> commit=null
   [junit4]   2> openMode=APPEND
   [junit4]   2> similarity=org.apache.solr.search.similarities.SchemaSimilarityFactory$SchemaSimilarity
   [junit4]   2> mergeScheduler=ConcurrentMergeScheduler: maxThreadCount=-1, maxMergeCount=-1, ioThrottle=true
   [junit4]   2> codec=Lucene70
   [junit4]   2> infoStream=org.apache.solr.update.LoggingInfoStream
   [junit4]   2> mergePolicy=[TieredMergePolicy: maxMergeAtOnce=10, maxMergeAtOnceExplicit=30, maxMergedSegmentMB=5120.0, floorSegmentMB=2.0, forceMergeDeletesPctAllowed=10.0, segmentsPerTier=10.0, maxCFSSegmentSizeMB=8.796093022207999E12, noCFSRatio=0.1
   [junit4]   2> indexerThreadPool=org.apache.lucene.index.DocumentsWriterPerThreadPool@571bf29c
   [junit4]   2> readerPooling=true
   [junit4]   2> perThreadHardLimitMB=1945
   [junit4]   2> useCompoundFile=false
   [junit4]   2> commitOnClose=true
   [junit4]   2> indexSort=null
   [junit4]   2> checkPendingFlushOnUpdate=true
   [junit4]   2> softDeletesField=null
   [junit4]   2> writer=org.apache.solr.update.SolrIndexWriter@2a0bc743
   [junit4]   2> 
   [junit4]   2> 13212 INFO  (coreLoadExecutor-19-thread-1) [    x:collection1] o.a.s.u.LoggingInfoStream [IW][coreLoadExecutor-19-thread-1]: MMapDirectory.UNMAP_SUPPORTED=true
   [junit4]   2> 13212 INFO  (coreLoadExecutor-19-thread-1) [    x:collection1] o.a.s.u.LoggingInfoStream [IW][coreLoadExecutor-19-thread-1]: flush at getReader
   [junit4]   2> 13212 INFO  (coreLoadExecutor-19-thread-1) [    x:collection1] o.a.s.u.LoggingInfoStream [DW][coreLoadExecutor-19-thread-1]: startFullFlush
   [junit4]   2> 13212 INFO  (coreLoadExecutor-19-thread-1) [    x:collection1] o.a.s.u.LoggingInfoStream [IW][coreLoadExecutor-19-thread-1]: now apply all deletes for all segments buffered updates bytesUsed=0 reader pool bytesUsed=0
   [junit4]   2> 13212 INFO  (coreLoadExecutor-19-thread-1) [    x:collection1] o.a.s.u.LoggingInfoStream [BD][coreLoadExecutor-19-thread-1]: waitApply: no deletes to apply
   [junit4]   2> 13212 INFO  (coreLoadExecutor-19-thread-1) [    x:collection1] o.a.s.u.LoggingInfoStream [IW][coreLoadExecutor-19-thread-1]: incRefDeleter for NRT reader version=2 segments=
   [junit4]   2> 13212 INFO  (coreLoadExecutor-19-thread-1) [    x:collection1] o.a.s.u.LoggingInfoStream [IW][coreLoadExecutor-19-thread-1]: return reader version=2 reader=StandardDirectoryReader(segments_1:2:nrt)
   [junit4]   2> 13212 INFO  (coreLoadExecutor-19-thread-1) [    x:collection1] o.a.s.u.LoggingInfoStream [DW][coreLoadExecutor-19-thread-1]: coreLoadExecutor-19-thread-1 finishFullFlush success=true
   [junit4]   2> 13212 INFO  (coreLoadExecutor-19-thread-1) [    x:collection1] o.a.s.u.LoggingInfoStream [IW][coreLoadExecutor-19-thread-1]: getReader took 0 msec
   [junit4]   2> 13212 INFO  (coreLoadExecutor-19-thread-1) [    x:collection1] o.a.s.s.SolrIndexSearcher Opening [Searcher@798dd73f[collection1] main]
   [junit4]   2> 13213 INFO  (coreLoadExecutor-19-thread-1) [    x:collection1] o.a.s.r.ManagedResourceStorage File-based storage initialized to use dir: /home/jenkins/workspace/Lucene-Solr-master-Linux/solr/build/solr-solrj/test/J0/temp/solr.client.solrj.embedded.LargeVolumeEmbeddedTest_AD54FA5A09D362FA-001/tempDir-001/collection1/conf
   [junit4]   2> 13213 INFO  (coreLoadExecutor-19-thread-1) [    x:collection1] o.a.s.r.ManagedResourceStorage Loaded LinkedHashMap at path _rest_managed.json using file:dir=/home/jenkins/workspace/Lucene-Solr-master-Linux/solr/build/solr-solrj/test/J0/temp/solr.client.solrj.embedded.LargeVolumeEmbeddedTest_AD54FA5A09D362FA-001/tempDir-001/collection1/conf
   [junit4]   2> 13213 INFO  (coreLoadExecutor-19-thread-1) [    x:collection1] o.a.s.r.ManagedResource Loaded initArgs {} for /rest/managed
   [junit4]   2> 13214 INFO  (coreLoadExecutor-19-thread-1) [    x:collection1] o.a.s.r.ManagedResourceStorage Loaded LinkedHashMap at path _schema_analysis_stopwords_english.json using file:dir=/home/jenkins/workspace/Lucene-Solr-master-Linux/solr/build/solr-solrj/test/J0/temp/solr.client.solrj.embedded.LargeVolumeEmbeddedTest_AD54FA5A09D362FA-001/tempDir-001/collection1/conf
   [junit4]   2> 13214 INFO  (coreLoadExecutor-19-thread-1) [    x:collection1] o.a.s.r.ManagedResource Loaded initArgs {ignoreCase=true} for /schema/analysis/stopwords/english
   [junit4]   2> 13214 INFO  (coreLoadExecutor-19-thread-1) [    x:collection1] o.a.s.r.s.a.ManagedWordSetResource Loaded 35 words for /schema/analysis/stopwords/english
   [junit4]   2> 13214 INFO  (coreLoadExecutor-19-thread-1) [    x:collection1] o.a.s.r.ManagedResource Notified 4 observers of /schema/analysis/stopwords/english
   [junit4]   2> 13215 INFO  (coreLoadExecutor-19-thread-1) [    x:collection1] o.a.s.r.ManagedResourceStorage Loaded LinkedHashMap at path _schema_analysis_synonyms_english.json using file:dir=/home/jenkins/workspace/Lucene-Solr-master-Linux/solr/build/solr-solrj/test/J0/temp/solr.client.solrj.embedded.LargeVolumeEmbeddedTest_AD54FA5A09D362FA-001/tempDir-001/collection1/conf
   [junit4]   2> 13215 INFO  (coreLoadExecutor-19-thread-1) [    x:collection1] o.a.s.r.ManagedResource Loaded initArgs {ignoreCase=true,format=solr} for /schema/analysis/synonyms/english
   [junit4]   2> 13216 INFO  (coreLoadExecutor-19-thread-1) [    x:collection1] o.a.s.r.s.a.ManagedSynonymGraphFilterFactory Loaded 3 synonym mappings for /schema/analysis/synonyms/english
   [junit4]   2> 13217 INFO  (coreLoadExecutor-19-thread-1) [    x:collection1] o.a.s.r.ManagedResource Notified 4 observers of /schema/analysis/synonyms/english
   [junit4]   2> 13217 INFO  (coreLoadExecutor-19-thread-1) [    x:collection1] o.a.s.h.c.SpellCheckComponent Initializing spell checkers
   [junit4]   2> 13217 INFO  (coreLoadExecutor-19-thread-1) [    x:collection1] o.a.s.s.DirectSolrSpellChecker init: {name=default,field=text,classname=solr.DirectSolrSpellChecker,distanceMeasure=internal,accuracy=0.5,maxEdits=2,minPrefix=1,maxInspections=5,minQueryLength=4,maxQueryFrequency=0.01}
   [junit4]   2> 13226 INFO  (coreLoadExecutor-19-thread-1) [    x:collection1] o.a.s.h.c.SuggestComponent Initializing SuggestComponent
   [junit4]   2> 13230 INFO  (coreLoadExecutor-19-thread-1) [    x:collection1] o.a.s.s.s.SolrSuggester init: {name=mySuggester,lookupImpl=FuzzyLookupFactory,dictionaryImpl=DocumentDictionaryFactory,field=cat,weightField=price,suggestAnalyzerFieldType=string,buildOnStartup=false}
   [junit4]   2> 13256 INFO  (coreLoadExecutor-19-thread-1) [    x:collection1] o.a.s.s.s.SolrSuggester Dictionary loaded with params: {name=mySuggester,lookupImpl=FuzzyLookupFactory,dictionaryImpl=DocumentDictionaryFactory,field=cat,weightField=price,suggestAnalyzerFieldType=string,buildOnStartup=false}
   [junit4]   2> 13256 INFO  (coreLoadExecutor-19-thread-1) [    x:collection1] o.a.s.h.c.QueryElevationComponent Loading QueryElevation from: /home/jenkins/workspace/Lucene-Solr-master-Linux/solr/build/solr-solrj/test/J0/temp/solr.client.solrj.embedded.LargeVolumeEmbeddedTest_AD54FA5A09D362FA-001/tempDir-001/collection1/conf/elevate.xml
   [junit4]   2> 13260 INFO  (coreLoadExecutor-19-thread-1) [    x:collection1] o.a.s.h.ReplicationHandler Commits will be reserved for 10000ms.
   [junit4]   2> 13260 INFO  (searcherExecutor-20-thread-1-processing-x:collection1) [    x:collection1] o.a.s.c.QuerySenderListener QuerySenderListener sending requests to Searcher@798dd73f[collection1] main{ExitableDirectoryReader(UninvertingDirectoryReader())}
   [junit4]   2> 13260 INFO  (coreLoadExecutor-19-thread-1) [    x:collection1] o.a.s.u.UpdateLog Could not find max version in index or recent updates, using new clock 1600605350428409856
   [junit4]   2> 13262 INFO  (SUITE-LargeVolumeEmbeddedTest-seed#[AD54FA5A09D362FA]-worker) [    ] o.a.s.SolrTestCaseJ4 ####initCore end
   [junit4]   2> 13264 INFO  (TEST-LargeVolumeEmbeddedTest.testMultiThreaded-seed#[AD54FA5A09D362FA]) [    ] o.a.s.SolrTestCaseJ4 ###Starting testMultiThreaded
   [junit4]   2> 13265 INFO  (searcherExecutor-20-thread-1-processing-x:collection1) [    x:collection1] o.a.s.c.S.Request [collection1]  webapp=null path=null params={q=static+firstSearcher+warming+in+solrconfig.xml&distrib=false&event=firstSearcher} hits=0 status=0 QTime=4
   [junit4]   2> 13265 INFO  (searcherExecutor-20-thread-1-processing-x:collection1) [    x:collection1] o.a.s.c.QuerySenderListener QuerySenderListener done.
   [junit4]   2> 13265 INFO  (searcherExecutor-20-thread-1-processing-x:collection1) [    x:collection1] o.a.s.h.c.SpellCheckComponent Loading spell index for spellchecker: default
   [junit4]   2> 13265 INFO  (searcherExecutor-20-thread-1-processing-x:collection1) [    x:collection1] o.a.s.h.c.SpellCheckComponent Loading spell index for spellchecker: wordbreak
   [junit4]   2> 13266 INFO  (searcherExecutor-20-thread-1-processing-x:collection1) [    x:collection1] o.a.s.c.SolrCore [collection1] Registered new searcher Searcher@798dd73f[collection1] main{ExitableDirectoryReader(UninvertingDirectoryReader())}
   [junit4]   2> 13311 INFO  (TEST-LargeVolumeEmbeddedTest.testMultiThreaded-seed#[AD54FA5A09D362FA]) [    ] o.a.s.u.LoggingInfoStream [DW][TEST-LargeVolumeEmbeddedTest.testMultiThreaded-seed#[AD54FA5A09D362FA]]: anyChanges? numDocsInRam=0 deletes=true hasTickets:false pendingChangesInFullFlush: false
   [junit4]   2> 13311 INFO  (TEST-LargeVolumeEmbeddedTest.testMultiThreaded-seed#[AD54FA5A09D362FA]) [    ] o.a.s.u.LoggingInfoStream [DW][TEST-LargeVolumeEmbeddedTest.testMultiThreaded-seed#[AD54FA5A09D362FA]]: anyChanges? numDocsInRam=0 deletes=true hasTickets:false pendingChangesInFullFlush: false
   [junit4]   2> 13311 INFO  (TEST-LargeVolumeEmbeddedTest.testMultiThreaded-seed#[AD54FA5A09D362FA]) [    ] o.a.s.u.LoggingInfoStream [IW][TEST-LargeVolumeEmbeddedTest.testMultiThreaded-seed#[AD54FA5A09D362FA]]: nrtIsCurrent: infoVersion matches: true; DW changes: true; BD changes: false
   [junit4]   2> 13311 INFO  (TEST-LargeVolumeEmbeddedTest.testMultiThreaded-seed#[AD54FA5A09D362FA]) [    ] o.a.s.u.LoggingInfoStream [IW][TEST-LargeVolumeEmbeddedTest.testMultiThreaded-seed#[AD54FA5A09D362FA]]: flush at getReader
   [junit4]   2> 13311 INFO  (TEST-LargeVolumeEmbeddedTest.testMultiThreaded-seed#[AD54FA5A09D362FA]) [    ] o.a.s.u.LoggingInfoStream [DW][TEST-LargeVolumeEmbeddedTest.testMultiThreaded-seed#[AD54FA5A09D362FA]]: startFullFlush
   [junit4]   2> 13311 INFO  (TEST-LargeVolumeEmbeddedTest.testMultiThreaded-seed#[AD54FA5A09D362FA]) [    ] o.a.s.u.LoggingInfoStream [DW][TEST-LargeVolumeEmbeddedTest.testMultiThreaded-seed#[AD54FA5A09D362FA]]: anyChanges? numDocsInRam=0 deletes=true hasTickets:false pendingChangesInFullFlush: false
   [junit4]   2> 13311 INFO  (TEST-LargeVolumeEmbeddedTest.testMultiThreaded-seed#[AD54FA5A09D362FA]) [    ] o.a.s.u.LoggingInfoStream [DW][TEST-LargeVolumeEmbeddedTest.testMultiThreaded-seed#[AD54FA5A09D362FA]]: TEST-LargeVolumeEmbeddedTest.testMultiThreaded-seed#[AD54FA5A09D362FA]: flush naked frozen global deletes
   [junit4]   2> 13312 INFO  (TEST-LargeVolumeEmbeddedTest.testMultiThreaded-seed#[AD54FA5A09D362FA]) [    ] o.a.s.u.LoggingInfoStream [BD][TEST-LargeVolumeEmbeddedTest.testMultiThreaded-seed#[AD54FA5A09D362FA]]: compressed 104 to 52 bytes (50.00%) for deletes/updates; private segment null
   [junit4]   2> 13312 INFO  (TEST-LargeVolumeEmbeddedTest.testMultiThreaded-seed#[AD54FA5A09D362FA]) [    ] o.a.s.u.LoggingInfoStream [BD][TEST-LargeVolumeEmbeddedTest.testMultiThreaded-seed#[AD54FA5A09D362FA]]: push new packet (delGen=1 numDeleteQueries=1 bytesUsed=52), packetCount=1, bytesUsed=0.000 MB
   [junit4]   2> 13312 INFO  (TEST-LargeVolumeEmbeddedTest.testMultiThreaded-seed#[AD54FA5A09D362FA]) [    ] o.a.s.u.LoggingInfoStream [IW][TEST-LargeVolumeEmbeddedTest.testMultiThreaded-seed#[AD54FA5A09D362FA]]: flush: push buffered updates: delGen=1 numDeleteQueries=1 bytesUsed=52
   [junit4]   2> 13312 INFO  (TEST-LargeVolumeEmbeddedTest.testMultiThreaded-seed#[AD54FA5A09D362FA]) [    ] o.a.s.u.LoggingInfoStream [BD][TEST-LargeVolumeEmbeddedTest.testMultiThreaded-seed#[AD54FA5A09D362FA]]: packet matches no segments
   [junit4]   2> 13312 INFO  (TEST-LargeVolumeEmbeddedTest.testMultiThreaded-seed#[AD54FA5A09D362FA]) [    ] o.a.s.u.LoggingInfoStream [BD][TEST-LargeVolumeEmbeddedTest.testMultiThreaded-seed#[AD54FA5A09D362FA]]: finished packet delGen=1 now completedDelGen=1
   [junit4]   2> 13312 INFO  (TEST-LargeVolumeEmbeddedTest.testMultiThreaded-seed#[AD54FA5A09D362FA]) [    ] o.a.s.u.LoggingInfoStream [BD][TEST-LargeVolumeEmbeddedTest.testMultiThreaded-seed#[AD54FA5A09D362FA]]: done apply del packet (delGen=1 numDeleteQueries=1 bytesUsed=52) to 0 segments; 0 new deletes/updates; took 0.000 sec; 0 packets remain
   [junit4]   2> 13312 INFO  (TEST-LargeVolumeEmbeddedTest.testMultiThreaded-seed#[AD54FA5A09D362FA]) [    ] o.a.s.u.LoggingInfoStream [IW][TEST-LargeVolumeEmbeddedTest.testMultiThreaded-seed#[AD54FA5A09D362FA]]: now apply all deletes for all segments buffered updates bytesUsed=0 reader pool bytesUsed=0
   [junit4]   2> 13312 INFO  (TEST-LargeVolumeEmbeddedTest.testMultiThreaded-seed#[AD54FA5A09D362FA]) [    ] o.a.s.u.LoggingInfoStream [BD][TEST-LargeVolumeEmbeddedTest.testMultiThreaded-seed#[AD54FA5A09D362FA]]: waitApply: no deletes to apply
   [junit4]   2> 13312 INFO  (TEST-LargeVolumeEmbeddedTest.testMultiThreaded-seed#[AD54FA5A09D362FA]) [    ] o.a.s.u.LoggingInfoStream [IW][TEST-LargeVolumeEmbeddedTest.testMultiThreaded-seed#[AD54FA5A09D362FA]]: incRefDeleter for NRT reader version=2 segments=
   [junit4]   2> 13312 INFO  (TEST-LargeVolumeEmbeddedTest.testMultiThreaded-seed#[AD54FA5A09D362FA]) [    ] o.a.s.u.LoggingInfoStream [IW][TEST-LargeVolumeEmbeddedTest.testMultiThreaded-seed#[AD54FA5A09D362FA]]: return reader version=2 reader=StandardDirectoryReader(segments_1:2:nrt)
   [junit4]   2> 13312 INFO  (TEST-LargeVolumeEmbeddedTest.testMultiThreaded-seed#[AD54FA5A09D362FA]) [    ] o.a.s.u.LoggingInfoStream [DW][TEST-LargeVolumeEmbeddedTest.testMultiThreaded-seed#[AD54FA5A09D362FA]]: TEST-LargeVolumeEmbeddedTest.testMultiThreaded-seed#[AD54FA5A09D362FA] finishFullFlush success=true
   [junit4]   2> 13313 INFO  (TEST-LargeVolumeEmbeddedTest.testMultiThreaded-seed#[AD54FA5A09D362FA]) [    ] o.a.s.u.LoggingInfoStream [IW][TEST-LargeVolumeEmbeddedTest.testMultiThreaded-seed#[AD54FA5A09D362FA]]: getReader took 2 msec
   [junit4]   2> 13313 INFO  (TEST-LargeVolumeEmbeddedTest.testMultiThreaded-seed#[AD54FA5A09D362FA]) [    ] o.a.s.u.LoggingInfoStream [IW][TEST-LargeVolumeEmbeddedTest.testMultiThreaded-seed#[AD54FA5A09D362FA]]: decRefDeleter for NRT reader version=2 segments=
   [junit4]   2> 13313 INFO  (TEST-LargeVolumeEmbeddedTest.testMultiThreaded-seed#[AD54FA5A09D362FA]) [    ] o.a.s.u.p.LogUpdateProcessorFactory [collection1]  webapp=null path=/update params={}{deleteByQuery=*:* (-1600605350480838656)} 0 45
   [junit4]   2> 13314 INFO  (TEST-LargeVolumeEmbeddedTest.testMultiThreaded-seed#[AD54FA5A09D362FA]) [    ] o.a.s.c.s.LargeVolumeTestBase Started thread: 0
   [junit4]   2> 13315 INFO  (TEST-LargeVolumeEmbeddedTest.testMultiThreaded-seed#[AD54FA5A09D362FA]) [    ] o.a.s.c.s.LargeVolumeTestBase Started thread: 1
   [junit4]   2> 13315 INFO  (TEST-LargeVolumeEmbeddedTest.testMultiThreaded-seed#[AD54FA5A09D362FA]) [    ] o.a.s.c.s.LargeVolumeTestBase Started thread: 2
   [junit4]   2> 13316 INFO  (TEST-LargeVolumeEmbeddedTest.testMultiThreaded-seed#[AD54FA5A09D362FA]) [    ] o.a.s.c.s.LargeVolumeTestBase Started thread: 3
   [junit4]   2> 13317 INFO  (TEST-LargeVolumeEmbeddedTest.testMultiThreaded-seed#[AD54FA5A09D362FA]) [    ] o.a.s.c.s.LargeVolumeTestBase Started thread: 4
   [junit4]   2> 13358 INFO  (DocThread-3) [    ] o.a.s.u.p.LogUpdateProcessorFactory [collection1]  webapp=null path=/update params={}{add=[T3:0 (1600605350493421568), T3:1 (1600605350494470149), T3:2 (1600605350495518724), T3:3 (1600605350495518728), T3:4 (1600605350495518731), T3:5 (1600605350496567298), T3:6 (1600605350496567303), T3:7 (1600605350496567307), T3:8 (1600605350497615874), T3:9 (1600605350497615879), ... (100 adds)]} 0 39
   [junit4]   2> 13358 INFO  (DocThread-3) [    ] o.a.s.u.DirectUpdateHandler2 start commit{_version_=1600605350531170311,optimize=false,openSearcher=true,waitSearcher=true,expungeDeletes=false,softCommit=false,prepareCommit=false}
   [junit4]   2> 13358 INFO  (DocThread-3) [    ] o.a.s.u.SolrIndexWriter Calling setCommitData with IW:org.apache.solr.update.SolrIndexWriter@2a0bc743 commitCommandVersion:1600605350531170311
   [junit4]   2> 13358 INFO  (DocThread-3) [    ] o.a.s.u.LoggingInfoStream [IW][DocThread-3]: commit: start
   [junit4]   2> 13358 INFO  (DocThread-3) [    ] o.a.s.u.LoggingInfoStream [IW][DocThread-3]: commit: enter lock
   [junit4]   2> 13358 INFO  (DocThread-3) [    ] o.a.s.u.LoggingInfoStream [IW][DocThread-3]: commit: now prepare
   [junit4]   2> 13358 INFO  (DocThread-3) [    ] o.a.s.u.LoggingInfoStream [IW][DocThread-3]: prepareCommit: flush
   [junit4]   2> 13358 INFO  (DocThread-3) [    ] o.a.s.u.LoggingInfoStream [IW][DocThread-3]:   index before flush 
   [junit4]   2> 13358 INFO  (DocThread-3) [    ] o.a.s.u.LoggingInfoStream [DW][DocThread-3]: startFullFlush
   [junit4]   2> 13359 INFO  (DocThread-3) [    ] o.a.s.u.LoggingInfoStream [DW][DocThread-3]: anyChanges? numDocsInRam=460 deletes=true hasTickets:false pendingChangesInFullFlush: false
   [junit4]   2> 13359 INFO  (DocThread-3) [    ] o.a.s.u.LoggingInfoStream [DWFC][DocThread-3]: addFlushableState DocumentsWriterPerThread [pendingDeletes=gen=0 456 deleted terms (unique count=456) bytesUsed=106199, segment=_0, aborted=false, numDocsInRAM=101, deleteQueue=DWDQ: [ generation: 2 ]]
   [junit4]   2> 13359 INFO  (DocThread-3) [    ] o.a.s.u.LoggingInfoStream [DWFC][DocThread-3]: addFlushableState DocumentsWriterPerThread [pendingDeletes=gen=0 310 deleted terms (unique count=310) bytesUsed=72182, segment=_1, aborted=false, numDocsInRAM=82, deleteQueue=DWDQ: [ generation: 2 ]]
   [junit4]   2> 13359 INFO  (DocThread-1) [    ] o.a.s.u.p.LogUpdateProcessorFactory [collection1]  webapp=null path=/update params={}{add=[T1:0 (1600605350488178689), T1:1 (1600605350494470145), T1:2 (1600605350494470147), T1:3 (1600605350495518720), T1:4 (1600605350495518723), T1:5 (1600605350495518726), T1:6 (1600605350495518730), T1:7 (1600605350496567301), T1:8 (1600605350496567305), T1:9 (1600605350497615873), ... (86 adds)]} 0 42
   [junit4]   2> 13359 INFO  (DocThread-3) [    ] o.a.s.u.LoggingInfoStream [DWFC][DocThread-3]: addFlushableState DocumentsWriterPerThread [pendingDeletes=gen=0 456 deleted terms (unique count=456) bytesUsed=106201, segment=_2, aborted=false, numDocsInRAM=105, deleteQueue=DWDQ: [ generation: 2 ]]
   [junit4]   2> 13359 INFO  (DocThread-0) [    ] o.a.s.u.p.LogUpdateProcessorFactory [collection1]  webapp=null path=/update params={}{add=[T0:0 (1600605350488178688), T0:1 (1600605350494470144), T0:2 (1600605350494470148), T0:3 (1600605350495518721), T0:4 (1600605350495518725), T0:5 (1600605350495518727), T0:6 (1600605350495518729), T0:7 (1600605350496567296), T0:8 (1600605350496567297), T0:9 (1600605350496567300), ... (100 adds)]} 0 43
   [junit4]   2> 13359 INFO  (DocThread-2) [    ] o.a.s.u.LoggingInfoStream [DWFC][DocThread-2]: addFlushableState DocumentsWriterPerThread [pendingDeletes=gen=0 453 deleted terms (unique count=453) bytesUsed=105506, segment=_3, aborted=false, numDocsInRAM=79, deleteQueue=DWDQ: [ generation: 2 ]]
   [junit4]   2> 13359 ERROR (DocThread-1) [    ] o.a.s.h.RequestHandlerBase org.apache.solr.common.SolrException: Exception writing document id T1:86 to the index; possible analysis error.
   [junit4]   2> 	at org.apache.solr.update.DirectUpdateHandler2.addDoc(DirectUpdateHandler2.java:246)
   [junit4]   2> 	at org.apache.solr.update.processor.RunUpdateProcessor.processAdd(RunUpdateProcessorFactory.java:67)
   [junit4]   2> 	at org.apache.solr.update.processor.UpdateRequestProcessor.processAdd(UpdateRequestProcessor.java:55)
   [junit4]   2> 	at org.apache.solr.update.processor.DistributedUpdateProcessor.doLocalAdd(DistributedUpdateProcessor.java:950)
   [junit4]   2> 	at org.apache.solr.update.processor.DistributedUpdateProcessor.versionAdd(DistributedUpdateProcessor.java:1163)
   [junit4]   2> 	at org.apache.solr.update.processor.DistributedUpdateProcessor.processAdd(DistributedUpdateProcessor.java:633)
   [junit4]   2> 	at org.apache.solr.update.processor.LogUpdateProcessorFactory$LogUpdateProcessor.processAdd(LogUpdateProcessorFactory.java:103)
   [junit4]   2> 	at org.apache.solr.handler.loader.XMLLoader.processUpdate(XMLLoader.java:261)
   [junit4]   2> 	at org.apache.solr.handler.loader.XMLLoader.load(XMLLoader.java:188)
   [junit4]   2> 	at org.apache.solr.handler.UpdateRequestHandler$1.load(UpdateRequestHandler.java:97)
   [junit4]   2> 	at org.apache.solr.handler.ContentStreamHandlerBase.handleRequestBody(ContentStreamHandlerBase.java:68)
   [junit4]   2> 	at org.apache.solr.handler.RequestHandlerBase.handleRequest(RequestHandlerBase.java:199)
   [junit4]   2> 	at org.apache.solr.core.SolrCore.execute(SolrCore.java:2510)
   [junit4]   2> 	at org.apache.solr.client.solrj.embedded.EmbeddedSolrServer.request(EmbeddedSolrServer.java:196)
   [junit4]   2> 	at org.apache.solr.client.solrj.SolrRequest.process(SolrRequest.java:194)
   [junit4]   2> 	at org.apache.solr.client.solrj.SolrClient.add(SolrClient.java:106)
   [junit4]   2> 	at org.apache.solr.client.solrj.SolrClient.add(SolrClient.java:71)
   [junit4]   2> 	at org.apache.solr.client.solrj.SolrClient.add(SolrClient.java:85)
   [junit4]   2> 	at org.apache.solr.client.solrj.LargeVolumeTestBase$DocThread.run(LargeVolumeTestBase.java:110)
   [junit4]   2> Caused by: java.lang.NullPointerException
   [junit4]   2> 	at org.apache.solr.update.UpdateLog.getCurrentLogSizeFromStream(UpdateLog.java:299)
   [junit4]   2> 	at org.apache.solr.update.DirectUpdateHandler2.getCurrentTLogSize(DirectUpdateHandler2.java:1007)
   [junit4]   2> 	at org.apache.solr.update.DirectUpdateHandler2.addDoc0(DirectUpdateHandler2.java:291)
   [junit4]   2> 	at org.apache.solr.update.DirectUpdateHandler2.addDoc(DirectUpdateHandler2.java:234)
   [junit4]   2> 	... 18 more
   [junit4]   2> 
   [junit4]   2> 13359 INFO  (DocThread-4) [    ] o.a.s.u.LoggingInfoStream [DWFC][DocThread-4]: addFlushableState DocumentsWriterPerThread [pendingDeletes=gen=0 292 deleted terms (unique count=292) bytesUsed=68036, segment=_4, aborted=false, numDocsInRAM=93, deleteQueue=DWDQ: [ generation: 2 ]]
   [junit4]   2> org.apache.solr.common.SolrException: Exception writing document id T1:86 to the index; possible analysis error.
   [junit4]   2> 	at org.apache.solr.update.DirectUpdateHandler2.addDoc(DirectUpdateHandler2.java:246)
   [junit4]   2> 	at org.apache.solr.update.processor.RunUpdateProcessor.processAdd(RunUpdateProcessorFactory.java:67)
   [junit4]   2> 	at org.apache.solr.update.processor.UpdateRequestProcessor.processAdd(UpdateRequestProcessor.java:55)
   [junit4]   2> 	at org.apache.solr.update.processor.DistributedUpdateProcessor.doLocalAdd(DistributedUpdateProcessor.java:950)
   [junit4]   2> 	at org.apache.solr.update.processor.DistributedUpdateProcessor.versionAdd(DistributedUpdateProcessor.java:1163)
   [junit4]   2> 	at org.apache.solr.update.processor.DistributedUpdateProcessor.processAdd(DistributedUpdateProcessor.java:633)
   [junit4]   2> 	at org.apache.solr.update.processor.LogUpdateProcessorFactory$LogUpdateProcessor.processAdd(LogUpdateProcessorFactory.java:103)
   [junit4]   2> 	at org.apache.solr.handler.loader.XMLLoader.processUpdate(XMLLoader.java:261)
   [junit4]   2> 	at org.apache.solr.handler.loader.XMLLoader.load(XMLLoader.java:188)
   [junit4]   2> 	at org.apache.solr.handler.UpdateRequestHandler$1.load(UpdateRequestHandler.java:97)
   [junit4]   2> 	at org.apache.solr.handler.ContentStreamHandlerBase.handleRequestBody(ContentStreamHandlerBase.java:68)
   [junit4]   2> 	at org.apache.solr.handler.RequestHandlerBase.handleRequest(RequestHandlerBase.java:199)
   [junit4]   2> 	at org.apache.solr.core.SolrCore.execute(SolrCore.java:2510)
   [junit4]   2> 	at org.apache.solr.client.solrj.embedded.EmbeddedSolrServer.request(EmbeddedSolrServer.java:196)
   [junit4]   2> 	at org.apache.solr.client.solrj.SolrRequest.process(SolrRequest.java:194)
   [junit4]   2> 	at org.apache.solr.client.solrj.SolrClient.add(SolrClient.java:106)
   [junit4]   2> 	at org.apache.solr.client.solrj.SolrClient.add(SolrClient.java:71)
   [junit4]   2> 	at org.apache.solr.client.solrj.SolrClient.add(SolrClient.java:85)
   [junit4]   2> 	at org.apache.solr.client.solrj.LargeVolumeTestBase$DocThread.run(LargeVolumeTestBase.java:110)
   [junit4]   2> Caused by: java.lang.NullPointerException
   [junit4]   2> 	at org.apache.solr.update.UpdateLog.getCurrentLogSizeFromStream(UpdateLog.java:299)
   [junit4]   2> 	at org.apache.solr.update.DirectUpdateHandler2.getCurrentTLogSize(DirectUpdateHandler2.java:1007)
   [junit4]   2> 	at org.apache.solr.update.DirectUpdateHandler2.addDoc0(DirectUpdateHandler2.java:291)
   [junit4]   2> 	at org.apache.solr.update.DirectUpdateHandler2.addDoc(DirectUpdateHandler2.java:234)
   [junit4]   2> 	... 18 more
   [junit4]   2> 13362 INFO  (DocThread-2) [    ] o.a.s.u.p.LogUpdateProcessorFactory [collection1]  webapp=null path=/update params={}{add=[T2:0 (1600605350489227264), T2:1 (1600605350494470146), T2:2 (1600605350494470150), T2:3 (1600605350496567299), T2:4 (1600605350496567302), T2:5 (1600605350496567306), T2:6 (1600605350497615877), T2:7 (1600605350497615882), T2:8 (1600605350497615886), T2:9 (1600605350498664452), ... (100 adds)]} 0 44
   [junit4]   2> maj 16, 2018 4:36:53 PM com.carrotsearch.randomizedtesting.RandomizedRunner$QueueUncaughtExceptionsHandler uncaughtException
   [junit4]   2> WARNING: Uncaught exception in thread: Thread[DocThread-1,5,TGRP-LargeVolumeEmbeddedTest]
   [junit4]   2> java.lang.AssertionError: DocThread-1---Exception writing document id T1:86 to the index; possible analysis error.
   [junit4]   2> 	at __randomizedtesting.SeedInfo.seed([AD54FA5A09D362FA]:0)
   [junit4]   2> 	at org.junit.Assert.fail(Assert.java:93)
   [junit4]   2> 	at org.apache.solr.client.solrj.LargeVolumeTestBase$DocThread.run(LargeVolumeTestBase.java:128)
   [junit4]   2> 
   [junit4]   2> 13366 INFO  (DocThread-3) [    ] o.a.s.u.LoggingInfoStream [BD][DocThread-3]: compressed 107130 to 2064 bytes (1.93%) for deletes/updates; private segment null
   [junit4]   2> 13367 INFO  (DocThread-3) [    ] o.a.s.u.LoggingInfoStream [DWPT][DocThread-3]: flush postings as segment _0 numDocs=101
   [junit4]   2> 13367 INFO  (DocThread-4) [    ] o.a.s.u.LoggingInfoStream [DWPT][DocThread-4]: flush postings as segment _1 numDocs=82
   [junit4]   2> 13367 INFO  (DocThread-4) [    ] o.a.s.u.LoggingInfoStream [IW][DocThread-4]: 0 msec to write norms
   [junit4]   2> 13367 INFO  (DocThread-3) [    ] o.a.s.u.LoggingInfoStream [IW][DocThread-3]: 0 msec to write norms
   [junit4]   2> 13367 INFO  (DocThread-4) [    ] o.a.s.u.LoggingInfoStream [IW][DocThread-4]: 0 msec to write docValues
   [junit4]   2> 13367 INFO  (DocThread-4) [    ] o.a.s.u.LoggingInfoStream [IW][DocThread-4]: 0 msec to write points
   [junit4]   2> 13368 INFO  (DocThread-3) [    ] o.a.s.u.LoggingInfoStream [IW][DocThread-3]: 0 msec to write docValues
   [junit4]   2> 13368 INFO  (DocThread-3) [    ] o.a.s.u.LoggingInfoStream [IW][DocThread-3]: 0 msec to write points
   [junit4]   2> 13368 INFO  (DocThread-4) [    ] o.a.s.u.LoggingInfoStream [IW][DocThread-4]: 0 msec to finish stored fields
   [junit4]   2> 13368 INFO  (DocThread-3) [    ] o.a.s.u.LoggingInfoStream [IW][DocThread-3]: 0 msec to finish stored fields
   [junit4]   2> 13372 INFO  (DocThread-4) [    ] o.a.s.u.LoggingInfoStream [IW][DocThread-4]: 4 msec to write postings and finish vectors
   [junit4]   2> 13373 INFO  (DocThread-4) [    ] o.a.s.u.LoggingInfoStream [IW][DocThread-4]: 0 msec to write fieldInfos
   [junit4]   2> 13373 INFO  (DocThread-4) [    ] o.a.s.u.LoggingInfoStream [DWPT][DocThread-4]: new segment has 0 deleted docs
   [junit4]   2> 13373 INFO  (DocThread-3) [    ] o.a.s.u.LoggingInfoStream [IW][DocThread-3]: 4 msec to write postings and finish vectors
   [junit4]   2> 13373 INFO  (DocThread-4) [    ] o.a.s.u.LoggingInfoStream [DWPT][DocThread-4]: new segment has no vectors; norms; docValues; prox; freqs
   [junit4]   2> 13373 INFO  (DocThread-4) [    ] o.a.s.u.LoggingInfoStream [DWPT][DocThread-4]: flushedFiles=[_1_Lucene50_0.doc, _1_Lucene50_0.tim, _1_Lucene70_0.dvd, _1.nvd, _1_Lucene50_0.pos, _1.fdx, _1.nvm, _1.fnm, _1.fdt, _1_Lucene70_0.dvm, _1_Lucene50_0.tip]
   [junit4]   2> 13373 INFO  (DocThread-3) [    ] o.a.s.u.LoggingInfoStream [IW][DocThread-3]: 0 msec to write fieldInfos
   [junit4]   2> 13373 INFO  (DocThread-4) [    ] o.a.s.u.LoggingInfoStream [DWPT][DocThread-4]: flushed codec=Lucene70
   [junit4]   2> 13373 INFO  (DocThread-3) [    ] o.a.s.u.LoggingInfoStream [DWPT][DocThread-3]: new segment has 0 deleted docs
   [junit4]   2> 13373 INFO  (DocThread-3) [    ] o.a.s.u.LoggingInfoStream [DWPT][DocThread-3]: new segment has no vectors; norms; docValues; prox; freqs
   [junit4]   2> 13373 INFO  (DocThread-3) [    ] o.a.s.u.LoggingInfoStream [DWPT][DocThread-3]: flushedFiles=[_0_Lucene50_0.doc, _0_Lucene50_0.tim, _0_Lucene70_0.dvd, _0_Lucene50_0.pos, _0.nvd, _0.fdx, _0_Lucene50_0.tip, _0.fdt, _0.nvm, _0_Lucene70_0.dvm, _0.fnm]
   [junit4]   2> 13373 INFO  (DocThread-3) [    ] o.a.s.u.LoggingInfoStream [DWPT][DocThread-3]: flushed codec=Lucene70
   [junit4]   2> 13374 INFO  (DocThread-4) [    ] o.a.s.u.LoggingInfoStream [DWPT][DocThread-4]: flushed: segment=_1 ramUsed=0.2 MB newFlushedSize=0.004 MB docs/MB=23,289.066
   [junit4]   2> 13374 INFO  (DocThread-3) [    ] o.a.s.u.LoggingInfoStream [DWPT][DocThread-3]: flushed: segment=_0 ramUsed=0.201 MB newFlushedSize=0.004 MB docs/MB=25,799.312
   [junit4]   2> 13375 INFO  (DocThread-4) [    ] o.a.s.u.LoggingInfoStream [DWPT][DocThread-4]: flush time 7.926647 msec
   [junit4]   2> 13375 INFO  (DocThread-3) [    ] o.a.s.u.LoggingInfoStream [DWPT][DocThread-3]: flush time 8.008791 msec
   [junit4]   2> 13375 INFO  (DocThread-4) [    ] o.a.s.u.LoggingInfoStream [DWPT][DocThread-4]: flush postings as segment _2 numDocs=105
   [junit4]   2> 13375 INFO  (DocThread-3) [    ] o.a.s.u.LoggingInfoStream [DWPT][DocThread-3]: flush postings as segment _3 numDocs=79
   [junit4]   2> 13375 INFO  (DocThread-4) [    ] o.a.s.u.LoggingInfoStream [IW][DocThread-4]: 0 msec to write norms
   [junit4]   2> 13375 INFO  (DocThread-3) [    ] o.a.s.u.LoggingInfoStream [IW][DocThread-3]: 0 msec to write norms
   [junit4]   2> 13375 INFO  (DocThread-4) [    ] o.a.s.u.LoggingInfoStream [IW][DocThread-4]: 0 msec to write docValues
   [junit4]   2> 13375 INFO  (DocThread-4) [    ] o.a.s.u.LoggingInfoStream [IW][DocThread-4]: 0 msec to write points
   [junit4]   2> 13375 INFO  (DocThread-3) [    ] o.a.s.u.LoggingInfoStream [IW][DocThread-3]: 0 msec to write docValues
   [junit4]   2> 13375 INFO  (DocThread-3) [    ] o.a.s.u.LoggingInfoStream [IW][DocThread-3]: 0 msec to write points
   [junit4]   2> 13376 INFO  (DocThread-4) [    ] o.a.s.u.LoggingInfoStream [IW][DocThread-4]: 0 msec to finish stored fields
   [junit4]   2> 13376 INFO  (DocThread-3) [    ] o.a.s.u.LoggingInfoStream [IW][DocThread-3]: 0 msec to finish stored fields
   [junit4]   2> 13378 INFO  (DocThread-4) [    ] o.a.s.u.LoggingInfoStream [IW][DocThread-4]: 2 msec to write postings and finish vectors
   [junit4]   2> 13379 INFO  (DocThread-4) [    ] o.a.s.u.LoggingInfoStream [IW][DocThread-4]: 0 msec to write fieldInfos
   [junit4]   2> 13379 INFO  (DocThread-4) [    ] o.a.s.u.LoggingInfoStream [DWPT][DocThread-4]: new segment has 0 deleted docs
   [junit4]   2> 13379 INFO  (DocThread-4) [    ] o.a.s.u.LoggingInfoStream [DWPT][DocThread-4]: new segment has no vectors; norms; docValues; prox; freqs
   [junit4]   2> 13379 INFO  (DocThread-4) [    ] o.a.s.u.LoggingInfoStream [DWPT][DocThread-4]: flushedFiles=[_2.nvd, _2_Lucene70_0.dvd, _2.fdt, _2.nvm, _2_Lucene50_0.pos, _2.fnm, _2.fdx, _2_Lucene50_0.doc, _2_Lucene50_0.tim, _2_Lucene70_0.dvm, _2_Lucene50_0.tip]
   [junit4]   2> 13379 INFO  (DocThread-4) [    ] o.a.s.u.LoggingInfoStream [DWPT][DocThread-4]: flushed codec=Lucene70
   [junit4]   2> 13379 INFO  (DocThread-4) [    ] o.a.s.u.LoggingInfoStream [DWPT][DocThread-4]: flushed: segment=_2 ramUsed=0.2 MB newFlushedSize=0.004 MB docs/MB=25,918.192
   [junit4]   2> 13379 INFO  (DocThread-3) [    ] o.a.s.u.LoggingInfoStream [IW][DocThread-3]: 2 msec to write postings and finish vectors
   [junit4]   2> 13379 INFO  (DocThread-3) [    ] o.a.s.u.LoggingInfoStream [IW][DocThread-3]: 0 msec to write fieldInfos
   [junit4]   2> 13379 INFO  (DocThread-4) [    ] o.a.s.u.LoggingInfoStream [DWPT][DocThread-4]: flush time 4.372118 msec
   [junit4]   2> 13379 INFO  (DocThread-3) [    ] o.a.s.u.LoggingInfoStream [DWPT][DocThread-3]: new segment has 0 deleted docs
   [junit4]   2> 13379 INFO  (DocThread-4) [    ] o.a.s.u.LoggingInfoStream [DWPT][DocThread-4]: flush postings as segment _4 numDocs=93
   [junit4]   2> 13379 INFO  (DocThread-3) [    ] o.a.s.u.LoggingInfoStream [DWPT][DocThread-3]: new segment has no vectors; norms; docValues; prox; freqs
   [junit4]   2> 13379 INFO  (DocThread-3) [    ] o.a.s.u.LoggingInfoStream [DWPT][DocThread-3]: flushedFiles=[_3.fdx, _3.nvd, _3_Lucene50_0.pos, _3_Lucene70_0.dvd, _3_Lucene50_0.doc, _3_Lucene50_0.tim, _3_Lucene70_0.dvm, _3.nvm, _3.fnm, _3.fdt, _3_Lucene50_0.tip]
   [junit4]   2> 13379 INFO  (DocThread-3) [    ] o.a.s.u.LoggingInfoStream [DWPT][DocThread-3]: flushed codec=Lucene70
   [junit4]   2> 13379 INFO  (DocThread-4) [    ] o.a.s.u.LoggingInfoStream [IW][DocThread-4]: 0 msec to write norms
   [junit4]   2> 13379 INFO  (DocThread-3) [    ] o.a.s.u.LoggingInfoStream [DWPT][DocThread-3]: flushed: segment=_3 ramUsed=0.199 MB newFlushedSize=0.003 MB docs/MB=22,870.653
   [junit4]   2> 13379 INFO  (DocThread-3) [    ] o.a.s.u.LoggingInfoStream [DWPT][DocThread-3]: flush time 4.722831 msec
   [junit4]   2> 13379 INFO  (DocThread-3) [    ] o.a.s.u.LoggingInfoStream [IW][DocThread-3]: publishFlushedSegment seg-private updates=null
   [junit4]   2> 13379 INFO  (DocThread-3) [    ] o.a.s.u.LoggingInfoStream [IW][DocThread-3]: publishFlushedSegment _0(8.0.0):C101
   [junit4]   2> 13380 INFO  (DocThread-4) [    ] o.a.s.u.LoggingInfoStream [IW][DocThread-4]: 0 msec to write docValues
   [junit4]   2> 13380 INFO  (DocThread-4) [    ] o.a.s.u.LoggingInfoStream [IW][DocThread-4]: 0 msec to write points
   [junit4]   2> 13380 INFO  (DocThread-3) [    ] o.a.s.u.LoggingInfoStream [BD][DocThread-3]: push new packet (delGen=2 numDeleteTerms=460 bytesUsed=2064), packetCount=1, bytesUsed=0.002 MB
   [junit4]   2> 13380 INFO  (DocThread-3) [    ] o.a.s.u.LoggingInfoStream [BD][DocThread-3]: finished packet delGen=3 now completedDelGen=1
   [junit4]   2> 13380 INFO  (DocThread-3) [    ] o.a.s.u.LoggingInfoStream [IW][DocThread-3]: publish sets newSegment delGen=3 seg=_0(8.0.0):C101
   [junit4]   2> 13380 INFO  (DocThread-4) [    ] o.a.s.u.LoggingInfoStream [IW][DocThread-4]: 0 msec to finish stored fields
   [junit4]   2> 13380 INFO  (DocThread-3) [    ] o.a.s.u.LoggingInfoStream [IFD][DocThread-3]: now checkpoint "_0(8.0.0):C101" [1 segments ; isCommit = false]
   [junit4]   2> 13380 INFO  (DocThread-3) [    ] o.a.s.u.LoggingInfoStream [IFD][DocThread-3]: 0 msec to checkpoint
   [junit4]   2> 13380 INFO  (DocThread-3) [    ] o.a.s.u.LoggingInfoStream [IW][DocThread-3]: publishFlushedSegment seg-private updates=null
   [junit4]   2> 13380 INFO  (DocThread-3) [    ] o.a.s.u.LoggingInfoStream [IW][DocThread-3]: publishFlushedSegment _1(8.0.0):C82
   [junit4]   2> 13380 INFO  (DocThread-3) [    ] o.a.s.u.LoggingInfoStream [BD][DocThread-3]: finished packet delGen=4 now completedDelGen=1
   [junit4]   2> 13380 INFO  (DocThread-3) [    ] o.a.s.u.LoggingInfoStream [IW][DocThread-3]: publish sets newSegment delGen=4 seg=_1(8.0.0):C82
   [junit4]   2> 13380 INFO  (DocThread-3) [    ] o.a.s.u.LoggingInfoStream [IFD][DocThread-3]: now checkpoint "_0(8.0.0):C101 _1(8.0.0):C82" [2 segments ; isCommit = false]
   [junit4]   2> 13380 INFO  (DocThread-3) [    ] o.a.s.u.LoggingInfoStream [IFD][DocThread-3]: 0 msec to checkpoint
   [junit4]   2> 13381 INFO  (DocThread-3) [    ] o.a.s.u.LoggingInfoStream [IW][DocThread-3]: publishFlushedSegment seg-private updates=null
   [junit4]   2> 13381 INFO  (DocThread-3) [    ] o.a.s.u.LoggingInfoStream [IW][DocThread-3]: publishFlushedSegment _2(8.0.0):C105
   [junit4]   2> 13381 INFO  (DocThread-3) [    ] o.a.s.u.LoggingInfoStream [BD][DocThread-3]: finished packet delGen=5 now completedDelGen=1
   [junit4]   2> 13381 INFO  (DocThread-3) [    ] o.a.s.u.LoggingInfoStream [IW][DocThread-3]: publish sets newSegment delGen=5 seg=_2(8.0.0):C105
   [junit4]   2> 13381 INFO  (DocThread-3) [    ] o.a.s.u.LoggingInfoStream [IFD][DocThread-3]: now checkpoint "_0(8.0.0):C101 _1(8.0.0):C82 _2(8.0.0):C105" [3 segments ; isCommit = false]
   [junit4]   2> 13381 INFO  (DocThread-3) [    ] o.a.s.u.LoggingInfoStream [IFD][DocThread-3]: 0 msec to checkpoint
   [junit4]   2> 13381 INFO  (DocThread-3) [    ] o.a.s.u.LoggingInfoStream [IW][DocThread-3]: publishFlushedSegment seg-private updates=null
   [junit4]   2> 13381 INFO  (DocThread-3) [    ] o.a.s.u.LoggingInfoStream [IW][DocThread-3]: publishFlushedSegment _3(8.0.0):C79
   [junit4]   2> 13381 INFO  (DocThread-3) [    ] o.a.s.u.LoggingInfoStream [BD][DocThread-3]: finished packet delGen=6 now completedDelGen=1
   [junit4]   2> 13381 INFO  (DocThread-3) [    ] o.a.s.u.LoggingInfoStream [IW][DocThread-3]: publish sets newSegment delGen=6 seg=_3(8.0.0):C79
   [junit4]   2> 13381 INFO  (DocThread-3) [    ] o.a.s.u.LoggingInfoStream [IFD][DocThread-3]: now checkpoint "_0(8.0.0):C101 _1(8.0.0):C82 _2(8.0.0):C105 _3(8.0.0):C79" [4 segments ; isCommit = false]
   [junit4]   2> 13381 INFO  (DocThread-3) [    ] o.a.s.u.LoggingInfoStream [IFD][DocThread-3]: 0 msec to checkpoint
   [junit4]   2> 13382 INFO  (DocThread-4) [    ] o.a.s.u.LoggingInfoStream [IW][DocThread-4]: 1 msec to write postings and finish vectors
   [junit4]   2> 13382 INFO  (DocThread-4) [    ] o.a.s.u.LoggingInfoStream [IW][DocThread-4]: 0 msec to write fieldInfos
   [junit4]   2> 13382 INFO  (DocThread-4) [    ] o.a.s.u.LoggingInfoStream [DWPT][DocThread-4]: new segment has 0 deleted docs
   [junit4]   2> 13382 INFO  (DocThread-4) [    ] o.a.s.u.LoggingInfoStream [DWPT][DocThread-4]: new segment has no vectors; norms; docValues; prox; freqs
   [junit4]   2> 13382 INFO  (DocThread-4) [    ] o.a.s.u.LoggingInfoStream [DWPT][DocThread-4]: flushedFiles=[_4.fdt, _4.nvm, _4_Lucene50_0.pos, _4.fnm, _4_Lucene70_0.dvd, _4_Lucene50_0.tip, _4.nvd, _4_Lucene70_0.dvm, _4.fdx, _4_Lucene50_0.doc, _4_Lucene50_0.tim]
   [junit4]   2> 13382 INFO  (DocThread-4) [    ] o.a.s.u.LoggingInfoStream [DWPT][DocThread-4]: flushed codec=Lucene70
   [junit4]   2> 13382 INFO  (DocThread-4) [    ] o.a.s.u.LoggingInfoStream [DWPT][DocThread-4]: flushed: segment=_4 ramUsed=0.164 MB newFlushedSize=0.004 MB docs/MB=24,826.265
   [junit4]   2> 13382 INFO  (DocThread-4) [    ] o.a.s.u.LoggingInfoStream [DWPT][DocThread-4]: flush time 2.772134 msec
   [junit4]   2> 13382 INFO  (DocThread-4) [    ] o.a.s.u.LoggingInfoStream [IW][DocThread-4]: publishFlushedSegment seg-private updates=null
   [junit4]   2> 13382 INFO  (DocThread-4) [    ] o.a.s.u.LoggingInfoStream [IW][DocThread-4]: publishFlushedSegment _4(8.0.0):C93
   [junit4]   2> 13382 INFO  (DocThread-4) [    ] o.a.s.u.LoggingInfoStream [BD][DocThread-4]: finished packet delGen=7 now completedDelGen=1
   [junit4]   2> 13382 INFO  (DocThread-4) [    ] o.a.s.u.LoggingInfoStream [IW][DocThread-4]: publish sets newSegment delGen=7 seg=_4(8.0.0):C93
   [junit4]   2> 13382 INFO  (DocThread-4) [    ] o.a.s.u.LoggingInfoStream [IFD][DocThread-4]: now checkpoint "_0(8.0.0):C101 _1(8.0.0):C82 _2(8.0.0):C105 _3(8.0.0):C79 _4(8.0.0):C93" [5 segments ; isCommit = false]
   [junit4]   2> 13382 INFO  (DocThread-4) [    ] o.a.s.u.LoggingInfoStream [IFD][DocThread-4]: 0 msec to checkpoint
   [junit4]   2> 13382 INFO  (DocThread-3) [    ] o.a.s.u.LoggingInfoStream [BD][DocThread-3]: packet matches no segments
   [junit4]   2> 13382 INFO  (DocThread-3) [    ] o.a.s.u.LoggingInfoStream [BD][DocThread-3]: finished packet delGen=2 now completedDelGen=7
   [junit4]   2> 13382 INFO  (DocThread-4) [    ] o.a.s.u.LoggingInfoStream [TMP][DocThread-4]: findMerges: 5 segments
   [junit4]   2> 13382 INFO  (DocThread-3) [    ] o.a.s.u.LoggingInfoStream [BD][DocThread-3]: done apply del packet (delGen=2 numDeleteTerms=460 bytesUsed=2064) to 0 segments; 0 new deletes/updates; took 0.000 sec; 0 packets remain
   [junit4]   2> 13383 INFO  (DocThread-3) [    ] o.a.s.u.LoggingInfoStream [IW][DocThread-3]: now apply all deletes for all segments buffered updates bytesUsed=0 reader pool bytesUsed=0
   [junit4]   2> 13383 INFO  (DocThread-3) [    ] o.a.s.u.LoggingInfoStream [BD][DocThread-3]: waitApply: no deletes to apply
   [junit4]   2> 13383 INFO  (DocThread-4) [    ] o.a.s.u.LoggingInfoStream [TMP][DocThread-4]:   seg=_2(8.0.0):C105 size=0.004 MB [floored]
   [junit4]   2> 13383 INFO  (DocThread-4) [    ] o.a.s.u.LoggingInfoStream [TMP][DocThread-4]:   seg=_0(8.0.0):C101 size=0.004 MB [floored]
   [junit4]   2> 13384 INFO  (DocThread-4) [    ] o.a.s.u.LoggingInfoStream [TMP][DocThread-4]:   seg=_4(8.0.0):C93 size=0.004 MB [floored]
   [junit4]   2> 13384 INFO  (DocThread-4) [    ] o.a.s.u.LoggingInfoStream [TMP][DocThread-4]:   seg=_1(8.0.0):C82 size=0.004 MB [floored]
   [junit4]   2> 13384 INFO  (DocThread-4) [    ] o.a.s.u.LoggingInfoStream [TMP][DocThread-4]:   seg=_3(8.0.0):C79 size=0.004 MB [floored]
   [junit4]   2> 13384 INFO  (DocThread-4) [    ] o.a.s.u.LoggingInfoStream [TMP][DocThread-4]:   allowedSegmentCount=1 vs count=5 (eligible count=5) tooBigCount=0
   [junit4]   2> 13384 INFO  (DocThread-4) [    ] o.a.s.u.LoggingInfoStream [MS][DocThread-4]: initDynamicDefaults spins=true maxThreadCount=1 maxMergeCount=6
   [junit4]   2> 13384 INFO  (DocThread-4) [    ] o.a.s.u.LoggingInfoStream [MS][DocThread-4]: now merge
   [junit4]   2> 13384 INFO  (DocThread-3) [    ] o.a.s.u.LoggingInfoStream [DW][DocThread-3]: DocThread-3 finishFullFlush success=true
   [junit4]   2> 13384 INFO  (DocThread-4) [    ] o.a.s.u.LoggingInfoStream [MS][DocThread-4]:   index: _0(8.0.0):C101 _1(8.0.0):C82 _2(8.0.0):C105 _3(8.0.0):C79 _4(8.0.0):C93
   [junit4]   2> 13384 INFO  (DocThread-3) [    ] o.a.s.u.LoggingInfoStream [IW][DocThread-3]: startCommit(): start
   [junit4]   2> 13384 INFO  (DocThread-4) [    ] o.a.s.u.LoggingInfoStream [MS][DocThread-4]:   no more merges pending; now return
   [junit4]   2> 13384 INFO  (DocThread-3) [    ] o.a.s.u.LoggingInfoStream [IW][DocThread-3]: startCommit index=_0(8.0.0):C101 _1(8.0.0):C82 _2(8.0.0):C105 _3(8.0.0):C79 _4(8.0.0):C93 changeCount=14
   [junit4]   2> 13384 INFO  (DocThread-3) [    ] o.a.s.u.LoggingInfoStream [IW][DocThread-3]: startCommit: wrote pending segments file "pending_segments_2"
   [junit4]   2> 13384 INFO  (DocThread-3) [    ] o.a.s.u.LoggingInfoStream [IW][DocThread-3]: done all syncs: [_3.si, _1.nvd, _3_Lucene70_0.dvd, _0.nvd, _2_Lucene50_0.pos, _1.nvm, _1.fnm, _4_Lucene50_0.doc, _1_Lucene50_0.tim, _2.nvd, _4_Lucene50_0.pos, _0_Lucene70_0.dvd, _2.nvm, _2.fnm, _1_Lucene70_0.dvm, _1_Lucene50_0.tip, _2.si, _1_Lucene70_0.dvd, _0_Lucene50_0.pos, _4_Lucene50_0.tip, _4_Lucene70_0.dvm, _4_Lucene50_0.tim, _4.fdt, _2_Lucene70_0.dvd, _3_Lucene50_0.tim, _3_Lucene70_0.dvm, _3.fdt, _3_Lucene50_0.tip, _0.nvm, _0.fnm, _3.fdx, _0_Lucene50_0.doc, _1.si, _3_Lucene50_0.pos, _2.fdt, _2.fdx, _2_Lucene50_0.tim, _2_Lucene70_0.dvm, _2_Lucene50_0.tip, _4.fdx, _4_Lucene70_0.dvd, _1_Lucene50_0.pos, _3_Lucene50_0.doc, _1.fdx, _1.fdt, _0.si, _0_Lucene50_0.tim, _3.nvd, _4.nvm, _4.fnm, _0.fdx, _3.nvm, _3.fnm, _0_Lucene50_0.tip, _4.nvd, _2_Lucene50_0.doc, _0.fdt, _0_Lucene70_0.dvm, _1_Lucene50_0.doc, _4.si]
   [junit4]   2> 13384 INFO  (DocThread-3) [    ] o.a.s.u.LoggingInfoStream [IW][DocThread-3]: commit: pendingCommit != null
   [junit4]   2> 13384 INFO  (DocThread-3) [    ] o.a.s.u.LoggingInfoStream [IW][DocThread-3]: commit: done writing segments file "segments_2"
   [junit4]   2> 13384 INFO  (DocThread-3) [    ] o.a.s.u.LoggingInfoStream [IFD][DocThread-3]: now checkpoint "_0(8.0.0):C101 _1(8.0.0):C82 _2(8.0.0):C105 _3(8.0.0):C79 _4(8.0.0):C93" [5 segments ; isCommit = true]
   [junit4]   2> 13385 INFO  (DocThread-3) [    ] o.a.s.u.LoggingInfoStream [IFD][DocThread-3]: deleteCommits: now decRef commit "segments_1"
   [junit4]   2> 13385 INFO  (DocThread-3) [    ] o.a.s.u.LoggingInfoStream [IFD][DocThread-3]: delete [segments_1]
   [junit4]   2> 13385 INFO  (DocThread-3) [    ] o.a.s.u.LoggingInfoStream [IFD][DocThread-3]: 0 msec to checkpoint
   [junit4]   2> 13385 INFO  (DocThread-3) [    ] o.a.s.u.LoggingInfoStream [IW][DocThread-3]: commit: took 26.4 msec
   [junit4]   2> 13385 INFO  (DocThread-3) [    ] o.a.s.u.LoggingInfoStream [IW][DocThread-3]: commit: done
   [junit4]   2> 13385 INFO  (DocThread-3) [    ] o.a.s.u.LoggingInfoStream [TMP][DocThread-3]: findMerges: 5 segments
   [junit4]   2> 13385 INFO  (DocThread-3) [    ] o.a.s.u.LoggingInfoStream [TMP][DocThread-3]:   seg=_2(8.0.0):C105 size=0.004 MB [floored]
   [junit4]   2> 13385 INFO  (DocThread-3) [    ] o.a.s.u.LoggingInfoStream [TMP][DocThread-3]:   seg=_0(8.0.0):C101 size=0.004 MB [floored]
   [junit4]   2> 13385 INFO  (DocThread-3) [    ] o.a.s.u.LoggingInfoStream [TMP][DocThread-3]:   seg=_4(8.0.0):C93 size=0.004 MB [floored]
   [junit4]   2> 13385 INFO  (DocThread-3) [    ] o.a.s.u.LoggingInfoStream [TMP][DocThread-3]:   seg=_1(8.0.0):C82 size=0.004 MB [floored]
   [junit4]   2> 13385 INFO  (DocThread-3) [    ] o.a.s.u.LoggingInfoStream [TMP][DocThread-3]:   seg=_3(8.0.0):C79 size=0.004 MB [floored]
   [junit4]   2> 13385 INFO  (DocThread-3) [    ] o.a.s.u.LoggingInfoStream [TMP][DocThread-3]:   allowedSegmentCount=1 vs count=5 (eligible count=5) tooBigCount=0
   [junit4]   2> 13386 INFO  (DocThread-3) [    ] o.a.s.u.LoggingInfoStream [MS][DocThread-3]: now merge
   [junit4]   2> 13386 INFO  (DocThread-3) [    ] o.a.s.u.LoggingInfoStream [MS][DocThread-3]:   index: _0(8.0.0):C101 _1(8.0.0):C82 _2(8.0.0):C105 _3(8.0.0):C79 _4(8.0.0):C93
   [junit4]   2> 13386 INFO  (DocThread-3) [    ] o.a.s.u.LoggingInfoStream [MS][DocThread-3]:   no more merges pending; now return
   [junit4]   2> 13386 INFO  (DocThread-3) [    ] o.a.s.u.LoggingInfoStream [DW][DocThread-3]: anyChanges? numDocsInRam=12 deletes=true hasTickets:false pendingChangesInFullFlush: false
   [junit4]   2> 13386 INFO  (DocThread-3) [    ] o.a.s.u.LoggingInfoStream [IW][DocThread-3]: nrtIsCurrent: infoVersion matches: false; DW changes: true; BD changes: false
   [junit4]   2> 13386 INFO  (DocThread-3) [    ] o.a.s.u.LoggingInfoStream [IW][DocThread-3]: flush at getReader
   [junit4]   2> 13386 INFO  (DocThread-3) [    ] o.a.s.u.LoggingInfoStream [DW][DocThread-3]: startFullFlush
   [junit4]   2> 13386 INFO  (DocThread-3) [    ] o.a.s.u.LoggingInfoStream [DW][DocThread-3]: anyChanges? numDocsInRam=13 deletes=true hasTickets:false pendingChangesInFullFlush: false
   [junit4]   2> 13386 INFO  (DocThread-3) [    ] o.a.s.u.LoggingInfoStream [DWFC][DocThread-3]: addFlushableState DocumentsWriterPerThread [pendingDeletes=gen=0 1 deleted terms (unique count=1) bytesUsed=233, segment=_5, aborted=false, numDocsInRAM=2, deleteQueue=DWDQ: [ generation: 3 ]]
   [junit4]   2> 13386 INFO  (DocThread-3) [    ] o.a.s.u.LoggingInfoStream [DWFC][DocThread-3]: addFlushableState DocumentsWriterPerThread [pendingDeletes=gen=0 11 deleted terms (unique count=11) bytesUsed=2563, segment=_6, aborted=false, numDocsInRAM=12, deleteQueue=DWDQ: [ generation: 3 ]]
   [junit4]   2> 13387 INFO  (DocThread-4) [    ] o.a.s.u.LoggingInfoStream [BD][DocThread-4]: compressed 3262 to 1040 bytes (31.88%) for deletes/updates; private segment null
   [junit4]   2> 13387 INFO  (DocThread-4) [    ] o.a.s.u.LoggingInfoStream [DWPT][DocThread-4]: flush postings as segment _5 numDocs=2
   [junit4]   2> 13387 INFO  (DocThread-3) [    ] o.a.s.u.LoggingInfoStream [DWPT][DocThread-3]: flush postings as segment _6 numDocs=12
   [junit4]   2> 13387 INFO  (DocThread-4) [    ] o.a.s.u.LoggingInfoStream [IW][DocThread-4]: 0 msec to write norms
   [junit4]   2> 13387 INFO  (DocThread-3) [    ] o.a.s.u.LoggingInfoStream [IW][DocThread-3]: 0 msec to write norms
   [junit4]   2> 13387 INFO  (DocThread-4) [    ] o.a.s.u.LoggingInfoStream [IW][DocThread-4]: 0 msec to write docValues
   [junit4]   2> 13387 INFO  (DocThread-4) [    ] o.a.s.u.LoggingInfoStream [IW][DocThread-4]: 0 msec to write points
   [junit4]   2> 13387 INFO  (DocThread-4) [    ] o.a.s.u.LoggingInfoStream [IW][DocThread-4]: 0 msec to finish stored fields
   [junit4]   2> 13387 INFO  (DocThread-3) [    ] o.a.s.u.LoggingInfoStream [IW][DocThread-3]: 0 msec to write docValues
   [junit4]   2> 13387 INFO  (DocThread-3) [    ] o.a.s.u.LoggingInfoStream [IW][DocThread-3]: 0 msec to write points
   [junit4]   2> 13387 INFO  (DocThread-3) [    ] o.a.s.u.LoggingInfoStream [IW][DocThread-3]: 0 msec to finish stored fields
   [junit4]   2> 13387 INFO  (DocThread-4) [    ] o.a.s.u.LoggingInfoStream [IW][DocThread-4]: 0 msec to write postings and finish vectors
   [junit4]   2> 13387 INFO  (DocThread-4) [    ] o.a.s.u.LoggingInfoStream [IW][DocThread-4]: 0 msec to write fieldInfos
   [junit4]   2> 13387 INFO  (DocThread-4) [    ] o.a.s.u.LoggingInfoStream [DWPT][DocThread-4]: new segment has 0 deleted docs
   [junit4]   2> 13388 INFO  (DocThread-4) [    ] o.a.s.u.LoggingInfoStream [DWPT][DocThread-4]: new segment has no vectors; norms; docValues; prox; freqs
   [junit4]   2> 13388 INFO  (DocThread-4) [    ] o.a.s.u.LoggingInfoStream [DWPT][DocThread-4]: flushedFiles=[_5.nvm, _5.fnm, _5_Lucene50_0.pos, _5.fdt, _5_Lucene70_0.dvm, _5_Lucene70_0.dvd, _5.nvd, _5_Lucene50_0.tip, _5_Lucene50_0.doc, _5_Lucene50_0.tim, _5.fdx]
   [junit4]   2> 13388 INFO  (DocThread-4) [    ] o.a.s.u.LoggingInfoStream [DWPT][DocThread-4]: flushed codec=Lucene70
   [junit4]   2> 13388 INFO  (DocThread-3) [    ] o.a.s.u.LoggingInfoStream [IW][DocThread-3]: 0 msec to write postings and finish vectors
   [junit4]   2> 13388 INFO  (DocThread-4) [    ] o.a.s.u.LoggingInfoStream [DWPT][DocThread-4]: flushed: segment=_5 ramUsed=0.098 MB newFlushedSize=0.002 MB docs/MB=1,311.54
   [junit4]   2> 13388 INFO  (DocThread-3) [    ] o.a.s.u.LoggingInfoStream [IW][DocThread-3]: 0 msec to write fieldInfos
   [junit4]   2> 13388 INFO  (DocThread-4) [    ] o.a.s.u.LoggingInfoStream [DWPT][DocThread-4]: flush time 1.124473 msec
   [junit4]   2> 13388 INFO  (DocThread-3) [    ] o.a.s.u.LoggingInfoStream [DWPT][DocThread-3]: new segment has 0 deleted docs
   [junit4]   2> 13388 INFO  (DocThread-4) [    ] o.a.s.u.LoggingInfoStream [IW][DocThread-4]: publishFlushedSegment seg-private updates=null
   [junit4]   2> 13388 INFO  (DocThread-3) [    ] o.a.s.u.LoggingInfoStream [DWPT][DocThread-3]: new segment has no vectors; norms; docValues; prox; freqs
   [junit4]   2> 13388 INFO  (DocThread-4) [    ] o.a.s.u.LoggingInfoStream [IW][DocThread-4]: publishFlushedSegment _5(8.0.0):C2
   [junit4]   2> 13388 INFO  (DocThread-3) [    ] o.a.s.u.LoggingInfoStream [DWPT][DocThread-3]: flushedFiles=[_6_Lucene50_0.doc, _6_Lucene50_0.tim, _6_Lucene70_0.dvm, _6_Lucene50_0.tip, _6.fdt, _6.nvm, _6.fnm, _6.fdx, _6_Lucene70_0.dvd, _6_Lucene50_0.pos, _6.nvd]
   [junit4]   2> 13388 INFO  (DocThread-3) [    ] o.a.s.u.LoggingInfoStream [DWPT][DocThread-3]: flushed codec=Lucene70
   [junit4]   2> 13388 INFO  (DocThread-3) [    ] o.a.s.u.LoggingInfoStream [DWPT][DocThread-3]: flushed: segment=_6 ramUsed=0.098 MB newFlushedSize=0.002 MB docs/MB=6,754.113
   [junit4]   2> 13388 INFO  (DocThread-4) [    ] o.a.s.u.LoggingInfoStream [BD][DocThread-4]: push new packet (delGen=8 numDeleteTerms=14 bytesUsed=1040), packetCount=1, bytesUsed=0.001 MB
   [junit4]   2> 13388 INFO  (DocThread-4) [    ] o.a.s.u.LoggingInfoStream [BD][DocThread-4]: finished packet delGen=9 now completedDelGen=7
   [junit4]   2> 13388 INFO  (DocThread-4) [    ] o.a.s.u.LoggingInfoStream [IW][DocThread-4]: publish sets newSegment delGen=9 seg=_5(8.0.0):C2
   [junit4]   2> 13388 INFO  (DocThread-3) [    ] o.a.s.u.LoggingInfoStream [DWPT][DocThread-3]: flush time 1.448033 msec
   [junit4]   2> 13388 INFO  (DocThread-4) [    ] o.a.s.u.LoggingInfoStream [IFD][DocThread-4]: now checkpoint "_0(8.0.0):C101 _1(8.0.0):C82 _2(8.0.0):C105 _3(8.0.0):C79 _4(8.0.0):C93 _5(8.0.0):C2" [6 segments ; isCommit = false]
   [junit4]   2> 13388 INFO  (DocThread-4) [    ] o.a.s.u.LoggingInfoStream [IFD][DocThread-4]: 0 msec to checkpoint
   [junit4]   2> 13388 INFO  (DocThread-4) [    ] o.a.s.u.LoggingInfoStream [IW][DocThread-4]: publishFlushedSegment seg-private updates=null
   [junit4]   2> 13388 INFO  (DocThread-4) [    ] o.a.s.u.LoggingInfoStream [IW][DocThread-4]: publishFlushedSegment _6(8.0.0):C12
   [junit4]   2> 13388 INFO  (DocThread-4) [    ] o.a.s.u.LoggingInfoStream [BD][DocThread-4]: finished packet delGen=10 now completedDelGen=7
   [junit4]   2> 13388 INFO  (DocThread-4) [    ] o.a.s.u.LoggingInfoStream [IW][DocThread-4]: publish sets newSegment delGen=10 seg=_6(8.0.0):C12
   [junit4]   2> 13388 INFO  (DocThread-4) [    ] o.a.s.u.LoggingInfoStream [IFD][DocThread-4]: now checkpoint "_0(8.0.0):C101 _1(8.0.0):C82 _2(8.0.0):C105 _3(8.0.0):C79 _4(8.0.0):C93 _5(8.0.0):C2 _6(8.0.0):C12" [7 segments ; isCommit = false]
   [junit4]   2> 13388 INFO  (DocThread-4) [    ] o.a.s.u.LoggingInfoStream [IFD][DocThread-4]: 0 msec to checkpoint
   [junit4]   2> 13389 INFO  (DocThread-3) [    ] o.a.s.u.LoggingInfoStream [IW][DocThread-3]: now apply all deletes for all segments buffered updates bytesUsed=1040 reader pool bytesUsed=0
   [junit4]   2> 13389 INFO  (DocThread-3) [    ] o.a.s.u.LoggingInfoStream [BD][DocThread-3]: waitApply: 1 packets: [delGen=8 numDeleteTerms=14 bytesUsed=1040]
   [junit4]   2> 13390 INFO  (DocThread-4) [    ] o.a.s.u.LoggingInfoStream [BD][DocThread-4]: now apply del packet (delGen=8 numDeleteTerms=14 bytesUsed=1040) to 5 segments, mergeGen 0
   [junit4]   2> 13390 INFO  (DocThread-4) [    ] o.a.s.u.LoggingInfoStream [BD][DocThread-4]: applyTermDeletes took 0.35 msec for 5 segments and 14 del terms; 0 new deletions
   [junit4]   2> 13390 INFO  (DocThread-4) [    ] o.a.s.u.LoggingInfoStream [BD][DocThread-4]: closeSegmentStates: 0 new deleted documents; pool 1 packets; bytesUsed=0
   [junit4]   2> 13391 INFO  (DocThread-4) [    ] o.a.s.u.LoggingInfoStream [BD][DocThread-4]: done inner apply del packet (delGen=8 numDeleteTerms=14 bytesUsed=1040) to 5 segments; 0 new deletes/updates; took 0.002 sec
   [junit4]   2> 13391 INFO  (DocThread-4) [    ] o.a.s.u.LoggingInfoStream [BD][DocThread-4]: finished packet delGen=8 now completedDelGen=10
   [junit4]   2> 13391 INFO  (DocThread-4) [    ] o.a.s.u.LoggingInfoStream [BD][DocThread-4]: done apply del packet (delGen=8 numDeleteTerms=14 bytesUsed=1040) to 5 segments; 0 new deletes/updates; took 0.002 sec; 0 packets remain
   [junit4]   2> 13391 INFO  (DocThread-4) [    ] o.a.s.u.LoggingInfoStream [TMP][DocThread-4]: findMerges: 7 segments
   [junit4]   2> 13391 INFO  (DocThread-3) [    ] o.a.s.u.LoggingInfoStream [BD][DocThread-3]: waitApply: done 1 packets; totalDelCount=0; totBytesUsed=0; took 2.12 msec
   [junit4]   2> 13391 INFO  (DocThread-4) [    ] o.a.s.u.LoggingInfoStream [TMP][DocThread-4]:   seg=_2(8.0.0):C105 size=0.004 MB [floored]
   [junit4]   2> 13391 INFO  (DocThread-4) [    ] o.a.s.u.LoggingInfoStream [TMP][DocThread-4]:   seg=_0(8.0.0):C101 size=0.004 MB [floored]
   [junit4]   2> 13391 INFO  (DocThread-4) [    ] o.a.s.u.LoggingInfoStream [TMP][DocThread-4]:   seg=_4(8.0.0):C93 size=0.004 MB [floored]
   [junit4]   2> 13391 INFO  (DocThread-4) [    ] o.a.s.u.LoggingInfoStream [TMP][DocThread-4]:   seg=_1(8.0.0):C82 size=0.004 MB [floored]
   [junit4]   2> 13391 INFO  (DocThread-4) [    ] o.a.s.u.LoggingInfoStream [TMP][DocThread-4]:   seg=_3(8.0.0):C79 size=0.004 MB [floored]
   [junit4]   2> 13391 INFO  (DocThread-4) [    ] o.a.s.u.LoggingInfoStream [TMP][DocThread-4]:   seg=_6(8.0.0):C12 size=0.002 MB [floored]
   [junit4]   2> 13391 INFO  (DocThread-4) [    ] o.a.s.u.LoggingInfoStream [TMP][DocThread-4]:   seg=_5(8.0.0):C2 size=0.002 MB [floored]
   [junit4]   2> 13391 INFO  (DocThread-4) [    ] o.a.s.u.LoggingInfoStream [TMP][DocThread-4]:   allowedSegmentCount=1 vs count=7 (eligible count=7) tooBigCount=0
   [junit4]   2> 13391 INFO  (DocThread-4) [    ] o.a.s.u.LoggingInfoStream [MS][DocThread-4]: now merge
   [junit4]   2> 13392 INFO  (DocThread-3) [    ] o.a.s.u.LoggingInfoStream [IW][DocThread-3]: incRefDeleter for NRT reader version=19 segments=_0(8.0.0):C101 _1(8.0.0):C82 _2(8.0.0):C105 _3(8.0.0):C79 _4(8.0.0):C93 _5(8.0.0):C2 _6(8.0.0):C12
   [junit4]   2> 13393 INFO  (DocThread-3) [    ] o.a.s.u.LoggingInfoStream [IW][DocThread-3]: return reader version=19 reader=StandardDirectoryReader(segments_2:19:nrt _0(8.0.0):C101 _1(8.0.0):C82 _2(8.0.0):C105 _3(8.0.0):C79 _4(8.0.0):C93 _5(8.0.0):C2 _6(8.0.0):C12)
   [junit4]   2> 13393 INFO  (DocThread-3) [    ] o.a.s.u.LoggingInfoStream [DW][DocThread-3]: DocThread-3 finishFullFlush success=true
   [junit4]   2> 13393 INFO  (DocThread-4) [    ] o.a.s.u.LoggingInfoStrea

[...truncated too long message...]

s 0.

-ivy-fail-disallowed-ivy-version:

ivy-fail:

ivy-configure:
[ivy:configure] :: loading settings :: file = /home/jenkins/workspace/Lucene-Solr-master-Linux/lucene/top-level-ivy-settings.xml

resolve:

init:

-clover.disable:

-clover.load:

-clover.classpath:

-clover.setup:

clover:

compile-core:

init:

-clover.disable:

-clover.load:

-clover.classpath:

-clover.setup:

clover:

common.compile-core:

compile-core:

compile-test-framework:

-check-git-state:

-git-cleanroot:

-copy-git-state:

git-autoclean:

ivy-availability-check:
[loadresource] Do not set property disallowed.ivy.jars.list as its length is 0.

-ivy-fail-disallowed-ivy-version:

ivy-fail:

ivy-configure:
[ivy:configure] :: loading settings :: file = /home/jenkins/workspace/Lucene-Solr-master-Linux/lucene/top-level-ivy-settings.xml

resolve:

init:

compile-lucene-core:

compile-codecs:

-check-git-state:

-git-cleanroot:

-copy-git-state:

git-autoclean:

ivy-availability-check:
[loadresource] Do not set property disallowed.ivy.jars.list as its length is 0.

-ivy-fail-disallowed-ivy-version:

ivy-fail:

ivy-configure:
[ivy:configure] :: loading settings :: file = /home/jenkins/workspace/Lucene-Solr-master-Linux/lucene/top-level-ivy-settings.xml

resolve:

common.init:

compile-lucene-core:

init:

-clover.disable:

-clover.load:

-clover.classpath:

-clover.setup:

clover:

compile-core:

-clover.disable:

-clover.load:

-clover.classpath:

-clover.setup:

clover:

common.compile-core:

compile-core:

common.compile-test:
    [mkdir] Created dir: /home/jenkins/workspace/Lucene-Solr-master-Linux/solr/build/solr-solrj/classes/test
    [javac] Compiling 159 source files to /home/jenkins/workspace/Lucene-Solr-master-Linux/solr/build/solr-solrj/classes/test
    [javac] Note: Some input files use or override a deprecated API.
    [javac] Note: Recompile with -Xlint:deprecation for details.
    [javac] Note: Some input files use unchecked or unsafe operations.
    [javac] Note: Recompile with -Xlint:unchecked for details.

compile-test:

BUILD SUCCESSFUL
Total time: 46 seconds
[repro] ant test-nocompile -Dtests.dups=5 -Dtests.maxfailures=5 -Dtests.class="*.LargeVolumeEmbeddedTest" -Dtests.showOutput=onerror "-Dargs=-XX:-UseCompressedOops -XX:+UseSerialGC" -Dtests.seed=AD54FA5A09D362FA -Dtests.multiplier=3 -Dtests.slow=true -Dtests.locale=sr-Latn-RS -Dtests.timezone=Pacific/Palau -Dtests.asserts=true -Dtests.file.encoding=ISO-8859-1
Buildfile: /home/jenkins/workspace/Lucene-Solr-master-Linux/solr/solrj/build.xml

-clover.disable:

ivy-configure:
[ivy:configure] :: Apache Ivy 2.4.0 - 20141213170938 :: http://ant.apache.org/ivy/ ::
[ivy:configure] :: loading settings :: file = /home/jenkins/workspace/Lucene-Solr-master-Linux/lucene/top-level-ivy-settings.xml

install-junit4-taskdef:

ivy-availability-check:
[loadresource] Do not set property disallowed.ivy.jars.list as its length is 0.

-ivy-fail-disallowed-ivy-version:

ivy-fail:

resolve-groovy:
[ivy:cachepath] :: resolving dependencies :: org.codehaus.groovy#groovy-all-caller;working
[ivy:cachepath] 	confs: [default]
[ivy:cachepath] 	found org.codehaus.groovy#groovy-all;2.4.15 in public
[ivy:cachepath] :: resolution report :: resolve 18ms :: artifacts dl 1ms
	---------------------------------------------------------------------
	|                  |            modules            ||   artifacts   |
	|       conf       | number| search|dwnlded|evicted|| number|dwnlded|
	---------------------------------------------------------------------
	|      default     |   1   |   0   |   0   |   0   ||   1   |   0   |
	---------------------------------------------------------------------

-init-totals:

-test:
    [mkdir] Created dir: /home/jenkins/workspace/Lucene-Solr-master-Linux/solr/build/solr-solrj/test
[junit4:pickseed] Seed property 'tests.seed' already defined: AD54FA5A09D362FA
    [mkdir] Created dir: /home/jenkins/workspace/Lucene-Solr-master-Linux/solr/build/solr-solrj/test/temp
   [junit4] <JUnit4> says olá! Master seed: AD54FA5A09D362FA
   [junit4] Executing 5 suites with 3 JVMs.
   [junit4] 
   [junit4] Started J2 PID(16021@serv1.sd-datasolutions.de).
   [junit4] Started J1 PID(16020@serv1.sd-datasolutions.de).
   [junit4] Started J0 PID(16019@serv1.sd-datasolutions.de).
   [junit4] Suite: org.apache.solr.client.solrj.embedded.LargeVolumeEmbeddedTest
   [junit4] OK      0.90s J1 | LargeVolumeEmbeddedTest.testMultiThreaded
   [junit4] Completed [1/5] on J1 in 8.37s, 1 test
   [junit4] 
   [junit4] Suite: org.apache.solr.client.solrj.embedded.LargeVolumeEmbeddedTest
   [junit4] OK      1.05s J2 | LargeVolumeEmbeddedTest.testMultiThreaded
   [junit4] Completed [2/5] on J2 in 8.82s, 1 test
   [junit4] 
   [junit4] Duplicate suite name used with XML reports: org.apache.solr.client.solrj.embedded.LargeVolumeEmbeddedTest. This may confuse tools that process XML reports. Set 'ignoreDuplicateSuites' to true to skip this message.
   [junit4] Suite: org.apache.solr.client.solrj.embedded.LargeVolumeEmbeddedTest
   [junit4] OK      1.13s J0 | LargeVolumeEmbeddedTest.testMultiThreaded
   [junit4] Completed [3/5] on J0 in 8.95s, 1 test
   [junit4] 
   [junit4] Suite: org.apache.solr.client.solrj.embedded.LargeVolumeEmbeddedTest
   [junit4] OK      0.33s J1 | LargeVolumeEmbeddedTest.testMultiThreaded
   [junit4] Completed [4/5] on J1 in 1.54s, 1 test
   [junit4] 
   [junit4] Suite: org.apache.solr.client.solrj.embedded.LargeVolumeEmbeddedTest
   [junit4] OK      0.25s J2 | LargeVolumeEmbeddedTest.testMultiThreaded
   [junit4] Completed [5/5] on J2 in 1.39s, 1 test
   [junit4] 
   [junit4] JVM J0:     0.68 ..    10.27 =     9.59s
   [junit4] JVM J1:     0.67 ..    11.37 =    10.70s
   [junit4] JVM J2:     0.67 ..    11.79 =    11.12s
   [junit4] Execution time total: 11 seconds
   [junit4] Tests summary: 5 suites, 5 tests
   [junit4] Could not remove temporary path: /home/jenkins/workspace/Lucene-Solr-master-Linux/solr/build/solr-solrj/test/J2 (java.nio.file.DirectoryNotEmptyException: Remaining files: [/home/jenkins/workspace/Lucene-Solr-master-Linux/solr/build/solr-solrj/test/J2/temp])
   [junit4] Could not remove temporary path: /home/jenkins/workspace/Lucene-Solr-master-Linux/solr/build/solr-solrj/test/J1 (java.nio.file.DirectoryNotEmptyException: Remaining files: [/home/jenkins/workspace/Lucene-Solr-master-Linux/solr/build/solr-solrj/test/J1/temp])
   [junit4] Could not remove temporary path: /home/jenkins/workspace/Lucene-Solr-master-Linux/solr/build/solr-solrj/test/J0 (java.nio.file.DirectoryNotEmptyException: Remaining files: [/home/jenkins/workspace/Lucene-Solr-master-Linux/solr/build/solr-solrj/test/J0/temp])
     [echo] 5 slowest tests:
[junit4:tophints]  71.53s | org.apache.solr.client.solrj.io.stream.StreamDecoratorTest
[junit4:tophints]  41.32s | org.apache.solr.client.solrj.impl.CloudSolrClientTest
[junit4:tophints]  39.34s | org.apache.solr.common.cloud.TestCloudCollectionsListeners
[junit4:tophints]  27.38s | org.apache.solr.common.cloud.TestCollectionStateWatchers
[junit4:tophints]  15.98s | org.apache.solr.client.solrj.io.stream.StreamExpressionTest

-check-totals:

test-nocompile:

BUILD SUCCESSFUL
Total time: 13 seconds
[repro] Failures:
[repro]   0/5 failed: org.apache.solr.client.solrj.embedded.LargeVolumeEmbeddedTest
[repro] Exiting with code 0
+ mv lucene/build lucene/build.repro
+ mv solr/build solr/build.repro
+ mv lucene/build.orig lucene/build
+ mv solr/build.orig solr/build
Archiving artifacts
Setting ANT_1_8_2_HOME=/var/lib/jenkins/tools/hudson.tasks.Ant_AntInstallation/ANT_1.8.2
java.lang.InterruptedException: no matches found within 10000
	at hudson.FilePath$34.hasMatch(FilePath.java:2667)
	at hudson.FilePath$34.invoke(FilePath.java:2546)
	at hudson.FilePath$34.invoke(FilePath.java:2536)
	at hudson.FilePath.act(FilePath.java:1036)
	at hudson.FilePath.act(FilePath.java:1014)
	at hudson.FilePath.validateAntFileMask(FilePath.java:2536)
	at hudson.tasks.ArtifactArchiver.perform(ArtifactArchiver.java:243)
	at hudson.tasks.BuildStepCompatibilityLayer.perform(BuildStepCompatibilityLayer.java:81)
	at hudson.tasks.BuildStepMonitor$1.perform(BuildStepMonitor.java:20)
	at hudson.model.AbstractBuild$AbstractBuildExecution.perform(AbstractBuild.java:744)
	at hudson.model.AbstractBuild$AbstractBuildExecution.performAllBuildSteps(AbstractBuild.java:690)
	at hudson.model.Build$BuildExecution.post2(Build.java:186)
	at hudson.model.AbstractBuild$AbstractBuildExecution.post(AbstractBuild.java:635)
	at hudson.model.Run.execute(Run.java:1819)
	at hudson.model.FreeStyleBuild.run(FreeStyleBuild.java:43)
	at hudson.model.ResourceController.execute(ResourceController.java:97)
	at hudson.model.Executor.run(Executor.java:429)
No artifacts found that match the file pattern "**/*.events,heapdumps/**,**/*_pid*.log". Configuration error?
[WARNINGS] Parsing warnings in console log with parser Java Compiler (javac)
Setting ANT_1_8_2_HOME=/var/lib/jenkins/tools/hudson.tasks.Ant_AntInstallation/ANT_1.8.2
Setting ANT_1_8_2_HOME=/var/lib/jenkins/tools/hudson.tasks.Ant_AntInstallation/ANT_1.8.2
<Git Blamer> Using GitBlamer to create author and commit information for all warnings.
<Git Blamer> GIT_COMMIT=09a789f535007c907c8dc55f3ae4e4e9ca9c8ee3, workspace=/var/lib/jenkins/workspace/Lucene-Solr-master-Linux
[WARNINGS] Computing warning deltas based on reference build #22015
Recording test results
Setting ANT_1_8_2_HOME=/var/lib/jenkins/tools/hudson.tasks.Ant_AntInstallation/ANT_1.8.2
Build step 'Publish JUnit test result report' changed build result to UNSTABLE
Email was triggered for: Unstable (Test Failures)
Sending email for trigger: Unstable (Test Failures)
Setting ANT_1_8_2_HOME=/var/lib/jenkins/tools/hudson.tasks.Ant_AntInstallation/ANT_1.8.2
Setting ANT_1_8_2_HOME=/var/lib/jenkins/tools/hudson.tasks.Ant_AntInstallation/ANT_1.8.2
Setting ANT_1_8_2_HOME=/var/lib/jenkins/tools/hudson.tasks.Ant_AntInstallation/ANT_1.8.2
Setting ANT_1_8_2_HOME=/var/lib/jenkins/tools/hudson.tasks.Ant_AntInstallation/ANT_1.8.2

Mime
View raw message