lucene-dev mailing list archives

Site index · List index
Message view « Date » · « Thread »
Top « Date » · « Thread »
From Apache Jenkins Server <jenk...@builds.apache.org>
Subject [JENKINS] Lucene-Solr-BadApples-Tests-7.x - Build # 51 - Unstable
Date Tue, 01 May 2018 16:41:32 GMT
Build: https://builds.apache.org/job/Lucene-Solr-BadApples-Tests-7.x/51/

10 tests failed.
FAILED:  junit.framework.TestSuite.org.apache.solr.cloud.ZkControllerTest

Error Message:
ObjectTracker found 1 object(s) that were not released!!! [Overseer] org.apache.solr.common.util.ObjectReleaseTracker$ObjectTrackerException: org.apache.solr.cloud.Overseer  at org.apache.solr.common.util.ObjectReleaseTracker.track(ObjectReleaseTracker.java:42)  at org.apache.solr.cloud.Overseer.start(Overseer.java:545)  at org.apache.solr.cloud.OverseerElectionContext.runLeaderProcess(ElectionContext.java:851)  at org.apache.solr.cloud.LeaderElector.runIamLeaderProcess(LeaderElector.java:170)  at org.apache.solr.cloud.LeaderElector.checkIfIamLeader(LeaderElector.java:135)  at org.apache.solr.cloud.LeaderElector.joinElection(LeaderElector.java:307)  at org.apache.solr.cloud.LeaderElector.retryElection(LeaderElector.java:393)  at org.apache.solr.cloud.ZkController.rejoinOverseerElection(ZkController.java:2081)  at org.apache.solr.cloud.Overseer$ClusterStateUpdater.checkIfIamStillLeader(Overseer.java:331)  at java.lang.Thread.run(Thread.java:748)  

Stack Trace:
java.lang.AssertionError: ObjectTracker found 1 object(s) that were not released!!! [Overseer]
org.apache.solr.common.util.ObjectReleaseTracker$ObjectTrackerException: org.apache.solr.cloud.Overseer
	at org.apache.solr.common.util.ObjectReleaseTracker.track(ObjectReleaseTracker.java:42)
	at org.apache.solr.cloud.Overseer.start(Overseer.java:545)
	at org.apache.solr.cloud.OverseerElectionContext.runLeaderProcess(ElectionContext.java:851)
	at org.apache.solr.cloud.LeaderElector.runIamLeaderProcess(LeaderElector.java:170)
	at org.apache.solr.cloud.LeaderElector.checkIfIamLeader(LeaderElector.java:135)
	at org.apache.solr.cloud.LeaderElector.joinElection(LeaderElector.java:307)
	at org.apache.solr.cloud.LeaderElector.retryElection(LeaderElector.java:393)
	at org.apache.solr.cloud.ZkController.rejoinOverseerElection(ZkController.java:2081)
	at org.apache.solr.cloud.Overseer$ClusterStateUpdater.checkIfIamStillLeader(Overseer.java:331)
	at java.lang.Thread.run(Thread.java:748)


	at __randomizedtesting.SeedInfo.seed([8816A03D966D33E5]:0)
	at org.junit.Assert.fail(Assert.java:93)
	at org.junit.Assert.assertTrue(Assert.java:43)
	at org.junit.Assert.assertNull(Assert.java:551)
	at org.apache.solr.SolrTestCaseJ4.teardownTestCases(SolrTestCaseJ4.java:303)
	at sun.reflect.GeneratedMethodAccessor53.invoke(Unknown Source)
	at sun.reflect.DelegatingMethodAccessorImpl.invoke(DelegatingMethodAccessorImpl.java:43)
	at java.lang.reflect.Method.invoke(Method.java:498)
	at com.carrotsearch.randomizedtesting.RandomizedRunner.invoke(RandomizedRunner.java:1737)
	at com.carrotsearch.randomizedtesting.RandomizedRunner$7.evaluate(RandomizedRunner.java:897)
	at com.carrotsearch.randomizedtesting.rules.StatementAdapter.evaluate(StatementAdapter.java:36)
	at com.carrotsearch.randomizedtesting.rules.SystemPropertiesRestoreRule$1.evaluate(SystemPropertiesRestoreRule.java:57)
	at org.apache.lucene.util.AbstractBeforeAfterRule$1.evaluate(AbstractBeforeAfterRule.java:45)
	at com.carrotsearch.randomizedtesting.rules.StatementAdapter.evaluate(StatementAdapter.java:36)
	at org.apache.lucene.util.TestRuleStoreClassName$1.evaluate(TestRuleStoreClassName.java:41)
	at com.carrotsearch.randomizedtesting.rules.NoShadowingOrOverridesOnMethodsRule$1.evaluate(NoShadowingOrOverridesOnMethodsRule.java:40)
	at com.carrotsearch.randomizedtesting.rules.NoShadowingOrOverridesOnMethodsRule$1.evaluate(NoShadowingOrOverridesOnMethodsRule.java:40)
	at com.carrotsearch.randomizedtesting.rules.StatementAdapter.evaluate(StatementAdapter.java:36)
	at com.carrotsearch.randomizedtesting.rules.StatementAdapter.evaluate(StatementAdapter.java:36)
	at com.carrotsearch.randomizedtesting.rules.StatementAdapter.evaluate(StatementAdapter.java:36)
	at org.apache.lucene.util.TestRuleAssertionsRequired$1.evaluate(TestRuleAssertionsRequired.java:53)
	at org.apache.lucene.util.TestRuleMarkFailure$1.evaluate(TestRuleMarkFailure.java:47)
	at org.apache.lucene.util.TestRuleIgnoreAfterMaxFailures$1.evaluate(TestRuleIgnoreAfterMaxFailures.java:64)
	at org.apache.lucene.util.TestRuleIgnoreTestSuites$1.evaluate(TestRuleIgnoreTestSuites.java:54)
	at com.carrotsearch.randomizedtesting.rules.StatementAdapter.evaluate(StatementAdapter.java:36)
	at com.carrotsearch.randomizedtesting.ThreadLeakControl$StatementRunner.run(ThreadLeakControl.java:368)
	at java.lang.Thread.run(Thread.java:748)


FAILED:  junit.framework.TestSuite.org.apache.solr.cloud.ZkControllerTest

Error Message:
1 thread leaked from SUITE scope at org.apache.solr.cloud.ZkControllerTest:     1) Thread[id=28496, name=OverseerAutoScalingTriggerThread-72550670015528962-127.0.0.1:8983_solr-n_0000000001, state=RUNNABLE, group=Overseer autoscaling triggers]         at sun.reflect.Reflection.getCallerClass(Native Method)         at sun.reflect.GeneratedMethodAccessor1.invoke(Unknown Source)         at sun.reflect.DelegatingMethodAccessorImpl.invoke(DelegatingMethodAccessorImpl.java:43)         at java.lang.reflect.Method.invoke(Method.java:498)         at org.apache.logging.log4j.util.StackLocator.getCallerClass(StackLocator.java:110)         at org.apache.logging.log4j.util.StackLocator.getCurrentStackTrace(StackLocator.java:169)         at org.apache.logging.log4j.util.StackLocatorUtil.getCurrentStackTrace(StackLocatorUtil.java:67)         at org.apache.logging.log4j.core.impl.ThrowableProxy.<init>(ThrowableProxy.java:137)         at org.apache.logging.log4j.core.impl.ThrowableProxy.<init>(ThrowableProxy.java:122)         at org.apache.logging.log4j.core.impl.Log4jLogEvent.getThrownProxy(Log4jLogEvent.java:605)         at org.apache.logging.log4j.core.pattern.ExtendedThrowablePatternConverter.format(ExtendedThrowablePatternConverter.java:64)         at org.apache.logging.log4j.core.pattern.PatternFormatter.format(PatternFormatter.java:38)         at org.apache.logging.log4j.core.layout.PatternLayout$PatternSerializer.toSerializable(PatternLayout.java:334)         at org.apache.logging.log4j.core.layout.PatternLayout.toText(PatternLayout.java:233)         at org.apache.logging.log4j.core.layout.PatternLayout.encode(PatternLayout.java:218)         at org.apache.logging.log4j.core.layout.PatternLayout.encode(PatternLayout.java:58)         at org.apache.logging.log4j.core.appender.AbstractOutputStreamAppender.directEncodeEvent(AbstractOutputStreamAppender.java:177)         at org.apache.logging.log4j.core.appender.AbstractOutputStreamAppender.tryAppend(AbstractOutputStreamAppender.java:170)         at org.apache.logging.log4j.core.appender.AbstractOutputStreamAppender.append(AbstractOutputStreamAppender.java:161)         at org.apache.logging.log4j.core.config.AppenderControl.tryCallAppender(AppenderControl.java:156)         at org.apache.logging.log4j.core.config.AppenderControl.callAppender0(AppenderControl.java:129)         at org.apache.logging.log4j.core.config.AppenderControl.callAppenderPreventRecursion(AppenderControl.java:120)         at org.apache.logging.log4j.core.config.AppenderControl.callAppender(AppenderControl.java:84)         at org.apache.logging.log4j.core.config.LoggerConfig.callAppenders(LoggerConfig.java:448)         at org.apache.logging.log4j.core.config.LoggerConfig.processLogEvent(LoggerConfig.java:433)         at org.apache.logging.log4j.core.config.LoggerConfig.log(LoggerConfig.java:417)         at org.apache.logging.log4j.core.config.LoggerConfig.logParent(LoggerConfig.java:439)         at org.apache.logging.log4j.core.config.LoggerConfig.processLogEvent(LoggerConfig.java:434)         at org.apache.logging.log4j.core.config.LoggerConfig.log(LoggerConfig.java:417)         at org.apache.logging.log4j.core.config.LoggerConfig.logParent(LoggerConfig.java:439)         at org.apache.logging.log4j.core.config.LoggerConfig.processLogEvent(LoggerConfig.java:434)         at org.apache.logging.log4j.core.config.LoggerConfig.log(LoggerConfig.java:417)         at org.apache.logging.log4j.core.config.LoggerConfig.log(LoggerConfig.java:403)         at org.apache.logging.log4j.core.config.DefaultReliabilityStrategy.log(DefaultReliabilityStrategy.java:49)         at org.apache.logging.log4j.core.Logger.logMessage(Logger.java:146)         at org.apache.logging.log4j.spi.AbstractLogger.tryLogMessage(AbstractLogger.java:2170)         at org.apache.logging.log4j.spi.AbstractLogger.logMessageTrackRecursion(AbstractLogger.java:2125)         at org.apache.logging.log4j.spi.AbstractLogger.logMessageSafely(AbstractLogger.java:2108)         at org.apache.logging.log4j.spi.AbstractLogger.logMessage(AbstractLogger.java:2002)         at org.apache.logging.log4j.spi.AbstractLogger.logIfEnabled(AbstractLogger.java:1974)         at org.apache.logging.slf4j.Log4jLogger.error(Log4jLogger.java:319)         at org.apache.solr.cloud.autoscaling.OverseerTriggerThread.run(OverseerTriggerThread.java:146)         at java.lang.Thread.run(Thread.java:748)

Stack Trace:
com.carrotsearch.randomizedtesting.ThreadLeakError: 1 thread leaked from SUITE scope at org.apache.solr.cloud.ZkControllerTest: 
   1) Thread[id=28496, name=OverseerAutoScalingTriggerThread-72550670015528962-127.0.0.1:8983_solr-n_0000000001, state=RUNNABLE, group=Overseer autoscaling triggers]
        at sun.reflect.Reflection.getCallerClass(Native Method)
        at sun.reflect.GeneratedMethodAccessor1.invoke(Unknown Source)
        at sun.reflect.DelegatingMethodAccessorImpl.invoke(DelegatingMethodAccessorImpl.java:43)
        at java.lang.reflect.Method.invoke(Method.java:498)
        at org.apache.logging.log4j.util.StackLocator.getCallerClass(StackLocator.java:110)
        at org.apache.logging.log4j.util.StackLocator.getCurrentStackTrace(StackLocator.java:169)
        at org.apache.logging.log4j.util.StackLocatorUtil.getCurrentStackTrace(StackLocatorUtil.java:67)
        at org.apache.logging.log4j.core.impl.ThrowableProxy.<init>(ThrowableProxy.java:137)
        at org.apache.logging.log4j.core.impl.ThrowableProxy.<init>(ThrowableProxy.java:122)
        at org.apache.logging.log4j.core.impl.Log4jLogEvent.getThrownProxy(Log4jLogEvent.java:605)
        at org.apache.logging.log4j.core.pattern.ExtendedThrowablePatternConverter.format(ExtendedThrowablePatternConverter.java:64)
        at org.apache.logging.log4j.core.pattern.PatternFormatter.format(PatternFormatter.java:38)
        at org.apache.logging.log4j.core.layout.PatternLayout$PatternSerializer.toSerializable(PatternLayout.java:334)
        at org.apache.logging.log4j.core.layout.PatternLayout.toText(PatternLayout.java:233)
        at org.apache.logging.log4j.core.layout.PatternLayout.encode(PatternLayout.java:218)
        at org.apache.logging.log4j.core.layout.PatternLayout.encode(PatternLayout.java:58)
        at org.apache.logging.log4j.core.appender.AbstractOutputStreamAppender.directEncodeEvent(AbstractOutputStreamAppender.java:177)
        at org.apache.logging.log4j.core.appender.AbstractOutputStreamAppender.tryAppend(AbstractOutputStreamAppender.java:170)
        at org.apache.logging.log4j.core.appender.AbstractOutputStreamAppender.append(AbstractOutputStreamAppender.java:161)
        at org.apache.logging.log4j.core.config.AppenderControl.tryCallAppender(AppenderControl.java:156)
        at org.apache.logging.log4j.core.config.AppenderControl.callAppender0(AppenderControl.java:129)
        at org.apache.logging.log4j.core.config.AppenderControl.callAppenderPreventRecursion(AppenderControl.java:120)
        at org.apache.logging.log4j.core.config.AppenderControl.callAppender(AppenderControl.java:84)
        at org.apache.logging.log4j.core.config.LoggerConfig.callAppenders(LoggerConfig.java:448)
        at org.apache.logging.log4j.core.config.LoggerConfig.processLogEvent(LoggerConfig.java:433)
        at org.apache.logging.log4j.core.config.LoggerConfig.log(LoggerConfig.java:417)
        at org.apache.logging.log4j.core.config.LoggerConfig.logParent(LoggerConfig.java:439)
        at org.apache.logging.log4j.core.config.LoggerConfig.processLogEvent(LoggerConfig.java:434)
        at org.apache.logging.log4j.core.config.LoggerConfig.log(LoggerConfig.java:417)
        at org.apache.logging.log4j.core.config.LoggerConfig.logParent(LoggerConfig.java:439)
        at org.apache.logging.log4j.core.config.LoggerConfig.processLogEvent(LoggerConfig.java:434)
        at org.apache.logging.log4j.core.config.LoggerConfig.log(LoggerConfig.java:417)
        at org.apache.logging.log4j.core.config.LoggerConfig.log(LoggerConfig.java:403)
        at org.apache.logging.log4j.core.config.DefaultReliabilityStrategy.log(DefaultReliabilityStrategy.java:49)
        at org.apache.logging.log4j.core.Logger.logMessage(Logger.java:146)
        at org.apache.logging.log4j.spi.AbstractLogger.tryLogMessage(AbstractLogger.java:2170)
        at org.apache.logging.log4j.spi.AbstractLogger.logMessageTrackRecursion(AbstractLogger.java:2125)
        at org.apache.logging.log4j.spi.AbstractLogger.logMessageSafely(AbstractLogger.java:2108)
        at org.apache.logging.log4j.spi.AbstractLogger.logMessage(AbstractLogger.java:2002)
        at org.apache.logging.log4j.spi.AbstractLogger.logIfEnabled(AbstractLogger.java:1974)
        at org.apache.logging.slf4j.Log4jLogger.error(Log4jLogger.java:319)
        at org.apache.solr.cloud.autoscaling.OverseerTriggerThread.run(OverseerTriggerThread.java:146)
        at java.lang.Thread.run(Thread.java:748)
	at __randomizedtesting.SeedInfo.seed([8816A03D966D33E5]:0)


FAILED:  org.apache.solr.cloud.autoscaling.SearchRateTriggerIntegrationTest.testBelowSearchRate

Error Message:
[Op{action=DELETEREPLICA, hints={COLL_SHARD=[{   "first":"belowRate_collection",   "second":"shard1"}], REPLICA=[core_node8]}}, Op{action=NONE, hints={SRC_NODE=[127.0.0.1:37596_solr]}}, Op{action=NONE, hints={SRC_NODE=[127.0.0.1:33953_solr]}}] expected:<2> but was:<3>

Stack Trace:
java.lang.AssertionError: [Op{action=DELETEREPLICA, hints={COLL_SHARD=[{
  "first":"belowRate_collection",
  "second":"shard1"}], REPLICA=[core_node8]}}, Op{action=NONE, hints={SRC_NODE=[127.0.0.1:37596_solr]}}, Op{action=NONE, hints={SRC_NODE=[127.0.0.1:33953_solr]}}] expected:<2> but was:<3>
	at __randomizedtesting.SeedInfo.seed([8816A03D966D33E5:E2BB065DCE85B6F6]:0)
	at org.junit.Assert.fail(Assert.java:93)
	at org.junit.Assert.failNotEquals(Assert.java:647)
	at org.junit.Assert.assertEquals(Assert.java:128)
	at org.junit.Assert.assertEquals(Assert.java:472)
	at org.apache.solr.cloud.autoscaling.SearchRateTriggerIntegrationTest.testBelowSearchRate(SearchRateTriggerIntegrationTest.java:493)
	at sun.reflect.NativeMethodAccessorImpl.invoke0(Native Method)
	at sun.reflect.NativeMethodAccessorImpl.invoke(NativeMethodAccessorImpl.java:62)
	at sun.reflect.DelegatingMethodAccessorImpl.invoke(DelegatingMethodAccessorImpl.java:43)
	at java.lang.reflect.Method.invoke(Method.java:498)
	at com.carrotsearch.randomizedtesting.RandomizedRunner.invoke(RandomizedRunner.java:1737)
	at com.carrotsearch.randomizedtesting.RandomizedRunner$8.evaluate(RandomizedRunner.java:934)
	at com.carrotsearch.randomizedtesting.RandomizedRunner$9.evaluate(RandomizedRunner.java:970)
	at com.carrotsearch.randomizedtesting.RandomizedRunner$10.evaluate(RandomizedRunner.java:984)
	at com.carrotsearch.randomizedtesting.rules.SystemPropertiesRestoreRule$1.evaluate(SystemPropertiesRestoreRule.java:57)
	at org.apache.lucene.util.TestRuleSetupTeardownChained$1.evaluate(TestRuleSetupTeardownChained.java:49)
	at org.apache.lucene.util.AbstractBeforeAfterRule$1.evaluate(AbstractBeforeAfterRule.java:45)
	at org.apache.lucene.util.TestRuleThreadAndTestName$1.evaluate(TestRuleThreadAndTestName.java:48)
	at org.apache.lucene.util.TestRuleIgnoreAfterMaxFailures$1.evaluate(TestRuleIgnoreAfterMaxFailures.java:64)
	at org.apache.lucene.util.TestRuleMarkFailure$1.evaluate(TestRuleMarkFailure.java:47)
	at com.carrotsearch.randomizedtesting.rules.StatementAdapter.evaluate(StatementAdapter.java:36)
	at com.carrotsearch.randomizedtesting.ThreadLeakControl$StatementRunner.run(ThreadLeakControl.java:368)
	at com.carrotsearch.randomizedtesting.ThreadLeakControl.forkTimeoutingTask(ThreadLeakControl.java:817)
	at com.carrotsearch.randomizedtesting.ThreadLeakControl$3.evaluate(ThreadLeakControl.java:468)
	at com.carrotsearch.randomizedtesting.RandomizedRunner.runSingleTest(RandomizedRunner.java:943)
	at com.carrotsearch.randomizedtesting.RandomizedRunner$5.evaluate(RandomizedRunner.java:829)
	at com.carrotsearch.randomizedtesting.RandomizedRunner$6.evaluate(RandomizedRunner.java:879)
	at com.carrotsearch.randomizedtesting.RandomizedRunner$7.evaluate(RandomizedRunner.java:890)
	at com.carrotsearch.randomizedtesting.rules.StatementAdapter.evaluate(StatementAdapter.java:36)
	at com.carrotsearch.randomizedtesting.rules.SystemPropertiesRestoreRule$1.evaluate(SystemPropertiesRestoreRule.java:57)
	at org.apache.lucene.util.AbstractBeforeAfterRule$1.evaluate(AbstractBeforeAfterRule.java:45)
	at com.carrotsearch.randomizedtesting.rules.StatementAdapter.evaluate(StatementAdapter.java:36)
	at org.apache.lucene.util.TestRuleStoreClassName$1.evaluate(TestRuleStoreClassName.java:41)
	at com.carrotsearch.randomizedtesting.rules.NoShadowingOrOverridesOnMethodsRule$1.evaluate(NoShadowingOrOverridesOnMethodsRule.java:40)
	at com.carrotsearch.randomizedtesting.rules.NoShadowingOrOverridesOnMethodsRule$1.evaluate(NoShadowingOrOverridesOnMethodsRule.java:40)
	at com.carrotsearch.randomizedtesting.rules.StatementAdapter.evaluate(StatementAdapter.java:36)
	at com.carrotsearch.randomizedtesting.rules.StatementAdapter.evaluate(StatementAdapter.java:36)
	at com.carrotsearch.randomizedtesting.rules.StatementAdapter.evaluate(StatementAdapter.java:36)
	at org.apache.lucene.util.TestRuleAssertionsRequired$1.evaluate(TestRuleAssertionsRequired.java:53)
	at org.apache.lucene.util.TestRuleMarkFailure$1.evaluate(TestRuleMarkFailure.java:47)
	at org.apache.lucene.util.TestRuleIgnoreAfterMaxFailures$1.evaluate(TestRuleIgnoreAfterMaxFailures.java:64)
	at org.apache.lucene.util.TestRuleIgnoreTestSuites$1.evaluate(TestRuleIgnoreTestSuites.java:54)
	at com.carrotsearch.randomizedtesting.rules.StatementAdapter.evaluate(StatementAdapter.java:36)
	at com.carrotsearch.randomizedtesting.ThreadLeakControl$StatementRunner.run(ThreadLeakControl.java:368)
	at java.lang.Thread.run(Thread.java:748)


FAILED:  org.apache.solr.cloud.autoscaling.SearchRateTriggerIntegrationTest.testDeleteNode

Error Message:
unexpected DELETENODE status: {responseHeader={status=0,QTime=56},status={state=notfound,msg=Did not find [search_rate_trigger3/1ab7cb35469068Ta6qpw7ipx46y2lslsr8k8c385/0] in any tasks queue}}

Stack Trace:
java.lang.AssertionError: unexpected DELETENODE status: {responseHeader={status=0,QTime=56},status={state=notfound,msg=Did not find [search_rate_trigger3/1ab7cb35469068Ta6qpw7ipx46y2lslsr8k8c385/0] in any tasks queue}}
	at __randomizedtesting.SeedInfo.seed([8816A03D966D33E5:AA846EBFA1A7BC98]:0)
	at org.junit.Assert.fail(Assert.java:93)
	at org.apache.solr.cloud.autoscaling.SearchRateTriggerIntegrationTest.lambda$testDeleteNode$6(SearchRateTriggerIntegrationTest.java:668)
	at java.util.ArrayList.forEach(ArrayList.java:1257)
	at org.apache.solr.cloud.autoscaling.SearchRateTriggerIntegrationTest.testDeleteNode(SearchRateTriggerIntegrationTest.java:660)
	at sun.reflect.NativeMethodAccessorImpl.invoke0(Native Method)
	at sun.reflect.NativeMethodAccessorImpl.invoke(NativeMethodAccessorImpl.java:62)
	at sun.reflect.DelegatingMethodAccessorImpl.invoke(DelegatingMethodAccessorImpl.java:43)
	at java.lang.reflect.Method.invoke(Method.java:498)
	at com.carrotsearch.randomizedtesting.RandomizedRunner.invoke(RandomizedRunner.java:1737)
	at com.carrotsearch.randomizedtesting.RandomizedRunner$8.evaluate(RandomizedRunner.java:934)
	at com.carrotsearch.randomizedtesting.RandomizedRunner$9.evaluate(RandomizedRunner.java:970)
	at com.carrotsearch.randomizedtesting.RandomizedRunner$10.evaluate(RandomizedRunner.java:984)
	at com.carrotsearch.randomizedtesting.rules.SystemPropertiesRestoreRule$1.evaluate(SystemPropertiesRestoreRule.java:57)
	at org.apache.lucene.util.TestRuleSetupTeardownChained$1.evaluate(TestRuleSetupTeardownChained.java:49)
	at org.apache.lucene.util.AbstractBeforeAfterRule$1.evaluate(AbstractBeforeAfterRule.java:45)
	at org.apache.lucene.util.TestRuleThreadAndTestName$1.evaluate(TestRuleThreadAndTestName.java:48)
	at org.apache.lucene.util.TestRuleIgnoreAfterMaxFailures$1.evaluate(TestRuleIgnoreAfterMaxFailures.java:64)
	at org.apache.lucene.util.TestRuleMarkFailure$1.evaluate(TestRuleMarkFailure.java:47)
	at com.carrotsearch.randomizedtesting.rules.StatementAdapter.evaluate(StatementAdapter.java:36)
	at com.carrotsearch.randomizedtesting.ThreadLeakControl$StatementRunner.run(ThreadLeakControl.java:368)
	at com.carrotsearch.randomizedtesting.ThreadLeakControl.forkTimeoutingTask(ThreadLeakControl.java:817)
	at com.carrotsearch.randomizedtesting.ThreadLeakControl$3.evaluate(ThreadLeakControl.java:468)
	at com.carrotsearch.randomizedtesting.RandomizedRunner.runSingleTest(RandomizedRunner.java:943)
	at com.carrotsearch.randomizedtesting.RandomizedRunner$5.evaluate(RandomizedRunner.java:829)
	at com.carrotsearch.randomizedtesting.RandomizedRunner$6.evaluate(RandomizedRunner.java:879)
	at com.carrotsearch.randomizedtesting.RandomizedRunner$7.evaluate(RandomizedRunner.java:890)
	at com.carrotsearch.randomizedtesting.rules.StatementAdapter.evaluate(StatementAdapter.java:36)
	at com.carrotsearch.randomizedtesting.rules.SystemPropertiesRestoreRule$1.evaluate(SystemPropertiesRestoreRule.java:57)
	at org.apache.lucene.util.AbstractBeforeAfterRule$1.evaluate(AbstractBeforeAfterRule.java:45)
	at com.carrotsearch.randomizedtesting.rules.StatementAdapter.evaluate(StatementAdapter.java:36)
	at org.apache.lucene.util.TestRuleStoreClassName$1.evaluate(TestRuleStoreClassName.java:41)
	at com.carrotsearch.randomizedtesting.rules.NoShadowingOrOverridesOnMethodsRule$1.evaluate(NoShadowingOrOverridesOnMethodsRule.java:40)
	at com.carrotsearch.randomizedtesting.rules.NoShadowingOrOverridesOnMethodsRule$1.evaluate(NoShadowingOrOverridesOnMethodsRule.java:40)
	at com.carrotsearch.randomizedtesting.rules.StatementAdapter.evaluate(StatementAdapter.java:36)
	at com.carrotsearch.randomizedtesting.rules.StatementAdapter.evaluate(StatementAdapter.java:36)
	at com.carrotsearch.randomizedtesting.rules.StatementAdapter.evaluate(StatementAdapter.java:36)
	at org.apache.lucene.util.TestRuleAssertionsRequired$1.evaluate(TestRuleAssertionsRequired.java:53)
	at org.apache.lucene.util.TestRuleMarkFailure$1.evaluate(TestRuleMarkFailure.java:47)
	at org.apache.lucene.util.TestRuleIgnoreAfterMaxFailures$1.evaluate(TestRuleIgnoreAfterMaxFailures.java:64)
	at org.apache.lucene.util.TestRuleIgnoreTestSuites$1.evaluate(TestRuleIgnoreTestSuites.java:54)
	at com.carrotsearch.randomizedtesting.rules.StatementAdapter.evaluate(StatementAdapter.java:36)
	at com.carrotsearch.randomizedtesting.ThreadLeakControl$StatementRunner.run(ThreadLeakControl.java:368)
	at java.lang.Thread.run(Thread.java:748)


FAILED:  org.apache.solr.cloud.autoscaling.sim.TestLargeCluster.testAddNode

Error Message:
java.util.concurrent.ExecutionException: java.io.IOException: org.apache.solr.api.ApiBag$ExceptionWithErrObject: Error in command payload, errors: [{suspend-trigger={name=.scheduled_maintenance}, errorMessages=[No trigger exists with name: .scheduled_maintenance]}], 

Stack Trace:
java.io.IOException: java.util.concurrent.ExecutionException: java.io.IOException: org.apache.solr.api.ApiBag$ExceptionWithErrObject: Error in command payload, errors: [{suspend-trigger={name=.scheduled_maintenance}, errorMessages=[No trigger exists with name: .scheduled_maintenance]}], 
	at __randomizedtesting.SeedInfo.seed([8816A03D966D33E5:2FF9BD9E5920BCFD]:0)
	at org.apache.solr.cloud.autoscaling.sim.SimCloudManager.request(SimCloudManager.java:540)
	at org.apache.solr.cloud.autoscaling.sim.SimCloudManager$1.request(SimCloudManager.java:414)
	at org.apache.solr.client.solrj.SolrClient.request(SolrClient.java:1219)
	at org.apache.solr.cloud.autoscaling.sim.TestLargeCluster.setupTest(TestLargeCluster.java:108)
	at sun.reflect.NativeMethodAccessorImpl.invoke0(Native Method)
	at sun.reflect.NativeMethodAccessorImpl.invoke(NativeMethodAccessorImpl.java:62)
	at sun.reflect.DelegatingMethodAccessorImpl.invoke(DelegatingMethodAccessorImpl.java:43)
	at java.lang.reflect.Method.invoke(Method.java:498)
	at com.carrotsearch.randomizedtesting.RandomizedRunner.invoke(RandomizedRunner.java:1737)
	at com.carrotsearch.randomizedtesting.RandomizedRunner$9.evaluate(RandomizedRunner.java:968)
	at com.carrotsearch.randomizedtesting.RandomizedRunner$10.evaluate(RandomizedRunner.java:984)
	at com.carrotsearch.randomizedtesting.rules.SystemPropertiesRestoreRule$1.evaluate(SystemPropertiesRestoreRule.java:57)
	at org.apache.lucene.util.TestRuleSetupTeardownChained$1.evaluate(TestRuleSetupTeardownChained.java:49)
	at org.apache.lucene.util.AbstractBeforeAfterRule$1.evaluate(AbstractBeforeAfterRule.java:45)
	at org.apache.lucene.util.TestRuleThreadAndTestName$1.evaluate(TestRuleThreadAndTestName.java:48)
	at org.apache.lucene.util.TestRuleIgnoreAfterMaxFailures$1.evaluate(TestRuleIgnoreAfterMaxFailures.java:64)
	at org.apache.lucene.util.TestRuleMarkFailure$1.evaluate(TestRuleMarkFailure.java:47)
	at com.carrotsearch.randomizedtesting.rules.StatementAdapter.evaluate(StatementAdapter.java:36)
	at com.carrotsearch.randomizedtesting.ThreadLeakControl$StatementRunner.run(ThreadLeakControl.java:368)
	at com.carrotsearch.randomizedtesting.ThreadLeakControl.forkTimeoutingTask(ThreadLeakControl.java:817)
	at com.carrotsearch.randomizedtesting.ThreadLeakControl$3.evaluate(ThreadLeakControl.java:468)
	at com.carrotsearch.randomizedtesting.RandomizedRunner.runSingleTest(RandomizedRunner.java:943)
	at com.carrotsearch.randomizedtesting.RandomizedRunner$5.evaluate(RandomizedRunner.java:829)
	at com.carrotsearch.randomizedtesting.RandomizedRunner$6.evaluate(RandomizedRunner.java:879)
	at com.carrotsearch.randomizedtesting.RandomizedRunner$7.evaluate(RandomizedRunner.java:890)
	at com.carrotsearch.randomizedtesting.rules.StatementAdapter.evaluate(StatementAdapter.java:36)
	at com.carrotsearch.randomizedtesting.rules.SystemPropertiesRestoreRule$1.evaluate(SystemPropertiesRestoreRule.java:57)
	at org.apache.lucene.util.AbstractBeforeAfterRule$1.evaluate(AbstractBeforeAfterRule.java:45)
	at com.carrotsearch.randomizedtesting.rules.StatementAdapter.evaluate(StatementAdapter.java:36)
	at org.apache.lucene.util.TestRuleStoreClassName$1.evaluate(TestRuleStoreClassName.java:41)
	at com.carrotsearch.randomizedtesting.rules.NoShadowingOrOverridesOnMethodsRule$1.evaluate(NoShadowingOrOverridesOnMethodsRule.java:40)
	at com.carrotsearch.randomizedtesting.rules.NoShadowingOrOverridesOnMethodsRule$1.evaluate(NoShadowingOrOverridesOnMethodsRule.java:40)
	at com.carrotsearch.randomizedtesting.rules.StatementAdapter.evaluate(StatementAdapter.java:36)
	at com.carrotsearch.randomizedtesting.rules.StatementAdapter.evaluate(StatementAdapter.java:36)
	at com.carrotsearch.randomizedtesting.rules.StatementAdapter.evaluate(StatementAdapter.java:36)
	at org.apache.lucene.util.TestRuleAssertionsRequired$1.evaluate(TestRuleAssertionsRequired.java:53)
	at org.apache.lucene.util.TestRuleMarkFailure$1.evaluate(TestRuleMarkFailure.java:47)
	at org.apache.lucene.util.TestRuleIgnoreAfterMaxFailures$1.evaluate(TestRuleIgnoreAfterMaxFailures.java:64)
	at org.apache.lucene.util.TestRuleIgnoreTestSuites$1.evaluate(TestRuleIgnoreTestSuites.java:54)
	at com.carrotsearch.randomizedtesting.rules.StatementAdapter.evaluate(StatementAdapter.java:36)
	at com.carrotsearch.randomizedtesting.ThreadLeakControl$StatementRunner.run(ThreadLeakControl.java:368)
	at java.lang.Thread.run(Thread.java:748)
Caused by: java.util.concurrent.ExecutionException: java.io.IOException: org.apache.solr.api.ApiBag$ExceptionWithErrObject: Error in command payload, errors: [{suspend-trigger={name=.scheduled_maintenance}, errorMessages=[No trigger exists with name: .scheduled_maintenance]}], 
	at java.util.concurrent.FutureTask.report(FutureTask.java:122)
	at java.util.concurrent.FutureTask.get(FutureTask.java:192)
	at org.apache.solr.cloud.autoscaling.sim.SimCloudManager.request(SimCloudManager.java:538)
	... 41 more
Caused by: java.io.IOException: org.apache.solr.api.ApiBag$ExceptionWithErrObject: Error in command payload, errors: [{suspend-trigger={name=.scheduled_maintenance}, errorMessages=[No trigger exists with name: .scheduled_maintenance]}], 
	at org.apache.solr.cloud.autoscaling.sim.SimCloudManager.simHandleSolrRequest(SimCloudManager.java:578)
	at org.apache.solr.cloud.autoscaling.sim.SimCloudManager.lambda$request$12(SimCloudManager.java:537)
	at java.util.concurrent.FutureTask.run(FutureTask.java:266)
	at org.apache.solr.common.util.ExecutorUtil$MDCAwareThreadPoolExecutor.lambda$execute$0(ExecutorUtil.java:192)
	at java.util.concurrent.ThreadPoolExecutor.runWorker(ThreadPoolExecutor.java:1149)
	at java.util.concurrent.ThreadPoolExecutor$Worker.run(ThreadPoolExecutor.java:624)
	... 1 more
Caused by: org.apache.solr.api.ApiBag$ExceptionWithErrObject: Error in command payload, errors: [{suspend-trigger={name=.scheduled_maintenance}, errorMessages=[No trigger exists with name: .scheduled_maintenance]}], 
	at org.apache.solr.cloud.autoscaling.AutoScalingHandler.processOps(AutoScalingHandler.java:210)
	at org.apache.solr.cloud.autoscaling.AutoScalingHandler.handleRequestBody(AutoScalingHandler.java:148)
	at org.apache.solr.handler.RequestHandlerBase.handleRequest(RequestHandlerBase.java:199)
	at org.apache.solr.cloud.autoscaling.sim.SimCloudManager.simHandleSolrRequest(SimCloudManager.java:575)
	... 6 more


FAILED:  org.apache.solr.cloud.autoscaling.sim.TestLargeCluster.testBasic

Error Message:
there should be new MOVERPLICA ops

Stack Trace:
java.lang.AssertionError: there should be new MOVERPLICA ops
	at __randomizedtesting.SeedInfo.seed([8816A03D966D33E5:23ECBD2849B1B5CB]:0)
	at org.junit.Assert.fail(Assert.java:93)
	at org.junit.Assert.assertTrue(Assert.java:43)
	at org.apache.solr.cloud.autoscaling.sim.TestLargeCluster.testBasic(TestLargeCluster.java:225)
	at sun.reflect.NativeMethodAccessorImpl.invoke0(Native Method)
	at sun.reflect.NativeMethodAccessorImpl.invoke(NativeMethodAccessorImpl.java:62)
	at sun.reflect.DelegatingMethodAccessorImpl.invoke(DelegatingMethodAccessorImpl.java:43)
	at java.lang.reflect.Method.invoke(Method.java:498)
	at com.carrotsearch.randomizedtesting.RandomizedRunner.invoke(RandomizedRunner.java:1737)
	at com.carrotsearch.randomizedtesting.RandomizedRunner$8.evaluate(RandomizedRunner.java:934)
	at com.carrotsearch.randomizedtesting.RandomizedRunner$9.evaluate(RandomizedRunner.java:970)
	at com.carrotsearch.randomizedtesting.RandomizedRunner$10.evaluate(RandomizedRunner.java:984)
	at com.carrotsearch.randomizedtesting.rules.SystemPropertiesRestoreRule$1.evaluate(SystemPropertiesRestoreRule.java:57)
	at org.apache.lucene.util.TestRuleSetupTeardownChained$1.evaluate(TestRuleSetupTeardownChained.java:49)
	at org.apache.lucene.util.AbstractBeforeAfterRule$1.evaluate(AbstractBeforeAfterRule.java:45)
	at org.apache.lucene.util.TestRuleThreadAndTestName$1.evaluate(TestRuleThreadAndTestName.java:48)
	at org.apache.lucene.util.TestRuleIgnoreAfterMaxFailures$1.evaluate(TestRuleIgnoreAfterMaxFailures.java:64)
	at org.apache.lucene.util.TestRuleMarkFailure$1.evaluate(TestRuleMarkFailure.java:47)
	at com.carrotsearch.randomizedtesting.rules.StatementAdapter.evaluate(StatementAdapter.java:36)
	at com.carrotsearch.randomizedtesting.ThreadLeakControl$StatementRunner.run(ThreadLeakControl.java:368)
	at com.carrotsearch.randomizedtesting.ThreadLeakControl.forkTimeoutingTask(ThreadLeakControl.java:817)
	at com.carrotsearch.randomizedtesting.ThreadLeakControl$3.evaluate(ThreadLeakControl.java:468)
	at com.carrotsearch.randomizedtesting.RandomizedRunner.runSingleTest(RandomizedRunner.java:943)
	at com.carrotsearch.randomizedtesting.RandomizedRunner$5.evaluate(RandomizedRunner.java:829)
	at com.carrotsearch.randomizedtesting.RandomizedRunner$6.evaluate(RandomizedRunner.java:879)
	at com.carrotsearch.randomizedtesting.RandomizedRunner$7.evaluate(RandomizedRunner.java:890)
	at com.carrotsearch.randomizedtesting.rules.StatementAdapter.evaluate(StatementAdapter.java:36)
	at com.carrotsearch.randomizedtesting.rules.SystemPropertiesRestoreRule$1.evaluate(SystemPropertiesRestoreRule.java:57)
	at org.apache.lucene.util.AbstractBeforeAfterRule$1.evaluate(AbstractBeforeAfterRule.java:45)
	at com.carrotsearch.randomizedtesting.rules.StatementAdapter.evaluate(StatementAdapter.java:36)
	at org.apache.lucene.util.TestRuleStoreClassName$1.evaluate(TestRuleStoreClassName.java:41)
	at com.carrotsearch.randomizedtesting.rules.NoShadowingOrOverridesOnMethodsRule$1.evaluate(NoShadowingOrOverridesOnMethodsRule.java:40)
	at com.carrotsearch.randomizedtesting.rules.NoShadowingOrOverridesOnMethodsRule$1.evaluate(NoShadowingOrOverridesOnMethodsRule.java:40)
	at com.carrotsearch.randomizedtesting.rules.StatementAdapter.evaluate(StatementAdapter.java:36)
	at com.carrotsearch.randomizedtesting.rules.StatementAdapter.evaluate(StatementAdapter.java:36)
	at com.carrotsearch.randomizedtesting.rules.StatementAdapter.evaluate(StatementAdapter.java:36)
	at org.apache.lucene.util.TestRuleAssertionsRequired$1.evaluate(TestRuleAssertionsRequired.java:53)
	at org.apache.lucene.util.TestRuleMarkFailure$1.evaluate(TestRuleMarkFailure.java:47)
	at org.apache.lucene.util.TestRuleIgnoreAfterMaxFailures$1.evaluate(TestRuleIgnoreAfterMaxFailures.java:64)
	at org.apache.lucene.util.TestRuleIgnoreTestSuites$1.evaluate(TestRuleIgnoreTestSuites.java:54)
	at com.carrotsearch.randomizedtesting.rules.StatementAdapter.evaluate(StatementAdapter.java:36)
	at com.carrotsearch.randomizedtesting.ThreadLeakControl$StatementRunner.run(ThreadLeakControl.java:368)
	at java.lang.Thread.run(Thread.java:748)


FAILED:  org.apache.solr.handler.TestSolrConfigHandlerCloud.test

Error Message:
{   "responseHeader":{     "status":500,     "QTime":30439},   "errorMessages":["4 out of 5 the property overlay to be of version 19 within 30 seconds! Failed cores: [http://127.0.0.1:33743/c/collection1_shard2_replica_n41/, http://127.0.0.1:33825/c/collection1_shard2_replica_n45/, http://127.0.0.1:44993/c/collection1_shard1_replica_n43/, http://127.0.0.1:39150/c/collection1_shard1_replica_n47/]\n"],   "WARNING":"This response format is experimental.  It is likely to change in the future.",   "error":{     "metadata":[       "error-class","org.apache.solr.common.SolrException",       "root-error-class","org.apache.solr.common.SolrException"],     "msg":"4 out of 5 the property overlay to be of version 19 within 30 seconds! Failed cores: [http://127.0.0.1:33743/c/collection1_shard2_replica_n41/, http://127.0.0.1:33825/c/collection1_shard2_replica_n45/, http://127.0.0.1:44993/c/collection1_shard1_replica_n43/, http://127.0.0.1:39150/c/collection1_shard1_replica_n47/]",     "trace":"org.apache.solr.common.SolrException: 4 out of 5 the property overlay to be of version 19 within 30 seconds! Failed cores: [http://127.0.0.1:33743/c/collection1_shard2_replica_n41/, http://127.0.0.1:33825/c/collection1_shard2_replica_n45/, http://127.0.0.1:44993/c/collection1_shard1_replica_n43/, http://127.0.0.1:39150/c/collection1_shard1_replica_n47/]\n\tat org.apache.solr.handler.SolrConfigHandler.waitForAllReplicasState(SolrConfigHandler.java:771)\n\tat org.apache.solr.handler.SolrConfigHandler.access$400(SolrConfigHandler.java:101)\n\tat org.apache.solr.handler.SolrConfigHandler$Command.handleCommands(SolrConfigHandler.java:502)\n\tat org.apache.solr.handler.SolrConfigHandler$Command.handlePOST(SolrConfigHandler.java:345)\n\tat org.apache.solr.handler.SolrConfigHandler$Command.access$100(SolrConfigHandler.java:158)\n\tat org.apache.solr.handler.SolrConfigHandler.handleRequestBody(SolrConfigHandler.java:136)\n\tat org.apache.solr.handler.RequestHandlerBase.handleRequest(RequestHandlerBase.java:199)\n\tat org.apache.solr.core.SolrCore.execute(SolrCore.java:2510)\n\tat org.apache.solr.servlet.HttpSolrCall.execute(HttpSolrCall.java:711)\n\tat org.apache.solr.servlet.HttpSolrCall.call(HttpSolrCall.java:517)\n\tat org.apache.solr.servlet.SolrDispatchFilter.doFilter(SolrDispatchFilter.java:393)\n\tat org.apache.solr.servlet.SolrDispatchFilter.doFilter(SolrDispatchFilter.java:339)\n\tat org.eclipse.jetty.servlet.ServletHandler$CachedChain.doFilter(ServletHandler.java:1637)\n\tat org.apache.solr.client.solrj.embedded.JettySolrRunner$DebugFilter.doFilter(JettySolrRunner.java:139)\n\tat org.eclipse.jetty.servlet.ServletHandler$CachedChain.doFilter(ServletHandler.java:1637)\n\tat org.eclipse.jetty.servlet.ServletHandler.doHandle(ServletHandler.java:533)\n\tat org.eclipse.jetty.server.handler.ScopedHandler.nextHandle(ScopedHandler.java:188)\n\tat org.eclipse.jetty.server.session.SessionHandler.doHandle(SessionHandler.java:1595)\n\tat org.eclipse.jetty.server.handler.ScopedHandler.nextHandle(ScopedHandler.java:188)\n\tat org.eclipse.jetty.server.handler.ContextHandler.doHandle(ContextHandler.java:1253)\n\tat org.eclipse.jetty.server.handler.ScopedHandler.nextScope(ScopedHandler.java:168)\n\tat org.eclipse.jetty.servlet.ServletHandler.doScope(ServletHandler.java:473)\n\tat org.eclipse.jetty.server.session.SessionHandler.doScope(SessionHandler.java:1564)\n\tat org.eclipse.jetty.server.handler.ScopedHandler.nextScope(ScopedHandler.java:166)\n\tat org.eclipse.jetty.server.handler.ContextHandler.doScope(ContextHandler.java:1155)\n\tat org.eclipse.jetty.server.handler.ScopedHandler.handle(ScopedHandler.java:141)\n\tat org.eclipse.jetty.server.handler.gzip.GzipHandler.handle(GzipHandler.java:455)\n\tat org.eclipse.jetty.server.handler.HandlerWrapper.handle(HandlerWrapper.java:132)\n\tat org.eclipse.jetty.server.Server.handle(Server.java:530)\n\tat org.eclipse.jetty.server.HttpChannel.handle(HttpChannel.java:347)\n\tat org.eclipse.jetty.server.HttpConnection.onFillable(HttpConnection.java:256)\n\tat org.eclipse.jetty.io.AbstractConnection$ReadCallback.succeeded(AbstractConnection.java:279)\n\tat org.eclipse.jetty.io.FillInterest.fillable(FillInterest.java:102)\n\tat org.eclipse.jetty.io.ChannelEndPoint$2.run(ChannelEndPoint.java:124)\n\tat org.eclipse.jetty.util.thread.strategy.EatWhatYouKill.doProduce(EatWhatYouKill.java:247)\n\tat org.eclipse.jetty.util.thread.strategy.EatWhatYouKill.produce(EatWhatYouKill.java:140)\n\tat org.eclipse.jetty.util.thread.strategy.EatWhatYouKill.run(EatWhatYouKill.java:131)\n\tat org.eclipse.jetty.util.thread.ReservedThreadExecutor$ReservedThread.run(ReservedThreadExecutor.java:382)\n\tat org.eclipse.jetty.util.thread.QueuedThreadPool.runJob(QueuedThreadPool.java:708)\n\tat org.eclipse.jetty.util.thread.QueuedThreadPool$2.run(QueuedThreadPool.java:626)\n\tat java.lang.Thread.run(Thread.java:748)\n",     "code":500}} 

Stack Trace:
java.lang.AssertionError: {
  "responseHeader":{
    "status":500,
    "QTime":30439},
  "errorMessages":["4 out of 5 the property overlay to be of version 19 within 30 seconds! Failed cores: [http://127.0.0.1:33743/c/collection1_shard2_replica_n41/, http://127.0.0.1:33825/c/collection1_shard2_replica_n45/, http://127.0.0.1:44993/c/collection1_shard1_replica_n43/, http://127.0.0.1:39150/c/collection1_shard1_replica_n47/]\n"],
  "WARNING":"This response format is experimental.  It is likely to change in the future.",
  "error":{
    "metadata":[
      "error-class","org.apache.solr.common.SolrException",
      "root-error-class","org.apache.solr.common.SolrException"],
    "msg":"4 out of 5 the property overlay to be of version 19 within 30 seconds! Failed cores: [http://127.0.0.1:33743/c/collection1_shard2_replica_n41/, http://127.0.0.1:33825/c/collection1_shard2_replica_n45/, http://127.0.0.1:44993/c/collection1_shard1_replica_n43/, http://127.0.0.1:39150/c/collection1_shard1_replica_n47/]",
    "trace":"org.apache.solr.common.SolrException: 4 out of 5 the property overlay to be of version 19 within 30 seconds! Failed cores: [http://127.0.0.1:33743/c/collection1_shard2_replica_n41/, http://127.0.0.1:33825/c/collection1_shard2_replica_n45/, http://127.0.0.1:44993/c/collection1_shard1_replica_n43/, http://127.0.0.1:39150/c/collection1_shard1_replica_n47/]\n\tat org.apache.solr.handler.SolrConfigHandler.waitForAllReplicasState(SolrConfigHandler.java:771)\n\tat org.apache.solr.handler.SolrConfigHandler.access$400(SolrConfigHandler.java:101)\n\tat org.apache.solr.handler.SolrConfigHandler$Command.handleCommands(SolrConfigHandler.java:502)\n\tat org.apache.solr.handler.SolrConfigHandler$Command.handlePOST(SolrConfigHandler.java:345)\n\tat org.apache.solr.handler.SolrConfigHandler$Command.access$100(SolrConfigHandler.java:158)\n\tat org.apache.solr.handler.SolrConfigHandler.handleRequestBody(SolrConfigHandler.java:136)\n\tat org.apache.solr.handler.RequestHandlerBase.handleRequest(RequestHandlerBase.java:199)\n\tat org.apache.solr.core.SolrCore.execute(SolrCore.java:2510)\n\tat org.apache.solr.servlet.HttpSolrCall.execute(HttpSolrCall.java:711)\n\tat org.apache.solr.servlet.HttpSolrCall.call(HttpSolrCall.java:517)\n\tat org.apache.solr.servlet.SolrDispatchFilter.doFilter(SolrDispatchFilter.java:393)\n\tat org.apache.solr.servlet.SolrDispatchFilter.doFilter(SolrDispatchFilter.java:339)\n\tat org.eclipse.jetty.servlet.ServletHandler$CachedChain.doFilter(ServletHandler.java:1637)\n\tat org.apache.solr.client.solrj.embedded.JettySolrRunner$DebugFilter.doFilter(JettySolrRunner.java:139)\n\tat org.eclipse.jetty.servlet.ServletHandler$CachedChain.doFilter(ServletHandler.java:1637)\n\tat org.eclipse.jetty.servlet.ServletHandler.doHandle(ServletHandler.java:533)\n\tat org.eclipse.jetty.server.handler.ScopedHandler.nextHandle(ScopedHandler.java:188)\n\tat org.eclipse.jetty.server.session.SessionHandler.doHandle(SessionHandler.java:1595)\n\tat org.eclipse.jetty.server.handler.ScopedHandler.nextHandle(ScopedHandler.java:188)\n\tat org.eclipse.jetty.server.handler.ContextHandler.doHandle(ContextHandler.java:1253)\n\tat org.eclipse.jetty.server.handler.ScopedHandler.nextScope(ScopedHandler.java:168)\n\tat org.eclipse.jetty.servlet.ServletHandler.doScope(ServletHandler.java:473)\n\tat org.eclipse.jetty.server.session.SessionHandler.doScope(SessionHandler.java:1564)\n\tat org.eclipse.jetty.server.handler.ScopedHandler.nextScope(ScopedHandler.java:166)\n\tat org.eclipse.jetty.server.handler.ContextHandler.doScope(ContextHandler.java:1155)\n\tat org.eclipse.jetty.server.handler.ScopedHandler.handle(ScopedHandler.java:141)\n\tat org.eclipse.jetty.server.handler.gzip.GzipHandler.handle(GzipHandler.java:455)\n\tat org.eclipse.jetty.server.handler.HandlerWrapper.handle(HandlerWrapper.java:132)\n\tat org.eclipse.jetty.server.Server.handle(Server.java:530)\n\tat org.eclipse.jetty.server.HttpChannel.handle(HttpChannel.java:347)\n\tat org.eclipse.jetty.server.HttpConnection.onFillable(HttpConnection.java:256)\n\tat org.eclipse.jetty.io.AbstractConnection$ReadCallback.succeeded(AbstractConnection.java:279)\n\tat org.eclipse.jetty.io.FillInterest.fillable(FillInterest.java:102)\n\tat org.eclipse.jetty.io.ChannelEndPoint$2.run(ChannelEndPoint.java:124)\n\tat org.eclipse.jetty.util.thread.strategy.EatWhatYouKill.doProduce(EatWhatYouKill.java:247)\n\tat org.eclipse.jetty.util.thread.strategy.EatWhatYouKill.produce(EatWhatYouKill.java:140)\n\tat org.eclipse.jetty.util.thread.strategy.EatWhatYouKill.run(EatWhatYouKill.java:131)\n\tat org.eclipse.jetty.util.thread.ReservedThreadExecutor$ReservedThread.run(ReservedThreadExecutor.java:382)\n\tat org.eclipse.jetty.util.thread.QueuedThreadPool.runJob(QueuedThreadPool.java:708)\n\tat org.eclipse.jetty.util.thread.QueuedThreadPool$2.run(QueuedThreadPool.java:626)\n\tat java.lang.Thread.run(Thread.java:748)\n",
    "code":500}}

	at __randomizedtesting.SeedInfo.seed([8816A03D966D33E5:429FE738915E1D]:0)
	at org.junit.Assert.fail(Assert.java:93)
	at org.junit.Assert.assertTrue(Assert.java:43)
	at org.junit.Assert.assertNull(Assert.java:551)
	at org.apache.solr.core.TestSolrConfigHandler.runConfigCommand(TestSolrConfigHandler.java:185)
	at org.apache.solr.core.TestSolrConfigHandler.reqhandlertests(TestSolrConfigHandler.java:487)
	at org.apache.solr.handler.TestSolrConfigHandlerCloud.testReqHandlerAPIs(TestSolrConfigHandlerCloud.java:79)
	at org.apache.solr.handler.TestSolrConfigHandlerCloud.test(TestSolrConfigHandlerCloud.java:49)
	at sun.reflect.NativeMethodAccessorImpl.invoke0(Native Method)
	at sun.reflect.NativeMethodAccessorImpl.invoke(NativeMethodAccessorImpl.java:62)
	at sun.reflect.DelegatingMethodAccessorImpl.invoke(DelegatingMethodAccessorImpl.java:43)
	at java.lang.reflect.Method.invoke(Method.java:498)
	at com.carrotsearch.randomizedtesting.RandomizedRunner.invoke(RandomizedRunner.java:1737)
	at com.carrotsearch.randomizedtesting.RandomizedRunner$8.evaluate(RandomizedRunner.java:934)
	at com.carrotsearch.randomizedtesting.RandomizedRunner$9.evaluate(RandomizedRunner.java:970)
	at com.carrotsearch.randomizedtesting.RandomizedRunner$10.evaluate(RandomizedRunner.java:984)
	at org.apache.solr.BaseDistributedSearchTestCase$ShardsRepeatRule$ShardsFixedStatement.callStatement(BaseDistributedSearchTestCase.java:993)
	at org.apache.solr.BaseDistributedSearchTestCase$ShardsRepeatRule$ShardsStatement.evaluate(BaseDistributedSearchTestCase.java:968)
	at com.carrotsearch.randomizedtesting.rules.SystemPropertiesRestoreRule$1.evaluate(SystemPropertiesRestoreRule.java:57)
	at org.apache.lucene.util.TestRuleSetupTeardownChained$1.evaluate(TestRuleSetupTeardownChained.java:49)
	at org.apache.lucene.util.AbstractBeforeAfterRule$1.evaluate(AbstractBeforeAfterRule.java:45)
	at org.apache.lucene.util.TestRuleThreadAndTestName$1.evaluate(TestRuleThreadAndTestName.java:48)
	at org.apache.lucene.util.TestRuleIgnoreAfterMaxFailures$1.evaluate(TestRuleIgnoreAfterMaxFailures.java:64)
	at org.apache.lucene.util.TestRuleMarkFailure$1.evaluate(TestRuleMarkFailure.java:47)
	at com.carrotsearch.randomizedtesting.rules.StatementAdapter.evaluate(StatementAdapter.java:36)
	at com.carrotsearch.randomizedtesting.ThreadLeakControl$StatementRunner.run(ThreadLeakControl.java:368)
	at com.carrotsearch.randomizedtesting.ThreadLeakControl.forkTimeoutingTask(ThreadLeakControl.java:817)
	at com.carrotsearch.randomizedtesting.ThreadLeakControl$3.evaluate(ThreadLeakControl.java:468)
	at com.carrotsearch.randomizedtesting.RandomizedRunner.runSingleTest(RandomizedRunner.java:943)
	at com.carrotsearch.randomizedtesting.RandomizedRunner$5.evaluate(RandomizedRunner.java:829)
	at com.carrotsearch.randomizedtesting.RandomizedRunner$6.evaluate(RandomizedRunner.java:879)
	at com.carrotsearch.randomizedtesting.RandomizedRunner$7.evaluate(RandomizedRunner.java:890)
	at com.carrotsearch.randomizedtesting.rules.StatementAdapter.evaluate(StatementAdapter.java:36)
	at com.carrotsearch.randomizedtesting.rules.SystemPropertiesRestoreRule$1.evaluate(SystemPropertiesRestoreRule.java:57)
	at org.apache.lucene.util.AbstractBeforeAfterRule$1.evaluate(AbstractBeforeAfterRule.java:45)
	at com.carrotsearch.randomizedtesting.rules.StatementAdapter.evaluate(StatementAdapter.java:36)
	at org.apache.lucene.util.TestRuleStoreClassName$1.evaluate(TestRuleStoreClassName.java:41)
	at com.carrotsearch.randomizedtesting.rules.NoShadowingOrOverridesOnMethodsRule$1.evaluate(NoShadowingOrOverridesOnMethodsRule.java:40)
	at com.carrotsearch.randomizedtesting.rules.NoShadowingOrOverridesOnMethodsRule$1.evaluate(NoShadowingOrOverridesOnMethodsRule.java:40)
	at com.carrotsearch.randomizedtesting.rules.StatementAdapter.evaluate(StatementAdapter.java:36)
	at com.carrotsearch.randomizedtesting.rules.StatementAdapter.evaluate(StatementAdapter.java:36)
	at com.carrotsearch.randomizedtesting.rules.StatementAdapter.evaluate(StatementAdapter.java:36)
	at org.apache.lucene.util.TestRuleAssertionsRequired$1.evaluate(TestRuleAssertionsRequired.java:53)
	at org.apache.lucene.util.TestRuleMarkFailure$1.evaluate(TestRuleMarkFailure.java:47)
	at org.apache.lucene.util.TestRuleIgnoreAfterMaxFailures$1.evaluate(TestRuleIgnoreAfterMaxFailures.java:64)
	at org.apache.lucene.util.TestRuleIgnoreTestSuites$1.evaluate(TestRuleIgnoreTestSuites.java:54)
	at com.carrotsearch.randomizedtesting.rules.StatementAdapter.evaluate(StatementAdapter.java:36)
	at com.carrotsearch.randomizedtesting.ThreadLeakControl$StatementRunner.run(ThreadLeakControl.java:368)
	at java.lang.Thread.run(Thread.java:748)


FAILED:  org.apache.solr.client.solrj.io.stream.StreamDecoratorTest.testParallelDaemonUpdateStream

Error Message:
Could not load collection from ZK: parallelDestinationCollection1

Stack Trace:
org.apache.solr.common.SolrException: Could not load collection from ZK: parallelDestinationCollection1
	at __randomizedtesting.SeedInfo.seed([2F0CC4645394BEE9:5FB3E544BB79C754]:0)
	at org.apache.solr.common.cloud.ZkStateReader.getCollectionLive(ZkStateReader.java:1301)
	at org.apache.solr.common.cloud.ZkStateReader$LazyCollectionRef.get(ZkStateReader.java:730)
	at org.apache.solr.common.cloud.ClusterState.getCollectionOrNull(ClusterState.java:148)
	at org.apache.solr.common.cloud.ClusterState.getCollectionOrNull(ClusterState.java:131)
	at org.apache.solr.cloud.AbstractDistribZkTestBase.waitForRecoveriesToFinish(AbstractDistribZkTestBase.java:154)
	at org.apache.solr.client.solrj.io.stream.StreamDecoratorTest.testParallelDaemonUpdateStream(StreamDecoratorTest.java:2512)
	at sun.reflect.NativeMethodAccessorImpl.invoke0(Native Method)
	at sun.reflect.NativeMethodAccessorImpl.invoke(NativeMethodAccessorImpl.java:62)
	at sun.reflect.DelegatingMethodAccessorImpl.invoke(DelegatingMethodAccessorImpl.java:43)
	at java.lang.reflect.Method.invoke(Method.java:498)
	at com.carrotsearch.randomizedtesting.RandomizedRunner.invoke(RandomizedRunner.java:1737)
	at com.carrotsearch.randomizedtesting.RandomizedRunner$8.evaluate(RandomizedRunner.java:934)
	at com.carrotsearch.randomizedtesting.RandomizedRunner$9.evaluate(RandomizedRunner.java:970)
	at com.carrotsearch.randomizedtesting.RandomizedRunner$10.evaluate(RandomizedRunner.java:984)
	at com.carrotsearch.randomizedtesting.rules.SystemPropertiesRestoreRule$1.evaluate(SystemPropertiesRestoreRule.java:57)
	at org.apache.lucene.util.TestRuleSetupTeardownChained$1.evaluate(TestRuleSetupTeardownChained.java:49)
	at org.apache.lucene.util.AbstractBeforeAfterRule$1.evaluate(AbstractBeforeAfterRule.java:45)
	at org.apache.lucene.util.TestRuleThreadAndTestName$1.evaluate(TestRuleThreadAndTestName.java:48)
	at org.apache.lucene.util.TestRuleIgnoreAfterMaxFailures$1.evaluate(TestRuleIgnoreAfterMaxFailures.java:64)
	at org.apache.lucene.util.TestRuleMarkFailure$1.evaluate(TestRuleMarkFailure.java:47)
	at com.carrotsearch.randomizedtesting.rules.StatementAdapter.evaluate(StatementAdapter.java:36)
	at com.carrotsearch.randomizedtesting.ThreadLeakControl$StatementRunner.run(ThreadLeakControl.java:368)
	at com.carrotsearch.randomizedtesting.ThreadLeakControl.forkTimeoutingTask(ThreadLeakControl.java:817)
	at com.carrotsearch.randomizedtesting.ThreadLeakControl$3.evaluate(ThreadLeakControl.java:468)
	at com.carrotsearch.randomizedtesting.RandomizedRunner.runSingleTest(RandomizedRunner.java:943)
	at com.carrotsearch.randomizedtesting.RandomizedRunner$5.evaluate(RandomizedRunner.java:829)
	at com.carrotsearch.randomizedtesting.RandomizedRunner$6.evaluate(RandomizedRunner.java:879)
	at com.carrotsearch.randomizedtesting.RandomizedRunner$7.evaluate(RandomizedRunner.java:890)
	at com.carrotsearch.randomizedtesting.rules.StatementAdapter.evaluate(StatementAdapter.java:36)
	at com.carrotsearch.randomizedtesting.rules.SystemPropertiesRestoreRule$1.evaluate(SystemPropertiesRestoreRule.java:57)
	at org.apache.lucene.util.AbstractBeforeAfterRule$1.evaluate(AbstractBeforeAfterRule.java:45)
	at com.carrotsearch.randomizedtesting.rules.StatementAdapter.evaluate(StatementAdapter.java:36)
	at org.apache.lucene.util.TestRuleStoreClassName$1.evaluate(TestRuleStoreClassName.java:41)
	at com.carrotsearch.randomizedtesting.rules.NoShadowingOrOverridesOnMethodsRule$1.evaluate(NoShadowingOrOverridesOnMethodsRule.java:40)
	at com.carrotsearch.randomizedtesting.rules.NoShadowingOrOverridesOnMethodsRule$1.evaluate(NoShadowingOrOverridesOnMethodsRule.java:40)
	at com.carrotsearch.randomizedtesting.rules.StatementAdapter.evaluate(StatementAdapter.java:36)
	at com.carrotsearch.randomizedtesting.rules.StatementAdapter.evaluate(StatementAdapter.java:36)
	at com.carrotsearch.randomizedtesting.rules.StatementAdapter.evaluate(StatementAdapter.java:36)
	at org.apache.lucene.util.TestRuleAssertionsRequired$1.evaluate(TestRuleAssertionsRequired.java:53)
	at org.apache.lucene.util.TestRuleMarkFailure$1.evaluate(TestRuleMarkFailure.java:47)
	at org.apache.lucene.util.TestRuleIgnoreAfterMaxFailures$1.evaluate(TestRuleIgnoreAfterMaxFailures.java:64)
	at org.apache.lucene.util.TestRuleIgnoreTestSuites$1.evaluate(TestRuleIgnoreTestSuites.java:54)
	at com.carrotsearch.randomizedtesting.rules.StatementAdapter.evaluate(StatementAdapter.java:36)
	at com.carrotsearch.randomizedtesting.ThreadLeakControl$StatementRunner.run(ThreadLeakControl.java:368)
	at java.lang.Thread.run(Thread.java:748)
Caused by: org.apache.zookeeper.KeeperException$SessionExpiredException: KeeperErrorCode = Session expired for /collections/parallelDestinationCollection1/state.json
	at org.apache.zookeeper.KeeperException.create(KeeperException.java:130)
	at org.apache.zookeeper.KeeperException.create(KeeperException.java:54)
	at org.apache.zookeeper.ZooKeeper.getData(ZooKeeper.java:1215)
	at org.apache.solr.common.cloud.SolrZkClient.lambda$getData$5(SolrZkClient.java:340)
	at org.apache.solr.common.cloud.ZkCmdExecutor.retryOperation(ZkCmdExecutor.java:60)
	at org.apache.solr.common.cloud.SolrZkClient.getData(SolrZkClient.java:340)
	at org.apache.solr.common.cloud.ZkStateReader.fetchCollectionState(ZkStateReader.java:1313)
	at org.apache.solr.common.cloud.ZkStateReader.getCollectionLive(ZkStateReader.java:1299)
	... 44 more


FAILED:  org.apache.solr.client.solrj.io.stream.StreamDecoratorTest.testParallelDaemonCommitStream

Error Message:
Error from server at https://127.0.0.1:39379/solr: collection already exists: parallelDestinationCollection1

Stack Trace:
org.apache.solr.client.solrj.impl.HttpSolrClient$RemoteSolrException: Error from server at https://127.0.0.1:39379/solr: collection already exists: parallelDestinationCollection1
	at __randomizedtesting.SeedInfo.seed([2F0CC4645394BEE9:8FFA95E196E57077]:0)
	at org.apache.solr.client.solrj.impl.HttpSolrClient.executeMethod(HttpSolrClient.java:643)
	at org.apache.solr.client.solrj.impl.HttpSolrClient.request(HttpSolrClient.java:255)
	at org.apache.solr.client.solrj.impl.HttpSolrClient.request(HttpSolrClient.java:244)
	at org.apache.solr.client.solrj.impl.LBHttpSolrClient.doRequest(LBHttpSolrClient.java:483)
	at org.apache.solr.client.solrj.impl.LBHttpSolrClient.request(LBHttpSolrClient.java:413)
	at org.apache.solr.client.solrj.impl.CloudSolrClient.sendRequest(CloudSolrClient.java:1106)
	at org.apache.solr.client.solrj.impl.CloudSolrClient.requestWithRetryOnStaleState(CloudSolrClient.java:886)
	at org.apache.solr.client.solrj.impl.CloudSolrClient.request(CloudSolrClient.java:819)
	at org.apache.solr.client.solrj.SolrRequest.process(SolrRequest.java:194)
	at org.apache.solr.client.solrj.SolrRequest.process(SolrRequest.java:211)
	at org.apache.solr.client.solrj.io.stream.StreamDecoratorTest.testParallelDaemonCommitStream(StreamDecoratorTest.java:2999)
	at sun.reflect.NativeMethodAccessorImpl.invoke0(Native Method)
	at sun.reflect.NativeMethodAccessorImpl.invoke(NativeMethodAccessorImpl.java:62)
	at sun.reflect.DelegatingMethodAccessorImpl.invoke(DelegatingMethodAccessorImpl.java:43)
	at java.lang.reflect.Method.invoke(Method.java:498)
	at com.carrotsearch.randomizedtesting.RandomizedRunner.invoke(RandomizedRunner.java:1737)
	at com.carrotsearch.randomizedtesting.RandomizedRunner$8.evaluate(RandomizedRunner.java:934)
	at com.carrotsearch.randomizedtesting.RandomizedRunner$9.evaluate(RandomizedRunner.java:970)
	at com.carrotsearch.randomizedtesting.RandomizedRunner$10.evaluate(RandomizedRunner.java:984)
	at com.carrotsearch.randomizedtesting.rules.SystemPropertiesRestoreRule$1.evaluate(SystemPropertiesRestoreRule.java:57)
	at org.apache.lucene.util.TestRuleSetupTeardownChained$1.evaluate(TestRuleSetupTeardownChained.java:49)
	at org.apache.lucene.util.AbstractBeforeAfterRule$1.evaluate(AbstractBeforeAfterRule.java:45)
	at org.apache.lucene.util.TestRuleThreadAndTestName$1.evaluate(TestRuleThreadAndTestName.java:48)
	at org.apache.lucene.util.TestRuleIgnoreAfterMaxFailures$1.evaluate(TestRuleIgnoreAfterMaxFailures.java:64)
	at org.apache.lucene.util.TestRuleMarkFailure$1.evaluate(TestRuleMarkFailure.java:47)
	at com.carrotsearch.randomizedtesting.rules.StatementAdapter.evaluate(StatementAdapter.java:36)
	at com.carrotsearch.randomizedtesting.ThreadLeakControl$StatementRunner.run(ThreadLeakControl.java:368)
	at com.carrotsearch.randomizedtesting.ThreadLeakControl.forkTimeoutingTask(ThreadLeakControl.java:817)
	at com.carrotsearch.randomizedtesting.ThreadLeakControl$3.evaluate(ThreadLeakControl.java:468)
	at com.carrotsearch.randomizedtesting.RandomizedRunner.runSingleTest(RandomizedRunner.java:943)
	at com.carrotsearch.randomizedtesting.RandomizedRunner$5.evaluate(RandomizedRunner.java:829)
	at com.carrotsearch.randomizedtesting.RandomizedRunner$6.evaluate(RandomizedRunner.java:879)
	at com.carrotsearch.randomizedtesting.RandomizedRunner$7.evaluate(RandomizedRunner.java:890)
	at com.carrotsearch.randomizedtesting.rules.StatementAdapter.evaluate(StatementAdapter.java:36)
	at com.carrotsearch.randomizedtesting.rules.SystemPropertiesRestoreRule$1.evaluate(SystemPropertiesRestoreRule.java:57)
	at org.apache.lucene.util.AbstractBeforeAfterRule$1.evaluate(AbstractBeforeAfterRule.java:45)
	at com.carrotsearch.randomizedtesting.rules.StatementAdapter.evaluate(StatementAdapter.java:36)
	at org.apache.lucene.util.TestRuleStoreClassName$1.evaluate(TestRuleStoreClassName.java:41)
	at com.carrotsearch.randomizedtesting.rules.NoShadowingOrOverridesOnMethodsRule$1.evaluate(NoShadowingOrOverridesOnMethodsRule.java:40)
	at com.carrotsearch.randomizedtesting.rules.NoShadowingOrOverridesOnMethodsRule$1.evaluate(NoShadowingOrOverridesOnMethodsRule.java:40)
	at com.carrotsearch.randomizedtesting.rules.StatementAdapter.evaluate(StatementAdapter.java:36)
	at com.carrotsearch.randomizedtesting.rules.StatementAdapter.evaluate(StatementAdapter.java:36)
	at com.carrotsearch.randomizedtesting.rules.StatementAdapter.evaluate(StatementAdapter.java:36)
	at org.apache.lucene.util.TestRuleAssertionsRequired$1.evaluate(TestRuleAssertionsRequired.java:53)
	at org.apache.lucene.util.TestRuleMarkFailure$1.evaluate(TestRuleMarkFailure.java:47)
	at org.apache.lucene.util.TestRuleIgnoreAfterMaxFailures$1.evaluate(TestRuleIgnoreAfterMaxFailures.java:64)
	at org.apache.lucene.util.TestRuleIgnoreTestSuites$1.evaluate(TestRuleIgnoreTestSuites.java:54)
	at com.carrotsearch.randomizedtesting.rules.StatementAdapter.evaluate(StatementAdapter.java:36)
	at com.carrotsearch.randomizedtesting.ThreadLeakControl$StatementRunner.run(ThreadLeakControl.java:368)
	at java.lang.Thread.run(Thread.java:748)


FAILED:  org.apache.solr.client.solrj.io.stream.StreamDecoratorTest.testParallelTerminatingDaemonUpdateStream

Error Message:
Error from server at https://127.0.0.1:39379/solr: collection already exists: parallelDestinationCollection1

Stack Trace:
org.apache.solr.client.solrj.impl.HttpSolrClient$RemoteSolrException: Error from server at https://127.0.0.1:39379/solr: collection already exists: parallelDestinationCollection1
	at __randomizedtesting.SeedInfo.seed([2F0CC4645394BEE9:DE681C0C07FE71F7]:0)
	at org.apache.solr.client.solrj.impl.HttpSolrClient.executeMethod(HttpSolrClient.java:643)
	at org.apache.solr.client.solrj.impl.HttpSolrClient.request(HttpSolrClient.java:255)
	at org.apache.solr.client.solrj.impl.HttpSolrClient.request(HttpSolrClient.java:244)
	at org.apache.solr.client.solrj.impl.LBHttpSolrClient.doRequest(LBHttpSolrClient.java:483)
	at org.apache.solr.client.solrj.impl.LBHttpSolrClient.request(LBHttpSolrClient.java:413)
	at org.apache.solr.client.solrj.impl.CloudSolrClient.sendRequest(CloudSolrClient.java:1106)
	at org.apache.solr.client.solrj.impl.CloudSolrClient.requestWithRetryOnStaleState(CloudSolrClient.java:886)
	at org.apache.solr.client.solrj.impl.CloudSolrClient.request(CloudSolrClient.java:819)
	at org.apache.solr.client.solrj.SolrRequest.process(SolrRequest.java:194)
	at org.apache.solr.client.solrj.SolrRequest.process(SolrRequest.java:211)
	at org.apache.solr.client.solrj.io.stream.StreamDecoratorTest.testParallelTerminatingDaemonUpdateStream(StreamDecoratorTest.java:2686)
	at sun.reflect.NativeMethodAccessorImpl.invoke0(Native Method)
	at sun.reflect.NativeMethodAccessorImpl.invoke(NativeMethodAccessorImpl.java:62)
	at sun.reflect.DelegatingMethodAccessorImpl.invoke(DelegatingMethodAccessorImpl.java:43)
	at java.lang.reflect.Method.invoke(Method.java:498)
	at com.carrotsearch.randomizedtesting.RandomizedRunner.invoke(RandomizedRunner.java:1737)
	at com.carrotsearch.randomizedtesting.RandomizedRunner$8.evaluate(RandomizedRunner.java:934)
	at com.carrotsearch.randomizedtesting.RandomizedRunner$9.evaluate(RandomizedRunner.java:970)
	at com.carrotsearch.randomizedtesting.RandomizedRunner$10.evaluate(RandomizedRunner.java:984)
	at com.carrotsearch.randomizedtesting.rules.SystemPropertiesRestoreRule$1.evaluate(SystemPropertiesRestoreRule.java:57)
	at org.apache.lucene.util.TestRuleSetupTeardownChained$1.evaluate(TestRuleSetupTeardownChained.java:49)
	at org.apache.lucene.util.AbstractBeforeAfterRule$1.evaluate(AbstractBeforeAfterRule.java:45)
	at org.apache.lucene.util.TestRuleThreadAndTestName$1.evaluate(TestRuleThreadAndTestName.java:48)
	at org.apache.lucene.util.TestRuleIgnoreAfterMaxFailures$1.evaluate(TestRuleIgnoreAfterMaxFailures.java:64)
	at org.apache.lucene.util.TestRuleMarkFailure$1.evaluate(TestRuleMarkFailure.java:47)
	at com.carrotsearch.randomizedtesting.rules.StatementAdapter.evaluate(StatementAdapter.java:36)
	at com.carrotsearch.randomizedtesting.ThreadLeakControl$StatementRunner.run(ThreadLeakControl.java:368)
	at com.carrotsearch.randomizedtesting.ThreadLeakControl.forkTimeoutingTask(ThreadLeakControl.java:817)
	at com.carrotsearch.randomizedtesting.ThreadLeakControl$3.evaluate(ThreadLeakControl.java:468)
	at com.carrotsearch.randomizedtesting.RandomizedRunner.runSingleTest(RandomizedRunner.java:943)
	at com.carrotsearch.randomizedtesting.RandomizedRunner$5.evaluate(RandomizedRunner.java:829)
	at com.carrotsearch.randomizedtesting.RandomizedRunner$6.evaluate(RandomizedRunner.java:879)
	at com.carrotsearch.randomizedtesting.RandomizedRunner$7.evaluate(RandomizedRunner.java:890)
	at com.carrotsearch.randomizedtesting.rules.StatementAdapter.evaluate(StatementAdapter.java:36)
	at com.carrotsearch.randomizedtesting.rules.SystemPropertiesRestoreRule$1.evaluate(SystemPropertiesRestoreRule.java:57)
	at org.apache.lucene.util.AbstractBeforeAfterRule$1.evaluate(AbstractBeforeAfterRule.java:45)
	at com.carrotsearch.randomizedtesting.rules.StatementAdapter.evaluate(StatementAdapter.java:36)
	at org.apache.lucene.util.TestRuleStoreClassName$1.evaluate(TestRuleStoreClassName.java:41)
	at com.carrotsearch.randomizedtesting.rules.NoShadowingOrOverridesOnMethodsRule$1.evaluate(NoShadowingOrOverridesOnMethodsRule.java:40)
	at com.carrotsearch.randomizedtesting.rules.NoShadowingOrOverridesOnMethodsRule$1.evaluate(NoShadowingOrOverridesOnMethodsRule.java:40)
	at com.carrotsearch.randomizedtesting.rules.StatementAdapter.evaluate(StatementAdapter.java:36)
	at com.carrotsearch.randomizedtesting.rules.StatementAdapter.evaluate(StatementAdapter.java:36)
	at com.carrotsearch.randomizedtesting.rules.StatementAdapter.evaluate(StatementAdapter.java:36)
	at org.apache.lucene.util.TestRuleAssertionsRequired$1.evaluate(TestRuleAssertionsRequired.java:53)
	at org.apache.lucene.util.TestRuleMarkFailure$1.evaluate(TestRuleMarkFailure.java:47)
	at org.apache.lucene.util.TestRuleIgnoreAfterMaxFailures$1.evaluate(TestRuleIgnoreAfterMaxFailures.java:64)
	at org.apache.lucene.util.TestRuleIgnoreTestSuites$1.evaluate(TestRuleIgnoreTestSuites.java:54)
	at com.carrotsearch.randomizedtesting.rules.StatementAdapter.evaluate(StatementAdapter.java:36)
	at com.carrotsearch.randomizedtesting.ThreadLeakControl$StatementRunner.run(ThreadLeakControl.java:368)
	at java.lang.Thread.run(Thread.java:748)




Build Log:
[...truncated 12510 lines...]
   [junit4] Suite: org.apache.solr.handler.TestSolrConfigHandlerCloud
   [junit4]   2> Creating dataDir: /home/jenkins/jenkins-slave/workspace/Lucene-Solr-BadApples-Tests-7.x/solr/build/solr-core/test/J1/temp/solr.handler.TestSolrConfigHandlerCloud_8816A03D966D33E5-001/init-core-data-001
   [junit4]   2> 360534 INFO  (SUITE-TestSolrConfigHandlerCloud-seed#[8816A03D966D33E5]-worker) [    ] o.a.s.SolrTestCaseJ4 Using PointFields (NUMERIC_POINTS_SYSPROP=true) w/NUMERIC_DOCVALUES_SYSPROP=true
   [junit4]   2> 360535 INFO  (SUITE-TestSolrConfigHandlerCloud-seed#[8816A03D966D33E5]-worker) [    ] o.a.s.SolrTestCaseJ4 Randomized ssl (false) and clientAuth (true) via: @org.apache.solr.util.RandomizeSSL(reason=, ssl=NaN, value=NaN, clientAuth=NaN)
   [junit4]   2> 360535 INFO  (SUITE-TestSolrConfigHandlerCloud-seed#[8816A03D966D33E5]-worker) [    ] o.a.s.SolrTestCaseJ4 SecureRandom sanity checks: test.solr.allowed.securerandom=null & java.security.egd=file:/dev/./urandom
   [junit4]   2> 360535 INFO  (SUITE-TestSolrConfigHandlerCloud-seed#[8816A03D966D33E5]-worker) [    ] o.a.s.BaseDistributedSearchTestCase Setting hostContext system property: /c/
   [junit4]   2> 360573 INFO  (TEST-TestSolrConfigHandlerCloud.test-seed#[8816A03D966D33E5]) [    ] o.a.s.c.ZkTestServer STARTING ZK TEST SERVER
   [junit4]   2> 360606 INFO  (Thread-120) [    ] o.a.s.c.ZkTestServer client port:0.0.0.0/0.0.0.0:0
   [junit4]   2> 360606 INFO  (Thread-120) [    ] o.a.s.c.ZkTestServer Starting server
   [junit4]   2> 360716 ERROR (Thread-120) [    ] o.a.z.s.ZooKeeperServer ZKShutdownHandler is not registered, so ZooKeeper server won't take any action on ERROR or SHUTDOWN server state changes
   [junit4]   2> 360736 INFO  (TEST-TestSolrConfigHandlerCloud.test-seed#[8816A03D966D33E5]) [    ] o.a.s.c.ZkTestServer start zk server on port:38534
   [junit4]   2> 360792 INFO  (zkConnectionManagerCallback-194-thread-1) [    ] o.a.s.c.c.ConnectionManager zkClient has connected
   [junit4]   2> 360971 INFO  (zkConnectionManagerCallback-196-thread-1) [    ] o.a.s.c.c.ConnectionManager zkClient has connected
   [junit4]   2> 361009 INFO  (TEST-TestSolrConfigHandlerCloud.test-seed#[8816A03D966D33E5]) [    ] o.a.s.c.AbstractZkTestCase put /home/jenkins/jenkins-slave/workspace/Lucene-Solr-BadApples-Tests-7.x/solr/core/src/test-files/solr/collection1/conf/solrconfig-tlog.xml to /configs/conf1/solrconfig.xml
   [junit4]   2> 361061 INFO  (TEST-TestSolrConfigHandlerCloud.test-seed#[8816A03D966D33E5]) [    ] o.a.s.c.AbstractZkTestCase put /home/jenkins/jenkins-slave/workspace/Lucene-Solr-BadApples-Tests-7.x/solr/core/src/test-files/solr/collection1/conf/schema.xml to /configs/conf1/schema.xml
   [junit4]   2> 361064 INFO  (TEST-TestSolrConfigHandlerCloud.test-seed#[8816A03D966D33E5]) [    ] o.a.s.c.AbstractZkTestCase put /home/jenkins/jenkins-slave/workspace/Lucene-Solr-BadApples-Tests-7.x/solr/core/src/test-files/solr/collection1/conf/solrconfig.snippet.randomindexconfig.xml to /configs/conf1/solrconfig.snippet.randomindexconfig.xml
   [junit4]   2> 361098 INFO  (TEST-TestSolrConfigHandlerCloud.test-seed#[8816A03D966D33E5]) [    ] o.a.s.c.AbstractZkTestCase put /home/jenkins/jenkins-slave/workspace/Lucene-Solr-BadApples-Tests-7.x/solr/core/src/test-files/solr/collection1/conf/stopwords.txt to /configs/conf1/stopwords.txt
   [junit4]   2> 361099 INFO  (TEST-TestSolrConfigHandlerCloud.test-seed#[8816A03D966D33E5]) [    ] o.a.s.c.AbstractZkTestCase put /home/jenkins/jenkins-slave/workspace/Lucene-Solr-BadApples-Tests-7.x/solr/core/src/test-files/solr/collection1/conf/protwords.txt to /configs/conf1/protwords.txt
   [junit4]   2> 361100 INFO  (TEST-TestSolrConfigHandlerCloud.test-seed#[8816A03D966D33E5]) [    ] o.a.s.c.AbstractZkTestCase put /home/jenkins/jenkins-slave/workspace/Lucene-Solr-BadApples-Tests-7.x/solr/core/src/test-files/solr/collection1/conf/currency.xml to /configs/conf1/currency.xml
   [junit4]   2> 361101 INFO  (TEST-TestSolrConfigHandlerCloud.test-seed#[8816A03D966D33E5]) [    ] o.a.s.c.AbstractZkTestCase put /home/jenkins/jenkins-slave/workspace/Lucene-Solr-BadApples-Tests-7.x/solr/core/src/test-files/solr/collection1/conf/enumsConfig.xml to /configs/conf1/enumsConfig.xml
   [junit4]   2> 361137 INFO  (TEST-TestSolrConfigHandlerCloud.test-seed#[8816A03D966D33E5]) [    ] o.a.s.c.AbstractZkTestCase put /home/jenkins/jenkins-slave/workspace/Lucene-Solr-BadApples-Tests-7.x/solr/core/src/test-files/solr/collection1/conf/open-exchange-rates.json to /configs/conf1/open-exchange-rates.json
   [junit4]   2> 361154 INFO  (TEST-TestSolrConfigHandlerCloud.test-seed#[8816A03D966D33E5]) [    ] o.a.s.c.AbstractZkTestCase put /home/jenkins/jenkins-slave/workspace/Lucene-Solr-BadApples-Tests-7.x/solr/core/src/test-files/solr/collection1/conf/mapping-ISOLatin1Accent.txt to /configs/conf1/mapping-ISOLatin1Accent.txt
   [junit4]   2> 361156 INFO  (TEST-TestSolrConfigHandlerCloud.test-seed#[8816A03D966D33E5]) [    ] o.a.s.c.AbstractZkTestCase put /home/jenkins/jenkins-slave/workspace/Lucene-Solr-BadApples-Tests-7.x/solr/core/src/test-files/solr/collection1/conf/old_synonyms.txt to /configs/conf1/old_synonyms.txt
   [junit4]   2> 361157 INFO  (TEST-TestSolrConfigHandlerCloud.test-seed#[8816A03D966D33E5]) [    ] o.a.s.c.AbstractZkTestCase put /home/jenkins/jenkins-slave/workspace/Lucene-Solr-BadApples-Tests-7.x/solr/core/src/test-files/solr/collection1/conf/synonyms.txt to /configs/conf1/synonyms.txt
   [junit4]   2> 361191 INFO  (TEST-TestSolrConfigHandlerCloud.test-seed#[8816A03D966D33E5]) [    ] o.a.s.c.AbstractFullDistribZkTestBase Will use NRT replicas unless explicitly asked otherwise
   [junit4]   2> 362299 INFO  (TEST-TestSolrConfigHandlerCloud.test-seed#[8816A03D966D33E5]) [    ] o.e.j.s.Server jetty-9.4.8.v20171121, build timestamp: 2017-11-22T00:27:37+03:00, git hash: 82b8fb23f757335bb3329d540ce37a2a2615f0a8
   [junit4]   2> 362428 INFO  (TEST-TestSolrConfigHandlerCloud.test-seed#[8816A03D966D33E5]) [    ] o.e.j.s.session DefaultSessionIdManager workerName=node0
   [junit4]   2> 362428 INFO  (TEST-TestSolrConfigHandlerCloud.test-seed#[8816A03D966D33E5]) [    ] o.e.j.s.session No SessionScavenger set, using defaults
   [junit4]   2> 362429 INFO  (TEST-TestSolrConfigHandlerCloud.test-seed#[8816A03D966D33E5]) [    ] o.e.j.s.session Scavenging every 660000ms
   [junit4]   2> 362430 INFO  (TEST-TestSolrConfigHandlerCloud.test-seed#[8816A03D966D33E5]) [    ] o.e.j.s.h.ContextHandler Started o.e.j.s.ServletContextHandler@18db8ff8{/c,null,AVAILABLE}
   [junit4]   2> 362432 INFO  (TEST-TestSolrConfigHandlerCloud.test-seed#[8816A03D966D33E5]) [    ] o.e.j.s.AbstractConnector Started ServerConnector@1332a98f{HTTP/1.1,[http/1.1]}{127.0.0.1:36524}
   [junit4]   2> 362432 INFO  (TEST-TestSolrConfigHandlerCloud.test-seed#[8816A03D966D33E5]) [    ] o.e.j.s.Server Started @362744ms
   [junit4]   2> 362432 INFO  (TEST-TestSolrConfigHandlerCloud.test-seed#[8816A03D966D33E5]) [    ] o.a.s.c.s.e.JettySolrRunner Jetty properties: {solr.data.dir=/home/jenkins/jenkins-slave/workspace/Lucene-Solr-BadApples-Tests-7.x/solr/build/solr-core/test/J1/temp/solr.handler.TestSolrConfigHandlerCloud_8816A03D966D33E5-001/tempDir-001/control/data, replicaType=NRT, hostContext=/c, hostPort=36524, coreRootDirectory=/home/jenkins/jenkins-slave/workspace/Lucene-Solr-BadApples-Tests-7.x/solr/build/solr-core/test/J1/../../../../../../../../../../home/jenkins/jenkins-slave/workspace/Lucene-Solr-BadApples-Tests-7.x/solr/build/solr-core/test/J1/temp/solr.handler.TestSolrConfigHandlerCloud_8816A03D966D33E5-001/control-001/cores}
   [junit4]   2> 362465 ERROR (TEST-TestSolrConfigHandlerCloud.test-seed#[8816A03D966D33E5]) [    ] o.a.s.u.StartupLoggingUtils Missing Java Option solr.log.dir. Logging may be missing or incomplete.
   [junit4]   2> 362465 INFO  (TEST-TestSolrConfigHandlerCloud.test-seed#[8816A03D966D33E5]) [    ] o.a.s.s.SolrDispatchFilter Using logger factory org.apache.logging.slf4j.Log4jLoggerFactory
   [junit4]   2> 362465 INFO  (TEST-TestSolrConfigHandlerCloud.test-seed#[8816A03D966D33E5]) [    ] o.a.s.s.SolrDispatchFilter  ___      _       Welcome to Apache Solr™ version 7.4.0
   [junit4]   2> 362465 INFO  (TEST-TestSolrConfigHandlerCloud.test-seed#[8816A03D966D33E5]) [    ] o.a.s.s.SolrDispatchFilter / __| ___| |_ _   Starting in cloud mode on port null
   [junit4]   2> 362465 INFO  (TEST-TestSolrConfigHandlerCloud.test-seed#[8816A03D966D33E5]) [    ] o.a.s.s.SolrDispatchFilter \__ \/ _ \ | '_|  Install dir: null
   [junit4]   2> 362465 INFO  (TEST-TestSolrConfigHandlerCloud.test-seed#[8816A03D966D33E5]) [    ] o.a.s.s.SolrDispatchFilter |___/\___/_|_|    Start time: 2018-05-01T13:37:59.652Z
   [junit4]   2> 362558 INFO  (zkConnectionManagerCallback-198-thread-1) [    ] o.a.s.c.c.ConnectionManager zkClient has connected
   [junit4]   2> 362583 INFO  (TEST-TestSolrConfigHandlerCloud.test-seed#[8816A03D966D33E5]) [    ] o.a.s.s.SolrDispatchFilter Loading solr.xml from SolrHome (not found in ZooKeeper)
   [junit4]   2> 362583 INFO  (TEST-TestSolrConfigHandlerCloud.test-seed#[8816A03D966D33E5]) [    ] o.a.s.c.SolrXmlConfig Loading container configuration from /home/jenkins/jenkins-slave/workspace/Lucene-Solr-BadApples-Tests-7.x/solr/build/solr-core/test/J1/temp/solr.handler.TestSolrConfigHandlerCloud_8816A03D966D33E5-001/control-001/solr.xml
   [junit4]   2> 362612 INFO  (TEST-TestSolrConfigHandlerCloud.test-seed#[8816A03D966D33E5]) [    ] o.a.s.c.SolrXmlConfig Configuration parameter autoReplicaFailoverWorkLoopDelay is ignored
   [junit4]   2> 362612 INFO  (TEST-TestSolrConfigHandlerCloud.test-seed#[8816A03D966D33E5]) [    ] o.a.s.c.SolrXmlConfig Configuration parameter autoReplicaFailoverBadNodeExpiration is ignored
   [junit4]   2> 362687 INFO  (TEST-TestSolrConfigHandlerCloud.test-seed#[8816A03D966D33E5]) [    ] o.a.s.c.SolrXmlConfig MBean server found: com.sun.jmx.mbeanserver.JmxMBeanServer@76246590, but no JMX reporters were configured - adding default JMX reporter.
   [junit4]   2> 362775 INFO  (TEST-TestSolrConfigHandlerCloud.test-seed#[8816A03D966D33E5]) [    ] o.a.s.c.ZkContainer Zookeeper client=127.0.0.1:38534/solr
   [junit4]   2> 362849 INFO  (zkConnectionManagerCallback-202-thread-1) [    ] o.a.s.c.c.ConnectionManager zkClient has connected
   [junit4]   2> 362886 WARN  (NIOServerCxn.Factory:0.0.0.0/0.0.0.0:0) [    ] o.a.z.s.NIOServerCnxn Unable to read additional data from client sessionid 0x101c02f16ae0003, likely client has closed socket
   [junit4]   2> 362920 INFO  (zkConnectionManagerCallback-204-thread-1) [    ] o.a.s.c.c.ConnectionManager zkClient has connected
   [junit4]   2> 364257 INFO  (TEST-TestSolrConfigHandlerCloud.test-seed#[8816A03D966D33E5]) [n:127.0.0.1:36524_c    ] o.a.s.c.Overseer Overseer (id=null) closing
   [junit4]   2> 364258 INFO  (TEST-TestSolrConfigHandlerCloud.test-seed#[8816A03D966D33E5]) [n:127.0.0.1:36524_c    ] o.a.s.c.OverseerElectionContext I am going to be the leader 127.0.0.1:36524_c
   [junit4]   2> 364312 INFO  (TEST-TestSolrConfigHandlerCloud.test-seed#[8816A03D966D33E5]) [n:127.0.0.1:36524_c    ] o.a.s.c.Overseer Overseer (id=72550377491136516-127.0.0.1:36524_c-n_0000000000) starting
   [junit4]   2> 364494 INFO  (zkConnectionManagerCallback-211-thread-1) [    ] o.a.s.c.c.ConnectionManager zkClient has connected
   [junit4]   2> 364512 INFO  (TEST-TestSolrConfigHandlerCloud.test-seed#[8816A03D966D33E5]) [n:127.0.0.1:36524_c    ] o.a.s.c.s.i.ZkClientClusterStateProvider Cluster at 127.0.0.1:38534/solr ready
   [junit4]   2> 364559 INFO  (TEST-TestSolrConfigHandlerCloud.test-seed#[8816A03D966D33E5]) [n:127.0.0.1:36524_c    ] o.a.s.c.ZkController Register node as live in ZooKeeper:/live_nodes/127.0.0.1:36524_c
   [junit4]   2> 364692 INFO  (OverseerStateUpdate-72550377491136516-127.0.0.1:36524_c-n_0000000000) [    ] o.a.s.c.c.ZkStateReader Updated live nodes from ZooKeeper... (0) -> (1)
   [junit4]   2> 364871 INFO  (zkCallback-210-thread-1) [    ] o.a.s.c.c.ZkStateReader Updated live nodes from ZooKeeper... (0) -> (1)
   [junit4]   2> 366955 INFO  (TEST-TestSolrConfigHandlerCloud.test-seed#[8816A03D966D33E5]) [n:127.0.0.1:36524_c    ] o.a.s.m.r.SolrJmxReporter JMX monitoring for 'solr.node' (registry 'solr.node') enabled at server: com.sun.jmx.mbeanserver.JmxMBeanServer@76246590
   [junit4]   2> 367042 INFO  (TEST-TestSolrConfigHandlerCloud.test-seed#[8816A03D966D33E5]) [n:127.0.0.1:36524_c    ] o.a.s.m.r.SolrJmxReporter JMX monitoring for 'solr.jvm' (registry 'solr.jvm') enabled at server: com.sun.jmx.mbeanserver.JmxMBeanServer@76246590
   [junit4]   2> 367043 INFO  (TEST-TestSolrConfigHandlerCloud.test-seed#[8816A03D966D33E5]) [n:127.0.0.1:36524_c    ] o.a.s.m.r.SolrJmxReporter JMX monitoring for 'solr.jetty' (registry 'solr.jetty') enabled at server: com.sun.jmx.mbeanserver.JmxMBeanServer@76246590
   [junit4]   2> 367044 INFO  (TEST-TestSolrConfigHandlerCloud.test-seed#[8816A03D966D33E5]) [n:127.0.0.1:36524_c    ] o.a.s.c.CorePropertiesLocator Found 0 core definitions underneath /home/jenkins/jenkins-slave/workspace/Lucene-Solr-BadApples-Tests-7.x/solr/build/solr-core/test/J1/../../../../../../../../../../home/jenkins/jenkins-slave/workspace/Lucene-Solr-BadApples-Tests-7.x/solr/build/solr-core/test/J1/temp/solr.handler.TestSolrConfigHandlerCloud_8816A03D966D33E5-001/control-001/cores
   [junit4]   2> 367281 INFO  (zkConnectionManagerCallback-216-thread-1) [    ] o.a.s.c.c.ConnectionManager zkClient has connected
   [junit4]   2> 367282 INFO  (TEST-TestSolrConfigHandlerCloud.test-seed#[8816A03D966D33E5]) [    ] o.a.s.c.c.ZkStateReader Updated live nodes from ZooKeeper... (0) -> (1)
   [junit4]   2> 367283 INFO  (TEST-TestSolrConfigHandlerCloud.test-seed#[8816A03D966D33E5]) [    ] o.a.s.c.s.i.ZkClientClusterStateProvider Cluster at 127.0.0.1:38534/solr ready
   [junit4]   2> 367371 INFO  (qtp1690014099-1099) [n:127.0.0.1:36524_c    ] o.a.s.h.a.CollectionsHandler Invoked Collection Action :create with params replicationFactor=1&collection.configName=conf1&name=control_collection&nrtReplicas=1&action=CREATE&numShards=1&createNodeSet=127.0.0.1:36524_c&wt=javabin&version=2 and sendToOCPQueue=true
   [junit4]   2> 367445 INFO  (OverseerThreadFactory-259-thread-1) [    ] o.a.s.c.a.c.CreateCollectionCmd Create collection control_collection
   [junit4]   2> 367592 INFO  (qtp1690014099-1103) [n:127.0.0.1:36524_c    ] o.a.s.h.a.CoreAdminOperation core create command qt=/admin/cores&collection.configName=conf1&newCollection=true&name=control_collection_shard1_replica_n1&action=CREATE&numShards=1&collection=control_collection&shard=shard1&wt=javabin&version=2&replicaType=NRT
   [junit4]   2> 367592 INFO  (qtp1690014099-1103) [n:127.0.0.1:36524_c    ] o.a.s.c.TransientSolrCoreCacheDefault Allocating transient cache for 4 transient cores
   [junit4]   2> 369004 INFO  (qtp1690014099-1103) [n:127.0.0.1:36524_c c:control_collection s:shard1  x:control_collection_shard1_replica_n1] o.a.s.c.SolrConfig Using Lucene MatchVersion: 7.4.0
   [junit4]   2> 369123 INFO  (qtp1690014099-1103) [n:127.0.0.1:36524_c c:control_collection s:shard1  x:control_collection_shard1_replica_n1] o.a.s.s.IndexSchema [control_collection_shard1_replica_n1] Schema name=test
   [junit4]   2> 370054 INFO  (qtp1690014099-1103) [n:127.0.0.1:36524_c c:control_collection s:shard1  x:control_collection_shard1_replica_n1] o.a.s.s.IndexSchema Loaded schema test/1.0 with uniqueid field id
   [junit4]   2> 370185 INFO  (qtp1690014099-1103) [n:127.0.0.1:36524_c c:control_collection s:shard1  x:control_collection_shard1_replica_n1] o.a.s.c.CoreContainer Creating SolrCore 'control_collection_shard1_replica_n1' using configuration from collection control_collection, trusted=true
   [junit4]   2> 370186 INFO  (qtp1690014099-1103) [n:127.0.0.1:36524_c c:control_collection s:shard1  x:control_collection_shard1_replica_n1] o.a.s.m.r.SolrJmxReporter JMX monitoring for 'solr.core.control_collection.shard1.replica_n1' (registry 'solr.core.control_collection.shard1.replica_n1') enabled at server: com.sun.jmx.mbeanserver.JmxMBeanServer@76246590
   [junit4]   2> 370186 INFO  (qtp1690014099-1103) [n:127.0.0.1:36524_c c:control_collection s:shard1  x:control_collection_shard1_replica_n1] o.a.s.c.SolrCore solr.RecoveryStrategy.Builder
   [junit4]   2> 370186 INFO  (qtp1690014099-1103) [n:127.0.0.1:36524_c c:control_collection s:shard1  x:control_collection_shard1_replica_n1] o.a.s.c.SolrCore [[control_collection_shard1_replica_n1] ] Opening new SolrCore at [/home/jenkins/jenkins-slave/workspace/Lucene-Solr-BadApples-Tests-7.x/solr/build/solr-core/test/J1/temp/solr.handler.TestSolrConfigHandlerCloud_8816A03D966D33E5-001/control-001/cores/control_collection_shard1_replica_n1], dataDir=[/home/jenkins/jenkins-slave/workspace/Lucene-Solr-BadApples-Tests-7.x/solr/build/solr-core/test/J1/../../../../../../../../../../home/jenkins/jenkins-slave/workspace/Lucene-Solr-BadApples-Tests-7.x/solr/build/solr-core/test/J1/temp/solr.handler.TestSolrConfigHandlerCloud_8816A03D966D33E5-001/control-001/cores/control_collection_shard1_replica_n1/data/]
   [junit4]   2> 370221 INFO  (qtp1690014099-1103) [n:127.0.0.1:36524_c c:control_collection s:shard1  x:control_collection_shard1_replica_n1] o.a.s.u.RandomMergePolicy RandomMergePolicy wrapping class org.apache.lucene.index.TieredMergePolicy: [TieredMergePolicy: maxMergeAtOnce=42, maxMergeAtOnceExplicit=27, maxMergedSegmentMB=51.314453125, floorSegmentMB=1.427734375, forceMergeDeletesPctAllowed=10.12316467692614, segmentsPerTier=39.0, maxCFSSegmentSizeMB=8.796093022207999E12, noCFSRatio=0.0
   [junit4]   2> 370237 WARN  (qtp1690014099-1103) [n:127.0.0.1:36524_c c:control_collection s:shard1  x:control_collection_shard1_replica_n1] o.a.s.c.RequestHandlers INVALID paramSet a in requestHandler {type = requestHandler,name = /dump,class = DumpRequestHandler,attributes = {initParams=a, name=/dump, class=DumpRequestHandler},args = {defaults={a=A,b=B}}}
   [junit4]   2> 370835 INFO  (qtp1690014099-1103) [n:127.0.0.1:36524_c c:control_collection s:shard1  x:control_collection_shard1_replica_n1] o.a.s.u.UpdateHandler Using UpdateLog implementation: org.apache.solr.update.UpdateLog
   [junit4]   2> 370835 INFO  (qtp1690014099-1103) [n:127.0.0.1:36524_c c:control_collection s:shard1  x:control_collection_shard1_replica_n1] o.a.s.u.UpdateLog Initializing UpdateLog: dataDir= defaultSyncLevel=FLUSH numRecordsToKeep=100 maxNumLogsToKeep=10 numVersionBuckets=65536
   [junit4]   2> 370836 INFO  (qtp1690014099-1103) [n:127.0.0.1:36524_c c:control_collection s:shard1  x:control_collection_shard1_replica_n1] o.a.s.u.CommitTracker Hard AutoCommit: disabled
   [junit4]   2> 370837 INFO  (qtp1690014099-1103) [n:127.0.0.1:36524_c c:control_collection s:shard1  x:control_collection_shard1_replica_n1] o.a.s.u.CommitTracker Soft AutoCommit: disabled
   [junit4]   2> 370838 INFO  (qtp1690014099-1103) [n:127.0.0.1:36524_c c:control_collection s:shard1  x:control_collection_shard1_replica_n1] o.a.s.u.RandomMergePolicy RandomMergePolicy wrapping class org.apache.lucene.index.TieredMergePolicy: [TieredMergePolicy: maxMergeAtOnce=33, maxMergeAtOnceExplicit=35, maxMergedSegmentMB=84.0078125, floorSegmentMB=1.1357421875, forceMergeDeletesPctAllowed=6.886188144553804, segmentsPerTier=27.0, maxCFSSegmentSizeMB=8.796093022207999E12, noCFSRatio=0.7255695621639687
   [junit4]   2> 370856 INFO  (qtp1690014099-1103) [n:127.0.0.1:36524_c c:control_collection s:shard1  x:control_collection_shard1_replica_n1] o.a.s.s.SolrIndexSearcher Opening [Searcher@2e200e4e[control_collection_shard1_replica_n1] main]
   [junit4]   2> 370857 INFO  (qtp1690014099-1103) [n:127.0.0.1:36524_c c:control_collection s:shard1  x:control_collection_shard1_replica_n1] o.a.s.r.ManagedResourceStorage Configured ZooKeeperStorageIO with znodeBase: /configs/conf1
   [junit4]   2> 370857 INFO  (qtp1690014099-1103) [n:127.0.0.1:36524_c c:control_collection s:shard1  x:control_collection_shard1_replica_n1] o.a.s.r.ManagedResourceStorage Loaded null at path _rest_managed.json using ZooKeeperStorageIO:path=/configs/conf1
   [junit4]   2> 370859 INFO  (qtp1690014099-1103) [n:127.0.0.1:36524_c c:control_collection s:shard1  x:control_collection_shard1_replica_n1] o.a.s.h.ReplicationHandler Commits will be reserved for 10000ms.
   [junit4]   2> 370908 INFO  (qtp1690014099-1103) [n:127.0.0.1:36524_c c:control_collection s:shard1  x:control_collection_shard1_replica_n1] o.a.s.u.UpdateLog Could not find max version in index or recent updates, using new clock 1599269123491102720
   [junit4]   2> 370943 INFO  (qtp1690014099-1103) [n:127.0.0.1:36524_c c:control_collection s:shard1  x:control_collection_shard1_replica_n1] o.a.s.c.ZkShardTerms Successful update of terms at /collections/control_collection/terms/shard1 to Terms{values={core_node2=0}, version=0}
   [junit4]   2> 370963 INFO  (searcherExecutor-262-thread-1-processing-n:127.0.0.1:36524_c x:control_collection_shard1_replica_n1 c:control_collection s:shard1) [n:127.0.0.1:36524_c c:control_collection s:shard1  x:control_collection_shard1_replica_n1] o.a.s.c.SolrCore [control_collection_shard1_replica_n1] Registered new searcher Searcher@2e200e4e[control_collection_shard1_replica_n1] main{ExitableDirectoryReader(UninvertingDirectoryReader())}
   [junit4]   2> 370964 INFO  (qtp1690014099-1103) [n:127.0.0.1:36524_c c:control_collection s:shard1  x:control_collection_shard1_replica_n1] o.a.s.c.ShardLeaderElectionContext Enough replicas found to continue.
   [junit4]   2> 370964 INFO  (qtp1690014099-1103) [n:127.0.0.1:36524_c c:control_collection s:shard1  x:control_collection_shard1_replica_n1] o.a.s.c.ShardLeaderElectionContext I may be the new leader - try and sync
   [junit4]   2> 370964 INFO  (qtp1690014099-1103) [n:127.0.0.1:36524_c c:control_collection s:shard1  x:control_collection_shard1_replica_n1] o.a.s.c.SyncStrategy Sync replicas to http://127.0.0.1:36524/c/control_collection_shard1_replica_n1/
   [junit4]   2> 370964 INFO  (qtp1690014099-1103) [n:127.0.0.1:36524_c c:control_collection s:shard1  x:control_collection_shard1_replica_n1] o.a.s.c.SyncStrategy Sync Success - now sync replicas to me
   [junit4]   2> 370964 INFO  (qtp1690014099-1103) [n:127.0.0.1:36524_c c:control_collection s:shard1  x:control_collection_shard1_replica_n1] o.a.s.c.SyncStrategy http://127.0.0.1:36524/c/control_collection_shard1_replica_n1/ has no replicas
   [junit4]   2> 370964 INFO  (qtp1690014099-1103) [n:127.0.0.1:36524_c c:control_collection s:shard1  x:control_collection_shard1_replica_n1] o.a.s.c.ShardLeaderElectionContext Found all replicas participating in election, clear LIR
   [junit4]   2> 370980 INFO  (qtp1690014099-1103) [n:127.0.0.1:36524_c c:control_collection s:shard1  x:control_collection_shard1_replica_n1] o.a.s.c.ShardLeaderElectionContext I am the new leader: http://127.0.0.1:36524/c/control_collection_shard1_replica_n1/ shard1
   [junit4]   2> 371034 INFO  (qtp1690014099-1103) [n:127.0.0.1:36524_c c:control_collection s:shard1  x:control_collection_shard1_replica_n1] o.a.s.c.ZkController I am the leader, no recovery necessary
   [junit4]   2> 371036 INFO  (qtp1690014099-1103) [n:127.0.0.1:36524_c c:control_collection s:shard1  x:control_collection_shard1_replica_n1] o.a.s.s.HttpSolrCall [admin] webapp=null path=/admin/cores params={qt=/admin/cores&collection.configName=conf1&newCollection=true&name=control_collection_shard1_replica_n1&action=CREATE&numShards=1&collection=control_collection&shard=shard1&wt=javabin&version=2&replicaType=NRT} status=0 QTime=3444
   [junit4]   2> 371069 INFO  (qtp1690014099-1099) [n:127.0.0.1:36524_c    ] o.a.s.h.a.CollectionsHandler Wait for new collection to be active for at most 30 seconds. Check all shard replicas
   [junit4]   2> 371140 INFO  (zkCallback-203-thread-1) [    ] o.a.s.c.c.ZkStateReader A cluster state change: [WatchedEvent state:SyncConnected type:NodeDataChanged path:/collections/control_collection/state.json] for collection [control_collection] has occurred - updating... (live nodes size: [1])
   [junit4]   2> 371452 INFO  (OverseerCollectionConfigSetProcessor-72550377491136516-127.0.0.1:36524_c-n_0000000000) [    ] o.a.s.c.OverseerTaskQueue Response ZK path: /overseer/collection-queue-work/qnr-0000000000 doesn't exist.  Requestor may have disconnected from ZooKeeper
   [junit4]   2> 372069 INFO  (qtp1690014099-1099) [n:127.0.0.1:36524_c    ] o.a.s.s.HttpSolrCall [admin] webapp=null path=/admin/collections params={replicationFactor=1&collection.configName=conf1&name=control_collection&nrtReplicas=1&action=CREATE&numShards=1&createNodeSet=127.0.0.1:36524_c&wt=javabin&version=2} status=0 QTime=4698
   [junit4]   2> 372168 INFO  (zkConnectionManagerCallback-221-thread-1) [    ] o.a.s.c.c.ConnectionManager zkClient has connected
   [junit4]   2> 372215 INFO  (TEST-TestSolrConfigHandlerCloud.test-seed#[8816A03D966D33E5]) [    ] o.a.s.c.c.ZkStateReader Updated live nodes from ZooKeeper... (0) -> (1)
   [junit4]   2> 372216 INFO  (TEST-TestSolrConfigHandlerCloud.test-seed#[8816A03D966D33E5]) [    ] o.a.s.c.s.i.ZkClientClusterStateProvider Cluster at 127.0.0.1:38534/solr ready
   [junit4]   2> 372216 INFO  (TEST-TestSolrConfigHa

[...truncated too long message...]

e] :: loading settings :: file = /home/jenkins/jenkins-slave/workspace/Lucene-Solr-BadApples-Tests-7.x/lucene/top-level-ivy-settings.xml

resolve:

ivy-availability-check:
[loadresource] Do not set property disallowed.ivy.jars.list as its length is 0.

-ivy-fail-disallowed-ivy-version:

ivy-fail:

ivy-configure:
[ivy:configure] :: loading settings :: file = /home/jenkins/jenkins-slave/workspace/Lucene-Solr-BadApples-Tests-7.x/lucene/top-level-ivy-settings.xml

resolve:

ivy-availability-check:
[loadresource] Do not set property disallowed.ivy.jars.list as its length is 0.

-ivy-fail-disallowed-ivy-version:

ivy-fail:

ivy-configure:
[ivy:configure] :: loading settings :: file = /home/jenkins/jenkins-slave/workspace/Lucene-Solr-BadApples-Tests-7.x/lucene/top-level-ivy-settings.xml

resolve:

ivy-availability-check:
[loadresource] Do not set property disallowed.ivy.jars.list as its length is 0.

-ivy-fail-disallowed-ivy-version:

ivy-fail:

ivy-configure:
[ivy:configure] :: loading settings :: file = /home/jenkins/jenkins-slave/workspace/Lucene-Solr-BadApples-Tests-7.x/lucene/top-level-ivy-settings.xml

resolve:

jar-checksums:
    [mkdir] Created dir: /home/jenkins/jenkins-slave/workspace/Lucene-Solr-BadApples-Tests-7.x/lucene/null1291530607
     [copy] Copying 40 files to /home/jenkins/jenkins-slave/workspace/Lucene-Solr-BadApples-Tests-7.x/lucene/null1291530607
   [delete] Deleting directory /home/jenkins/jenkins-slave/workspace/Lucene-Solr-BadApples-Tests-7.x/lucene/null1291530607

resolve-example:

ivy-availability-check:
[loadresource] Do not set property disallowed.ivy.jars.list as its length is 0.

-ivy-fail-disallowed-ivy-version:

ivy-fail:

ivy-configure:
[ivy:configure] :: loading settings :: file = /home/jenkins/jenkins-slave/workspace/Lucene-Solr-BadApples-Tests-7.x/lucene/top-level-ivy-settings.xml

resolve:

resolve-server:

ivy-availability-check:
[loadresource] Do not set property disallowed.ivy.jars.list as its length is 0.

-ivy-fail-disallowed-ivy-version:

ivy-fail:

ivy-fail:

ivy-configure:
[ivy:configure] :: loading settings :: file = /home/jenkins/jenkins-slave/workspace/Lucene-Solr-BadApples-Tests-7.x/lucene/top-level-ivy-settings.xml

resolve:

resolve:

ivy-availability-check:
[loadresource] Do not set property disallowed.ivy.jars.list as its length is 0.

-ivy-fail-disallowed-ivy-version:

ivy-fail:

ivy-fail:

ivy-configure:
[ivy:configure] :: loading settings :: file = /home/jenkins/jenkins-slave/workspace/Lucene-Solr-BadApples-Tests-7.x/lucene/top-level-ivy-settings.xml

resolve:

ivy-availability-check:
[loadresource] Do not set property disallowed.ivy.jars.list as its length is 0.

-ivy-fail-disallowed-ivy-version:

ivy-fail:

ivy-fail:

ivy-configure:
[ivy:configure] :: loading settings :: file = /home/jenkins/jenkins-slave/workspace/Lucene-Solr-BadApples-Tests-7.x/lucene/top-level-ivy-settings.xml

resolve:

ivy-availability-check:
[loadresource] Do not set property disallowed.ivy.jars.list as its length is 0.

-ivy-fail-disallowed-ivy-version:

ivy-fail:

ivy-configure:
[ivy:configure] :: loading settings :: file = /home/jenkins/jenkins-slave/workspace/Lucene-Solr-BadApples-Tests-7.x/lucene/top-level-ivy-settings.xml

resolve:

ivy-availability-check:
[loadresource] Do not set property disallowed.ivy.jars.list as its length is 0.

-ivy-fail-disallowed-ivy-version:

ivy-fail:

ivy-fail:

ivy-configure:
[ivy:configure] :: loading settings :: file = /home/jenkins/jenkins-slave/workspace/Lucene-Solr-BadApples-Tests-7.x/lucene/top-level-ivy-settings.xml

resolve:

ivy-availability-check:
[loadresource] Do not set property disallowed.ivy.jars.list as its length is 0.

-ivy-fail-disallowed-ivy-version:

ivy-fail:

ivy-configure:
[ivy:configure] :: loading settings :: file = /home/jenkins/jenkins-slave/workspace/Lucene-Solr-BadApples-Tests-7.x/lucene/top-level-ivy-settings.xml

resolve:

ivy-availability-check:
[loadresource] Do not set property disallowed.ivy.jars.list as its length is 0.

-ivy-fail-disallowed-ivy-version:

ivy-fail:

ivy-fail:

ivy-configure:
[ivy:configure] :: loading settings :: file = /home/jenkins/jenkins-slave/workspace/Lucene-Solr-BadApples-Tests-7.x/lucene/top-level-ivy-settings.xml

resolve:

ivy-availability-check:
[loadresource] Do not set property disallowed.ivy.jars.list as its length is 0.

-ivy-fail-disallowed-ivy-version:

ivy-fail:

ivy-fail:

ivy-configure:
[ivy:configure] :: loading settings :: file = /home/jenkins/jenkins-slave/workspace/Lucene-Solr-BadApples-Tests-7.x/lucene/top-level-ivy-settings.xml

resolve:

ivy-availability-check:
[loadresource] Do not set property disallowed.ivy.jars.list as its length is 0.

-ivy-fail-disallowed-ivy-version:

ivy-fail:

ivy-fail:

ivy-configure:
[ivy:configure] :: loading settings :: file = /home/jenkins/jenkins-slave/workspace/Lucene-Solr-BadApples-Tests-7.x/lucene/top-level-ivy-settings.xml

resolve:

ivy-availability-check:
[loadresource] Do not set property disallowed.ivy.jars.list as its length is 0.

-ivy-fail-disallowed-ivy-version:

ivy-fail:

ivy-fail:

ivy-configure:
[ivy:configure] :: loading settings :: file = /home/jenkins/jenkins-slave/workspace/Lucene-Solr-BadApples-Tests-7.x/lucene/top-level-ivy-settings.xml

resolve:

ivy-availability-check:
[loadresource] Do not set property disallowed.ivy.jars.list as its length is 0.

-ivy-fail-disallowed-ivy-version:

ivy-fail:

ivy-fail:

ivy-configure:
[ivy:configure] :: loading settings :: file = /home/jenkins/jenkins-slave/workspace/Lucene-Solr-BadApples-Tests-7.x/lucene/top-level-ivy-settings.xml

resolve:

ivy-availability-check:
[loadresource] Do not set property disallowed.ivy.jars.list as its length is 0.

-ivy-fail-disallowed-ivy-version:

ivy-fail:

ivy-fail:

ivy-configure:
[ivy:configure] :: loading settings :: file = /home/jenkins/jenkins-slave/workspace/Lucene-Solr-BadApples-Tests-7.x/lucene/top-level-ivy-settings.xml

resolve:

ivy-availability-check:
[loadresource] Do not set property disallowed.ivy.jars.list as its length is 0.

-ivy-fail-disallowed-ivy-version:

ivy-fail:

ivy-fail:

ivy-configure:
[ivy:configure] :: loading settings :: file = /home/jenkins/jenkins-slave/workspace/Lucene-Solr-BadApples-Tests-7.x/lucene/top-level-ivy-settings.xml

resolve:

ivy-availability-check:
[loadresource] Do not set property disallowed.ivy.jars.list as its length is 0.

-ivy-fail-disallowed-ivy-version:

ivy-fail:

ivy-fail:

ivy-configure:
[ivy:configure] :: loading settings :: file = /home/jenkins/jenkins-slave/workspace/Lucene-Solr-BadApples-Tests-7.x/lucene/top-level-ivy-settings.xml

resolve:

ivy-availability-check:
[loadresource] Do not set property disallowed.ivy.jars.list as its length is 0.

-ivy-fail-disallowed-ivy-version:

ivy-fail:

ivy-fail:

ivy-configure:
[ivy:configure] :: loading settings :: file = /home/jenkins/jenkins-slave/workspace/Lucene-Solr-BadApples-Tests-7.x/lucene/top-level-ivy-settings.xml

resolve:

ivy-availability-check:
[loadresource] Do not set property disallowed.ivy.jars.list as its length is 0.

-ivy-fail-disallowed-ivy-version:

ivy-fail:

ivy-fail:

ivy-configure:
[ivy:configure] :: loading settings :: file = /home/jenkins/jenkins-slave/workspace/Lucene-Solr-BadApples-Tests-7.x/lucene/top-level-ivy-settings.xml

resolve:

ivy-availability-check:
[loadresource] Do not set property disallowed.ivy.jars.list as its length is 0.

-ivy-fail-disallowed-ivy-version:

ivy-fail:

ivy-fail:

ivy-configure:
[ivy:configure] :: loading settings :: file = /home/jenkins/jenkins-slave/workspace/Lucene-Solr-BadApples-Tests-7.x/lucene/top-level-ivy-settings.xml

resolve:

jar-checksums:
    [mkdir] Created dir: /home/jenkins/jenkins-slave/workspace/Lucene-Solr-BadApples-Tests-7.x/solr/null2066385465
     [copy] Copying 246 files to /home/jenkins/jenkins-slave/workspace/Lucene-Solr-BadApples-Tests-7.x/solr/null2066385465
   [delete] Deleting directory /home/jenkins/jenkins-slave/workspace/Lucene-Solr-BadApples-Tests-7.x/solr/null2066385465

check-working-copy:
[ivy:cachepath] :: resolving dependencies :: org.eclipse.jgit#org.eclipse.jgit-caller;working
[ivy:cachepath] 	confs: [default]
[ivy:cachepath] 	found org.eclipse.jgit#org.eclipse.jgit;4.6.0.201612231935-r in public
[ivy:cachepath] 	found com.jcraft#jsch;0.1.53 in public
[ivy:cachepath] 	found com.googlecode.javaewah#JavaEWAH;1.1.6 in public
[ivy:cachepath] 	found org.apache.httpcomponents#httpclient;4.3.6 in public
[ivy:cachepath] 	found org.apache.httpcomponents#httpcore;4.3.3 in public
[ivy:cachepath] 	found commons-logging#commons-logging;1.1.3 in public
[ivy:cachepath] 	found commons-codec#commons-codec;1.6 in public
[ivy:cachepath] 	found org.slf4j#slf4j-api;1.7.2 in public
[ivy:cachepath] :: resolution report :: resolve 29ms :: artifacts dl 2ms
	---------------------------------------------------------------------
	|                  |            modules            ||   artifacts   |
	|       conf       | number| search|dwnlded|evicted|| number|dwnlded|
	---------------------------------------------------------------------
	|      default     |   8   |   0   |   0   |   0   ||   8   |   0   |
	---------------------------------------------------------------------
[wc-checker] Initializing working copy...
[wc-checker] SLF4J: Failed to load class "org.slf4j.impl.StaticLoggerBinder".
[wc-checker] SLF4J: Defaulting to no-operation (NOP) logger implementation
[wc-checker] SLF4J: See http://www.slf4j.org/codes.html#StaticLoggerBinder for further details.
[wc-checker] Checking working copy status...

-jenkins-base:

BUILD SUCCESSFUL
Total time: 297 minutes 9 seconds
Archiving artifacts
WARN: No artifacts found that match the file pattern "**/*.events,heapdumps/**,**/hs_err_pid*". Configuration error?
WARN: java.lang.InterruptedException: no matches found within 10000
Recording test results
Build step 'Publish JUnit test result report' changed build result to UNSTABLE
Email was triggered for: Unstable (Test Failures)
Sending email for trigger: Unstable (Test Failures)

Mime
View raw message