lucene-dev mailing list archives

Site index · List index
Message view « Date » · « Thread »
Top « Date » · « Thread »
From Policeman Jenkins Server <jenk...@thetaphi.de>
Subject [JENKINS] Lucene-Solr-7.x-Solaris (64bit/jdk1.8.0) - Build # 645 - Still Unstable!
Date Thu, 24 May 2018 21:16:28 GMT
Build: https://jenkins.thetaphi.de/job/Lucene-Solr-7.x-Solaris/645/
Java: 64bit/jdk1.8.0 -XX:-UseCompressedOops -XX:+UseConcMarkSweepGC

5 tests failed.
FAILED:  org.apache.solr.cloud.autoscaling.IndexSizeTriggerTest.testMixedBounds

Error Message:
expected:<MERGESHARDS> but was:<SPLITSHARD>

Stack Trace:
java.lang.AssertionError: expected:<MERGESHARDS> but was:<SPLITSHARD>
	at __randomizedtesting.SeedInfo.seed([495113D3FB1FEDD8:43D2AC7EB6A4E682]:0)
	at org.junit.Assert.fail(Assert.java:93)
	at org.junit.Assert.failNotEquals(Assert.java:647)
	at org.junit.Assert.assertEquals(Assert.java:128)
	at org.junit.Assert.assertEquals(Assert.java:147)
	at org.apache.solr.cloud.autoscaling.IndexSizeTriggerTest.testMixedBounds(IndexSizeTriggerTest.java:635)
	at sun.reflect.NativeMethodAccessorImpl.invoke0(Native Method)
	at sun.reflect.NativeMethodAccessorImpl.invoke(NativeMethodAccessorImpl.java:62)
	at sun.reflect.DelegatingMethodAccessorImpl.invoke(DelegatingMethodAccessorImpl.java:43)
	at java.lang.reflect.Method.invoke(Method.java:498)
	at com.carrotsearch.randomizedtesting.RandomizedRunner.invoke(RandomizedRunner.java:1737)
	at com.carrotsearch.randomizedtesting.RandomizedRunner$8.evaluate(RandomizedRunner.java:934)
	at com.carrotsearch.randomizedtesting.RandomizedRunner$9.evaluate(RandomizedRunner.java:970)
	at com.carrotsearch.randomizedtesting.RandomizedRunner$10.evaluate(RandomizedRunner.java:984)
	at com.carrotsearch.randomizedtesting.rules.SystemPropertiesRestoreRule$1.evaluate(SystemPropertiesRestoreRule.java:57)
	at org.apache.lucene.util.TestRuleSetupTeardownChained$1.evaluate(TestRuleSetupTeardownChained.java:49)
	at org.apache.lucene.util.AbstractBeforeAfterRule$1.evaluate(AbstractBeforeAfterRule.java:45)
	at org.apache.lucene.util.TestRuleThreadAndTestName$1.evaluate(TestRuleThreadAndTestName.java:48)
	at org.apache.lucene.util.TestRuleIgnoreAfterMaxFailures$1.evaluate(TestRuleIgnoreAfterMaxFailures.java:64)
	at org.apache.lucene.util.TestRuleMarkFailure$1.evaluate(TestRuleMarkFailure.java:47)
	at com.carrotsearch.randomizedtesting.rules.StatementAdapter.evaluate(StatementAdapter.java:36)
	at com.carrotsearch.randomizedtesting.ThreadLeakControl$StatementRunner.run(ThreadLeakControl.java:368)
	at com.carrotsearch.randomizedtesting.ThreadLeakControl.forkTimeoutingTask(ThreadLeakControl.java:817)
	at com.carrotsearch.randomizedtesting.ThreadLeakControl$3.evaluate(ThreadLeakControl.java:468)
	at com.carrotsearch.randomizedtesting.RandomizedRunner.runSingleTest(RandomizedRunner.java:943)
	at com.carrotsearch.randomizedtesting.RandomizedRunner$5.evaluate(RandomizedRunner.java:829)
	at com.carrotsearch.randomizedtesting.RandomizedRunner$6.evaluate(RandomizedRunner.java:879)
	at com.carrotsearch.randomizedtesting.RandomizedRunner$7.evaluate(RandomizedRunner.java:890)
	at com.carrotsearch.randomizedtesting.rules.StatementAdapter.evaluate(StatementAdapter.java:36)
	at com.carrotsearch.randomizedtesting.rules.SystemPropertiesRestoreRule$1.evaluate(SystemPropertiesRestoreRule.java:57)
	at org.apache.lucene.util.AbstractBeforeAfterRule$1.evaluate(AbstractBeforeAfterRule.java:45)
	at com.carrotsearch.randomizedtesting.rules.StatementAdapter.evaluate(StatementAdapter.java:36)
	at org.apache.lucene.util.TestRuleStoreClassName$1.evaluate(TestRuleStoreClassName.java:41)
	at com.carrotsearch.randomizedtesting.rules.NoShadowingOrOverridesOnMethodsRule$1.evaluate(NoShadowingOrOverridesOnMethodsRule.java:40)
	at com.carrotsearch.randomizedtesting.rules.NoShadowingOrOverridesOnMethodsRule$1.evaluate(NoShadowingOrOverridesOnMethodsRule.java:40)
	at com.carrotsearch.randomizedtesting.rules.StatementAdapter.evaluate(StatementAdapter.java:36)
	at com.carrotsearch.randomizedtesting.rules.StatementAdapter.evaluate(StatementAdapter.java:36)
	at com.carrotsearch.randomizedtesting.rules.StatementAdapter.evaluate(StatementAdapter.java:36)
	at org.apache.lucene.util.TestRuleAssertionsRequired$1.evaluate(TestRuleAssertionsRequired.java:53)
	at org.apache.lucene.util.TestRuleMarkFailure$1.evaluate(TestRuleMarkFailure.java:47)
	at org.apache.lucene.util.TestRuleIgnoreAfterMaxFailures$1.evaluate(TestRuleIgnoreAfterMaxFailures.java:64)
	at org.apache.lucene.util.TestRuleIgnoreTestSuites$1.evaluate(TestRuleIgnoreTestSuites.java:54)
	at com.carrotsearch.randomizedtesting.rules.StatementAdapter.evaluate(StatementAdapter.java:36)
	at com.carrotsearch.randomizedtesting.ThreadLeakControl$StatementRunner.run(ThreadLeakControl.java:368)
	at java.lang.Thread.run(Thread.java:748)


FAILED:  org.apache.solr.cloud.autoscaling.IndexSizeTriggerTest.testMixedBounds

Error Message:
expected:<MERGESHARDS> but was:<SPLITSHARD>

Stack Trace:
java.lang.AssertionError: expected:<MERGESHARDS> but was:<SPLITSHARD>
	at __randomizedtesting.SeedInfo.seed([495113D3FB1FEDD8:43D2AC7EB6A4E682]:0)
	at org.junit.Assert.fail(Assert.java:93)
	at org.junit.Assert.failNotEquals(Assert.java:647)
	at org.junit.Assert.assertEquals(Assert.java:128)
	at org.junit.Assert.assertEquals(Assert.java:147)
	at org.apache.solr.cloud.autoscaling.IndexSizeTriggerTest.testMixedBounds(IndexSizeTriggerTest.java:635)
	at sun.reflect.NativeMethodAccessorImpl.invoke0(Native Method)
	at sun.reflect.NativeMethodAccessorImpl.invoke(NativeMethodAccessorImpl.java:62)
	at sun.reflect.DelegatingMethodAccessorImpl.invoke(DelegatingMethodAccessorImpl.java:43)
	at java.lang.reflect.Method.invoke(Method.java:498)
	at com.carrotsearch.randomizedtesting.RandomizedRunner.invoke(RandomizedRunner.java:1737)
	at com.carrotsearch.randomizedtesting.RandomizedRunner$8.evaluate(RandomizedRunner.java:934)
	at com.carrotsearch.randomizedtesting.RandomizedRunner$9.evaluate(RandomizedRunner.java:970)
	at com.carrotsearch.randomizedtesting.RandomizedRunner$10.evaluate(RandomizedRunner.java:984)
	at com.carrotsearch.randomizedtesting.rules.SystemPropertiesRestoreRule$1.evaluate(SystemPropertiesRestoreRule.java:57)
	at org.apache.lucene.util.TestRuleSetupTeardownChained$1.evaluate(TestRuleSetupTeardownChained.java:49)
	at org.apache.lucene.util.AbstractBeforeAfterRule$1.evaluate(AbstractBeforeAfterRule.java:45)
	at org.apache.lucene.util.TestRuleThreadAndTestName$1.evaluate(TestRuleThreadAndTestName.java:48)
	at org.apache.lucene.util.TestRuleIgnoreAfterMaxFailures$1.evaluate(TestRuleIgnoreAfterMaxFailures.java:64)
	at org.apache.lucene.util.TestRuleMarkFailure$1.evaluate(TestRuleMarkFailure.java:47)
	at com.carrotsearch.randomizedtesting.rules.StatementAdapter.evaluate(StatementAdapter.java:36)
	at com.carrotsearch.randomizedtesting.ThreadLeakControl$StatementRunner.run(ThreadLeakControl.java:368)
	at com.carrotsearch.randomizedtesting.ThreadLeakControl.forkTimeoutingTask(ThreadLeakControl.java:817)
	at com.carrotsearch.randomizedtesting.ThreadLeakControl$3.evaluate(ThreadLeakControl.java:468)
	at com.carrotsearch.randomizedtesting.RandomizedRunner.runSingleTest(RandomizedRunner.java:943)
	at com.carrotsearch.randomizedtesting.RandomizedRunner$5.evaluate(RandomizedRunner.java:829)
	at com.carrotsearch.randomizedtesting.RandomizedRunner$6.evaluate(RandomizedRunner.java:879)
	at com.carrotsearch.randomizedtesting.RandomizedRunner$7.evaluate(RandomizedRunner.java:890)
	at com.carrotsearch.randomizedtesting.rules.StatementAdapter.evaluate(StatementAdapter.java:36)
	at com.carrotsearch.randomizedtesting.rules.SystemPropertiesRestoreRule$1.evaluate(SystemPropertiesRestoreRule.java:57)
	at org.apache.lucene.util.AbstractBeforeAfterRule$1.evaluate(AbstractBeforeAfterRule.java:45)
	at com.carrotsearch.randomizedtesting.rules.StatementAdapter.evaluate(StatementAdapter.java:36)
	at org.apache.lucene.util.TestRuleStoreClassName$1.evaluate(TestRuleStoreClassName.java:41)
	at com.carrotsearch.randomizedtesting.rules.NoShadowingOrOverridesOnMethodsRule$1.evaluate(NoShadowingOrOverridesOnMethodsRule.java:40)
	at com.carrotsearch.randomizedtesting.rules.NoShadowingOrOverridesOnMethodsRule$1.evaluate(NoShadowingOrOverridesOnMethodsRule.java:40)
	at com.carrotsearch.randomizedtesting.rules.StatementAdapter.evaluate(StatementAdapter.java:36)
	at com.carrotsearch.randomizedtesting.rules.StatementAdapter.evaluate(StatementAdapter.java:36)
	at com.carrotsearch.randomizedtesting.rules.StatementAdapter.evaluate(StatementAdapter.java:36)
	at org.apache.lucene.util.TestRuleAssertionsRequired$1.evaluate(TestRuleAssertionsRequired.java:53)
	at org.apache.lucene.util.TestRuleMarkFailure$1.evaluate(TestRuleMarkFailure.java:47)
	at org.apache.lucene.util.TestRuleIgnoreAfterMaxFailures$1.evaluate(TestRuleIgnoreAfterMaxFailures.java:64)
	at org.apache.lucene.util.TestRuleIgnoreTestSuites$1.evaluate(TestRuleIgnoreTestSuites.java:54)
	at com.carrotsearch.randomizedtesting.rules.StatementAdapter.evaluate(StatementAdapter.java:36)
	at com.carrotsearch.randomizedtesting.ThreadLeakControl$StatementRunner.run(ThreadLeakControl.java:368)
	at java.lang.Thread.run(Thread.java:748)


FAILED:  org.apache.solr.cloud.autoscaling.IndexSizeTriggerTest.testMixedBounds

Error Message:
expected:<MERGESHARDS> but was:<SPLITSHARD>

Stack Trace:
java.lang.AssertionError: expected:<MERGESHARDS> but was:<SPLITSHARD>
	at __randomizedtesting.SeedInfo.seed([495113D3FB1FEDD8:43D2AC7EB6A4E682]:0)
	at org.junit.Assert.fail(Assert.java:93)
	at org.junit.Assert.failNotEquals(Assert.java:647)
	at org.junit.Assert.assertEquals(Assert.java:128)
	at org.junit.Assert.assertEquals(Assert.java:147)
	at org.apache.solr.cloud.autoscaling.IndexSizeTriggerTest.testMixedBounds(IndexSizeTriggerTest.java:635)
	at sun.reflect.NativeMethodAccessorImpl.invoke0(Native Method)
	at sun.reflect.NativeMethodAccessorImpl.invoke(NativeMethodAccessorImpl.java:62)
	at sun.reflect.DelegatingMethodAccessorImpl.invoke(DelegatingMethodAccessorImpl.java:43)
	at java.lang.reflect.Method.invoke(Method.java:498)
	at com.carrotsearch.randomizedtesting.RandomizedRunner.invoke(RandomizedRunner.java:1737)
	at com.carrotsearch.randomizedtesting.RandomizedRunner$8.evaluate(RandomizedRunner.java:934)
	at com.carrotsearch.randomizedtesting.RandomizedRunner$9.evaluate(RandomizedRunner.java:970)
	at com.carrotsearch.randomizedtesting.RandomizedRunner$10.evaluate(RandomizedRunner.java:984)
	at com.carrotsearch.randomizedtesting.rules.SystemPropertiesRestoreRule$1.evaluate(SystemPropertiesRestoreRule.java:57)
	at org.apache.lucene.util.TestRuleSetupTeardownChained$1.evaluate(TestRuleSetupTeardownChained.java:49)
	at org.apache.lucene.util.AbstractBeforeAfterRule$1.evaluate(AbstractBeforeAfterRule.java:45)
	at org.apache.lucene.util.TestRuleThreadAndTestName$1.evaluate(TestRuleThreadAndTestName.java:48)
	at org.apache.lucene.util.TestRuleIgnoreAfterMaxFailures$1.evaluate(TestRuleIgnoreAfterMaxFailures.java:64)
	at org.apache.lucene.util.TestRuleMarkFailure$1.evaluate(TestRuleMarkFailure.java:47)
	at com.carrotsearch.randomizedtesting.rules.StatementAdapter.evaluate(StatementAdapter.java:36)
	at com.carrotsearch.randomizedtesting.ThreadLeakControl$StatementRunner.run(ThreadLeakControl.java:368)
	at com.carrotsearch.randomizedtesting.ThreadLeakControl.forkTimeoutingTask(ThreadLeakControl.java:817)
	at com.carrotsearch.randomizedtesting.ThreadLeakControl$3.evaluate(ThreadLeakControl.java:468)
	at com.carrotsearch.randomizedtesting.RandomizedRunner.runSingleTest(RandomizedRunner.java:943)
	at com.carrotsearch.randomizedtesting.RandomizedRunner$5.evaluate(RandomizedRunner.java:829)
	at com.carrotsearch.randomizedtesting.RandomizedRunner$6.evaluate(RandomizedRunner.java:879)
	at com.carrotsearch.randomizedtesting.RandomizedRunner$7.evaluate(RandomizedRunner.java:890)
	at com.carrotsearch.randomizedtesting.rules.StatementAdapter.evaluate(StatementAdapter.java:36)
	at com.carrotsearch.randomizedtesting.rules.SystemPropertiesRestoreRule$1.evaluate(SystemPropertiesRestoreRule.java:57)
	at org.apache.lucene.util.AbstractBeforeAfterRule$1.evaluate(AbstractBeforeAfterRule.java:45)
	at com.carrotsearch.randomizedtesting.rules.StatementAdapter.evaluate(StatementAdapter.java:36)
	at org.apache.lucene.util.TestRuleStoreClassName$1.evaluate(TestRuleStoreClassName.java:41)
	at com.carrotsearch.randomizedtesting.rules.NoShadowingOrOverridesOnMethodsRule$1.evaluate(NoShadowingOrOverridesOnMethodsRule.java:40)
	at com.carrotsearch.randomizedtesting.rules.NoShadowingOrOverridesOnMethodsRule$1.evaluate(NoShadowingOrOverridesOnMethodsRule.java:40)
	at com.carrotsearch.randomizedtesting.rules.StatementAdapter.evaluate(StatementAdapter.java:36)
	at com.carrotsearch.randomizedtesting.rules.StatementAdapter.evaluate(StatementAdapter.java:36)
	at com.carrotsearch.randomizedtesting.rules.StatementAdapter.evaluate(StatementAdapter.java:36)
	at org.apache.lucene.util.TestRuleAssertionsRequired$1.evaluate(TestRuleAssertionsRequired.java:53)
	at org.apache.lucene.util.TestRuleMarkFailure$1.evaluate(TestRuleMarkFailure.java:47)
	at org.apache.lucene.util.TestRuleIgnoreAfterMaxFailures$1.evaluate(TestRuleIgnoreAfterMaxFailures.java:64)
	at org.apache.lucene.util.TestRuleIgnoreTestSuites$1.evaluate(TestRuleIgnoreTestSuites.java:54)
	at com.carrotsearch.randomizedtesting.rules.StatementAdapter.evaluate(StatementAdapter.java:36)
	at com.carrotsearch.randomizedtesting.ThreadLeakControl$StatementRunner.run(ThreadLeakControl.java:368)
	at java.lang.Thread.run(Thread.java:748)


FAILED:  org.apache.solr.cloud.autoscaling.IndexSizeTriggerTest.testMixedBounds

Error Message:
expected:<MERGESHARDS> but was:<SPLITSHARD>

Stack Trace:
java.lang.AssertionError: expected:<MERGESHARDS> but was:<SPLITSHARD>
	at __randomizedtesting.SeedInfo.seed([495113D3FB1FEDD8:43D2AC7EB6A4E682]:0)
	at org.junit.Assert.fail(Assert.java:93)
	at org.junit.Assert.failNotEquals(Assert.java:647)
	at org.junit.Assert.assertEquals(Assert.java:128)
	at org.junit.Assert.assertEquals(Assert.java:147)
	at org.apache.solr.cloud.autoscaling.IndexSizeTriggerTest.testMixedBounds(IndexSizeTriggerTest.java:635)
	at sun.reflect.NativeMethodAccessorImpl.invoke0(Native Method)
	at sun.reflect.NativeMethodAccessorImpl.invoke(NativeMethodAccessorImpl.java:62)
	at sun.reflect.DelegatingMethodAccessorImpl.invoke(DelegatingMethodAccessorImpl.java:43)
	at java.lang.reflect.Method.invoke(Method.java:498)
	at com.carrotsearch.randomizedtesting.RandomizedRunner.invoke(RandomizedRunner.java:1737)
	at com.carrotsearch.randomizedtesting.RandomizedRunner$8.evaluate(RandomizedRunner.java:934)
	at com.carrotsearch.randomizedtesting.RandomizedRunner$9.evaluate(RandomizedRunner.java:970)
	at com.carrotsearch.randomizedtesting.RandomizedRunner$10.evaluate(RandomizedRunner.java:984)
	at com.carrotsearch.randomizedtesting.rules.SystemPropertiesRestoreRule$1.evaluate(SystemPropertiesRestoreRule.java:57)
	at org.apache.lucene.util.TestRuleSetupTeardownChained$1.evaluate(TestRuleSetupTeardownChained.java:49)
	at org.apache.lucene.util.AbstractBeforeAfterRule$1.evaluate(AbstractBeforeAfterRule.java:45)
	at org.apache.lucene.util.TestRuleThreadAndTestName$1.evaluate(TestRuleThreadAndTestName.java:48)
	at org.apache.lucene.util.TestRuleIgnoreAfterMaxFailures$1.evaluate(TestRuleIgnoreAfterMaxFailures.java:64)
	at org.apache.lucene.util.TestRuleMarkFailure$1.evaluate(TestRuleMarkFailure.java:47)
	at com.carrotsearch.randomizedtesting.rules.StatementAdapter.evaluate(StatementAdapter.java:36)
	at com.carrotsearch.randomizedtesting.ThreadLeakControl$StatementRunner.run(ThreadLeakControl.java:368)
	at com.carrotsearch.randomizedtesting.ThreadLeakControl.forkTimeoutingTask(ThreadLeakControl.java:817)
	at com.carrotsearch.randomizedtesting.ThreadLeakControl$3.evaluate(ThreadLeakControl.java:468)
	at com.carrotsearch.randomizedtesting.RandomizedRunner.runSingleTest(RandomizedRunner.java:943)
	at com.carrotsearch.randomizedtesting.RandomizedRunner$5.evaluate(RandomizedRunner.java:829)
	at com.carrotsearch.randomizedtesting.RandomizedRunner$6.evaluate(RandomizedRunner.java:879)
	at com.carrotsearch.randomizedtesting.RandomizedRunner$7.evaluate(RandomizedRunner.java:890)
	at com.carrotsearch.randomizedtesting.rules.StatementAdapter.evaluate(StatementAdapter.java:36)
	at com.carrotsearch.randomizedtesting.rules.SystemPropertiesRestoreRule$1.evaluate(SystemPropertiesRestoreRule.java:57)
	at org.apache.lucene.util.AbstractBeforeAfterRule$1.evaluate(AbstractBeforeAfterRule.java:45)
	at com.carrotsearch.randomizedtesting.rules.StatementAdapter.evaluate(StatementAdapter.java:36)
	at org.apache.lucene.util.TestRuleStoreClassName$1.evaluate(TestRuleStoreClassName.java:41)
	at com.carrotsearch.randomizedtesting.rules.NoShadowingOrOverridesOnMethodsRule$1.evaluate(NoShadowingOrOverridesOnMethodsRule.java:40)
	at com.carrotsearch.randomizedtesting.rules.NoShadowingOrOverridesOnMethodsRule$1.evaluate(NoShadowingOrOverridesOnMethodsRule.java:40)
	at com.carrotsearch.randomizedtesting.rules.StatementAdapter.evaluate(StatementAdapter.java:36)
	at com.carrotsearch.randomizedtesting.rules.StatementAdapter.evaluate(StatementAdapter.java:36)
	at com.carrotsearch.randomizedtesting.rules.StatementAdapter.evaluate(StatementAdapter.java:36)
	at org.apache.lucene.util.TestRuleAssertionsRequired$1.evaluate(TestRuleAssertionsRequired.java:53)
	at org.apache.lucene.util.TestRuleMarkFailure$1.evaluate(TestRuleMarkFailure.java:47)
	at org.apache.lucene.util.TestRuleIgnoreAfterMaxFailures$1.evaluate(TestRuleIgnoreAfterMaxFailures.java:64)
	at org.apache.lucene.util.TestRuleIgnoreTestSuites$1.evaluate(TestRuleIgnoreTestSuites.java:54)
	at com.carrotsearch.randomizedtesting.rules.StatementAdapter.evaluate(StatementAdapter.java:36)
	at com.carrotsearch.randomizedtesting.ThreadLeakControl$StatementRunner.run(ThreadLeakControl.java:368)
	at java.lang.Thread.run(Thread.java:748)


FAILED:  org.apache.solr.cloud.autoscaling.IndexSizeTriggerTest.testMixedBounds

Error Message:
expected:<MERGESHARDS> but was:<SPLITSHARD>

Stack Trace:
java.lang.AssertionError: expected:<MERGESHARDS> but was:<SPLITSHARD>
	at __randomizedtesting.SeedInfo.seed([495113D3FB1FEDD8:43D2AC7EB6A4E682]:0)
	at org.junit.Assert.fail(Assert.java:93)
	at org.junit.Assert.failNotEquals(Assert.java:647)
	at org.junit.Assert.assertEquals(Assert.java:128)
	at org.junit.Assert.assertEquals(Assert.java:147)
	at org.apache.solr.cloud.autoscaling.IndexSizeTriggerTest.testMixedBounds(IndexSizeTriggerTest.java:635)
	at sun.reflect.NativeMethodAccessorImpl.invoke0(Native Method)
	at sun.reflect.NativeMethodAccessorImpl.invoke(NativeMethodAccessorImpl.java:62)
	at sun.reflect.DelegatingMethodAccessorImpl.invoke(DelegatingMethodAccessorImpl.java:43)
	at java.lang.reflect.Method.invoke(Method.java:498)
	at com.carrotsearch.randomizedtesting.RandomizedRunner.invoke(RandomizedRunner.java:1737)
	at com.carrotsearch.randomizedtesting.RandomizedRunner$8.evaluate(RandomizedRunner.java:934)
	at com.carrotsearch.randomizedtesting.RandomizedRunner$9.evaluate(RandomizedRunner.java:970)
	at com.carrotsearch.randomizedtesting.RandomizedRunner$10.evaluate(RandomizedRunner.java:984)
	at com.carrotsearch.randomizedtesting.rules.SystemPropertiesRestoreRule$1.evaluate(SystemPropertiesRestoreRule.java:57)
	at org.apache.lucene.util.TestRuleSetupTeardownChained$1.evaluate(TestRuleSetupTeardownChained.java:49)
	at org.apache.lucene.util.AbstractBeforeAfterRule$1.evaluate(AbstractBeforeAfterRule.java:45)
	at org.apache.lucene.util.TestRuleThreadAndTestName$1.evaluate(TestRuleThreadAndTestName.java:48)
	at org.apache.lucene.util.TestRuleIgnoreAfterMaxFailures$1.evaluate(TestRuleIgnoreAfterMaxFailures.java:64)
	at org.apache.lucene.util.TestRuleMarkFailure$1.evaluate(TestRuleMarkFailure.java:47)
	at com.carrotsearch.randomizedtesting.rules.StatementAdapter.evaluate(StatementAdapter.java:36)
	at com.carrotsearch.randomizedtesting.ThreadLeakControl$StatementRunner.run(ThreadLeakControl.java:368)
	at com.carrotsearch.randomizedtesting.ThreadLeakControl.forkTimeoutingTask(ThreadLeakControl.java:817)
	at com.carrotsearch.randomizedtesting.ThreadLeakControl$3.evaluate(ThreadLeakControl.java:468)
	at com.carrotsearch.randomizedtesting.RandomizedRunner.runSingleTest(RandomizedRunner.java:943)
	at com.carrotsearch.randomizedtesting.RandomizedRunner$5.evaluate(RandomizedRunner.java:829)
	at com.carrotsearch.randomizedtesting.RandomizedRunner$6.evaluate(RandomizedRunner.java:879)
	at com.carrotsearch.randomizedtesting.RandomizedRunner$7.evaluate(RandomizedRunner.java:890)
	at com.carrotsearch.randomizedtesting.rules.StatementAdapter.evaluate(StatementAdapter.java:36)
	at com.carrotsearch.randomizedtesting.rules.SystemPropertiesRestoreRule$1.evaluate(SystemPropertiesRestoreRule.java:57)
	at org.apache.lucene.util.AbstractBeforeAfterRule$1.evaluate(AbstractBeforeAfterRule.java:45)
	at com.carrotsearch.randomizedtesting.rules.StatementAdapter.evaluate(StatementAdapter.java:36)
	at org.apache.lucene.util.TestRuleStoreClassName$1.evaluate(TestRuleStoreClassName.java:41)
	at com.carrotsearch.randomizedtesting.rules.NoShadowingOrOverridesOnMethodsRule$1.evaluate(NoShadowingOrOverridesOnMethodsRule.java:40)
	at com.carrotsearch.randomizedtesting.rules.NoShadowingOrOverridesOnMethodsRule$1.evaluate(NoShadowingOrOverridesOnMethodsRule.java:40)
	at com.carrotsearch.randomizedtesting.rules.StatementAdapter.evaluate(StatementAdapter.java:36)
	at com.carrotsearch.randomizedtesting.rules.StatementAdapter.evaluate(StatementAdapter.java:36)
	at com.carrotsearch.randomizedtesting.rules.StatementAdapter.evaluate(StatementAdapter.java:36)
	at org.apache.lucene.util.TestRuleAssertionsRequired$1.evaluate(TestRuleAssertionsRequired.java:53)
	at org.apache.lucene.util.TestRuleMarkFailure$1.evaluate(TestRuleMarkFailure.java:47)
	at org.apache.lucene.util.TestRuleIgnoreAfterMaxFailures$1.evaluate(TestRuleIgnoreAfterMaxFailures.java:64)
	at org.apache.lucene.util.TestRuleIgnoreTestSuites$1.evaluate(TestRuleIgnoreTestSuites.java:54)
	at com.carrotsearch.randomizedtesting.rules.StatementAdapter.evaluate(StatementAdapter.java:36)
	at com.carrotsearch.randomizedtesting.ThreadLeakControl$StatementRunner.run(ThreadLeakControl.java:368)
	at java.lang.Thread.run(Thread.java:748)




Build Log:
[...truncated 14539 lines...]
   [junit4] Suite: org.apache.solr.cloud.autoscaling.IndexSizeTriggerTest
   [junit4]   2> Creating dataDir: /export/home/jenkins/workspace/Lucene-Solr-7.x-Solaris/solr/build/solr-core/test/J0/temp/solr.cloud.autoscaling.IndexSizeTriggerTest_495113D3FB1FEDD8-001/init-core-data-001
   [junit4]   2> 2765346 WARN  (SUITE-IndexSizeTriggerTest-seed#[495113D3FB1FEDD8]-worker) [    ] o.a.s.SolrTestCaseJ4 startTrackingSearchers: numOpens=10 numCloses=10
   [junit4]   2> 2765346 INFO  (SUITE-IndexSizeTriggerTest-seed#[495113D3FB1FEDD8]-worker) [    ] o.a.s.SolrTestCaseJ4 Using PointFields (NUMERIC_POINTS_SYSPROP=true) w/NUMERIC_DOCVALUES_SYSPROP=false
   [junit4]   2> 2765347 INFO  (SUITE-IndexSizeTriggerTest-seed#[495113D3FB1FEDD8]-worker) [    ] o.a.s.SolrTestCaseJ4 Randomized ssl (false) and clientAuth (false) via: @org.apache.solr.util.RandomizeSSL(reason=, value=NaN, ssl=NaN, clientAuth=NaN)
   [junit4]   2> 2765347 INFO  (SUITE-IndexSizeTriggerTest-seed#[495113D3FB1FEDD8]-worker) [    ] o.a.s.SolrTestCaseJ4 SecureRandom sanity checks: test.solr.allowed.securerandom=null & java.security.egd=file:/dev/./urandom
   [junit4]   2> 2765348 INFO  (SUITE-IndexSizeTriggerTest-seed#[495113D3FB1FEDD8]-worker) [    ] o.a.s.c.MiniSolrCloudCluster Starting cluster of 2 servers in /export/home/jenkins/workspace/Lucene-Solr-7.x-Solaris/solr/build/solr-core/test/J0/temp/solr.cloud.autoscaling.IndexSizeTriggerTest_495113D3FB1FEDD8-001/tempDir-001
   [junit4]   2> 2765348 INFO  (SUITE-IndexSizeTriggerTest-seed#[495113D3FB1FEDD8]-worker) [    ] o.a.s.c.ZkTestServer STARTING ZK TEST SERVER
   [junit4]   2> 2765348 INFO  (Thread-5233) [    ] o.a.s.c.ZkTestServer client port:0.0.0.0/0.0.0.0:0
   [junit4]   2> 2765348 INFO  (Thread-5233) [    ] o.a.s.c.ZkTestServer Starting server
   [junit4]   2> 2765351 ERROR (Thread-5233) [    ] o.a.z.s.ZooKeeperServer ZKShutdownHandler is not registered, so ZooKeeper server won't take any action on ERROR or SHUTDOWN server state changes
   [junit4]   2> 2765448 INFO  (SUITE-IndexSizeTriggerTest-seed#[495113D3FB1FEDD8]-worker) [    ] o.a.s.c.ZkTestServer start zk server on port:58691
   [junit4]   2> 2765451 INFO  (zkConnectionManagerCallback-7868-thread-1) [    ] o.a.s.c.c.ConnectionManager zkClient has connected
   [junit4]   2> 2765455 INFO  (jetty-launcher-7865-thread-1) [    ] o.e.j.s.Server jetty-9.4.10.v20180503; built: 2018-05-03T15:56:21.710Z; git: daa59876e6f384329b122929e70a80934569428c; jvm 1.8.0_172-b11
   [junit4]   2> 2765455 INFO  (jetty-launcher-7865-thread-2) [    ] o.e.j.s.Server jetty-9.4.10.v20180503; built: 2018-05-03T15:56:21.710Z; git: daa59876e6f384329b122929e70a80934569428c; jvm 1.8.0_172-b11
   [junit4]   2> 2765456 INFO  (jetty-launcher-7865-thread-1) [    ] o.e.j.s.session DefaultSessionIdManager workerName=node0
   [junit4]   2> 2765456 INFO  (jetty-launcher-7865-thread-1) [    ] o.e.j.s.session No SessionScavenger set, using defaults
   [junit4]   2> 2765456 INFO  (jetty-launcher-7865-thread-1) [    ] o.e.j.s.session node0 Scavenging every 600000ms
   [junit4]   2> 2765457 INFO  (jetty-launcher-7865-thread-1) [    ] o.e.j.s.h.ContextHandler Started o.e.j.s.ServletContextHandler@2f49dc0a{/solr,null,AVAILABLE}
   [junit4]   2> 2765458 INFO  (jetty-launcher-7865-thread-2) [    ] o.e.j.s.session DefaultSessionIdManager workerName=node0
   [junit4]   2> 2765458 INFO  (jetty-launcher-7865-thread-2) [    ] o.e.j.s.session No SessionScavenger set, using defaults
   [junit4]   2> 2765458 INFO  (jetty-launcher-7865-thread-2) [    ] o.e.j.s.session node0 Scavenging every 600000ms
   [junit4]   2> 2765458 INFO  (jetty-launcher-7865-thread-1) [    ] o.e.j.s.AbstractConnector Started ServerConnector@2570ae8{HTTP/1.1,[http/1.1]}{127.0.0.1:54194}
   [junit4]   2> 2765458 INFO  (jetty-launcher-7865-thread-1) [    ] o.e.j.s.Server Started @2766978ms
   [junit4]   2> 2765458 INFO  (jetty-launcher-7865-thread-1) [    ] o.a.s.c.s.e.JettySolrRunner Jetty properties: {hostContext=/solr, hostPort=54194}
   [junit4]   2> 2765458 ERROR (jetty-launcher-7865-thread-1) [    ] o.a.s.u.StartupLoggingUtils Missing Java Option solr.log.dir. Logging may be missing or incomplete.
   [junit4]   2> 2765458 INFO  (jetty-launcher-7865-thread-1) [    ] o.a.s.s.SolrDispatchFilter Using logger factory org.apache.logging.slf4j.Log4jLoggerFactory
   [junit4]   2> 2765459 INFO  (jetty-launcher-7865-thread-1) [    ] o.a.s.s.SolrDispatchFilter  ___      _       Welcome to Apache Solr? version 7.4.0
   [junit4]   2> 2765459 INFO  (jetty-launcher-7865-thread-1) [    ] o.a.s.s.SolrDispatchFilter / __| ___| |_ _   Starting in cloud mode on port null
   [junit4]   2> 2765459 INFO  (jetty-launcher-7865-thread-1) [    ] o.a.s.s.SolrDispatchFilter \__ \/ _ \ | '_|  Install dir: null
   [junit4]   2> 2765459 INFO  (jetty-launcher-7865-thread-1) [    ] o.a.s.s.SolrDispatchFilter |___/\___/_|_|    Start time: 2018-05-24T20:38:51.534Z
   [junit4]   2> 2765459 INFO  (jetty-launcher-7865-thread-2) [    ] o.e.j.s.h.ContextHandler Started o.e.j.s.ServletContextHandler@a80c296{/solr,null,AVAILABLE}
   [junit4]   2> 2765459 INFO  (jetty-launcher-7865-thread-2) [    ] o.e.j.s.AbstractConnector Started ServerConnector@252c5cdd{HTTP/1.1,[http/1.1]}{127.0.0.1:38264}
   [junit4]   2> 2765459 INFO  (jetty-launcher-7865-thread-2) [    ] o.e.j.s.Server Started @2766979ms
   [junit4]   2> 2765459 INFO  (jetty-launcher-7865-thread-2) [    ] o.a.s.c.s.e.JettySolrRunner Jetty properties: {hostContext=/solr, hostPort=38264}
   [junit4]   2> 2765459 ERROR (jetty-launcher-7865-thread-2) [    ] o.a.s.u.StartupLoggingUtils Missing Java Option solr.log.dir. Logging may be missing or incomplete.
   [junit4]   2> 2765459 INFO  (jetty-launcher-7865-thread-2) [    ] o.a.s.s.SolrDispatchFilter Using logger factory org.apache.logging.slf4j.Log4jLoggerFactory
   [junit4]   2> 2765459 INFO  (jetty-launcher-7865-thread-2) [    ] o.a.s.s.SolrDispatchFilter  ___      _       Welcome to Apache Solr? version 7.4.0
   [junit4]   2> 2765459 INFO  (jetty-launcher-7865-thread-2) [    ] o.a.s.s.SolrDispatchFilter / __| ___| |_ _   Starting in cloud mode on port null
   [junit4]   2> 2765459 INFO  (jetty-launcher-7865-thread-2) [    ] o.a.s.s.SolrDispatchFilter \__ \/ _ \ | '_|  Install dir: null
   [junit4]   2> 2765459 INFO  (jetty-launcher-7865-thread-2) [    ] o.a.s.s.SolrDispatchFilter |___/\___/_|_|    Start time: 2018-05-24T20:38:51.534Z
   [junit4]   2> 2765461 INFO  (zkConnectionManagerCallback-7870-thread-1) [    ] o.a.s.c.c.ConnectionManager zkClient has connected
   [junit4]   2> 2765462 INFO  (zkConnectionManagerCallback-7872-thread-1) [    ] o.a.s.c.c.ConnectionManager zkClient has connected
   [junit4]   2> 2765462 INFO  (jetty-launcher-7865-thread-1) [    ] o.a.s.s.SolrDispatchFilter solr.xml found in ZooKeeper. Loading...
   [junit4]   2> 2765463 INFO  (jetty-launcher-7865-thread-2) [    ] o.a.s.s.SolrDispatchFilter solr.xml found in ZooKeeper. Loading...
   [junit4]   2> 2765470 INFO  (jetty-launcher-7865-thread-1) [    ] o.a.s.c.ZkContainer Zookeeper client=127.0.0.1:58691/solr
   [junit4]   2> 2765472 INFO  (zkConnectionManagerCallback-7877-thread-1) [    ] o.a.s.c.c.ConnectionManager zkClient has connected
   [junit4]   2> 2765473 INFO  (jetty-launcher-7865-thread-2) [    ] o.a.s.c.ZkContainer Zookeeper client=127.0.0.1:58691/solr
   [junit4]   2> 2765475 INFO  (zkConnectionManagerCallback-7880-thread-1) [    ] o.a.s.c.c.ConnectionManager zkClient has connected
   [junit4]   2> 2765475 INFO  (zkConnectionManagerCallback-7882-thread-1) [    ] o.a.s.c.c.ConnectionManager zkClient has connected
   [junit4]   2> 2765481 INFO  (zkConnectionManagerCallback-7884-thread-1) [    ] o.a.s.c.c.ConnectionManager zkClient has connected
   [junit4]   2> 2765625 INFO  (jetty-launcher-7865-thread-1) [n:127.0.0.1:54194_solr    ] o.a.s.c.Overseer Overseer (id=null) closing
   [junit4]   2> 2765626 INFO  (jetty-launcher-7865-thread-1) [n:127.0.0.1:54194_solr    ] o.a.s.c.OverseerElectionContext I am going to be the leader 127.0.0.1:54194_solr
   [junit4]   2> 2765628 INFO  (jetty-launcher-7865-thread-1) [n:127.0.0.1:54194_solr    ] o.a.s.c.Overseer Overseer (id=72218892452429829-127.0.0.1:54194_solr-n_0000000000) starting
   [junit4]   2> 2765639 INFO  (zkConnectionManagerCallback-7893-thread-1) [    ] o.a.s.c.c.ConnectionManager zkClient has connected
   [junit4]   2> 2765640 INFO  (jetty-launcher-7865-thread-2) [n:127.0.0.1:38264_solr    ] o.a.s.c.Overseer Overseer (id=null) closing
   [junit4]   2> 2765641 INFO  (jetty-launcher-7865-thread-2) [n:127.0.0.1:38264_solr    ] o.a.s.c.ZkController Register node as live in ZooKeeper:/live_nodes/127.0.0.1:38264_solr
   [junit4]   2> 2765642 INFO  (jetty-launcher-7865-thread-1) [n:127.0.0.1:54194_solr    ] o.a.s.c.s.i.ZkClientClusterStateProvider Cluster at 127.0.0.1:58691/solr ready
   [junit4]   2> 2765643 INFO  (zkCallback-7892-thread-1) [    ] o.a.s.c.c.ZkStateReader Updated live nodes from ZooKeeper... (0) -> (1)
   [junit4]   2> 2765644 INFO  (zkCallback-7881-thread-1) [    ] o.a.s.c.c.ZkStateReader Updated live nodes from ZooKeeper... (0) -> (1)
   [junit4]   2> 2765644 DEBUG (OverseerAutoScalingTriggerThread-72218892452429829-127.0.0.1:54194_solr-n_0000000000) [    ] o.a.s.c.a.OverseerTriggerThread Adding .auto_add_replicas and .scheduled_maintenance triggers
   [junit4]   2> 2765645 INFO  (zkCallback-7883-thread-1) [    ] o.a.s.c.c.ZkStateReader Updated live nodes from ZooKeeper... (0) -> (1)
   [junit4]   2> 2765645 DEBUG (OverseerAutoScalingTriggerThread-72218892452429829-127.0.0.1:54194_solr-n_0000000000) [    ] o.a.s.c.a.OverseerTriggerThread Refreshing /autoscaling.json with znode version 1
   [junit4]   2> 2765646 DEBUG (OverseerAutoScalingTriggerThread-72218892452429829-127.0.0.1:54194_solr-n_0000000000) [    ] o.a.s.c.a.OverseerTriggerThread Current znodeVersion 1, lastZnodeVersion -1
   [junit4]   2> 2765646 DEBUG (OverseerAutoScalingTriggerThread-72218892452429829-127.0.0.1:54194_solr-n_0000000000) [    ] o.a.s.c.a.OverseerTriggerThread Processed trigger updates upto znodeVersion 1
   [junit4]   2> 2765647 INFO  (jetty-launcher-7865-thread-1) [n:127.0.0.1:54194_solr    ] o.a.s.c.TransientSolrCoreCacheDefault Allocating transient cache for 2147483647 transient cores
   [junit4]   2> 2765647 INFO  (jetty-launcher-7865-thread-1) [n:127.0.0.1:54194_solr    ] o.a.s.c.ZkController Register node as live in ZooKeeper:/live_nodes/127.0.0.1:54194_solr
   [junit4]   2> 2765649 INFO  (zkCallback-7881-thread-1) [    ] o.a.s.c.c.ZkStateReader Updated live nodes from ZooKeeper... (1) -> (2)
   [junit4]   2> 2765649 INFO  (zkCallback-7892-thread-1) [    ] o.a.s.c.c.ZkStateReader Updated live nodes from ZooKeeper... (1) -> (2)
   [junit4]   2> 2765649 INFO  (zkCallback-7883-thread-1) [    ] o.a.s.c.c.ZkStateReader Updated live nodes from ZooKeeper... (1) -> (2)
   [junit4]   2> 2765651 DEBUG (OverseerAutoScalingTriggerThread-72218892452429829-127.0.0.1:54194_solr-n_0000000000) [    ] o.a.s.c.a.NodeLostTrigger NodeLostTrigger .auto_add_replicas - Initial livenodes: [127.0.0.1:38264_solr, 127.0.0.1:54194_solr]
   [junit4]   2> 2765651 DEBUG (OverseerAutoScalingTriggerThread-72218892452429829-127.0.0.1:54194_solr-n_0000000000) [    ] o.a.s.c.a.OverseerTriggerThread -- clean old nodeAdded markers
   [junit4]   2> 2765652 DEBUG (OverseerAutoScalingTriggerThread-72218892452429829-127.0.0.1:54194_solr-n_0000000000) [    ] o.a.s.c.a.OverseerTriggerThread Current znodeVersion 1, lastZnodeVersion 1
   [junit4]   2> 2765653 DEBUG (ScheduledTrigger-12111-thread-1) [    ] o.a.s.c.a.NodeLostTrigger Running NodeLostTrigger: .auto_add_replicas with currently live nodes: 2
   [junit4]   2> 2766025 INFO  (jetty-launcher-7865-thread-1) [n:127.0.0.1:54194_solr    ] o.a.s.m.r.SolrJmxReporter JMX monitoring for 'solr_54194.solr.node' (registry 'solr.node') enabled at server: com.sun.jmx.mbeanserver.JmxMBeanServer@7b004bd8
   [junit4]   2> 2766029 INFO  (jetty-launcher-7865-thread-1) [n:127.0.0.1:54194_solr    ] o.a.s.m.r.SolrJmxReporter JMX monitoring for 'solr_54194.solr.jvm' (registry 'solr.jvm') enabled at server: com.sun.jmx.mbeanserver.JmxMBeanServer@7b004bd8
   [junit4]   2> 2766029 INFO  (jetty-launcher-7865-thread-1) [n:127.0.0.1:54194_solr    ] o.a.s.m.r.SolrJmxReporter JMX monitoring for 'solr_54194.solr.jetty' (registry 'solr.jetty') enabled at server: com.sun.jmx.mbeanserver.JmxMBeanServer@7b004bd8
   [junit4]   2> 2766030 INFO  (jetty-launcher-7865-thread-1) [n:127.0.0.1:54194_solr    ] o.a.s.c.CorePropertiesLocator Found 0 core definitions underneath /export/home/jenkins/workspace/Lucene-Solr-7.x-Solaris/solr/build/solr-core/test/J0/temp/solr.cloud.autoscaling.IndexSizeTriggerTest_495113D3FB1FEDD8-001/tempDir-001/node1/.
   [junit4]   2> 2766455 INFO  (jetty-launcher-7865-thread-2) [n:127.0.0.1:38264_solr    ] o.a.s.m.r.SolrJmxReporter JMX monitoring for 'solr_38264.solr.node' (registry 'solr.node') enabled at server: com.sun.jmx.mbeanserver.JmxMBeanServer@7b004bd8
   [junit4]   2> 2766458 INFO  (jetty-launcher-7865-thread-2) [n:127.0.0.1:38264_solr    ] o.a.s.m.r.SolrJmxReporter JMX monitoring for 'solr_38264.solr.jvm' (registry 'solr.jvm') enabled at server: com.sun.jmx.mbeanserver.JmxMBeanServer@7b004bd8
   [junit4]   2> 2766458 INFO  (jetty-launcher-7865-thread-2) [n:127.0.0.1:38264_solr    ] o.a.s.m.r.SolrJmxReporter JMX monitoring for 'solr_38264.solr.jetty' (registry 'solr.jetty') enabled at server: com.sun.jmx.mbeanserver.JmxMBeanServer@7b004bd8
   [junit4]   2> 2766458 INFO  (jetty-launcher-7865-thread-2) [n:127.0.0.1:38264_solr    ] o.a.s.c.CorePropertiesLocator Found 0 core definitions underneath /export/home/jenkins/workspace/Lucene-Solr-7.x-Solaris/solr/build/solr-core/test/J0/temp/solr.cloud.autoscaling.IndexSizeTriggerTest_495113D3FB1FEDD8-001/tempDir-001/node2/.
   [junit4]   2> 2766466 INFO  (zkConnectionManagerCallback-7898-thread-1) [    ] o.a.s.c.c.ConnectionManager zkClient has connected
   [junit4]   2> 2766468 INFO  (jetty-launcher-7865-thread-2) [n:127.0.0.1:38264_solr    ] o.a.s.c.c.ZkStateReader Updated live nodes from ZooKeeper... (0) -> (2)
   [junit4]   2> 2766469 INFO  (jetty-launcher-7865-thread-2) [n:127.0.0.1:38264_solr    ] o.a.s.c.s.i.ZkClientClusterStateProvider Cluster at 127.0.0.1:58691/solr ready
   [junit4]   2> 2766484 INFO  (zkConnectionManagerCallback-7900-thread-1) [    ] o.a.s.c.c.ConnectionManager zkClient has connected
   [junit4]   2> 2766488 INFO  (zkConnectionManagerCallback-7905-thread-1) [    ] o.a.s.c.c.ConnectionManager zkClient has connected
   [junit4]   2> 2766490 INFO  (SUITE-IndexSizeTriggerTest-seed#[495113D3FB1FEDD8]-worker) [    ] o.a.s.c.c.ZkStateReader Updated live nodes from ZooKeeper... (0) -> (2)
   [junit4]   2> 2766491 INFO  (SUITE-IndexSizeTriggerTest-seed#[495113D3FB1FEDD8]-worker) [    ] o.a.s.c.s.i.ZkClientClusterStateProvider Cluster at 127.0.0.1:58691/solr ready
   [junit4]   2> 2766512 INFO  (TEST-IndexSizeTriggerTest.testMergeIntegration-seed#[495113D3FB1FEDD8]) [    ] o.a.s.SolrTestCaseJ4 ###Starting testMergeIntegration
   [junit4]   2> 2766513 INFO  (qtp1042424275-28163) [n:127.0.0.1:38264_solr    ] o.a.s.h.a.CollectionsHandler Invoked Collection Action :create with params replicationFactor=2&collection.configName=conf&maxShardsPerNode=2&name=testMergeIntegration_collection&nrtReplicas=2&action=CREATE&numShards=2&wt=javabin&version=2 and sendToOCPQueue=true
   [junit4]   2> 2766516 INFO  (OverseerThreadFactory-12113-thread-1) [    ] o.a.s.c.a.c.CreateCollectionCmd Create collection testMergeIntegration_collection
   [junit4]   2> 2766628 INFO  (OverseerStateUpdate-72218892452429829-127.0.0.1:54194_solr-n_0000000000) [    ] o.a.s.c.o.SliceMutator createReplica() {
   [junit4]   2>   "operation":"ADDREPLICA",
   [junit4]   2>   "collection":"testMergeIntegration_collection",
   [junit4]   2>   "shard":"shard1",
   [junit4]   2>   "core":"testMergeIntegration_collection_shard1_replica_n1",
   [junit4]   2>   "state":"down",
   [junit4]   2>   "base_url":"http://127.0.0.1:54194/solr",
   [junit4]   2>   "type":"NRT",
   [junit4]   2>   "waitForFinalState":"false"} 
   [junit4]   2> 2766633 INFO  (OverseerStateUpdate-72218892452429829-127.0.0.1:54194_solr-n_0000000000) [    ] o.a.s.c.o.SliceMutator createReplica() {
   [junit4]   2>   "operation":"ADDREPLICA",
   [junit4]   2>   "collection":"testMergeIntegration_collection",
   [junit4]   2>   "shard":"shard1",
   [junit4]   2>   "core":"testMergeIntegration_collection_shard1_replica_n2",
   [junit4]   2>   "state":"down",
   [junit4]   2>   "base_url":"http://127.0.0.1:38264/solr",
   [junit4]   2>   "type":"NRT",
   [junit4]   2>   "waitForFinalState":"false"} 
   [junit4]   2> 2766638 INFO  (OverseerStateUpdate-72218892452429829-127.0.0.1:54194_solr-n_0000000000) [    ] o.a.s.c.o.SliceMutator createReplica() {
   [junit4]   2>   "operation":"ADDREPLICA",
   [junit4]   2>   "collection":"testMergeIntegration_collection",
   [junit4]   2>   "shard":"shard2",
   [junit4]   2>   "core":"testMergeIntegration_collection_shard2_replica_n4",
   [junit4]   2>   "state":"down",
   [junit4]   2>   "base_url":"http://127.0.0.1:54194/solr",
   [junit4]   2>   "type":"NRT",
   [junit4]   2>   "waitForFinalState":"false"} 
   [junit4]   2> 2766641 INFO  (OverseerStateUpdate-72218892452429829-127.0.0.1:54194_solr-n_0000000000) [    ] o.a.s.c.o.SliceMutator createReplica() {
   [junit4]   2>   "operation":"ADDREPLICA",
   [junit4]   2>   "collection":"testMergeIntegration_collection",
   [junit4]   2>   "shard":"shard2",
   [junit4]   2>   "core":"testMergeIntegration_collection_shard2_replica_n6",
   [junit4]   2>   "state":"down",
   [junit4]   2>   "base_url":"http://127.0.0.1:38264/solr",
   [junit4]   2>   "type":"NRT",
   [junit4]   2>   "waitForFinalState":"false"} 
   [junit4]   2> 2766654 DEBUG (ScheduledTrigger-12111-thread-4) [    ] o.a.s.c.a.NodeLostTrigger Running NodeLostTrigger: .auto_add_replicas with currently live nodes: 2
   [junit4]   2> 2766845 INFO  (qtp1042424275-28158) [n:127.0.0.1:38264_solr    x:testMergeIntegration_collection_shard1_replica_n2] o.a.s.h.a.CoreAdminOperation core create command qt=/admin/cores&coreNodeName=core_node5&collection.configName=conf&newCollection=true&name=testMergeIntegration_collection_shard1_replica_n2&action=CREATE&numShards=2&collection=testMergeIntegration_collection&shard=shard1&wt=javabin&version=2&replicaType=NRT
   [junit4]   2> 2766845 INFO  (qtp838236708-28155) [n:127.0.0.1:54194_solr    x:testMergeIntegration_collection_shard1_replica_n1] o.a.s.h.a.CoreAdminOperation core create command qt=/admin/cores&coreNodeName=core_node3&collection.configName=conf&newCollection=true&name=testMergeIntegration_collection_shard1_replica_n1&action=CREATE&numShards=2&collection=testMergeIntegration_collection&shard=shard1&wt=javabin&version=2&replicaType=NRT
   [junit4]   2> 2766846 INFO  (qtp1042424275-28158) [n:127.0.0.1:38264_solr    x:testMergeIntegration_collection_shard1_replica_n2] o.a.s.c.TransientSolrCoreCacheDefault Allocating transient cache for 2147483647 transient cores
   [junit4]   2> 2766846 INFO  (qtp838236708-28156) [n:127.0.0.1:54194_solr    x:testMergeIntegration_collection_shard2_replica_n4] o.a.s.h.a.CoreAdminOperation core create command qt=/admin/cores&coreNodeName=core_node7&collection.configName=conf&newCollection=true&name=testMergeIntegration_collection_shard2_replica_n4&action=CREATE&numShards=2&collection=testMergeIntegration_collection&shard=shard2&wt=javabin&version=2&replicaType=NRT
   [junit4]   2> 2766846 INFO  (qtp1042424275-28162) [n:127.0.0.1:38264_solr    x:testMergeIntegration_collection_shard2_replica_n6] o.a.s.h.a.CoreAdminOperation core create command qt=/admin/cores&coreNodeName=core_node8&collection.configName=conf&newCollection=true&name=testMergeIntegration_collection_shard2_replica_n6&action=CREATE&numShards=2&collection=testMergeIntegration_collection&shard=shard2&wt=javabin&version=2&replicaType=NRT
   [junit4]   2> 2767654 DEBUG (ScheduledTrigger-12111-thread-1) [    ] o.a.s.c.a.NodeLostTrigger Running NodeLostTrigger: .auto_add_replicas with currently live nodes: 2
   [junit4]   2> 2767866 INFO  (qtp1042424275-28158) [n:127.0.0.1:38264_solr c:testMergeIntegration_collection s:shard1 r:core_node5 x:testMergeIntegration_collection_shard1_replica_n2] o.a.s.c.SolrConfig Using Lucene MatchVersion: 7.4.0
   [junit4]   2> 2767867 INFO  (qtp1042424275-28162) [n:127.0.0.1:38264_solr c:testMergeIntegration_collection s:shard2 r:core_node8 x:testMergeIntegration_collection_shard2_replica_n6] o.a.s.c.SolrConfig Using Lucene MatchVersion: 7.4.0
   [junit4]   2> 2767867 INFO  (qtp838236708-28156) [n:127.0.0.1:54194_solr c:testMergeIntegration_collection s:shard2 r:core_node7 x:testMergeIntegration_collection_shard2_replica_n4] o.a.s.c.SolrConfig Using Lucene MatchVersion: 7.4.0
   [junit4]   2> 2767880 INFO  (qtp838236708-28155) [n:127.0.0.1:54194_solr c:testMergeIntegration_collection s:shard1 r:core_node3 x:testMergeIntegration_collection_shard1_replica_n1] o.a.s.c.SolrConfig Using Lucene MatchVersion: 7.4.0
   [junit4]   2> 2767880 INFO  (qtp1042424275-28162) [n:127.0.0.1:38264_solr c:testMergeIntegration_collection s:shard2 r:core_node8 x:testMergeIntegration_collection_shard2_replica_n6] o.a.s.s.IndexSchema [testMergeIntegration_collection_shard2_replica_n6] Schema name=minimal
   [junit4]   2> 2767880 INFO  (qtp1042424275-28158) [n:127.0.0.1:38264_solr c:testMergeIntegration_collection s:shard1 r:core_node5 x:testMergeIntegration_collection_shard1_replica_n2] o.a.s.s.IndexSchema [testMergeIntegration_collection_shard1_replica_n2] Schema name=minimal
   [junit4]   2> 2767882 INFO  (qtp1042424275-28158) [n:127.0.0.1:38264_solr c:testMergeIntegration_collection s:shard1 r:core_node5 x:testMergeIntegration_collection_shard1_replica_n2] o.a.s.s.IndexSchema Loaded schema minimal/1.1 with uniqueid field id
   [junit4]   2> 2767882 INFO  (qtp1042424275-28162) [n:127.0.0.1:38264_solr c:testMergeIntegration_collection s:shard2 r:core_node8 x:testMergeIntegration_collection_shard2_replica_n6] o.a.s.s.IndexSchema Loaded schema minimal/1.1 with uniqueid field id
   [junit4]   2> 2767882 INFO  (qtp1042424275-28158) [n:127.0.0.1:38264_solr c:testMergeIntegration_collection s:shard1 r:core_node5 x:testMergeIntegration_collection_shard1_replica_n2] o.a.s.c.CoreContainer Creating SolrCore 'testMergeIntegration_collection_shard1_replica_n2' using configuration from collection testMergeIntegration_collection, trusted=true
   [junit4]   2> 2767882 INFO  (qtp1042424275-28162) [n:127.0.0.1:38264_solr c:testMergeIntegration_collection s:shard2 r:core_node8 x:testMergeIntegration_collection_shard2_replica_n6] o.a.s.c.CoreContainer Creating SolrCore 'testMergeIntegration_collection_shard2_replica_n6' using configuration from collection testMergeIntegration_collection, trusted=true
   [junit4]   2> 2767883 INFO  (qtp1042424275-28158) [n:127.0.0.1:38264_solr c:testMergeIntegration_collection s:shard1 r:core_node5 x:testMergeIntegration_collection_shard1_replica_n2] o.a.s.m.r.SolrJmxReporter JMX monitoring for 'solr_38264.solr.core.testMergeIntegration_collection.shard1.replica_n2' (registry 'solr.core.testMergeIntegration_collection.shard1.replica_n2') enabled at server: com.sun.jmx.mbeanserver.JmxMBeanServer@7b004bd8
   [junit4]   2> 2767883 INFO  (qtp1042424275-28158) [n:127.0.0.1:38264_solr c:testMergeIntegration_collection s:shard1 r:core_node5 x:testMergeIntegration_collection_shard1_replica_n2] o.a.s.c.SolrCore solr.RecoveryStrategy.Builder
   [junit4]   2> 2767883 INFO  (qtp1042424275-28158) [n:127.0.0.1:38264_solr c:testMergeIntegration_collection s:shard1 r:core_node5 x:testMergeIntegration_collection_shard1_replica_n2] o.a.s.c.SolrCore [[testMergeIntegration_collection_shard1_replica_n2] ] Opening new SolrCore at [/export/home/jenkins/workspace/Lucene-Solr-7.x-Solaris/solr/build/solr-core/test/J0/temp/solr.cloud.autoscaling.IndexSizeTriggerTest_495113D3FB1FEDD8-001/tempDir-001/node2/testMergeIntegration_collection_shard1_replica_n2], dataDir=[/export/home/jenkins/workspace/Lucene-Solr-7.x-Solaris/solr/build/solr-core/test/J0/temp/solr.cloud.autoscaling.IndexSizeTriggerTest_495113D3FB1FEDD8-001/tempDir-001/node2/./testMergeIntegration_collection_shard1_replica_n2/data/]
   [junit4]   2> 2767884 INFO  (qtp838236708-28156) [n:127.0.0.1:54194_solr c:testMergeIntegration_collection s:shard2 r:core_node7 x:testMergeIntegration_collection_shard2_replica_n4] o.a.s.s.IndexSchema [testMergeIntegration_collection_shard2_replica_n4] Schema name=minimal
   [junit4]   2> 2767884 INFO  (qtp1042424275-28162) [n:127.0.0.1:38264_solr c:testMergeIntegration_collection s:shard2 r:core_node8 x:testMergeIntegration_collection_shard2_replica_n6] o.a.s.m.r.SolrJmxReporter JMX monitoring for 'solr_38264.solr.core.testMergeIntegration_collection.shard2.replica_n6' (registry 'solr.core.testMergeIntegration_collection.shard2.replica_n6') enabled at server: com.sun.jmx.mbeanserver.JmxMBeanServer@7b004bd8
   [junit4]   2> 2767884 INFO  (qtp1042424275-28162) [n:127.0.0.1:38264_solr c:testMergeIntegration_collection s:shard2 r:core_node8 x:testMergeIntegration_collection_shard2_replica_n6] o.a.s.c.SolrCore solr.RecoveryStrategy.Builder
   [junit4]   2> 2767884 INFO  (qtp1042424275-28162) [n:127.0.0.1:38264_solr c:testMergeIntegration_collection s:shard2 r:core_node8 x:testMergeIntegration_collection_shard2_replica_n6] o.a.s.c.SolrCore [[testMergeIntegration_collection_shard2_replica_n6] ] Opening new SolrCore at [/export/home/jenkins/workspace/Lucene-Solr-7.x-Solaris/solr/build/solr-core/test/J0/temp/solr.cloud.autoscaling.IndexSizeTriggerTest_495113D3FB1FEDD8-001/tempDir-001/node2/testMergeIntegration_collection_shard2_replica_n6], dataDir=[/export/home/jenkins/workspace/Lucene-Solr-7.x-Solaris/solr/build/solr-core/test/J0/temp/solr.cloud.autoscaling.IndexSizeTriggerTest_495113D3FB1FEDD8-001/tempDir-001/node2/./testMergeIntegration_collection_shard2_replica_n6/data/]
   [junit4]   2> 2767885 INFO  (qtp838236708-28156) [n:127.0.0.1:54194_solr c:testMergeIntegration_collection s:shard2 r:core_node7 x:testMergeIntegration_collection_shard2_replica_n4] o.a.s.s.IndexSchema Loaded schema minimal/1.1 with uniqueid field id
   [junit4]   2> 2767885 INFO  (qtp838236708-28156) [n:127.0.0.1:54194_solr c:testMergeIntegration_collection s:shard2 r:core_node7 x:testMergeIntegration_collection_shard2_replica_n4] o.a.s.c.CoreContainer Creating SolrCore 'testMergeIntegration_collection_shard2_replica_n4' using configuration from collection testMergeIntegration_collection, trusted=true
   [junit4]   2> 2767885 INFO  (qtp838236708-28156) [n:127.0.0.1:54194_solr c:testMergeIntegration_collection s:shard2 r:core_node7 x:testMergeIntegration_collection_shard2_replica_n4] o.a.s.m.r.SolrJmxReporter JMX monitoring for 'solr_54194.solr.core.testMergeIntegration_collection.shard2.replica_n4' (registry 'solr.core.testMergeIntegration_collection.shard2.replica_n4') enabled at server: com.sun.jmx.mbeanserver.JmxMBeanServer@7b004bd8
   [junit4]   2> 2767886 INFO  (qtp838236708-28156) [n:127.0.0.1:54194_solr c:testMergeIntegration_collection s:shard2 r:core_node7 x:testMergeIntegration_collection_shard2_replica_n4] o.a.s.c.SolrCore solr.RecoveryStrategy.Builder
   [junit4]   2> 2767886 INFO  (qtp838236708-28156) [n:127.0.0.1:54194_solr c:testMergeIntegration_collection s:shard2 r:core_node7 x:testMergeIntegration_collection_shard2_replica_n4] o.a.s.c.SolrCore [[testMergeIntegration_collection_shard2_replica_n4] ] Opening new SolrCore at [/export/home/jenkins/workspace/Lucene-Solr-7.x-Solaris/solr/build/solr-core/test/J0/temp/solr.cloud.autoscaling.IndexSizeTriggerTest_495113D3FB1FEDD8-001/tempDir-001/node1/testMergeIntegration_collection_shard2_replica_n4], dataDir=[/export/home/jenkins/workspace/Lucene-Solr-7.x-Solaris/solr/build/solr-core/test/J0/temp/solr.cloud.autoscaling.IndexSizeTriggerTest_495113D3FB1FEDD8-001/tempDir-001/node1/./testMergeIntegration_collection_shard2_replica_n4/data/]
   [junit4]   2> 2767895 INFO  (qtp838236708-28155) [n:127.0.0.1:54194_solr c:testMergeIntegration_collection s:shard1 r:core_node3 x:testMergeIntegration_collection_shard1_replica_n1] o.a.s.s.IndexSchema [testMergeIntegration_collection_shard1_replica_n1] Schema name=minimal
   [junit4]   2> 2767897 INFO  (qtp838236708-28155) [n:127.0.0.1:54194_solr c:testMergeIntegration_collection s:shard1 r:core_node3 x:testMergeIntegration_collection_shard1_replica_n1] o.a.s.s.IndexSchema Loaded schema minimal/1.1 with uniqueid field id
   [junit4]   2> 2767897 INFO  (qtp838236708-28155) [n:127.0.0.1:54194_solr c:testMergeIntegration_collection s:shard1 r:core_node3 x:testMergeIntegration_collection_shard1_replica_n1] o.a.s.c.CoreContainer Creating SolrCore 'testMergeIntegration_collection_shard1_replica_n1' using configuration from collection testMergeIntegration_collection, trusted=true
   [junit4]   2> 2767897 INFO  (qtp838236708-28155) [n:127.0.0.1:54194_solr c:testMergeIntegration_collection s:shard1 r:core_node3 x:testMergeIntegration_collection_shard1_replica_n1] o.a.s.m.r.SolrJmxReporter JMX monitoring for 'solr_54194.solr.core.testMergeIntegration_collection.shard1.replica_n1' (registry 'solr.core.testMergeIntegration_collection.shard1.replica_n1') enabled at server: com.sun.jmx.mbeanserver.JmxMBeanServer@7b004bd8
   [junit4]   2> 2767897 INFO  (qtp838236708-28155) [n:127.0.0.1:54194_solr c:testMergeIntegration_collection s:shard1 r:core_node3 x:testMergeIntegration_collection_shard1_replica_n1] o.a.s.c.SolrCore solr.RecoveryStrategy.Builder
   [junit4]   2> 2767897 INFO  (qtp838236708-28155) [n:127.0.0.1:54194_solr c:testMergeIntegration_collection s:shard1 r:core_node3 x:testMergeIntegration_collection_shard1_replica_n1] o.a.s.c.SolrCore [[testMergeIntegration_collection_shard1_replica_n1] ] Opening new SolrCore at [/export/home/jenkins/workspace/Lucene-Solr-7.x-Solaris/solr/build/solr-core/test/J0/temp/solr.cloud.autoscaling.IndexSizeTriggerTest_495113D3FB1FEDD8-001/tempDir-001/node1/testMergeIntegration_collection_shard1_replica_n1], dataDir=[/export/home/jenkins/workspace/Lucene-Solr-7.x-Solaris/solr/build/solr-core/test/J0/temp/solr.cloud.autoscaling.IndexSizeTriggerTest_495113D3FB1FEDD8-001/tempDir-001/node1/./testMergeIntegration_collection_shard1_replica_n1/data/]
   [junit4]   2> 2767942 INFO  (qtp1042424275-28162) [n:127.0.0.1:38264_solr c:testMergeIntegration_collection s:shard2 r:core_node8 x:testMergeIntegration_collection_shard2_replica_n6] o.a.s.u.UpdateHandler Using UpdateLog implementation: org.apache.solr.update.UpdateLog
   [junit4]   2> 2767942 INFO  (qtp1042424275-28162) [n:127.0.0.1:38264_solr c:testMergeIntegration_collection s:shard2 r:core_node8 x:testMergeIntegration_collection_shard2_replica_n6] o.a.s.u.UpdateLog Initializing UpdateLog: dataDir=null defaultSyncLevel=FLUSH numRecordsToKeep=100 maxNumLogsToKeep=10 numVersionBuckets=65536
   [junit4]   2> 2767943 INFO  (qtp1042424275-28162) [n:127.0.0.1:38264_solr c:testMergeIntegration_collection s:shard2 r:core_node8 x:testMergeIntegration_collection_shard2_replica_n6] o.a.s.u.CommitTracker Hard AutoCommit: disabled
   [junit4]   2> 2767943 INFO  (qtp1042424275-28162) [n:127.0.0.1:38264_solr c:testMergeIntegration_collection s:shard2 r:core_node8 x:testMergeIntegration_collection_shard2_replica_n6] o.a.s.u.CommitTracker Soft AutoCommit: disabled
   [junit4]   2> 2767944 INFO  (qtp1042424275-28162) [n:127.0.0.1:38264_solr c:testMergeIntegration_collection s:shard2 r:core_node8 x:testMergeIntegration_collection_shard2_replica_n6] o.a.s.s.SolrIndexSearcher Opening [Searcher@2e3b7e33[testMergeIntegration_collection_shard2_replica_n6] main]
   [junit4]   2> 2767946 INFO  (qtp1042424275-28162) [n:127.0.0.1:38264_solr c:testMergeIntegration_collection s:shard2 r:core_node8 x:testMergeIntegration_collection_shard2_replica_n6] o.a.s.r.ManagedResourceStorage Configured ZooKeeperStorageIO with znodeBase: /configs/conf
   [junit4]   2> 2767946 INFO  (qtp1042424275-28162) [n:127.0.0.1:38264_solr c:testMergeIntegration_collection s:shard2 r:core_node8 x:testMergeIntegration_collection_shard2_replica_n6] o.a.s.r.ManagedResourceStorage Loaded null at path _rest_managed.json using ZooKeeperStorageIO:path=/configs/conf
   [junit4]   2> 2767946 INFO  (qtp1042424275-28162) [n:127.0.0.1:38264_solr c:testMergeIntegration_collection s:shard2 r:core_node8 x:testMergeIntegration_collection_shard2_replica_n6] o.a.s.h.ReplicationHandler Commits will be reserved for 10000ms.
   [junit4]   2> 2767947 INFO  (qtp1042424275-28162) [n:127.0.0.1:38264_solr c:testMergeIntegration_collection s:shard2 r:core_node8 x:testMergeIntegration_collection_shard2_replica_n6] o.a.s.u.UpdateLog Could not find max version in index or recent updates, using new clock 1601379325990404096
   [junit4]   2> 2767952 INFO  (searcherExecutor-12119-thread-1-processing-n:127.0.0.1:38264_solr x:testMergeIntegration_collection_shard2_replica_n6 c:testMergeIntegration_collection s:shard2 r:core_node8) [n:127.0.0.1:38264_solr c:testMergeIntegration_collection s:shard2 r:core_node8 x:testMergeIntegration_collection_shard2_replica_n6] o.a.s.c.SolrCore [testMergeIntegration_collection_shard2_replica_n6] Registered new searcher Searcher@2e3b7e33[testMergeIntegration_collection_shard2_replica_n6] main{ExitableDirectoryReader(UninvertingDirectoryReader())}
   [junit4]   2> 2767955 INFO  (qtp1042424275-28158) [n:127.0.0.1:38264_solr c:testMergeIntegration_collection s:shard1 r:core_node5 x:testMergeIntegration_collection_shard1_replica_n2] o.a.s.u.UpdateHandler Using UpdateLog implementation: org.apache.solr.update.UpdateLog
   [junit4]   2> 2767955 INFO  (qtp1042424275-28158) [n:127.0.0.1:38264_solr c:testMergeIntegration_collection s:shard1 r:core_node5 x:testMergeIntegration_collection_shard1_replica_n2] o.a.s.u.UpdateLog Initializing UpdateLog: dataDir=null defaultSyncLevel=FLUSH numRecordsToKeep=100 maxNumLogsToKeep=10 numVersionBuckets=65536
   [junit4]   2> 2767956 INFO  (qtp1042424275-28158) [n:127.0.0.1:38264_solr c:testMergeIntegration_collection s:shard1 r:core_node5 x:testMergeIntegration_collection_shard1_replica_n2] o.a.s.u.CommitTracker Hard AutoCommit: disabled
   [junit4]   2> 2767956 INFO  (qtp1042424275-28158) [n:127.0.0.1:38264_solr c:testMergeIntegration_collection s:shard1 r:core_node5 x:testMergeIntegration_collection_shard1_replica_n2] o.a.s.u.CommitTracker Soft AutoCommit: disabled
   [junit4]   2> 2767957 INFO  (qtp1042424275-28158) [n:127.0.0.1:38264_solr c:testMergeIntegration_collection s:shard1 r:core_node5 x:testMergeIntegration_collection_shard1_replica_n2] o.a.s.s.SolrIndexSearcher Opening [Searcher@4a938779[testMergeIntegration_collection_shard1_replica_n2] main]
   [junit4]   2> 2767958 INFO  (qtp1042424275-28158) [n:127.0.0.1:38264_solr c:testMergeIntegration_collection s:shard1 r:core_node5 x:testMergeIntegration_collection_shard1_replica_n2] o.a.s.r.ManagedResourceStorage Configured ZooKeeperStorageIO with znodeBase: /configs/conf
   [junit4]   2> 2767959 INFO  (qtp1042424275-28158) [n:127.0.0.1:38264_solr c:testMergeIntegration_collection s:shard1 r:core_node5 x:testMergeIntegration_collection_shard1_replica_n2] o.a.s.r.ManagedResourceStorage Loaded null at path _rest_managed.json using ZooKeeperStorageIO:path=/configs/conf
   [junit4]   2> 2767959 INFO  (qtp1042424275-28162) [n:127.0.0.1:38264_solr c:testMergeIntegration_collection s:shard2 r:core_node8 x:testMergeIntegration_collection_shard2_replica_n6] o.a.s.c.ZkShardTerms Successful update of terms at /collections/testMergeIntegration_collection/terms/shard2 to Terms{values={core_node8=0}, version=0}
   [junit4]   2> 2767959 INFO  (qtp1042424275-28158) [n:127.0.0.1:38264_solr c:testMergeIntegration_collection s:shard1 r:core_node5 x:testMergeIntegration_collection_shard1_replica_n2] o.a.s.h.ReplicationHandler Commits will be reserved for 10000ms.
   [junit4]   2> 2767960 INFO  (qtp1042424275-28158) [n:127.0.0.1:38264_solr c:testMergeIntegration_collection s:shard1 r:core_node5 x:testMergeIntegration_collection_shard1_replica_n2] o.a.s.u.UpdateLog Could not find max version in index or recent updates, using new clock 1601379326005084160
   [junit4]   2> 2767961 INFO  (searcherExecutor-12118-thread-1-processing-n:127.0.0.1:38264_solr x:testMergeIntegration_collection_shard1_replica_n2 c:testMergeIntegration_collection s:shard1 r:core_node5) [n:127.0.0.1:38264_solr c:testMergeIntegration_collection s:shard1 r:core_node5 x:testMergeIntegration_collection_shard1_replica_n2] o.a.s.c.SolrCore [testMergeIntegration_collection_shard1_replica_n2] Registered new searcher Searcher@4a938779[testMergeIntegration_collection_shard1_replica_n2] main{ExitableDirectoryReader(UninvertingDirectoryReader())}
   [junit4]   2> 2767966 INFO  (qtp1042424275-28162) [n:127.0.0.1:38264_solr c:testMergeIntegration_collection s:shard2 r:core_node8 x:testMergeIntegration_collection_shard2_replica_n6] o.a.s.c.ShardLeaderElectionContext Waiting until we see more replicas up for shard shard2: total=2 found=1 timeoutin=9998ms
   [junit4]   2> 2767967 INFO  (qtp1042424275-28158) [n:127.0.0.1:38264_solr c:testMergeIntegration_collection s:shard1 r:core_node5 x:testMergeIntegration_collection_shard1_replica_n2] o.a.s.c.ZkShardTerms Successful update of terms at /collections/testMergeIntegration_collection/terms/shard1 to Terms{values={core_node5=0}, version=0}
   [junit4]   2> 2767969 INFO  (qtp838236708-28155) [n:127.0.0.1:54194_solr c:testMergeIntegration_collection s:shard1 r:core_node3 x:testMergeIntegration_collection_shard1_replica_n1] o.a.s.u.UpdateHandler Using UpdateLog implementation: org.apache.solr.update.UpdateLog
   [junit4]   2> 2767969 INFO  (qtp838236708-28155) [n:127.0.0.1:54194_solr c:testMergeIntegration_collection s:shard1 r:core_node3 x:testMergeIntegration_collection_shard1_replica_n1] o.a.s.u.UpdateLog Initializing UpdateLog: dataDir=null defaultSyncLevel=FLUSH numRecordsToKeep=100 maxNumLogsToKeep=10 numVersionBuckets=65536
   [junit4]   2> 2767969 INFO  (qtp838236708-28155) [n:127.0.0.1:54194_solr c:testMergeIntegration_collection s:shard1 r:core_node3 x:testMergeIntegration_collection_shard1_replica_n1] o.a.s.u.CommitTracker Hard AutoCommit: disabled
   [junit4]   2> 2767969 INFO  (qtp838236708-28155) [n:127.0.0.1:54194_solr c:testMergeIntegration_collection s:shard1 r:core_node3 x:testMergeIntegration_collection_shard1_replica_n1] o.a.s.u.CommitTracker Soft AutoCommit: disabled
   [junit4]   2> 2767970 INFO  (qtp838236708-28155) [n:127.0.0.1:54194_solr c:testMergeIntegration_collection s:shard1 r:core_node3 x:testMergeIntegration_collection_shard1_replica_n1] o.a.s.s.SolrIndexSearcher Opening [Searcher@5a50852c[testMergeIntegration_collection_shard1_replica_n1] main]
   [junit4]   2> 2767972 INFO  (qtp838236708-28156) [n:127.0.0.1:54194_solr c:testMergeIntegration_collection s:shard2 r:core_node7 x:testMergeIntegration_collection_shard2_replica_n4] o.a.s.u.UpdateHandler Using UpdateLog implementation: org.apache.solr.update.UpdateLog
   [junit4]   2> 2767972 INFO  (qtp838236708-28156) [n:127.0.0.1:54194_solr c:testMergeIntegration_collection s:shard2 r:core_node7 x:testMergeIntegration_collection_shard2_replica_n4] o.a.s.u.UpdateLog Initializing UpdateLog: dataDir=null defaultSyncLevel=FLUSH numRecordsToKeep=100 maxNumLogsToKeep=10 numVersionBuckets=65536
   [junit4]   2> 2767972 INFO  (qtp838236708-28155) [n:127.0.0.1:54194_solr c:testMergeIntegration_collection s:shard1 r:core_node3 x:testMergeIntegration_collection_shard1_replica_n1] o.a.s.r.ManagedResourceStorage Configured ZooKeeperStorageIO with znodeBase: /configs/conf
   [junit4]   2> 2767972 INFO  (qtp838236708-28155) [n:127.0.0.1:54194_solr c:testMergeIntegration_collection s:shard1 r:core_node3 x:testMergeIntegration_collection_shard1_replica_n1] o.a.s.r.ManagedResourceStorage Loaded null at path _rest_managed.json using ZooKeeperStorageIO:path=/configs/conf
   [junit4]   2> 2767973 INFO  (qtp1042424275-28158) [n:127.0.0.1:38264_solr c:testMergeIntegration_collection s:shard1 r:core_node5 x:testMergeIntegration_collection_shard1_replica_n2] o.a.s.c.ShardLeaderElectionContext Waiting until we see more replicas up for shard shard1: total=2 found=1 timeoutin=9999ms
   [junit4]   2> 2767973 INFO  (qtp838236708-28156) [n:127.0.0.1:54194_solr c:testMergeIntegration_collection s:shard2 r:core_node7 x:testMergeIntegration_collection_shard2_replica_n4] o.a.s.u.CommitTracker Hard AutoCommit: disabled
   [junit4]   2> 2767974 INFO  (qtp838236708-28156) [n:127.0.0.1:54194_solr c:testMergeIntegration_collection s:shard2 r:core_node7 x:testMergeIntegration_collection_shard2_replica_n4] o.a.s.u.CommitTracker Soft AutoCommit: disabled
   [junit4]   2> 2767974 INFO  (qtp838236708-28155) [n:127.0.0.1:54194_solr c:testMergeIntegration_collection s:shard1 r:core_node3 x:testMergeIntegration_collection_shard1_replica_n1] o.a.s.h.ReplicationHandler Commits will be reserved for 10000ms.
   [junit4]   2> 2767974 INFO  (qtp838236708-28155) [n:127.0.0.1:54194_solr c:testMergeIntegration_collection s:shard1 r:core_node3 x:testMergeIntegration_collection_shard1_replica_n1] o.a.s.u.UpdateLog Could not find max version in index or recent updates, using new clock 1601379326019764224
   [junit4]   2> 2767974 INFO  (qtp838236708-28156) [n:127.0.0.1:54194_solr c:testMergeIntegration_collection s:shard2 r:core_node7 x:testMergeIntegration_collection_shard2_replica_n4] o.a.s.s.SolrIndexSearcher Opening [Searcher@3c700bcd[testMergeIntegration_collection_shard2_replica_n4] main]
   [junit4]   2> 2767974 INFO  (searcherExecutor-12121-thread-1-processing-n:127.0.0.1:54194_solr x:testMergeIntegration_collection_shard1_replica_n1 c:testMergeIntegration_collection s:shard1 r:core_node3) [n:127.0.0.1:54194_solr c:testMergeIntegration_collection s:shard1 r:core_node3 x:testMergeIntegration_collection_shard1_replica_n1] o.a.s.c.SolrCore [testMergeIntegration_collection_shard1_replica_n1] Registered new searcher Searcher@5a50852c[testMergeIntegration_collection_shard1_replica_n1] main{ExitableDirectoryReader(UninvertingDirectoryReader())}
   [junit4]   2> 2767976 INFO  (qtp838236708-28156) [n:127.0.0.1:54194_solr c:testMergeIntegration_collection s:shard2 r:core_node7 x:testMergeIntegration_collection_shard2_replica_n4] o.a.s.r.ManagedResourceStorage Configured ZooKeeperStorageIO with znodeBase: /configs/conf
   [junit4]   2> 2767976 INFO  (qtp838236708-28156) [n:127.0.0.1:54194_solr c:testMergeIntegration_collection s:shard2 r:core_node7 x:testMergeIntegration_collection_shard2_replica_n4] o.a.s.r.ManagedResourceStorage Loaded null at path _rest_managed.json using ZooKeeperStorageIO:path=/configs/conf
   [junit4]   2> 2767977 INFO  (qtp838236708-28156) [n:127.0.0.1:54194_solr c:testMergeIntegration_collection s:shard2 r:core_node7 x:testMergeIntegration_collection_shard2_replica_n4] o.a.s.h.ReplicationHandler Commits will be reserved for 10000ms.
   [junit4]   2> 2767977 INFO  (qtp838236708-28156) [n:127.0.0.1:54194_solr c:testMergeIntegration_collection s:shard2 r:core_node7 x:testMergeIntegration_collection_shard2_replica_n4] o.a.s.u.UpdateLog Could not find max version in index or recent updates, using new clock 1601379326022909952
   [junit4]   2> 2767979 INFO  (searcherExecutor-12120-thread-1-processing-n:127.0.0.1:54194_solr x:testMergeIntegration_collection_shard2_replica_n4 c:testMergeIntegration_collection s:shard2 r:core_node7) [n:127.0.0.1:54194_solr c:testMergeIntegration_collection s:shard2 r:core_node7 x:testMergeIntegration_collection_shard2_replica_n4] o.a.s.c.SolrCore [testMergeIntegration_collection_shard2_replica_n4] Registered new searcher Searcher@3c700bcd[testMergeIntegration_collection_shard2_replica_n4] main{ExitableDirectoryReader(UninvertingDirectoryReader())}
   [junit4]   2> 2767979 INFO  (qtp838236708-28155) [n:127.0.0.1:54194_solr c:testMergeIntegration_collection s:shard1 r:core_node3 x:testMergeIntegration_collection_shard1_replica_n1] o.a.s.c.ZkShardTerms Successful update of terms at /collections/testMergeIntegration_collection/terms/shard1 to Terms{values={core_node3=0, core_node5=0}, version=1}
   [junit4]   2> 2767983 INFO  (qtp838236708-28156) [n:127.0.0.1:54194_solr c:testMergeIntegration_collection s:shard2 r:core_node7 x:testMergeIntegration_collection_shard2_replica_n4] o.a.s.c.ZkShardTerms Successful update of terms at /collections/testMergeIntegration_collection/terms/shard2 to Terms{values={core_node7=0, core_node8=0}, version=1}
   [junit4]   2> 2768469 INFO  (qtp1042424275-28162) [n:127.0.0.1:38264_solr c:testMergeIntegration_collection s:shard2 r:core_node8 x:testMergeIntegration_collection_shard2_replica_n6] o.a.s.c.ShardLeaderElectionContext Enough replicas found to continue.
   [junit4]   2> 2768469 INFO  (qtp1042424275-28162) [n:127.0.0.1:38264_solr c:testMergeIntegration_collection s:shard2 r:core_node8 x:testMergeIntegration_collection_shard2_replica_n6] o.a.s.c.ShardLeaderElectionContext I may be the new leader - try and sync
   [junit4]   2> 2768469 INFO  (qtp1042424275-28162) [n:127.0.0.1:38264_solr c:testMergeIntegration_collection s:shard2 r:core_node8 x:testMergeIntegration_collection_shard2_replica_n6] o.a.s.c.SyncStrategy Sync replicas to http://127.0.0.1:38264/solr/testMergeIntegration_collection_shard2_replica_n6/
   [junit4]   2> 2768470 INFO  (qtp1042424275-28162) [n:127.0.0.1:38264_solr c:testMergeIntegration_collection s:shard2 r:core_node8 x:testMergeIntegration_collection_shard2_replica_n6] o.a.s.u.PeerSync PeerSync: core=testMergeIntegration_collection_shard2_replica_n6 url=http://127.0.0.1:38264/solr START replicas=[http://127.0.0.1:54194/solr/testMergeIntegration_collection_shard2_replica_n4/] nUpdates=100
   [junit4]   2> 2768471 INFO  (qtp838236708-28150) [n:127.0.0.1:54194_solr c:testMergeIntegration_collection s:shard2 r:core_node7 x:testMergeIntegration_collection_shard2_replica_n4] o.a.s.c.S.Request [testMergeIntegration_collection_shard2_replica_n4]  webapp=/solr path=/get params={distrib=false&qt=/get&fingerprint=false&getVersions=100&wt=javabin&version=2} status=0 QTime=0
   [junit4]   2> 2768476 INFO  (qtp1042424275-28158) [n:127.0.0.1:38264_solr c:testMergeIntegration_collection s:shard1 r:core_node5 x:testMergeIntegration_collection_shard1_replica_n2] o.a.s.c.ShardLeaderElectionContext Enough replicas found to continue.
   [junit4]   2> 2768476 INFO  (qtp1042424275-28158) [n:127.0.0.1:38264_solr c:testMergeIntegration_collection s:shard1 r:core_node5 x:testMergeIntegration_collection_shard1_replica_n2] o.a.s.c.ShardLeaderElectionContext I may be the new leader - try and sync
   [junit4]   2> 2768476 INFO  (qtp1042424275-28158) [n:127.0.0.1:38264_solr c:testMergeIntegration_collection s:shard1 r:core_node5 x:testMergeIntegration_collection_shard1_replica_n2] o.a.s.c.SyncStrategy Sync replicas to http://127.0.0.1:38264/solr/testMergeIntegration_collection_shard1_replica_n2/
   [junit4]   2> 2768476 INFO  (qtp1042424275-28158) [n:127.0.0.1:38264_solr c:testMergeIntegration_collection s:shard1 r:core_node5 x:testMergeIntegration_collection_shard1_replica_n2] o.a.s.u.PeerSync PeerSync: core=testMergeIntegration_collection_shard1_replica_n2 url=http://127.0.0.1:38264/solr START replicas=[http://127.0.0.1:54194/solr/testMergeIntegration_collection_shard1_replica_n1/] nUpdates=100
   [junit4]   2> 2768477 INFO  (qtp838236708-28154) [n:127.0.0.1:54194_solr c:testMergeIntegration_collection s:shard1 r:core_node3 x:testMergeIntegration_collection_shard1_replica_n1] o.a.s.c.S.Request [testMergeIntegration_collection_shard1_replica_n1]  webapp=/solr path=/get params={distrib=false&qt=/get&fingerprint=false&getVersions=100&wt=javabin&version=2} status=0 QTime=0
   [junit4]   2> 2768655 DEBUG (ScheduledTrigger-12111-thread-4) [    ] o.a.s.c.a.NodeLostTrigger Running NodeLostTrigger: .auto_add_replicas with currently live nodes: 2
   [junit4]   2> 2768774 INFO  (qtp1042424275-28162) [n:127.0.0.1:38264_solr c:testMergeIntegration_collection s:shard2 r:core_node8 x:testMergeIntegration_collection_shard2_replica_n6] o.a.s.u.PeerSync PeerSync: core=testMergeIntegration_collection_shard2_replica_n6 url=http://127.0.0.1:38264/solr DONE.  We have no versions.  sync failed.
   [junit4]   2> 2768775 INFO  (qtp1042424275-28162) [n:127.0.0.1:38264_solr c:testMergeIntegration_collection s:shard2 r:core_node8 x:testMergeIntegration_collection_shard2_replica_n6] o.a.s.c.SyncStrategy Leader's attempt to sync with shard failed, moving to the next candidate
   [junit4]   2> 2768775 INFO  (qtp1042424275-28162) [n:127.0.0.1:38264_solr c:testMergeIntegration_collection s:shard2 r:core_node8 x:testMergeIntegration_collection_shard2_replica_n6] o.a.s.c.ShardLeaderElectionContext We failed sync, but we have no versions - we can't sync in that case - we were active before, so become leader anyway
   [junit4]   2> 2768775 INFO  (qtp1042424275-28162) [n:127.0.0.1:38264_solr c:testMergeIntegration_collection s:shard2 r:core_node8 x:testMergeIntegration_collection_shard2_replica_n6] o.a.s.c.ShardLeaderElectionContext Found all replicas participating in election, clear LIR
   [junit4]   2> 2768777 INFO  (qtp1042424275-28158) [n:127.0.0.1:38264_solr c:testMergeIntegration_collection s:shard1 r:core_node5 x:testMergeIntegration_collection_shard1_replica_n2] o.a.s.u.PeerSync PeerSync: core=testMergeIntegration_collection_shard1_replica_n2 url=http://127.0.0.1:38264/solr DONE.  We have no versions.  sync failed.
   [junit4]   2> 2768777 INFO  (qtp1042424275-28158) [n:127.0.0.1:38264_solr c:testMergeIntegration_collection s:shard1 r:core_node5 x:testMergeIntegration_collection_shard1_replica_n2] o.a.s.c.SyncStrategy Leader's attempt to sync with shard failed, moving to the next candidate
   [junit4]   2> 2768777 INFO  (qtp1042424275-28158) [n:127.0.0.1:38264_solr c:testMergeIntegration_collection s:shard1 r:core_node5 x:testMergeIntegration_collection_shard1_replica_n2] o.a.s.c.ShardLeaderElectionContext We failed sync, but we have no versions - we can't sync in that case - we were active before, so become leader anyway
   [junit4]   2> 2768777 INFO  (qtp1042424275-28158) [n:127.0.0.1:38264_solr c:testMergeIntegration_collection s:shard1 r:core_node5 x:testMergeIntegration_collection_shard1_replica_n2] o.a.s.c.ShardLeaderElectionContext Found all replicas participating in election, clear LIR
   [junit4]   2> 2768781 INFO  (qtp1042424275-28162) [n:127.0.0.1:38264_solr c:testMergeIntegration_collection s:shard2 r:core_node8 x:testMergeIntegration_collection_shard2_replica_n6] o.a.s.c.ShardLeaderElectionContext I am the new leader: http://127.0.0.1:38264/solr/testMergeIntegration_collection_shard2_replica_n6/ shard2
   [junit4]   2> 2768783 INFO  (qtp1042424275-28158) [n:127.0.0.1:38264_solr c:testMergeIntegration_collection s:shard1 r:core_node5 x:testMergeIntegration_collection_shard1_replica_n2] o.a.s.c.ShardLeaderElectionContext I am the new leader: http://127.0.0.1:38264/solr/testMergeIntegration_collection_shard1_replica_n2/ shard1
   [junit4]   2> 2768887 INFO  (qtp1042424275-28158) [n:127.0.0.1:38264_solr c:testMergeIntegration_collection s:shard1 r:core_node5 x:testMergeIntegration_collection_shard1_replica_n2] o.a.s.c.ZkController I am the leader, no recovery necessary
   [junit4]   2> 2768889 INFO  (qtp1042424275-28158) [n:127.0.0.1:38264_solr c:testMergeIntegration_collection s:shard1 r:core_node5 x:testMergeIntegration_collection_shard1_replica_n2] o.a.s.s.HttpSolrCall [admin] webapp=null path=/admin/cores params={qt=/admin/cores&coreNodeName=core_node5&collection.configName=conf&newCollection=true&name=testMergeIntegration_collection_shard1_replica_n2&action=CREATE&numShards=2&collection=testMergeIntegration_collection&shard=shard1&wt=javabin&version=2&replicaType=NRT} status=0 QTime=2045
   [junit4]   2> 2768934 INFO  (qtp1042424275-28162) [n:127.0.0.1:38264_solr c:testMergeIntegration_collection s:shard2 r:core_node8 x:testMergeIntegration_collection_shard2_replica_n6] o.a.s.c.ZkController I am the leader, no recovery necessary
   [junit4]   2> 2768937 INFO  (qtp1042424275-28162) [n:127.0.0.1:38264_solr c:testMergeIntegration_collection s:shard2 r:core_node8 x:testMergeIntegration_collection_shard2_replica_n6] o.a.s.s.HttpSolrCall [admin] webapp=null path=/admin/cores params={qt=/admin/cores&coreNodeName=core_node8&collection.configName=conf&newCollection=true&name=testMergeIntegration_collection_shard2_replica_n6&action=CREATE&numShards=2&collection=testMergeIntegration_collection&shard=shard2&wt=javabin&version=2&replicaType=NRT} status=0 QTime=2091
   [junit4]   2> 2768989 INFO  (qtp838236708-28155) [n:127.0.0.1:54194_solr c:testMergeIntegration_collection s:shard1 r:core_node3 x:testMergeIntegration_collection_shard1_replica_n1] o.a.s.s.HttpSolrCall [admin] webapp=null path=/admin/cores params={qt=/admin/cores&coreNodeName=core_node3&collection.configName=conf&newCollection=true&name=testMergeIntegration_collection_shard1_replica_n1&action=CREATE&numShards=2&collection=testMergeIntegration_collection&shard=shard1&wt=javabin&version=2&replicaType=NRT} status=0 QTime=2145
   [junit4]   2> 2768992 INFO  (qtp838236708-28156) [n:127.0.0.1:54194_solr c:testMergeIntegration_collection s:shard2 r:core_node7 x:testMergeIntegration_collection_shard2_replica_n4] o.a.s.s.HttpSolrCall [admin] webapp=null path=/admin/cores params={qt=/admin/cores&coreNodeName=core_node7&collection.configName=conf&newCollection=true&name=testMergeIntegration_collection_shard2_replica_n4&action=CREATE&numShards=2&collection=testMergeIntegration_collection&shard=shard2&wt=javabin&version=2&replicaType=NRT} status=0 QTime=2147
   [junit4]   2> 2768995 INFO  (qtp1042424275-28163) [n:127.0.0.1:38264_solr    ] o.a.s.h.a.CollectionsHandler Wait for new collection to be active for at most 30 seconds. Check all shard replicas
   [junit4]   2> 2769094 INFO  (zkCallback-7881-thread-1) [    ] o.a.s.c.c.ZkStateReader A cluster state change: [WatchedEvent state:SyncConnected type:NodeDataChanged path:/collections/testMergeIntegration_collection/state.json] for collection [testMergeIntegration_collection] has occurred - updating... (live nodes size: [2])
   [junit4]   2> 2769094 INFO  (zkCallback-7883-thread-2) [    ] o.a.s.c.c.ZkStateReader A cluster state change: [WatchedEvent state:SyncConnected type:NodeDataChanged path:/collections/testMergeIntegration_collection/state.json] for collection [testMergeIntegration_collection] has occurred - updating... (live nodes size: [2])
   [junit4]   2> 2769658 DEBUG (ScheduledTrigger-12111-thread-4) [    ] o.a.s.c.a.NodeLostTrigger Running NodeLostTrigger: .auto_add_replicas with currently live nodes: 2
   [junit4]   2> 2770005 INFO  (qtp1042424275-28163) [n:127.0.0.1:38264_solr    ] o.a.s.s.HttpSolrCall [admin] webapp=null path=/admin/collections params={replicationFactor=2&collection.configName=conf&maxShardsPerNode=2&name=testMergeIntegration_collection&nrtReplicas=2&action=CREATE&numShards=2&wt=javabin&version=2} status=0 QTime=3492
   [junit4]   2> 2770011 INFO  (qtp1042424275-28159) [n:127.0.0.1:38264_solr c:testMergeIntegration_collection s:shard1 r:core_node5 x:testMergeIntegration_collection_shard1_replica_n2] o.a.s.c.ZkShardTerms Successful update of terms at /collections/testMergeIntegration_collection/terms/shard1 to Terms{values={core_node3=1, core_node5=1}, version=2}
   [junit4]   2> 2770012 INFO  (qtp838236708-28153) [n:127.0.0.1:54194_solr c:testMergeIntegration_collection s:shard1 r:core_node3 x:testMergeIntegration_collection_shard1_replica_n1] o.a.s.u.p.LogUpdateProcessorFactory [testMergeIntegration_collection_shard1_replica_n1]  webapp=/solr path=/update params={update.distrib=FROMLEADER&distrib.from=http://127.0.0.1:38264/solr/testMergeIntegration_collection_shard1_replica_n2/&wt=javabin&version=2}{add=[id-0 (1601379328153616384)]} 0 0
   [junit4]   2> 2770012 INFO  (qtp1042424275-28159) [n:127.0.0.1:38264_solr c:testMergeIntegration_collection s:shard1 r:core_node5 x:testMergeIntegration_collection_shard1_replica_n2] o.a.s.u.p.LogUpdateProcessorFactory [testMergeIntegration_collection_shard1_replica_n2]  webapp=/solr path=/update params={wt=javabin&version=2}{add=[id-0 (1601379328153616384)]} 0 4
   [junit4]   2> 2770014 INFO  (qtp838236708-28154) [n:127.0.0.1:54194_solr c:testMergeIntegration_collection s:shard1 r:core_node3 x:testMergeIntegration_collection_shard1_replica_n1] o.a.s.u.p.LogUpdateProcessorFactory [testMergeIntegration_collection_shard1_replica_n1]  webapp=/solr path=/update params={update.distrib=FROMLEADER&distrib.from=http://127.0.0.1:38264/solr/testMergeIntegration_collection_shard1_replica_n2/&wt=javabin&version=2}{add=[id-100 (1601379328157810688)]} 0 0
   [junit4]   2> 2770014 INFO  (qtp1042424275-28162) [n:127.0.0.1:38264_solr c:testMergeIntegration_collection s:shard1 r:core_node5 x:testMergeIntegration_collection_shard1_replica_n2] o.a.s.u.p.LogUpdateProcessorFactory [testMergeIntegration_collection_shard1_replica_n2]  webapp=/solr path=/update params={wt=javabin&version=2}{add=[id-100 (1601379328157810688)]} 0 0
   [junit4]   2> 2770015 INFO  (qtp838236708-28153) [n:127.0.0.1:54194_solr c:testMergeIntegration_collection s:shard1 r:core_node3 x:testMergeIntegration_collection_shard1_replica_n1] o.a.s.u.p.LogUpdateProcessorFactory [testMergeIntegration_collection_shard1_replica_n1]  webapp=/solr path=/update params={update.distrib=FROMLEADER&distrib.from=http://127.0.0.1:38264/solr/testMergeIntegration_collection_shard1_replica_n2/&wt=javabin&version=2}{add=[id-200 (1601379328159907840)]} 0 0
   [junit4]   2> 2770016 INFO  (qtp1042424275-28159) [n:127.0.0.1:38264_solr c:testMergeIntegration_collection s:shard1 r:core_node5 x:testMergeIntegration_collection_shard1_replica_n2] o.a.s.u.p.LogUpdateProcessorFactory [testMergeIntegration_collection_shard1_replica_n2]  webapp=/solr path=/update params={wt=javabin&version=2}{add=[id-200 (1601379328159907840)]} 0 0
   [junit4]   2> 2770017 INFO  (qtp838236708-28154) [n:127.0.0.1:54194_solr c:testMergeIntegration_collection s:shard1 r:core_node3 x:testMergeIntegration_collection_shard1_replica_n1] o.a.s.u.p.LogUpdateProcessorFactory [testMergeIntegration_collection_shard1_replica_n1]  webapp=/solr path=/update params={update.distrib=FROMLEADER&distrib.from=http://127.0.0.1:38264/solr/testMergeIntegration_collection_shard1_replica_n2/&wt=javabin&version=2}{add=[id-300 (1601379328160956416)]} 0 0
   [junit4]   2> 2770017 INFO  (qtp1042424275-28162) [n:127.0.0.1:38264_solr c:testMergeIntegration_collection s:shard1 r:core_node5 x:testMergeIntegration_collection_shard1_replica_n2] o.a.s.u.p.LogUpdateProcessorFactory [testMergeIntegration_collection_shard1_replica_n2]  webapp=/solr path=/update params={wt=javabin&version=2}{add=[id-300 (1601379328160956416)]} 0 0
   [junit4]   2> 2770017 INFO  (qtp838236708-28153) [n:127.0.0.1:54194_solr c:testMergeIntegration_collection s:shard1 r:core_node3 x:testMergeIntegration_collection_shard1_replica_n1] o.a.s.u.p.LogUpdateProcessorFactory [testMergeIntegration_collection_shard1_replica_n1]  webapp=/solr path=/update params={update.distrib=FROMLEADER&distrib.from=http://127.0.0.1:38264/solr/testMergeIntegration_collection_shard1_replica_n2/&wt=javabin&version=2}{add=[id-400 (1601379328162004992)]} 0 0
   [junit4]   2> 2770018 INFO  (qtp1042424275-28159) [n:127.0.0.1:38264_solr c:testMergeIntegration_collection s:shard1 r:core_node5 x:testMergeIntegration_collection_shard1_replica_n2] o.a.s.u.p.LogUpdateProcessorFactory [testMergeIntegration_collection_shard1_replica_n2]  webapp=/solr path=/update params={wt=javabin&version=2}{add=[id-400 (1601379328162004992)]} 0 0
   [junit4]   2> 2770019 INFO  (qtp1042424275-28162) [n:127.0.0.1:38264_solr c:testMergeIntegration_collection s:shard2 r:core_node8 x:testMergeIntegration_collection_shard2_replica_n6] o.a.s.c.ZkShardTerms Successful update of terms at /collections/testMergeIntegration_collection/terms/shard2 to Terms{values={core_node7=1, core_node8=1}, version=2}
   [junit4]   2> 2770020 INFO  (qtp838236708-28154) [n:127.0.0.1:54194_solr c:testMergeIntegration_collection s:shard2 r:core_node7 x:testMergeIntegration_collection_shard2_replica_n4] o.a.s.u.p.LogUpdateProcessorFactory [testMergeIntegration_collection_shard2_replica_n4]  webapp=/solr path=/update params={update.distrib=FROMLEADER&distrib.from=http://127.0.0.1:38264/solr/testMergeIntegration_collection_shard2_replica_n6/&wt=javabin&version=2}{add=[id-500 (1601379328163053568)]} 0 0
   [junit4]   2> 2770020 INFO  (qtp1042424275-28162) [n:127.0.0.1:38264_solr c:testMergeIntegration_collection s:shard2 r:core_node8 x:testMergeIntegration_collection_shard2_replica_n6] o.a.s.u.p.LogUpdateProcessorFactory [testMergeIntegration_collection_shard2_replica_n6]  webapp=/solr path=/update params={wt=javabin&version=2}{add=[id-500 (1601379328163053568)]} 0 1
   [junit4]   2> 2770021 INFO  (qtp838236708-28153) [n:127.0.0.1:54194_solr c:testMergeIntegration_collection s:shard2 r:core_node7 x:testMergeIntegration_collection_shard2_replica_n4] o.a.s.u.p.LogUpdateProcessorFactory [testMergeIntegration_collection_shard2_replica_n4]  webapp=/solr path=/update params={update.distrib=FROMLEADER&distrib.from=http://127.0.0.1:38264/solr/testMergeIntegration_collection_shard2_replica_n6/&wt=javabin&version=2}{add=[id-600 (1601379328166199296)]} 0 0
   [junit4]   2> 2770021 INFO  (qtp1042424275-28159) [n:127.0.0.1:38264_solr c:testMergeIntegration_collection s:shard2 r:core_node8 x:testMergeIntegration_collection_shard2_replica_n6] o.a.s.u.p.LogUpdateProcessorFactory [testMergeIntegration_collection_shard2_replica_n6]  webapp=/solr path=/update params={wt=javabin&version=2}{add=[id-600 (1601379328166199296)]} 0 0
   [junit4]   2> 2770022 INFO  (qtp838236708-28154) [n:127.0.0.1:54194_solr c:testMergeIntegration_collection s:shard2 r:core_node7 x:testMergeIntegration_collection_shard2_replica_n4] o.a.s.u.p.LogUpdateProcessorFactory [testMergeIntegration_collection_shard2_replica_n4]  webapp=/solr path=/update params={update.distrib=FROMLEADER&distrib.from=http://127.0.0.1:38264/solr/testMergeIntegration_collection_shard2_replica_n6/&wt=javabin&version=2}{add=[id-700 (1601379328167247872)]} 0 0
   [junit4]   2> 2770022 INFO  (qtp1042424275-28162) [n:127.0.0.1:38264_solr c:testMergeIntegration_collection s:shard2 r:core_node8 x:testMergeIntegration_collection_shard2_replica_n6] o.a.s.u.p.LogUpdateProcessorFactory [testMergeIntegration_collection_shard2_replica_n6]  webapp=/solr path=/update params={wt=javabin&version=2}{add=[id-700 (1601379328167247872)]} 0 0
   [junit4]   2> 2770024 INFO  (qtp838236708-28153) [n:127.0.0.1:54194_solr c:testMergeIntegration_collection s:shard1 r:core_node3 x:testMergeIntegration_collection_shard1_replica_n1] o.a.s.u.p.LogUpdateProcessorFactory [testMergeIntegration_collection_shard1_replica_n1]  webapp=/solr path=/update params={update.distrib=FROMLEADER&distrib.from=http://127.0.0.1:38264/solr/testMergeIntegration_collection_shard1_replica_n2/&wt=javabin&version=2}{add=[id-800 (1601379328168296448)]} 0 0
   [junit4]   2> 2770024 INFO  (qtp1042424275-28159) [n:127.0.0.1:38264_solr c:testMergeIntegration_collection s:shard1 r:core_node5 x:testMergeIntegration_collection_shard1_replica_n2] o.a.s.u.p.LogUpdateProcessorFactory [testMergeIntegration_collection_shard1_replica_n2]  webapp=/solr path=/update params={wt=javabin&version=2}{add=[id-800 (1601379328168296448)]} 0 0
   [junit4]   2> 2770025 INFO  (qtp838236708-28154) [n:127.0.0.1:54194_solr c:testMergeIntegration_collection s:shard1 r:core_node3 x:testMergeIntegration_collection_shard1_replica_n1] o.a.s.u.p.LogUpdateProcessorFactory [testMergeIntegration_collection_shard1_replica_n1]  webapp=/solr path=/update params={update.distrib=FROMLEADER&distrib.from=http://127.0.0.1:38264/solr/testMergeIntegration_collection_shard1_replica_n2/&wt=javabin&version=2}{add=[id-900 (1601379328169345024)]} 0 0
   [junit4]   2> 2770025 INFO  (qtp1042424275-28162) [n:127.0.0.1:38264_solr c:testMergeIntegration_collection s:shard1 r:core_node5 x:testMergeIntegration_collection_shard1_replica_n2] o.a.s.u.p.LogUpdateProcessorFactory [testMergeIntegration_collection_shard1_replica_n2]  webapp=/solr path=/update params={wt=javabin&version=2}{add=[id-900 (1601379328169345024)]} 0 0
   [junit4]   2> 2770026 INFO  (qtp838236708-28153) [n:127.0.0.1:54194_solr c:testMergeIntegration_collection s:shard1 r:core_node3 x:testMergeIntegration_collection_shard1_replica_n1] o.a.s.u.DirectUpdateHandler2 start commit{_version_=1601379328171442176,optimize=false,openSearcher=true,waitSearcher=true,expungeDeletes=false,softCommit=false,prepareCommit=false}
   [junit4]   2> 2770026 INFO  (qtp838236708-28153) [n:127.0.0.1:54194_solr c:testMergeIntegration_collection s:shard1 r:core_node3 x:testMergeIntegration_collection_shard1_replica_n1] o.a.s.u.SolrIndexWriter Calling setCommitData with IW:org.apache.solr.update.SolrIndexWriter@5d6758b4 commitCommandVersion:1601379328171442176
   [junit4]   2> 2770027 INFO  (qtp1042424275-28162) [n:127.0.0.1:38264_solr c:testMergeIntegration_collection s:shard1 r:core_node5 x:testMergeIntegration_collection_shard1_replica_n2] o.a.s.u.DirectUpdateHandler2 start commit{_version_=1601379328172490752,optimize=false,openSearcher=true,waitSearcher=true,expungeDeletes=false,softCommit=false,prepareCommit=false}
   [junit4]   2> 2770027 INFO  (qtp1042424275-28162) [n:127.0.0.1:38264_solr c:testMergeIntegration_collection s:shard1 r:core_node5 x:testMergeIntegration_collection_shard1_replica_n2] o.a.s.u.SolrIndexWriter Calling setCommitData with IW:org.apache.solr.update.SolrIndexWriter@71bdebbd commitCommandVersion:1601379328172490752
   [junit4]   2> 2770028 INFO  (qtp838236708-28154) [n:127.0.0.1:54194_solr c:testMergeIntegration_collection s:shard2 r:core_node7 x:testMergeIntegration_collection_shard2_replica_n4] o.a.s.u.DirectUpdateHandler2 start commit{_version_=1601379328173539328,optimize=false,openSearcher=true,waitSearcher=true,expungeDeletes=false,softCommit=false,prepareCommit=false}
   [junit4]   2> 2770028 INFO  (qtp838236708-28154) [n:127.0.0.1:54194_solr c:testMergeIntegration_collection s:shard2 r:core_node7 x:testMergeIntegration_collection_shard2_replica_n4] o.a.s.u.SolrIndexWriter Calling setCommitData with IW:org.apache.solr.update.SolrIndexWriter@3cbb242f commitCommandVersion:1601379328173539328
   [junit4]   2> 2770028 INFO  (qtp838236708-28153) [n:127.0.0.1:54194_solr c:testMergeIntegration_collection s:shard1 r:core_node3 x:testMergeIntegration_collection_shard1_replica_n1] o.a.s.s.SolrIndexSearcher Opening [Searcher@5f5c8848[testMergeIntegration_collection_shard1_replica_n1] main]
   [junit4]   2> 2770028 INFO  (qtp1042424275-28162) [n:127.0.0.1:38264_solr c:testMergeIntegration_collection s:shard1 r:core_node5 x:testMergeIntegration_collection_shard1_replica_n2] o.a.s.s.SolrIndexSearcher Opening [Searcher@433501f7[testMergeIntegration_collection_shard1_replica_n2] main]
   [junit4]   2> 2770028 INFO  (qtp1042424275-28162) [n:127.0.0.1:38264_solr c:testMergeIntegration_collection s:shard1 r:core_node5 x:testMergeIntegration_collection_shard1_replica_n2] o.a.s.u.DirectUpdateHandler2 end_commit_flush
   [junit4]   2> 2770028 INFO  (qtp838236708-28153) [n:127.0.0.1:54194_solr c:testMergeIntegration_collection s:shard1 r:core_node3 x:testMergeIntegration_collection_shard1_replica_n1] o.a.s.u.DirectUpdateHandler2 end_commit_flush
   [junit4]   2> 2770028 INFO  (qtp838236708-28154) [n:127.0.0.1:54194_solr c:testMergeIntegration_collection s:shard2 r:core_node7 x:testMergeIntegration_collection_shard2_replica_n4] o.a.s.s.SolrIndexSearcher Opening [Searcher@90ad300[testMergeIntegration_collection_shard2_replica_n4] main]
   [junit4]   2> 2770028 INFO  (qtp838236708-28154) [n:127.0.0.1:54194_solr c:testMergeIntegration_collection s:shard2 r:core_node7 x:testMergeIntegration_collection_sh

[...truncated too long message...]

ull
   [junit4]   2> 426065 INFO  (zkCallback-132-thread-2) [    ] o.a.s.c.c.ZkStateReader Updated live nodes from ZooKeeper... (2) -> (0)
   [junit4]   2> 426065 INFO  (zkCallback-137-thread-1) [    ] o.a.s.c.c.ZkStateReader Updated live nodes from ZooKeeper... (2) -> (1)
   [junit4]   2> 426065 INFO  (jetty-closer-120-thread-2) [    ] o.a.s.m.SolrMetricManager Closing metric reporters for registry=solr.cluster, tag=null
   [junit4]   2> 426066 INFO  (zkCallback-146-thread-1) [    ] o.a.s.c.c.ZkStateReader Updated live nodes from ZooKeeper... (2) -> (0)
   [junit4]   2> 426068 INFO  (zkCallback-151-thread-2) [    ] o.a.s.c.c.ZkStateReader Updated live nodes from ZooKeeper... (2) -> (0)
   [junit4]   2> 426068 INFO  (zkCallback-137-thread-4) [    ] o.a.s.c.c.ZkStateReader Updated live nodes from ZooKeeper... (1) -> (0)
   [junit4]   2> 426085 INFO  (jetty-closer-120-thread-1) [    ] o.a.s.c.Overseer Overseer (id=72219024668688388-127.0.0.1:37430_solr-n_0000000000) closing
   [junit4]   2> 426088 DEBUG (jetty-closer-120-thread-1) [    ] o.a.s.c.a.ScheduledTriggers Shutting down scheduled thread pool executor now
   [junit4]   2> 426089 DEBUG (jetty-closer-120-thread-1) [    ] o.a.s.c.a.ScheduledTriggers Shutting down action executor now
   [junit4]   2> 426089 DEBUG (jetty-closer-120-thread-1) [    ] o.a.s.c.a.ScheduledTriggers Awaiting termination for action executor
   [junit4]   2> 426089 INFO  (OverseerStateUpdate-72219024668688388-127.0.0.1:37430_solr-n_0000000000) [    ] o.a.s.c.Overseer Overseer Loop exiting : 127.0.0.1:37430_solr
   [junit4]   2> 426090 WARN  (OverseerAutoScalingTriggerThread-72219024668688388-127.0.0.1:37430_solr-n_0000000000) [    ] o.a.s.c.a.OverseerTriggerThread OverseerTriggerThread woken up but we are closed, exiting.
   [junit4]   2> 426090 DEBUG (jetty-closer-120-thread-1) [    ] o.a.s.c.a.ScheduledTriggers Awaiting termination for scheduled thread pool executor
   [junit4]   2> 426090 DEBUG (jetty-closer-120-thread-1) [    ] o.a.s.c.a.ScheduledTriggers ScheduledTriggers closed completely
   [junit4]   2> 426090 DEBUG (jetty-closer-120-thread-1) [    ] o.a.s.c.a.OverseerTriggerThread OverseerTriggerThread has been closed explicitly
   [junit4]   2> 426102 INFO  (jetty-closer-120-thread-1) [    ] o.e.j.s.h.ContextHandler Stopped o.e.j.s.ServletContextHandler@67cc895f{/solr,null,UNAVAILABLE}
   [junit4]   2> 426102 INFO  (jetty-closer-120-thread-1) [    ] o.e.j.s.session node0 Stopped scavenging
   [junit4]   2> 427614 INFO  (jetty-closer-120-thread-2) [    ] o.e.j.s.h.ContextHandler Stopped o.e.j.s.ServletContextHandler@3d8f5f7e{/solr,null,UNAVAILABLE}
   [junit4]   2> 427614 INFO  (jetty-closer-120-thread-2) [    ] o.e.j.s.session node0 Stopped scavenging
   [junit4]   2> 427617 ERROR (SUITE-IndexSizeTriggerTest-seed#[495113D3FB1FEDD8]-worker) [    ] o.a.z.s.ZooKeeperServer ZKShutdownHandler is not registered, so ZooKeeper server won't take any action on ERROR or SHUTDOWN server state changes
   [junit4]   2> 427618 INFO  (SUITE-IndexSizeTriggerTest-seed#[495113D3FB1FEDD8]-worker) [    ] o.a.s.c.ZkTestServer connecting to 127.0.0.1:37540 37540
   [junit4]   2> 429581 WARN  (NIOServerCxn.Factory:0.0.0.0/0.0.0.0:0) [    ] o.a.z.s.NIOServerCnxnFactory Ignoring unexpected runtime exception
   [junit4]   2> java.nio.channels.CancelledKeyException: null
   [junit4]   2> 	at sun.nio.ch.SelectionKeyImpl.ensureValid(SelectionKeyImpl.java:73) ~[?:1.8.0_172]
   [junit4]   2> 	at sun.nio.ch.SelectionKeyImpl.readyOps(SelectionKeyImpl.java:87) ~[?:1.8.0_172]
   [junit4]   2> 	at org.apache.zookeeper.server.NIOServerCnxnFactory.run(NIOServerCnxnFactory.java:205) [zookeeper-3.4.11.jar:3.4.11-37e277162d567b55a07d1755f0b31c32e93c01a0]
   [junit4]   2> 	at java.lang.Thread.run(Thread.java:748) [?:1.8.0_172]
   [junit4]   2> 429582 INFO  (Thread-74) [    ] o.a.s.c.ZkTestServer connecting to 127.0.0.1:37540 37540
   [junit4]   2> 429584 WARN  (Thread-74) [    ] o.a.s.c.ZkTestServer Watch limit violations: 
   [junit4]   2> Maximum concurrent create/delete watches above limit:
   [junit4]   2> 
   [junit4]   2> 	13	/solr/collections/testSplitIntegration_collection/terms/shard2_1
   [junit4]   2> 	13	/solr/collections/testMixedBounds_collection/terms/shard2_0
   [junit4]   2> 	12	/solr/collections/testMixedBounds_collection/terms/shard1_0
   [junit4]   2> 	12	/solr/collections/testMixedBounds_collection/terms/shard2_0_0
   [junit4]   2> 	11	/solr/collections/testSplitIntegration_collection/terms/shard1_1
   [junit4]   2> 	11	/solr/collections/testMixedBounds_collection/terms/shard1_0_0
   [junit4]   2> 	10	/solr/collections/testMergeIntegration_collection/terms/shard2
   [junit4]   2> 	10	/solr/collections/testSplitIntegration_collection/terms/shard2
   [junit4]   2> 	9	/solr/collections/testTrigger_collection/terms/shard1
   [junit4]   2> 	9	/solr/collections/testMixedBounds_collection/terms/shard2_1
   [junit4]   2> 	9	/solr/collections/testMixedBounds_collection/terms/shard1_1
   [junit4]   2> 	9	/solr/aliases.json
   [junit4]   2> 	9	/solr/collections/testMixedBounds_collection/terms/shard1
   [junit4]   2> 	9	/solr/collections/testMergeIntegration_collection/terms/shard1
   [junit4]   2> 	9	/solr/clusterprops.json
   [junit4]   2> 	9	/solr/collections/testSplitIntegration_collection/terms/shard1
   [junit4]   2> 	8	/solr/collections/testSplitIntegration_collection/terms/shard2_0
   [junit4]   2> 	8	/solr/collections/testSplitIntegration_collection/terms/shard1_0
   [junit4]   2> 	8	/solr/collections/testTrigger_collection/terms/shard2
   [junit4]   2> 	8	/solr/collections/testMixedBounds_collection/terms/shard1_0_1
   [junit4]   2> 	8	/solr/collections/testMixedBounds_collection/terms/shard2
   [junit4]   2> 	8	/solr/configs/conf
   [junit4]   2> 	7	/solr/collections/testMixedBounds_collection/terms/shard2_0_1
   [junit4]   2> 	2	/solr/security.json
   [junit4]   2> 
   [junit4]   2> Maximum concurrent data watches above limit:
   [junit4]   2> 
   [junit4]   2> 	9	/solr/clusterstate.json
   [junit4]   2> 	5	/solr/collections/testTrigger_collection/state.json
   [junit4]   2> 	5	/solr/collections/testMixedBounds_collection/state.json
   [junit4]   2> 	5	/solr/collections/testMergeIntegration_collection/state.json
   [junit4]   2> 	4	/solr/collections/testSplitIntegration_collection/state.json
   [junit4]   2> 
   [junit4]   2> Maximum concurrent children watches above limit:
   [junit4]   2> 
   [junit4]   2> 	25	/solr/collections
   [junit4]   2> 	9	/solr/live_nodes
   [junit4]   2> 
   [junit4]   2> NOTE: leaving temporary files on disk at: /export/home/jenkins/workspace/Lucene-Solr-7.x-Solaris/solr/build/solr-core/test/J0/temp/solr.cloud.autoscaling.IndexSizeTriggerTest_495113D3FB1FEDD8-002
   [junit4]   2> NOTE: test params are: codec=Asserting(Lucene70): {foo=PostingsFormat(name=MockRandom), id=FST50}, docValues:{}, maxPointsInLeafNode=778, maxMBSortInHeap=5.736531027726092, sim=RandomSimilarity(queryNorm=true): {}, locale=zh-TW, timezone=Atlantic/Madeira
   [junit4]   2> NOTE: SunOS 5.11 amd64/Oracle Corporation 1.8.0_172 (64-bit)/cpus=3,threads=1,free=85336656,total=209305600
   [junit4]   2> NOTE: All tests run in this JVM: [IndexSizeTriggerTest, IndexSizeTriggerTest, IndexSizeTriggerTest]
   [junit4] Completed [5/5 (4!)] on J0 in 156.75s, 4 tests, 1 failure <<< FAILURES!
   [junit4] 
   [junit4] 
   [junit4] Tests with failures [seed: 495113D3FB1FEDD8]:
   [junit4]   - org.apache.solr.cloud.autoscaling.IndexSizeTriggerTest.testMixedBounds
   [junit4]   - org.apache.solr.cloud.autoscaling.IndexSizeTriggerTest.testMixedBounds
   [junit4]   - org.apache.solr.cloud.autoscaling.IndexSizeTriggerTest.testMixedBounds
   [junit4]   - org.apache.solr.cloud.autoscaling.IndexSizeTriggerTest.testMixedBounds
   [junit4] 
   [junit4] 
   [junit4] JVM J0:     0.70 ..   430.58 =   429.88s
   [junit4] JVM J1:     0.69 ..   314.85 =   314.16s
   [junit4] Execution time total: 7 minutes 10 seconds
   [junit4] Tests summary: 5 suites, 20 tests, 4 failures

BUILD FAILED
/export/home/jenkins/workspace/Lucene-Solr-7.x-Solaris/lucene/common-build.xml:1568: The following error occurred while executing this line:
/export/home/jenkins/workspace/Lucene-Solr-7.x-Solaris/lucene/common-build.xml:1092: There were test failures: 5 suites, 20 tests, 4 failures [seed: 495113D3FB1FEDD8]

Total time: 7 minutes 12 seconds

[repro] Setting last failure code to 256

[repro] Failures:
[repro]   4/5 failed: org.apache.solr.cloud.autoscaling.IndexSizeTriggerTest
[repro] Exiting with code 256
+ mv lucene/build lucene/build.repro
+ mv solr/build solr/build.repro
+ mv lucene/build.orig lucene/build
+ mv solr/build.orig solr/build
Archiving artifacts
Setting ANT_1_8_2_HOME=/export/home/jenkins/tools/hudson.tasks.Ant_AntInstallation/ANT_1.8.2
[WARNINGS] Parsing warnings in console log with parser Java Compiler (javac)
Setting ANT_1_8_2_HOME=/export/home/jenkins/tools/hudson.tasks.Ant_AntInstallation/ANT_1.8.2
Setting ANT_1_8_2_HOME=/export/home/jenkins/tools/hudson.tasks.Ant_AntInstallation/ANT_1.8.2
<Git Blamer> Using GitBlamer to create author and commit information for all warnings.
<Git Blamer> GIT_COMMIT=7f0b184c66d501e45f33ae8a52ba4603725d39f0, workspace=/export/home/jenkins/workspace/Lucene-Solr-7.x-Solaris
[WARNINGS] Computing warning deltas based on reference build #644
Recording test results
Setting ANT_1_8_2_HOME=/export/home/jenkins/tools/hudson.tasks.Ant_AntInstallation/ANT_1.8.2
Build step 'Publish JUnit test result report' changed build result to UNSTABLE
Email was triggered for: Unstable (Test Failures)
Sending email for trigger: Unstable (Test Failures)
Setting ANT_1_8_2_HOME=/export/home/jenkins/tools/hudson.tasks.Ant_AntInstallation/ANT_1.8.2
Setting ANT_1_8_2_HOME=/export/home/jenkins/tools/hudson.tasks.Ant_AntInstallation/ANT_1.8.2
Setting ANT_1_8_2_HOME=/export/home/jenkins/tools/hudson.tasks.Ant_AntInstallation/ANT_1.8.2
Setting ANT_1_8_2_HOME=/export/home/jenkins/tools/hudson.tasks.Ant_AntInstallation/ANT_1.8.2

Mime
View raw message