lucene-dev mailing list archives

Site index · List index
Message view « Date » · « Thread »
Top « Date » · « Thread »
From Policeman Jenkins Server <jenk...@thetaphi.de>
Subject [JENKINS] Lucene-Solr-7.x-Linux (64bit/jdk1.8.0_162) - Build # 1890 - Unstable!
Date Sat, 12 May 2018 21:13:14 GMT
Build: https://jenkins.thetaphi.de/job/Lucene-Solr-7.x-Linux/1890/
Java: 64bit/jdk1.8.0_162 -XX:-UseCompressedOops -XX:+UseG1GC

3 tests failed.
FAILED:  org.apache.lucene.index.TestConcurrentMergeScheduler.testFlushExceptions

Error Message:


Stack Trace:
java.lang.AssertionError
	at __randomizedtesting.SeedInfo.seed([8CF31DF6DABF3D5:BCA56205644B65E1]:0)
	at org.junit.Assert.fail(Assert.java:92)
	at org.junit.Assert.assertTrue(Assert.java:43)
	at org.junit.Assert.assertTrue(Assert.java:54)
	at org.apache.lucene.index.TestConcurrentMergeScheduler.testFlushExceptions(TestConcurrentMergeScheduler.java:128)
	at sun.reflect.NativeMethodAccessorImpl.invoke0(Native Method)
	at sun.reflect.NativeMethodAccessorImpl.invoke(NativeMethodAccessorImpl.java:62)
	at sun.reflect.DelegatingMethodAccessorImpl.invoke(DelegatingMethodAccessorImpl.java:43)
	at java.lang.reflect.Method.invoke(Method.java:498)
	at com.carrotsearch.randomizedtesting.RandomizedRunner.invoke(RandomizedRunner.java:1737)
	at com.carrotsearch.randomizedtesting.RandomizedRunner$8.evaluate(RandomizedRunner.java:934)
	at com.carrotsearch.randomizedtesting.RandomizedRunner$9.evaluate(RandomizedRunner.java:970)
	at com.carrotsearch.randomizedtesting.RandomizedRunner$10.evaluate(RandomizedRunner.java:984)
	at org.apache.lucene.util.TestRuleSetupTeardownChained$1.evaluate(TestRuleSetupTeardownChained.java:49)
	at org.apache.lucene.util.AbstractBeforeAfterRule$1.evaluate(AbstractBeforeAfterRule.java:45)
	at org.apache.lucene.util.TestRuleThreadAndTestName$1.evaluate(TestRuleThreadAndTestName.java:48)
	at org.apache.lucene.util.TestRuleIgnoreAfterMaxFailures$1.evaluate(TestRuleIgnoreAfterMaxFailures.java:64)
	at org.apache.lucene.util.TestRuleMarkFailure$1.evaluate(TestRuleMarkFailure.java:47)
	at com.carrotsearch.randomizedtesting.rules.StatementAdapter.evaluate(StatementAdapter.java:36)
	at com.carrotsearch.randomizedtesting.ThreadLeakControl$StatementRunner.run(ThreadLeakControl.java:368)
	at com.carrotsearch.randomizedtesting.ThreadLeakControl.forkTimeoutingTask(ThreadLeakControl.java:817)
	at com.carrotsearch.randomizedtesting.ThreadLeakControl$3.evaluate(ThreadLeakControl.java:468)
	at com.carrotsearch.randomizedtesting.RandomizedRunner.runSingleTest(RandomizedRunner.java:943)
	at com.carrotsearch.randomizedtesting.RandomizedRunner$5.evaluate(RandomizedRunner.java:829)
	at com.carrotsearch.randomizedtesting.RandomizedRunner$6.evaluate(RandomizedRunner.java:879)
	at com.carrotsearch.randomizedtesting.RandomizedRunner$7.evaluate(RandomizedRunner.java:890)
	at org.apache.lucene.util.AbstractBeforeAfterRule$1.evaluate(AbstractBeforeAfterRule.java:45)
	at com.carrotsearch.randomizedtesting.rules.StatementAdapter.evaluate(StatementAdapter.java:36)
	at org.apache.lucene.util.TestRuleStoreClassName$1.evaluate(TestRuleStoreClassName.java:41)
	at com.carrotsearch.randomizedtesting.rules.NoShadowingOrOverridesOnMethodsRule$1.evaluate(NoShadowingOrOverridesOnMethodsRule.java:40)
	at com.carrotsearch.randomizedtesting.rules.NoShadowingOrOverridesOnMethodsRule$1.evaluate(NoShadowingOrOverridesOnMethodsRule.java:40)
	at com.carrotsearch.randomizedtesting.rules.StatementAdapter.evaluate(StatementAdapter.java:36)
	at com.carrotsearch.randomizedtesting.rules.StatementAdapter.evaluate(StatementAdapter.java:36)
	at com.carrotsearch.randomizedtesting.rules.StatementAdapter.evaluate(StatementAdapter.java:36)
	at org.apache.lucene.util.TestRuleAssertionsRequired$1.evaluate(TestRuleAssertionsRequired.java:53)
	at org.apache.lucene.util.TestRuleMarkFailure$1.evaluate(TestRuleMarkFailure.java:47)
	at org.apache.lucene.util.TestRuleIgnoreAfterMaxFailures$1.evaluate(TestRuleIgnoreAfterMaxFailures.java:64)
	at org.apache.lucene.util.TestRuleIgnoreTestSuites$1.evaluate(TestRuleIgnoreTestSuites.java:54)
	at com.carrotsearch.randomizedtesting.rules.StatementAdapter.evaluate(StatementAdapter.java:36)
	at com.carrotsearch.randomizedtesting.ThreadLeakControl$StatementRunner.run(ThreadLeakControl.java:368)
	at java.lang.Thread.run(Thread.java:748)


FAILED:  org.apache.solr.cloud.autoscaling.IndexSizeTriggerTest.testTrigger

Error Message:
number of ops expected:<2> but was:<1>

Stack Trace:
java.lang.AssertionError: number of ops expected:<2> but was:<1>
	at __randomizedtesting.SeedInfo.seed([454C9BBDC3034E4D:2687AD3F5ACC3D60]:0)
	at org.junit.Assert.fail(Assert.java:93)
	at org.junit.Assert.failNotEquals(Assert.java:647)
	at org.junit.Assert.assertEquals(Assert.java:128)
	at org.junit.Assert.assertEquals(Assert.java:472)
	at org.apache.solr.cloud.autoscaling.IndexSizeTriggerTest.testTrigger(IndexSizeTriggerTest.java:187)
	at sun.reflect.NativeMethodAccessorImpl.invoke0(Native Method)
	at sun.reflect.NativeMethodAccessorImpl.invoke(NativeMethodAccessorImpl.java:62)
	at sun.reflect.DelegatingMethodAccessorImpl.invoke(DelegatingMethodAccessorImpl.java:43)
	at java.lang.reflect.Method.invoke(Method.java:498)
	at com.carrotsearch.randomizedtesting.RandomizedRunner.invoke(RandomizedRunner.java:1737)
	at com.carrotsearch.randomizedtesting.RandomizedRunner$8.evaluate(RandomizedRunner.java:934)
	at com.carrotsearch.randomizedtesting.RandomizedRunner$9.evaluate(RandomizedRunner.java:970)
	at com.carrotsearch.randomizedtesting.RandomizedRunner$10.evaluate(RandomizedRunner.java:984)
	at com.carrotsearch.randomizedtesting.rules.SystemPropertiesRestoreRule$1.evaluate(SystemPropertiesRestoreRule.java:57)
	at org.apache.lucene.util.TestRuleSetupTeardownChained$1.evaluate(TestRuleSetupTeardownChained.java:49)
	at org.apache.lucene.util.AbstractBeforeAfterRule$1.evaluate(AbstractBeforeAfterRule.java:45)
	at org.apache.lucene.util.TestRuleThreadAndTestName$1.evaluate(TestRuleThreadAndTestName.java:48)
	at org.apache.lucene.util.TestRuleIgnoreAfterMaxFailures$1.evaluate(TestRuleIgnoreAfterMaxFailures.java:64)
	at org.apache.lucene.util.TestRuleMarkFailure$1.evaluate(TestRuleMarkFailure.java:47)
	at com.carrotsearch.randomizedtesting.rules.StatementAdapter.evaluate(StatementAdapter.java:36)
	at com.carrotsearch.randomizedtesting.ThreadLeakControl$StatementRunner.run(ThreadLeakControl.java:368)
	at com.carrotsearch.randomizedtesting.ThreadLeakControl.forkTimeoutingTask(ThreadLeakControl.java:817)
	at com.carrotsearch.randomizedtesting.ThreadLeakControl$3.evaluate(ThreadLeakControl.java:468)
	at com.carrotsearch.randomizedtesting.RandomizedRunner.runSingleTest(RandomizedRunner.java:943)
	at com.carrotsearch.randomizedtesting.RandomizedRunner$5.evaluate(RandomizedRunner.java:829)
	at com.carrotsearch.randomizedtesting.RandomizedRunner$6.evaluate(RandomizedRunner.java:879)
	at com.carrotsearch.randomizedtesting.RandomizedRunner$7.evaluate(RandomizedRunner.java:890)
	at com.carrotsearch.randomizedtesting.rules.StatementAdapter.evaluate(StatementAdapter.java:36)
	at com.carrotsearch.randomizedtesting.rules.SystemPropertiesRestoreRule$1.evaluate(SystemPropertiesRestoreRule.java:57)
	at org.apache.lucene.util.AbstractBeforeAfterRule$1.evaluate(AbstractBeforeAfterRule.java:45)
	at com.carrotsearch.randomizedtesting.rules.StatementAdapter.evaluate(StatementAdapter.java:36)
	at org.apache.lucene.util.TestRuleStoreClassName$1.evaluate(TestRuleStoreClassName.java:41)
	at com.carrotsearch.randomizedtesting.rules.NoShadowingOrOverridesOnMethodsRule$1.evaluate(NoShadowingOrOverridesOnMethodsRule.java:40)
	at com.carrotsearch.randomizedtesting.rules.NoShadowingOrOverridesOnMethodsRule$1.evaluate(NoShadowingOrOverridesOnMethodsRule.java:40)
	at com.carrotsearch.randomizedtesting.rules.StatementAdapter.evaluate(StatementAdapter.java:36)
	at com.carrotsearch.randomizedtesting.rules.StatementAdapter.evaluate(StatementAdapter.java:36)
	at com.carrotsearch.randomizedtesting.rules.StatementAdapter.evaluate(StatementAdapter.java:36)
	at org.apache.lucene.util.TestRuleAssertionsRequired$1.evaluate(TestRuleAssertionsRequired.java:53)
	at org.apache.lucene.util.TestRuleMarkFailure$1.evaluate(TestRuleMarkFailure.java:47)
	at org.apache.lucene.util.TestRuleIgnoreAfterMaxFailures$1.evaluate(TestRuleIgnoreAfterMaxFailures.java:64)
	at org.apache.lucene.util.TestRuleIgnoreTestSuites$1.evaluate(TestRuleIgnoreTestSuites.java:54)
	at com.carrotsearch.randomizedtesting.rules.StatementAdapter.evaluate(StatementAdapter.java:36)
	at com.carrotsearch.randomizedtesting.ThreadLeakControl$StatementRunner.run(ThreadLeakControl.java:368)
	at java.lang.Thread.run(Thread.java:748)


FAILED:  org.apache.solr.cloud.autoscaling.IndexSizeTriggerTest.testTrigger

Error Message:
number of ops expected:<2> but was:<1>

Stack Trace:
java.lang.AssertionError: number of ops expected:<2> but was:<1>
	at __randomizedtesting.SeedInfo.seed([454C9BBDC3034E4D:2687AD3F5ACC3D60]:0)
	at org.junit.Assert.fail(Assert.java:93)
	at org.junit.Assert.failNotEquals(Assert.java:647)
	at org.junit.Assert.assertEquals(Assert.java:128)
	at org.junit.Assert.assertEquals(Assert.java:472)
	at org.apache.solr.cloud.autoscaling.IndexSizeTriggerTest.testTrigger(IndexSizeTriggerTest.java:187)
	at sun.reflect.NativeMethodAccessorImpl.invoke0(Native Method)
	at sun.reflect.NativeMethodAccessorImpl.invoke(NativeMethodAccessorImpl.java:62)
	at sun.reflect.DelegatingMethodAccessorImpl.invoke(DelegatingMethodAccessorImpl.java:43)
	at java.lang.reflect.Method.invoke(Method.java:498)
	at com.carrotsearch.randomizedtesting.RandomizedRunner.invoke(RandomizedRunner.java:1737)
	at com.carrotsearch.randomizedtesting.RandomizedRunner$8.evaluate(RandomizedRunner.java:934)
	at com.carrotsearch.randomizedtesting.RandomizedRunner$9.evaluate(RandomizedRunner.java:970)
	at com.carrotsearch.randomizedtesting.RandomizedRunner$10.evaluate(RandomizedRunner.java:984)
	at com.carrotsearch.randomizedtesting.rules.SystemPropertiesRestoreRule$1.evaluate(SystemPropertiesRestoreRule.java:57)
	at org.apache.lucene.util.TestRuleSetupTeardownChained$1.evaluate(TestRuleSetupTeardownChained.java:49)
	at org.apache.lucene.util.AbstractBeforeAfterRule$1.evaluate(AbstractBeforeAfterRule.java:45)
	at org.apache.lucene.util.TestRuleThreadAndTestName$1.evaluate(TestRuleThreadAndTestName.java:48)
	at org.apache.lucene.util.TestRuleIgnoreAfterMaxFailures$1.evaluate(TestRuleIgnoreAfterMaxFailures.java:64)
	at org.apache.lucene.util.TestRuleMarkFailure$1.evaluate(TestRuleMarkFailure.java:47)
	at com.carrotsearch.randomizedtesting.rules.StatementAdapter.evaluate(StatementAdapter.java:36)
	at com.carrotsearch.randomizedtesting.ThreadLeakControl$StatementRunner.run(ThreadLeakControl.java:368)
	at com.carrotsearch.randomizedtesting.ThreadLeakControl.forkTimeoutingTask(ThreadLeakControl.java:817)
	at com.carrotsearch.randomizedtesting.ThreadLeakControl$3.evaluate(ThreadLeakControl.java:468)
	at com.carrotsearch.randomizedtesting.RandomizedRunner.runSingleTest(RandomizedRunner.java:943)
	at com.carrotsearch.randomizedtesting.RandomizedRunner$5.evaluate(RandomizedRunner.java:829)
	at com.carrotsearch.randomizedtesting.RandomizedRunner$6.evaluate(RandomizedRunner.java:879)
	at com.carrotsearch.randomizedtesting.RandomizedRunner$7.evaluate(RandomizedRunner.java:890)
	at com.carrotsearch.randomizedtesting.rules.StatementAdapter.evaluate(StatementAdapter.java:36)
	at com.carrotsearch.randomizedtesting.rules.SystemPropertiesRestoreRule$1.evaluate(SystemPropertiesRestoreRule.java:57)
	at org.apache.lucene.util.AbstractBeforeAfterRule$1.evaluate(AbstractBeforeAfterRule.java:45)
	at com.carrotsearch.randomizedtesting.rules.StatementAdapter.evaluate(StatementAdapter.java:36)
	at org.apache.lucene.util.TestRuleStoreClassName$1.evaluate(TestRuleStoreClassName.java:41)
	at com.carrotsearch.randomizedtesting.rules.NoShadowingOrOverridesOnMethodsRule$1.evaluate(NoShadowingOrOverridesOnMethodsRule.java:40)
	at com.carrotsearch.randomizedtesting.rules.NoShadowingOrOverridesOnMethodsRule$1.evaluate(NoShadowingOrOverridesOnMethodsRule.java:40)
	at com.carrotsearch.randomizedtesting.rules.StatementAdapter.evaluate(StatementAdapter.java:36)
	at com.carrotsearch.randomizedtesting.rules.StatementAdapter.evaluate(StatementAdapter.java:36)
	at com.carrotsearch.randomizedtesting.rules.StatementAdapter.evaluate(StatementAdapter.java:36)
	at org.apache.lucene.util.TestRuleAssertionsRequired$1.evaluate(TestRuleAssertionsRequired.java:53)
	at org.apache.lucene.util.TestRuleMarkFailure$1.evaluate(TestRuleMarkFailure.java:47)
	at org.apache.lucene.util.TestRuleIgnoreAfterMaxFailures$1.evaluate(TestRuleIgnoreAfterMaxFailures.java:64)
	at org.apache.lucene.util.TestRuleIgnoreTestSuites$1.evaluate(TestRuleIgnoreTestSuites.java:54)
	at com.carrotsearch.randomizedtesting.rules.StatementAdapter.evaluate(StatementAdapter.java:36)
	at com.carrotsearch.randomizedtesting.ThreadLeakControl$StatementRunner.run(ThreadLeakControl.java:368)
	at java.lang.Thread.run(Thread.java:748)




Build Log:
[...truncated 303 lines...]
   [junit4] Suite: org.apache.lucene.index.TestConcurrentMergeScheduler
   [junit4]   2> NOTE: reproduce with: ant test  -Dtestcase=TestConcurrentMergeScheduler -Dtests.method=testFlushExceptions -Dtests.seed=8CF31DF6DABF3D5 -Dtests.multiplier=3 -Dtests.slow=true -Dtests.locale=et -Dtests.timezone=America/St_Barthelemy -Dtests.asserts=true -Dtests.file.encoding=UTF-8
   [junit4] FAILURE 0.03s J1 | TestConcurrentMergeScheduler.testFlushExceptions <<<
   [junit4]    > Throwable #1: java.lang.AssertionError
   [junit4]    > 	at __randomizedtesting.SeedInfo.seed([8CF31DF6DABF3D5:BCA56205644B65E1]:0)
   [junit4]    > 	at org.apache.lucene.index.TestConcurrentMergeScheduler.testFlushExceptions(TestConcurrentMergeScheduler.java:128)
   [junit4]    > 	at java.lang.Thread.run(Thread.java:748)
   [junit4]   2> NOTE: test params are: codec=Asserting(Lucene70): {field=PostingsFormat(name=Asserting), id=BlockTreeOrds(blocksize=128), content=PostingsFormat(name=LuceneFixedGap)}, docValues:{}, maxPointsInLeafNode=481, maxMBSortInHeap=6.123165652064745, sim=RandomSimilarity(queryNorm=false): {content=DFR I(F)LZ(0.3)}, locale=et, timezone=America/St_Barthelemy
   [junit4]   2> NOTE: Linux 4.13.0-39-generic amd64/Oracle Corporation 1.8.0_162 (64-bit)/cpus=8,threads=1,free=509348896,total=536870912
   [junit4]   2> NOTE: All tests run in this JVM: [TestFilterIterator, TestFilterCodecReader, TestSizeBoundedForceMerge, TestRegexpRandom2, TestTimeLimitingCollector, TestExitableDirectoryReader, TestConcurrentMergeScheduler]
   [junit4] Completed [20/475 (1!)] on J1 in 6.49s, 16 tests, 1 failure <<< FAILURES!

[...truncated 12129 lines...]
   [junit4] Suite: org.apache.solr.cloud.autoscaling.IndexSizeTriggerTest
   [junit4]   2> 6853 INFO  (SUITE-IndexSizeTriggerTest-seed#[454C9BBDC3034E4D]-worker) [    ] o.a.s.SolrTestCaseJ4 SecureRandom sanity checks: test.solr.allowed.securerandom=null & java.security.egd=file:/dev/./urandom
   [junit4]   2> Creating dataDir: /home/jenkins/workspace/Lucene-Solr-7.x-Linux/solr/build/solr-core/test/J1/temp/solr.cloud.autoscaling.IndexSizeTriggerTest_454C9BBDC3034E4D-001/init-core-data-001
   [junit4]   2> 6854 WARN  (SUITE-IndexSizeTriggerTest-seed#[454C9BBDC3034E4D]-worker) [    ] o.a.s.SolrTestCaseJ4 startTrackingSearchers: numOpens=1 numCloses=1
   [junit4]   2> 6855 INFO  (SUITE-IndexSizeTriggerTest-seed#[454C9BBDC3034E4D]-worker) [    ] o.a.s.SolrTestCaseJ4 Using TrieFields (NUMERIC_POINTS_SYSPROP=false) w/NUMERIC_DOCVALUES_SYSPROP=false
   [junit4]   2> 6857 INFO  (SUITE-IndexSizeTriggerTest-seed#[454C9BBDC3034E4D]-worker) [    ] o.a.s.SolrTestCaseJ4 Randomized ssl (true) and clientAuth (true) via: @org.apache.solr.util.RandomizeSSL(reason=, value=NaN, ssl=NaN, clientAuth=NaN)
   [junit4]   2> 6863 INFO  (SUITE-IndexSizeTriggerTest-seed#[454C9BBDC3034E4D]-worker) [    ] o.a.s.c.MiniSolrCloudCluster Starting cluster of 2 servers in /home/jenkins/workspace/Lucene-Solr-7.x-Linux/solr/build/solr-core/test/J1/temp/solr.cloud.autoscaling.IndexSizeTriggerTest_454C9BBDC3034E4D-001/tempDir-001
   [junit4]   2> 6870 INFO  (SUITE-IndexSizeTriggerTest-seed#[454C9BBDC3034E4D]-worker) [    ] o.a.s.c.ZkTestServer STARTING ZK TEST SERVER
   [junit4]   2> 6880 INFO  (Thread-2) [    ] o.a.s.c.ZkTestServer client port:0.0.0.0/0.0.0.0:0
   [junit4]   2> 6880 INFO  (Thread-2) [    ] o.a.s.c.ZkTestServer Starting server
   [junit4]   2> 6980 INFO  (SUITE-IndexSizeTriggerTest-seed#[454C9BBDC3034E4D]-worker) [    ] o.a.s.c.ZkTestServer start zk server on port:39577
   [junit4]   2> 6999 ERROR (Thread-2) [    ] o.a.z.s.ZooKeeperServer ZKShutdownHandler is not registered, so ZooKeeper server won't take any action on ERROR or SHUTDOWN server state changes
   [junit4]   2> 7077 INFO  (zkConnectionManagerCallback-6-thread-1) [    ] o.a.s.c.c.ConnectionManager zkClient has connected
   [junit4]   2> 7136 WARN  (NIOServerCxn.Factory:0.0.0.0/0.0.0.0:0) [    ] o.a.z.s.NIOServerCnxn Unable to read additional data from client sessionid 0x10054bfc3af0000, likely client has closed socket
   [junit4]   2> 7408 INFO  (jetty-launcher-3-thread-1) [    ] o.e.j.s.Server jetty-9.4.10.v20180503; built: 2018-05-03T15:56:21.710Z; git: daa59876e6f384329b122929e70a80934569428c; jvm 1.8.0_162-b12
   [junit4]   2> 7416 INFO  (jetty-launcher-3-thread-2) [    ] o.e.j.s.Server jetty-9.4.10.v20180503; built: 2018-05-03T15:56:21.710Z; git: daa59876e6f384329b122929e70a80934569428c; jvm 1.8.0_162-b12
   [junit4]   2> 7508 INFO  (jetty-launcher-3-thread-2) [    ] o.e.j.s.session DefaultSessionIdManager workerName=node0
   [junit4]   2> 7508 INFO  (jetty-launcher-3-thread-2) [    ] o.e.j.s.session No SessionScavenger set, using defaults
   [junit4]   2> 7511 INFO  (jetty-launcher-3-thread-2) [    ] o.e.j.s.session node0 Scavenging every 600000ms
   [junit4]   2> 7569 INFO  (jetty-launcher-3-thread-1) [    ] o.e.j.s.session DefaultSessionIdManager workerName=node0
   [junit4]   2> 7569 INFO  (jetty-launcher-3-thread-1) [    ] o.e.j.s.session No SessionScavenger set, using defaults
   [junit4]   2> 7569 INFO  (jetty-launcher-3-thread-1) [    ] o.e.j.s.session node0 Scavenging every 600000ms
   [junit4]   2> 7579 INFO  (jetty-launcher-3-thread-2) [    ] o.e.j.s.h.ContextHandler Started o.e.j.s.ServletContextHandler@536e78cf{/solr,null,AVAILABLE}
   [junit4]   2> 7579 INFO  (jetty-launcher-3-thread-1) [    ] o.e.j.s.h.ContextHandler Started o.e.j.s.ServletContextHandler@6dde85e0{/solr,null,AVAILABLE}
   [junit4]   2> 7629 INFO  (jetty-launcher-3-thread-2) [    ] o.e.j.s.AbstractConnector Started ServerConnector@199f4982{SSL,[ssl, http/1.1]}{127.0.0.1:42127}
   [junit4]   2> 7629 INFO  (jetty-launcher-3-thread-2) [    ] o.e.j.s.Server Started @7659ms
   [junit4]   2> 7629 INFO  (jetty-launcher-3-thread-2) [    ] o.a.s.c.s.e.JettySolrRunner Jetty properties: {hostContext=/solr, hostPort=42127}
   [junit4]   2> 7630 INFO  (jetty-launcher-3-thread-1) [    ] o.e.j.s.AbstractConnector Started ServerConnector@6b831ed{SSL,[ssl, http/1.1]}{127.0.0.1:34233}
   [junit4]   2> 7630 INFO  (jetty-launcher-3-thread-1) [    ] o.e.j.s.Server Started @7659ms
   [junit4]   2> 7630 INFO  (jetty-launcher-3-thread-1) [    ] o.a.s.c.s.e.JettySolrRunner Jetty properties: {hostContext=/solr, hostPort=34233}
   [junit4]   2> 7653 INFO  (jetty-launcher-3-thread-1) [    ] o.a.s.u.c.SSLCredentialProviderFactory Processing SSL Credential Provider chain: env;sysprop
   [junit4]   2> 7657 ERROR (jetty-launcher-3-thread-2) [    ] o.a.s.u.StartupLoggingUtils Missing Java Option solr.log.dir. Logging may be missing or incomplete.
   [junit4]   2> 7657 ERROR (jetty-launcher-3-thread-1) [    ] o.a.s.u.StartupLoggingUtils Missing Java Option solr.log.dir. Logging may be missing or incomplete.
   [junit4]   2> 7657 INFO  (jetty-launcher-3-thread-2) [    ] o.a.s.s.SolrDispatchFilter Using logger factory org.apache.logging.slf4j.Log4jLoggerFactory
   [junit4]   2> 7657 INFO  (jetty-launcher-3-thread-1) [    ] o.a.s.s.SolrDispatchFilter Using logger factory org.apache.logging.slf4j.Log4jLoggerFactory
   [junit4]   2> 7657 INFO  (jetty-launcher-3-thread-1) [    ] o.a.s.s.SolrDispatchFilter  ___      _       Welcome to Apache Solr™ version 7.4.0
   [junit4]   2> 7657 INFO  (jetty-launcher-3-thread-1) [    ] o.a.s.s.SolrDispatchFilter / __| ___| |_ _   Starting in cloud mode on port null
   [junit4]   2> 7657 INFO  (jetty-launcher-3-thread-2) [    ] o.a.s.s.SolrDispatchFilter  ___      _       Welcome to Apache Solr™ version 7.4.0
   [junit4]   2> 7660 INFO  (jetty-launcher-3-thread-2) [    ] o.a.s.s.SolrDispatchFilter / __| ___| |_ _   Starting in cloud mode on port null
   [junit4]   2> 7660 INFO  (jetty-launcher-3-thread-2) [    ] o.a.s.s.SolrDispatchFilter \__ \/ _ \ | '_|  Install dir: null
   [junit4]   2> 7661 INFO  (jetty-launcher-3-thread-2) [    ] o.a.s.s.SolrDispatchFilter |___/\___/_|_|    Start time: 2018-05-12T20:11:01.397Z
   [junit4]   2> 7662 INFO  (jetty-launcher-3-thread-2) [    ] o.a.s.c.SolrResourceLoader solr home defaulted to 'solr/' (could not find system property or JNDI)
   [junit4]   2> 7660 INFO  (jetty-launcher-3-thread-1) [    ] o.a.s.s.SolrDispatchFilter \__ \/ _ \ | '_|  Install dir: null
   [junit4]   2> 7664 INFO  (jetty-launcher-3-thread-1) [    ] o.a.s.s.SolrDispatchFilter |___/\___/_|_|    Start time: 2018-05-12T20:11:01.400Z
   [junit4]   2> 7732 INFO  (zkConnectionManagerCallback-10-thread-1) [    ] o.a.s.c.c.ConnectionManager zkClient has connected
   [junit4]   2> 7732 INFO  (zkConnectionManagerCallback-8-thread-1) [    ] o.a.s.c.c.ConnectionManager zkClient has connected
   [junit4]   2> 7734 INFO  (jetty-launcher-3-thread-2) [    ] o.a.s.s.SolrDispatchFilter solr.xml found in ZooKeeper. Loading...
   [junit4]   2> 7737 INFO  (jetty-launcher-3-thread-1) [    ] o.a.s.s.SolrDispatchFilter solr.xml found in ZooKeeper. Loading...
   [junit4]   2> 7878 INFO  (jetty-launcher-3-thread-2) [    ] o.a.s.c.ZkContainer Zookeeper client=127.0.0.1:39577/solr
   [junit4]   2> 7900 INFO  (jetty-launcher-3-thread-1) [    ] o.a.s.c.ZkContainer Zookeeper client=127.0.0.1:39577/solr
   [junit4]   2> 7916 INFO  (zkConnectionManagerCallback-15-thread-1) [    ] o.a.s.c.c.ConnectionManager zkClient has connected
   [junit4]   2> 7918 INFO  (zkConnectionManagerCallback-18-thread-1) [    ] o.a.s.c.c.ConnectionManager zkClient has connected
   [junit4]   2> 7926 WARN  (NIOServerCxn.Factory:0.0.0.0/0.0.0.0:0) [    ] o.a.z.s.NIOServerCnxn Unable to read additional data from client sessionid 0x10054bfc3af0004, likely client has closed socket
   [junit4]   2> 7943 INFO  (zkConnectionManagerCallback-20-thread-1) [    ] o.a.s.c.c.ConnectionManager zkClient has connected
   [junit4]   2> 7944 INFO  (zkConnectionManagerCallback-22-thread-1) [    ] o.a.s.c.c.ConnectionManager zkClient has connected
   [junit4]   2> 8172 INFO  (jetty-launcher-3-thread-1) [n:127.0.0.1:34233_solr    ] o.a.s.c.Overseer Overseer (id=null) closing
   [junit4]   2> 8175 INFO  (jetty-launcher-3-thread-1) [n:127.0.0.1:34233_solr    ] o.a.s.c.OverseerElectionContext I am going to be the leader 127.0.0.1:34233_solr
   [junit4]   2> 8178 INFO  (jetty-launcher-3-thread-1) [n:127.0.0.1:34233_solr    ] o.a.s.c.Overseer Overseer (id=72150776636440582-127.0.0.1:34233_solr-n_0000000000) starting
   [junit4]   2> 8186 INFO  (jetty-launcher-3-thread-2) [n:127.0.0.1:42127_solr    ] o.a.s.c.Overseer Overseer (id=null) closing
   [junit4]   2> 8189 INFO  (jetty-launcher-3-thread-2) [n:127.0.0.1:42127_solr    ] o.a.s.c.ZkController Register node as live in ZooKeeper:/live_nodes/127.0.0.1:42127_solr
   [junit4]   2> 8224 INFO  (zkCallback-21-thread-1) [    ] o.a.s.c.c.ZkStateReader Updated live nodes from ZooKeeper... (0) -> (1)
   [junit4]   2> 8257 INFO  (zkCallback-19-thread-1) [    ] o.a.s.c.c.ZkStateReader Updated live nodes from ZooKeeper... (0) -> (1)
   [junit4]   2> 8312 INFO  (zkConnectionManagerCallback-31-thread-1) [    ] o.a.s.c.c.ConnectionManager zkClient has connected
   [junit4]   2> 8314 INFO  (jetty-launcher-3-thread-1) [n:127.0.0.1:34233_solr    ] o.a.s.c.c.ZkStateReader Updated live nodes from ZooKeeper... (0) -> (1)
   [junit4]   2> 8315 INFO  (jetty-launcher-3-thread-1) [n:127.0.0.1:34233_solr    ] o.a.s.c.s.i.ZkClientClusterStateProvider Cluster at 127.0.0.1:39577/solr ready
   [junit4]   2> 8390 INFO  (jetty-launcher-3-thread-1) [n:127.0.0.1:34233_solr    ] o.a.s.c.TransientSolrCoreCacheDefault Allocating transient cache for 2147483647 transient cores
   [junit4]   2> 8390 INFO  (jetty-launcher-3-thread-1) [n:127.0.0.1:34233_solr    ] o.a.s.c.ZkController Register node as live in ZooKeeper:/live_nodes/127.0.0.1:34233_solr
   [junit4]   2> 8416 INFO  (zkCallback-19-thread-1) [    ] o.a.s.c.c.ZkStateReader Updated live nodes from ZooKeeper... (1) -> (2)
   [junit4]   2> 8417 INFO  (zkCallback-21-thread-1) [    ] o.a.s.c.c.ZkStateReader Updated live nodes from ZooKeeper... (1) -> (2)
   [junit4]   2> 8436 INFO  (zkCallback-30-thread-1) [    ] o.a.s.c.c.ZkStateReader Updated live nodes from ZooKeeper... (1) -> (2)
   [junit4]   2> 8463 DEBUG (OverseerAutoScalingTriggerThread-72150776636440582-127.0.0.1:34233_solr-n_0000000000) [    ] o.a.s.c.a.OverseerTriggerThread Adding .auto_add_replicas and .scheduled_maintenance triggers
   [junit4]   2> 8475 DEBUG (OverseerAutoScalingTriggerThread-72150776636440582-127.0.0.1:34233_solr-n_0000000000) [    ] o.a.s.c.a.OverseerTriggerThread Refreshing /autoscaling.json with znode version 1
   [junit4]   2> 8599 DEBUG (OverseerAutoScalingTriggerThread-72150776636440582-127.0.0.1:34233_solr-n_0000000000) [    ] o.a.s.c.a.OverseerTriggerThread Current znodeVersion 1, lastZnodeVersion -1
   [junit4]   2> 8599 DEBUG (OverseerAutoScalingTriggerThread-72150776636440582-127.0.0.1:34233_solr-n_0000000000) [    ] o.a.s.c.a.OverseerTriggerThread Processed trigger updates upto znodeVersion 1
   [junit4]   2> 8678 INFO  (jetty-launcher-3-thread-2) [n:127.0.0.1:42127_solr    ] o.a.s.m.r.SolrJmxReporter JMX monitoring for 'solr_42127.solr.node' (registry 'solr.node') enabled at server: com.sun.jmx.mbeanserver.JmxMBeanServer@43ceb409
   [junit4]   2> 8679 INFO  (jetty-launcher-3-thread-2) [n:127.0.0.1:42127_solr    ] o.a.s.m.r.SolrJmxReporter JMX monitoring for 'solr_42127.solr.jvm' (registry 'solr.jvm') enabled at server: com.sun.jmx.mbeanserver.JmxMBeanServer@43ceb409
   [junit4]   2> 8679 INFO  (jetty-launcher-3-thread-2) [n:127.0.0.1:42127_solr    ] o.a.s.m.r.SolrJmxReporter JMX monitoring for 'solr_42127.solr.jetty' (registry 'solr.jetty') enabled at server: com.sun.jmx.mbeanserver.JmxMBeanServer@43ceb409
   [junit4]   2> 8682 INFO  (jetty-launcher-3-thread-2) [n:127.0.0.1:42127_solr    ] o.a.s.c.CorePropertiesLocator Found 0 core definitions underneath /home/jenkins/workspace/Lucene-Solr-7.x-Linux/solr/build/solr-core/test/J1/temp/solr.cloud.autoscaling.IndexSizeTriggerTest_454C9BBDC3034E4D-001/tempDir-001/node2/.
   [junit4]   2> 8709 DEBUG (OverseerAutoScalingTriggerThread-72150776636440582-127.0.0.1:34233_solr-n_0000000000) [    ] o.a.s.c.a.NodeLostTrigger NodeLostTrigger .auto_add_replicas - Initial livenodes: [127.0.0.1:34233_solr, 127.0.0.1:42127_solr]
   [junit4]   2> 8720 DEBUG (OverseerAutoScalingTriggerThread-72150776636440582-127.0.0.1:34233_solr-n_0000000000) [    ] o.a.s.c.a.OverseerTriggerThread -- clean old nodeAdded markers
   [junit4]   2> 8721 DEBUG (OverseerAutoScalingTriggerThread-72150776636440582-127.0.0.1:34233_solr-n_0000000000) [    ] o.a.s.c.a.OverseerTriggerThread Current znodeVersion 1, lastZnodeVersion 1
   [junit4]   2> 8722 DEBUG (ScheduledTrigger-22-thread-2) [    ] o.a.s.c.a.NodeLostTrigger Running NodeLostTrigger: .auto_add_replicas with currently live nodes: 2
   [junit4]   2> 8832 INFO  (zkConnectionManagerCallback-36-thread-1) [    ] o.a.s.c.c.ConnectionManager zkClient has connected
   [junit4]   2> 8833 INFO  (jetty-launcher-3-thread-2) [n:127.0.0.1:42127_solr    ] o.a.s.c.c.ZkStateReader Updated live nodes from ZooKeeper... (0) -> (2)
   [junit4]   2> 8834 INFO  (jetty-launcher-3-thread-2) [n:127.0.0.1:42127_solr    ] o.a.s.c.s.i.ZkClientClusterStateProvider Cluster at 127.0.0.1:39577/solr ready
   [junit4]   2> 8860 INFO  (jetty-launcher-3-thread-1) [n:127.0.0.1:34233_solr    ] o.a.s.m.r.SolrJmxReporter JMX monitoring for 'solr_34233.solr.node' (registry 'solr.node') enabled at server: com.sun.jmx.mbeanserver.JmxMBeanServer@43ceb409
   [junit4]   2> 8861 INFO  (jetty-launcher-3-thread-1) [n:127.0.0.1:34233_solr    ] o.a.s.m.r.SolrJmxReporter JMX monitoring for 'solr_34233.solr.jvm' (registry 'solr.jvm') enabled at server: com.sun.jmx.mbeanserver.JmxMBeanServer@43ceb409
   [junit4]   2> 8861 INFO  (jetty-launcher-3-thread-1) [n:127.0.0.1:34233_solr    ] o.a.s.m.r.SolrJmxReporter JMX monitoring for 'solr_34233.solr.jetty' (registry 'solr.jetty') enabled at server: com.sun.jmx.mbeanserver.JmxMBeanServer@43ceb409
   [junit4]   2> 8862 INFO  (jetty-launcher-3-thread-1) [n:127.0.0.1:34233_solr    ] o.a.s.c.CorePropertiesLocator Found 0 core definitions underneath /home/jenkins/workspace/Lucene-Solr-7.x-Linux/solr/build/solr-core/test/J1/temp/solr.cloud.autoscaling.IndexSizeTriggerTest_454C9BBDC3034E4D-001/tempDir-001/node1/.
   [junit4]   2> 9107 INFO  (zkConnectionManagerCallback-38-thread-1) [    ] o.a.s.c.c.ConnectionManager zkClient has connected
   [junit4]   2> 9136 INFO  (zkConnectionManagerCallback-43-thread-1) [    ] o.a.s.c.c.ConnectionManager zkClient has connected
   [junit4]   2> 9137 INFO  (SUITE-IndexSizeTriggerTest-seed#[454C9BBDC3034E4D]-worker) [    ] o.a.s.c.c.ZkStateReader Updated live nodes from ZooKeeper... (0) -> (2)
   [junit4]   2> 9138 INFO  (SUITE-IndexSizeTriggerTest-seed#[454C9BBDC3034E4D]-worker) [    ] o.a.s.c.s.i.ZkClientClusterStateProvider Cluster at 127.0.0.1:39577/solr ready
   [junit4]   2> 9253 DEBUG (Simulated OverseerAutoScalingTriggerThread) [    ] o.a.s.c.a.OverseerTriggerThread Adding .auto_add_replicas and .scheduled_maintenance triggers
   [junit4]   2> 9254 DEBUG (Simulated OverseerAutoScalingTriggerThread) [    ] o.a.s.c.a.OverseerTriggerThread Refreshing /autoscaling.json with znode version 0
   [junit4]   2> 9255 DEBUG (Simulated OverseerAutoScalingTriggerThread) [    ] o.a.s.c.a.OverseerTriggerThread Current znodeVersion 0, lastZnodeVersion -1
   [junit4]   2> 9255 DEBUG (Simulated OverseerAutoScalingTriggerThread) [    ] o.a.s.c.a.OverseerTriggerThread Processed trigger updates upto znodeVersion 0
   [junit4]   2> 9280 DEBUG (Simulated OverseerAutoScalingTriggerThread) [    ] o.a.s.c.a.NodeLostTrigger NodeLostTrigger .auto_add_replicas - Initial livenodes: [127.0.0.1:10001_solr, 127.0.0.1:10000_solr]
   [junit4]   2> 9289 DEBUG (Simulated OverseerAutoScalingTriggerThread) [    ] o.a.s.c.a.OverseerTriggerThread -- clean old nodeAdded markers
   [junit4]   2> 9289 DEBUG (Simulated OverseerAutoScalingTriggerThread) [    ] o.a.s.c.a.OverseerTriggerThread Current znodeVersion 0, lastZnodeVersion 0
   [junit4]   2> 9290 DEBUG (ScheduledTrigger-31-thread-2) [    ] o.a.s.c.a.NodeLostTrigger Running NodeLostTrigger: .auto_add_replicas with currently live nodes: 2
   [junit4]   2> 9310 DEBUG (ScheduledTrigger-31-thread-2) [    ] o.a.s.c.a.NodeLostTrigger Running NodeLostTrigger: .auto_add_replicas with currently live nodes: 2
   [junit4]   2> 9331 DEBUG (ScheduledTrigger-31-thread-3) [    ] o.a.s.c.a.NodeLostTrigger Running NodeLostTrigger: .auto_add_replicas with currently live nodes: 2
   [junit4]   2> 9353 DEBUG (ScheduledTrigger-31-thread-4) [    ] o.a.s.c.a.NodeLostTrigger Running NodeLostTrigger: .auto_add_replicas with currently live nodes: 2
   [junit4]   2> 9373 DEBUG (ScheduledTrigger-31-thread-4) [    ] o.a.s.c.a.NodeLostTrigger Running NodeLostTrigger: .auto_add_replicas with currently live nodes: 2
   [junit4]   2> 9394 DEBUG (ScheduledTrigger-31-thread-2) [    ] o.a.s.c.a.NodeLostTrigger Running NodeLostTrigger: .auto_add_replicas with currently live nodes: 2
   [junit4]   2> 9416 DEBUG (ScheduledTrigger-31-thread-1) [    ] o.a.s.c.a.NodeLostTrigger Running NodeLostTrigger: .auto_add_replicas with currently live nodes: 2
   [junit4]   2> 9436 DEBUG (ScheduledTrigger-31-thread-4) [    ] o.a.s.c.a.NodeLostTrigger Running NodeLostTrigger: .auto_add_replicas with currently live nodes: 2
   [junit4]   2> 9457 DEBUG (ScheduledTrigger-31-thread-1) [    ] o.a.s.c.a.NodeLostTrigger Running NodeLostTrigger: .auto_add_replicas with currently live nodes: 2
   [junit4]   2> 9466 INFO  (TEST-IndexSizeTriggerTest.testMergeIntegration-seed#[454C9BBDC3034E4D]) [    ] o.a.s.SolrTestCaseJ4 ###Starting testMergeIntegration
   [junit4]   2> 9483 DEBUG (ScheduledTrigger-31-thread-3) [    ] o.a.s.c.a.NodeLostTrigger Running NodeLostTrigger: .auto_add_replicas with currently live nodes: 2
   [junit4]   2> 9503 DEBUG (ScheduledTrigger-31-thread-3) [    ] o.a.s.c.a.NodeLostTrigger Running NodeLostTrigger: .auto_add_replicas with currently live nodes: 2
   [junit4]   2> 9523 DEBUG (ScheduledTrigger-31-thread-4) [    ] o.a.s.c.a.NodeLostTrigger Running NodeLostTrigger: .auto_add_replicas with currently live nodes: 2
   [junit4]   2> 9544 DEBUG (ScheduledTrigger-31-thread-3) [    ] o.a.s.c.a.NodeLostTrigger Running NodeLostTrigger: .auto_add_replicas with currently live nodes: 2
   [junit4]   2> 9564 DEBUG (ScheduledTrigger-31-thread-4) [    ] o.a.s.c.a.NodeLostTrigger Running NodeLostTrigger: .auto_add_replicas with currently live nodes: 2
   [junit4]   2> 9573 DEBUG (simCloudManagerPool-30-thread-6) [    ] o.a.s.c.a.s.SimClusterStateProvider -- elected new leader for testMergeIntegration_collection / shard2: {"core_node3":{
   [junit4]   2>     "core":"testMergeIntegration_collection_shard2_replica_n3",
   [junit4]   2>     "leader":"true",
   [junit4]   2>     "SEARCHER.searcher.maxDoc":0,
   [junit4]   2>     "SEARCHER.searcher.deletedDocs":0,
   [junit4]   2>     "INDEX.sizeInBytes":1,
   [junit4]   2>     "node_name":"127.0.0.1:10001_solr",
   [junit4]   2>     "state":"active",
   [junit4]   2>     "type":"NRT",
   [junit4]   2>     "SEARCHER.searcher.numDocs":0,
   [junit4]   2>     "shard":"shard2",
   [junit4]   2>     "collection":"testMergeIntegration_collection"}}
   [junit4]   2> 9584 DEBUG (ScheduledTrigger-31-thread-3) [    ] o.a.s.c.a.NodeLostTrigger Running NodeLostTrigger: .auto_add_replicas with currently live nodes: 2
   [junit4]   2> 9588 DEBUG (simCloudManagerPool-30-thread-7) [    ] o.a.s.c.a.s.SimClusterStateProvider -- elected new leader for testMergeIntegration_collection / shard1: {"core_node1":{
   [junit4]   2>     "core":"testMergeIntegration_collection_shard1_replica_n1",
   [junit4]   2>     "leader":"true",
   [junit4]   2>     "SEARCHER.searcher.maxDoc":0,
   [junit4]   2>     "SEARCHER.searcher.deletedDocs":0,
   [junit4]   2>     "INDEX.sizeInBytes":1,
   [junit4]   2>     "node_name":"127.0.0.1:10001_solr",
   [junit4]   2>     "state":"active",
   [junit4]   2>     "type":"NRT",
   [junit4]   2>     "SEARCHER.searcher.numDocs":0,
   [junit4]   2>     "shard":"shard1",
   [junit4]   2>     "collection":"testMergeIntegration_collection"}}
   [junit4]   2> 9605 DEBUG (ScheduledTrigger-31-thread-3) [    ] o.a.s.c.a.NodeLostTrigger Running NodeLostTrigger: .auto_add_replicas with currently live nodes: 2
   [junit4]   2> 9625 DEBUG (ScheduledTrigger-31-thread-2) [    ] o.a.s.c.a.NodeLostTrigger Running NodeLostTrigger: .auto_add_replicas with currently live nodes: 2
   [junit4]   2> 9646 DEBUG (ScheduledTrigger-31-thread-2) [    ] o.a.s.c.a.NodeLostTrigger Running NodeLostTrigger: .auto_add_replicas with currently live nodes: 2
   [junit4]   2> 9667 DEBUG (ScheduledTrigger-31-thread-4) [    ] o.a.s.c.a.NodeLostTrigger Running NodeLostTrigger: .auto_add_replicas with currently live nodes: 2
   [junit4]   2> 9687 DEBUG (ScheduledTrigger-31-thread-3) [    ] o.a.s.c.a.NodeLostTrigger Running NodeLostTrigger: .auto_add_replicas with currently live nodes: 2
   [junit4]   2> 9708 DEBUG (ScheduledTrigger-31-thread-3) [    ] o.a.s.c.a.NodeLostTrigger Running NodeLostTrigger: .auto_add_replicas with currently live nodes: 2
   [junit4]   2> 9724 DEBUG (ScheduledTrigger-22-thread-1) [    ] o.a.s.c.a.NodeLostTrigger Running NodeLostTrigger: .auto_add_replicas with currently live nodes: 2
   [junit4]   2> 9728 DEBUG (ScheduledTrigger-31-thread-1) [    ] o.a.s.c.a.NodeLostTrigger Running NodeLostTrigger: .auto_add_replicas with currently live nodes: 2
   [junit4]   2> 9748 DEBUG (ScheduledTrigger-31-thread-1) [    ] o.a.s.c.a.NodeLostTrigger Running NodeLostTrigger: .auto_add_replicas with currently live nodes: 2
   [junit4]   2> 9769 DEBUG (ScheduledTrigger-31-thread-1) [    ] o.a.s.c.a.NodeLostTrigger Running NodeLostTrigger: .auto_add_replicas with currently live nodes: 2
   [junit4]   2> 9789 DEBUG (ScheduledTrigger-31-thread-1) [    ] o.a.s.c.a.NodeLostTrigger Running NodeLostTrigger: .auto_add_replicas with currently live nodes: 2
   [junit4]   2> 9806 DEBUG (simCloudManagerPool-30-thread-19) [    ] o.a.s.c.a.AutoScalingHandler Verified autoscaling configuration
   [junit4]   2> 9806 DEBUG (simCloudManagerPool-30-thread-19) [    ] o.a.s.c.a.OverseerTriggerThread Refreshing /autoscaling.json with znode version 1
   [junit4]   2> 9809 DEBUG (ScheduledTrigger-31-thread-1) [    ] o.a.s.c.a.NodeLostTrigger Running NodeLostTrigger: .auto_add_replicas with currently live nodes: 2
   [junit4]   2> 9824 DEBUG (Simulated OverseerAutoScalingTriggerThread) [    ] o.a.s.c.a.OverseerTriggerThread Processed trigger updates upto znodeVersion 1
   [junit4]   2> 9824 DEBUG (Simulated OverseerAutoScalingTriggerThread) [    ] o.a.s.c.a.OverseerTriggerThread -- clean old nodeAdded markers
   [junit4]   2> 9826 DEBUG (Simulated OverseerAutoScalingTriggerThread) [    ] o.a.s.c.a.OverseerTriggerThread Current znodeVersion 1, lastZnodeVersion 1
   [junit4]   2> 9830 DEBUG (ScheduledTrigger-31-thread-2) [    ] o.a.s.c.a.NodeLostTrigger Running NodeLostTrigger: .auto_add_replicas with currently live nodes: 2
   [junit4]   2> 9845 DEBUG (simCloudManagerPool-30-thread-20) [    ] o.a.s.c.a.AutoScalingHandler Verified autoscaling configuration
   [junit4]   2> 9846 DEBUG (simCloudManagerPool-30-thread-20) [    ] o.a.s.c.a.OverseerTriggerThread Refreshing /autoscaling.json with znode version 2
   [junit4]   2> 9848 DEBUG (Simulated OverseerAutoScalingTriggerThread) [    ] o.a.s.c.a.OverseerTriggerThread Processed trigger updates upto znodeVersion 2
   [junit4]   2> 9848 DEBUG (Simulated OverseerAutoScalingTriggerThread) [    ] o.a.s.c.a.OverseerTriggerThread -- clean old nodeAdded markers
   [junit4]   2> 9848 DEBUG (Simulated OverseerAutoScalingTriggerThread) [    ] o.a.s.c.a.OverseerTriggerThread Current znodeVersion 2, lastZnodeVersion 2
   [junit4]   2> 9850 DEBUG (ScheduledTrigger-31-thread-2) [    ] o.a.s.c.a.NodeLostTrigger Running NodeLostTrigger: .auto_add_replicas with currently live nodes: 2
   [junit4]   2> 9870 DEBUG (ScheduledTrigger-31-thread-4) [    ] o.a.s.c.a.NodeLostTrigger Running NodeLostTrigger: .auto_add_replicas with currently live nodes: 2
   [junit4]   2> 9881 DEBUG (simCloudManagerPool-30-thread-21) [    ] o.a.s.c.a.AutoScalingHandler Verified autoscaling configuration
   [junit4]   2> 9882 DEBUG (simCloudManagerPool-30-thread-21) [    ] o.a.s.c.a.OverseerTriggerThread Refreshing /autoscaling.json with znode version 3
   [junit4]   2> 9883 DEBUG (Simulated OverseerAutoScalingTriggerThread) [    ] o.a.s.c.a.OverseerTriggerThread Processed trigger updates upto znodeVersion 3
   [junit4]   2> 9883 DEBUG (Simulated OverseerAutoScalingTriggerThread) [    ] o.a.s.c.a.OverseerTriggerThread -- clean old nodeAdded markers
   [junit4]   2> 9883 DEBUG (Simulated OverseerAutoScalingTriggerThread) [    ] o.a.s.c.a.OverseerTriggerThread Current znodeVersion 3, lastZnodeVersion 3
   [junit4]   2> 9891 DEBUG (ScheduledTrigger-31-thread-2) [    ] o.a.s.c.a.NodeLostTrigger Running NodeLostTrigger: .auto_add_replicas with currently live nodes: 2
   [junit4]   2> 9911 DEBUG (ScheduledTrigger-31-thread-4) [    ] o.a.s.c.a.NodeLostTrigger Running NodeLostTrigger: .auto_add_replicas with currently live nodes: 2
   [junit4]   2> 9932 DEBUG (ScheduledTrigger-31-thread-3) [    ] o.a.s.c.a.NodeLostTrigger Running NodeLostTrigger: .auto_add_replicas with currently live nodes: 2
   [junit4]   2> 9952 DEBUG (ScheduledTrigger-31-thread-4) [    ] o.a.s.c.a.NodeLostTrigger Running NodeLostTrigger: .auto_add_replicas with currently live nodes: 2
   [junit4]   2> 9973 DEBUG (ScheduledTrigger-31-thread-2) [    ] o.a.s.c.a.NodeLostTrigger Running NodeLostTrigger: .auto_add_replicas with currently live nodes: 2
   [junit4]   2> 9993 DEBUG (ScheduledTrigger-31-thread-1) [    ] o.a.s.c.a.NodeLostTrigger Running NodeLostTrigger: .auto_add_replicas with currently live nodes: 2
   [junit4]   2> 10013 DEBUG (ScheduledTrigger-31-thread-4) [    ] o.a.s.c.a.NodeLostTrigger Running NodeLostTrigger: .auto_add_replicas with currently live nodes: 2
   [junit4]   2> 10014 DEBUG (ScheduledTrigger-31-thread-2) [    ] o.a.s.c.a.ScheduledTriggers ++++++++ Cooldown inactive - processing event: {
   [junit4]   2>   "id":"50d330a0b3de7T7o355zwky2xt479ew84m6fwm5",
   [junit4]   2>   "source":"index_size_trigger",
   [junit4]   2>   "eventTime":1421887746555367,
   [junit4]   2>   "eventType":"INDEXSIZE",
   [junit4]   2>   "properties":{
   [junit4]   2>     "aboveSize":{},
   [junit4]   2>     "belowSize":{"testMergeIntegration_collection":[
   [junit4]   2>         "{\"core_node1\":{\n    \"core\":\"testMergeIntegration_collection_shard1_replica_n1\",\n    \"leader\":\"true\",\n    \"SEARCHER.searcher.maxDoc\":7,\n    \"SEARCHER.searcher.deletedDocs\":5,\n    \"INDEX.sizeInBytes\":1,\n    \"__docs__\":2,\n    \"violationType\":\"belowDocs\",\n    \"node_name\":\"127.0.0.1:10001_solr\",\n    \"state\":\"active\",\n    \"type\":\"NRT\",\n    \"SEARCHER.searcher.numDocs\":2,\n    \"__bytes__\":1,\n    \"shard\":\"shard1\",\n    \"collection\":\"testMergeIntegration_collection\"}}",
   [junit4]   2>         "{\"core_node3\":{\n    \"core\":\"testMergeIntegration_collection_shard2_replica_n3\",\n    \"leader\":\"true\",\n    \"SEARCHER.searcher.maxDoc\":3,\n    \"SEARCHER.searcher.deletedDocs\":0,\n    \"INDEX.sizeInBytes\":1,\n    \"__docs__\":3,\n    \"violationType\":\"belowDocs\",\n    \"node_name\":\"127.0.0.1:10001_solr\",\n    \"state\":\"active\",\n    \"type\":\"NRT\",\n    \"SEARCHER.searcher.numDocs\":3,\n    \"__bytes__\":1,\n    \"shard\":\"shard2\",\n    \"collection\":\"testMergeIntegration_collection\"}}"]},
   [junit4]   2>     "requestedOps":["Op{action=MERGESHARDS, hints={COLL_SHARD=[{\n  \"first\":\"testMergeIntegration_collection\",\n  \"second\":\"shard2\"}, {\n  \"first\":\"testMergeIntegration_collection\",\n  \"second\":\"shard1\"}]}}"]}}
   [junit4]   2> 10015 DEBUG (ScheduledTrigger-31-thread-2) [    ] o.a.s.c.a.ScheduledTriggers Pausing all triggers: [index_size_trigger, .auto_add_replicas, .scheduled_maintenance]
   [junit4]   2> 10018 INFO  (ScheduledTrigger-31-thread-2) [    ] o.a.s.c.a.IndexSizeTriggerTest =======> CapturedEvent{timestamp=1421897192257467, stage=STARTED, actionName='null', event={
   [junit4]   2>   "id":"50d330a0b3de7T7o355zwky2xt479ew84m6fwm5",
   [junit4]   2>   "source":"index_size_trigger",
   [junit4]   2>   "eventTime":1421887746555367,
   [junit4]   2>   "eventType":"INDEXSIZE",
   [junit4]   2>   "properties":{
   [junit4]   2>     "aboveSize":{},
   [junit4]   2>     "belowSize":{"testMergeIntegration_collection":[
   [junit4]   2>         "{\"core_node1\":{\n    \"core\":\"testMergeIntegration_collection_shard1_replica_n1\",\n    \"leader\":\"true\",\n    \"SEARCHER.searcher.maxDoc\":7,\n    \"SEARCHER.searcher.deletedDocs\":5,\n    \"INDEX.sizeInBytes\":1,\n    \"__docs__\":2,\n    \"violationType\":\"belowDocs\",\n    \"node_name\":\"127.0.0.1:10001_solr\",\n    \"state\":\"active\",\n    \"type\":\"NRT\",\n    \"SEARCHER.searcher.numDocs\":2,\n    \"__bytes__\":1,\n    \"shard\":\"shard1\",\n    \"collection\":\"testMergeIntegration_collection\"}}",
   [junit4]   2>         "{\"core_node3\":{\n    \"core\":\"testMergeIntegration_collection_shard2_replica_n3\",\n    \"leader\":\"true\",\n    \"SEARCHER.searcher.maxDoc\":3,\n    \"SEARCHER.searcher.deletedDocs\":0,\n    \"INDEX.sizeInBytes\":1,\n    \"__docs__\":3,\n    \"violationType\":\"belowDocs\",\n    \"node_name\":\"127.0.0.1:10001_solr\",\n    \"state\":\"active\",\n    \"type\":\"NRT\",\n    \"SEARCHER.searcher.numDocs\":3,\n    \"__bytes__\":1,\n    \"shard\":\"shard2\",\n    \"collection\":\"testMergeIntegration_collection\"}}"]},
   [junit4]   2>     "_enqueue_time_":1421897121534617,
   [junit4]   2>     "requestedOps":["Op{action=MERGESHARDS, hints={COLL_SHARD=[{\n  \"first\":\"testMergeIntegration_collection\",\n  \"second\":\"shard2\"}, {\n  \"first\":\"testMergeIntegration_collection\",\n  \"second\":\"shard1\"}]}}"]}}, context={}, config={
   [junit4]   2>   "trigger":"index_size_trigger",
   [junit4]   2>   "stage":[
   [junit4]   2>     "STARTED",
   [junit4]   2>     "ABORTED",
   [junit4]   2>     "SUCCEEDED",
   [junit4]   2>     "FAILED"],
   [junit4]   2>   "afterAction":[
   [junit4]   2>     "compute_plan",
   [junit4]   2>     "execute_plan"],
   [junit4]   2>   "class":"org.apache.solr.cloud.autoscaling.IndexSizeTriggerTest$CapturingTriggerListener",
   [junit4]   2>   "beforeAction":[
   [junit4]   2>     "compute_plan",
   [junit4]   2>     "execute_plan"]}, message='null'}
   [junit4]   2> 10056 DEBUG (AutoscalingActionExecutor-32-thread-1) [    ] o.a.s.c.a.ScheduledTriggers -- processing actions for {
   [junit4]   2>   "id":"50d330a0b3de7T7o355zwky2xt479ew84m6fwm5",
   [junit4]   2>   "source":"index_size_trigger",
   [junit4]   2>   "eventTime":1421887746555367,
   [junit4]   2>   "eventType":"INDEXSIZE",
   [junit4]   2>   "properties":{
   [junit4]   2>     "aboveSize":{},
   [junit4]   2>     "belowSize":{"testMergeIntegration_collection":[
   [junit4]   2>         "{\"core_node1\":{\n    \"core\":\"testMergeIntegration_collection_shard1_replica_n1\",\n    \"leader\":\"true\",\n    \"SEARCHER.searcher.maxDoc\":7,\n    \"SEARCHER.searcher.deletedDocs\":5,\n    \"INDEX.sizeInBytes\":1,\n    \"__docs__\":2,\n    \"violationType\":\"belowDocs\",\n    \"node_name\":\"127.0.0.1:10001_solr\",\n    \"state\":\"active\",\n    \"type\":\"NRT\",\n    \"SEARCHER.searcher.numDocs\":2,\n    \"__bytes__\":1,\n    \"shard\":\"shard1\",\n    \"collection\":\"testMergeIntegration_collection\"}}",
   [junit4]   2>         "{\"core_node3\":{\n    \"core\":\"testMergeIntegration_collection_shard2_replica_n3\",\n    \"leader\":\"true\",\n    \"SEARCHER.searcher.maxDoc\":3,\n    \"SEARCHER.searcher.deletedDocs\":0,\n    \"INDEX.sizeInBytes\":1,\n    \"__docs__\":3,\n    \"violationType\":\"belowDocs\",\n    \"node_name\":\"127.0.0.1:10001_solr\",\n    \"state\":\"active\",\n    \"type\":\"NRT\",\n    \"SEARCHER.searcher.numDocs\":3,\n    \"__bytes__\":1,\n    \"shard\":\"shard2\",\n    \"collection\":\"testMergeIntegration_collection\"}}"]},
   [junit4]   2>     "_enqueue_time_":1421897121534617,
   [junit4]   2>     "requestedOps":["Op{action=MERGESHARDS, hints={COLL_SHARD=[{\n  \"first\":\"testMergeIntegration_collection\",\n  \"second\":\"shard2\"}, {\n  \"first\":\"testMergeIntegration_collection\",\n  \"second\":\"shard1\"}]}}"]}}
   [junit4]   2> 10059 INFO  (AutoscalingActionExecutor-32-thread-1) [    ] o.a.s.c.a.IndexSizeTriggerTest =======> CapturedEvent{timestamp=1421899244386517, stage=BEFORE_ACTION, actionName='compute_plan', event={
   [junit4]   2>   "id":"50d330a0b3de7T7o355zwky2xt479ew84m6fwm5",
   [junit4]   2>   "source":"index_size_trigger",
   [junit4]   2>   "eventTime":1421887746555367,
   [junit4]   2>   "eventType":"INDEXSIZE",
   [junit4]   2>   "properties":{
   [junit4]   2>     "aboveSize":{},
   [junit4]   2>     "belowSize":{"testMergeIntegration_collection":[
   [junit4]   2>         "{\"core_node1\":{\n    \"core\":\"testMergeIntegration_collection_shard1_replica_n1\",\n    \"leader\":\"true\",\n    \"SEARCHER.searcher.maxDoc\":7,\n    \"SEARCHER.searcher.deletedDocs\":5,\n    \"INDEX.sizeInBytes\":1,\n    \"__docs__\":2,\n    \"violationType\":\"belowDocs\",\n    \"node_name\":\"127.0.0.1:10001_solr\",\n    \"state\":\"active\",\n    \"type\":\"NRT\",\n    \"SEARCHER.searcher.numDocs\":2,\n    \"__bytes__\":1,\n    \"shard\":\"shard1\",\n    \"collection\":\"testMergeIntegration_collection\"}}",
   [junit4]   2>         "{\"core_node3\":{\n    \"core\":\"testMergeIntegration_collection_shard2_replica_n3\",\n    \"leader\":\"true\",\n    \"SEARCHER.searcher.maxDoc\":3,\n    \"SEARCHER.searcher.deletedDocs\":0,\n    \"INDEX.sizeInBytes\":1,\n    \"__docs__\":3,\n    \"violationType\":\"belowDocs\",\n    \"node_name\":\"127.0.0.1:10001_solr\",\n    \"state\":\"active\",\n    \"type\":\"NRT\",\n    \"SEARCHER.searcher.numDocs\":3,\n    \"__bytes__\":1,\n    \"shard\":\"shard2\",\n    \"collection\":\"testMergeIntegration_collection\"}}"]},
   [junit4]   2>     "_enqueue_time_":1421897121534617,
   [junit4]   2>     "requestedOps":["Op{action=MERGESHARDS, hints={COLL_SHARD=[{\n  \"first\":\"testMergeIntegration_collection\",\n  \"second\":\"shard2\"}, {\n  \"first\":\"testMergeIntegration_collection\",\n  \"second\":\"shard1\"}]}}"]}}, context={properties.BEFORE_ACTION=[compute_plan], source=index_size_trigger}, config={
   [junit4]   2>   "trigger":"index_size_trigger",
   [junit4]   2>   "stage":[
   [junit4]   2>     "STARTED",
   [junit4]   2>     "ABORTED",
   [junit4]   2>     "SUCCEEDED",
   [junit4]   2>     "FAILED"],
   [junit4]   2>   "afterAction":[
   [junit4]   2>     "compute_plan",
   [junit4]   2>     "execute_plan"],
   [junit4]   2>   "class":"org.apache.solr.cloud.autoscaling.IndexSizeTriggerTest$CapturingTriggerListener",
   [junit4]   2>   "beforeAction":[
   [junit4]   2>     "compute_plan",
   [junit4]   2>     "execute_plan"]}, message='null'}
   [junit4]   2> 10075 DEBUG (AutoscalingActionExecutor-32-thread-1) [    ] o.a.s.c.a.ComputePlanAction -- processing event: {
   [junit4]   2>   "id":"50d330a0b3de7T7o355zwky2xt479ew84m6fwm5",
   [junit4]   2>   "source":"index_size_trigger",
   [junit4]   2>   "eventTime":1421887746555367,
   [junit4]   2>   "eventType":"INDEXSIZE",
   [junit4]   2>   "properties":{
   [junit4]   2>     "aboveSize":{},
   [junit4]   2>     "belowSize":{"testMergeIntegration_collection":[
   [junit4]   2>         "{\"core_node1\":{\n    \"core\":\"testMergeIntegration_collection_shard1_replica_n1\",\n    \"leader\":\"true\",\n    \"SEARCHER.searcher.maxDoc\":7,\n    \"SEARCHER.searcher.deletedDocs\":5,\n    \"INDEX.sizeInBytes\":1,\n    \"__docs__\":2,\n    \"violationType\":\"belowDocs\",\n    \"node_name\":\"127.0.0.1:10001_solr\",\n    \"state\":\"active\",\n    \"type\":\"NRT\",\n    \"SEARCHER.searcher.numDocs\":2,\n    \"__bytes__\":1,\n    \"shard\":\"shard1\",\n    \"collection\":\"testMergeIntegration_collection\"}}",
   [junit4]   2>         "{\"core_node3\":{\n    \"core\":\"testMergeIntegration_collection_shard2_replica_n3\",\n    \"leader\":\"true\",\n    \"SEARCHER.searcher.maxDoc\":3,\n    \"SEARCHER.searcher.deletedDocs\":0,\n    \"INDEX.sizeInBytes\":1,\n    \"__docs__\":3,\n    \"violationType\":\"belowDocs\",\n    \"node_name\":\"127.0.0.1:10001_solr\",\n    \"state\":\"active\",\n    \"type\":\"NRT\",\n    \"SEARCHER.searcher.numDocs\":3,\n    \"__bytes__\":1,\n    \"shard\":\"shard2\",\n    \"collection\":\"testMergeIntegration_collection\"}}"]},
   [junit4]   2>     "_enqueue_time_":1421897121534617,
   [junit4]   2>     "requestedOps":["Op{action=MERGESHARDS, hints={COLL_SHARD=[{\n  \"first\":\"testMergeIntegration_collection\",\n  \"second\":\"shard2\"}, {\n  \"first\":\"testMergeIntegration_collection\",\n  \"second\":\"shard1\"}]}}"]}} with context properties: {BEFORE_ACTION=[compute_plan]}
   [junit4]   2> 10108 INFO  (AutoscalingActionExecutor-32-thread-1) [    ] o.a.s.c.a.ComputePlanAction Computed plan empty, remained 0 requested ops to try.
   [junit4]   2> 10109 INFO  (AutoscalingActionExecutor-32-thread-1) [    ] o.a.s.c.s.c.a.PolicyHelper returnSession, curr-time 1421901771 sessionWrapper.createTime 1421901560309217, this.sessionWrapper.createTime 1421901560309217 
   [junit4]   2> 10109 INFO  (AutoscalingActionExecutor-32-thread-1) [    ] o.a.s.c.a.IndexSizeTriggerTest =======> CapturedEvent{timestamp=1421901792067367, stage=AFTER_ACTION, actionName='compute_plan', event={
   [junit4]   2>   "id":"50d330a0b3de7T7o355zwky2xt479ew84m6fwm5",
   [junit4]   2>   "source":"index_size_trigger",
   [junit4]   2>   "eventTime":1421887746555367,
   [junit4]   2>   "eventType":"INDEXSIZE",
   [junit4]   2>   "properties":{
   [junit4]   2>     "__start__":1,
   [junit4]   2>     "aboveSize":{},
   [junit4]   2>     "belowSize":{"testMergeIntegration_collection":[
   [junit4]   2>         "{\"core_node1\":{\n    \"core\":\"testMergeIntegration_collection_shard1_replica_n1\",\n    \"leader\":\"true\",\n    \"SEARCHER.searcher.maxDoc\":7,\n    \"SEARCHER.searcher.deletedDocs\":5,\n    \"INDEX.sizeInBytes\":1,\n    \"__docs__\":2,\n    \"violationType\":\"belowDocs\",\n    \"node_name\":\"127.0.0.1:10001_solr\",\n    \"state\":\"active\",\n    \"type\":\"NRT\",\n    \"SEARCHER.searcher.numDocs\":2,\n    \"__bytes__\":1,\n    \"shard\":\"shard1\",\n    \"collection\":\"testMergeIntegration_collection\"}}",
   [junit4]   2>         "{\"core_node3\":{\n    \"core\":\"testMergeIntegration_collection_shard2_replica_n3\",\n    \"leader\":\"true\",\n    \"SEARCHER.searcher.maxDoc\":3,\n    \"SEARCHER.searcher.deletedDocs\":0,\n    \"INDEX.sizeInBytes\":1,\n    \"__docs__\":3,\n    \"violationType\":\"belowDocs\",\n    \"node_name\":\"127.0.0.1:10001_solr\",\n    \"state\":\"active\",\n    \"type\":\"NRT\",\n    \"SEARCHER.searcher.numDocs\":3,\n    \"__bytes__\":1,\n    \"shard\":\"shard2\",\n    \"collection\":\"testMergeIntegration_collection\"}}"]},
   [junit4]   2>     "_enqueue_time_":1421897121534617,
   [junit4]   2>     "requestedOps":["Op{action=MERGESHARDS, hints={COLL_SHARD=[{\n  \"first\":\"testMergeIntegration_collection\",\n  \"second\":\"shard2\"}, {\n  \"first\":\"testMergeIntegration_collection\",\n  \"second\":\"shard1\"}]}}"]}}, context={properties.unsupportedOps=[Op{action=MERGESHARDS, hints={COLL_SHARD=[{
   [junit4]   2>   "first":"testMergeIntegration_collection",
   [junit4]   2>   "second":"shard2"}, {
   [junit4]   2>   "first":"testMergeIntegration_collection",
   [junit4]   2>   "second":"shard1"}]}}], properties.BEFORE_ACTION=[compute_plan], source=index_size_trigger, properties.AFTER_ACTION=[compute_plan]}, config={
   [junit4]   2>   "trigger":"index_size_trigger",
   [junit4]   2>   "stage":[
   [junit4]   2>     "STARTED",
   [junit4]   2>     "ABORTED",
   [junit4]   2>     "SUCCEEDED",
   [junit4]   2>     "FAILED"],
   [junit4]   2>   "afterAction":[
   [junit4]   2>     "compute_plan",
   [junit4]   2>     "execute_plan"],
   [junit4]   2>   "class":"org.apache.solr.cloud.autoscaling.IndexSizeTriggerTest$CapturingTriggerListener",
   [junit4]   2>   "beforeAction":[
   [junit4]   2>     "compute_plan",
   [junit4]   2>     "execute_plan"]}, message='null'}
   [junit4]   2> 10110 INFO  (AutoscalingActionExecutor-32-thread-1) [    ] o.a.s.c.a.IndexSizeTriggerTest =======> CapturedEvent{timestamp=1421901823533317, stage=BEFORE_ACTION, actionName='execute_plan', event={
   [junit4]   2>   "id":"50d330a0b3de7T7o355zwky2xt479ew84m6fwm5",
   [junit4]   2>   "source":"index_size_trigger",
   [junit4]   2>   "eventTime":1421887746555367,
   [junit4]   2>   "eventType":"INDEXSIZE",
   [junit4]   2>   "properties":{
   [junit4]   2>     "__start__":1,
   [junit4]   2>     "aboveSize":{},
   [junit4]   2>     "belowSize":{"testMergeIntegration_collection":[
   [junit4]   2>         "{\"core_node1\":{\n    \"core\":\"testMergeIntegration_collection_shard1_replica_n1\",\n    \"leader\":\"true\",\n    \"SEARCHER.searcher.maxDoc\":7,\n    \"SEARCHER.searcher.deletedDocs\":5,\n    \"INDEX.sizeInBytes\":1,\n    \"__docs__\":2,\n    \"violationType\":\"belowDocs\",\n    \"node_name\":\"127.0.0.1:10001_solr\",\n    \"state\":\"active\",\n    \"type\":\"NRT\",\n    \"SEARCHER.searcher.numDocs\":2,\n    \"__bytes__\":1,\n    \"shard\":\"shard1\",\n    \"collection\":\"testMergeIntegration_collection\"}}",
   [junit4]   2>         "{\"core_node3\":{\n    \"core\":\"testMergeIntegration_collection_shard2_replica_n3\",\n    \"leader\":\"true\",\n    \"SEARCHER.searcher.maxDoc\":3,\n    \"SEARCHER.searcher.deletedDocs\":0,\n    \"INDEX.sizeInBytes\":1,\n    \"__docs__\":3,\n    \"violationType\":\"belowDocs\",\n    \"node_name\":\"127.0.0.1:10001_solr\",\n    \"state\":\"active\",\n    \"type\":\"NRT\",\n    \"SEARCHER.searcher.numDocs\":3,\n    \"__bytes__\":1,\n    \"shard\":\"shard2\",\n    \"collection\":\"testMergeIntegration_collection\"}}"]},
   [junit4]   2>     "_enqueue_time_":1421897121534617,
   [junit4]   2>     "requestedOps":["Op{action=MERGESHARDS, hints={COLL_SHARD=[{\n  \"first\":\"testMergeIntegration_collection\",\n  \"second\":\"shard2\"}, {\n  \"first\":\"testMergeIntegration_collection\",\n  \"second\":\"shard1\"}]}}"]}}, context={properties.unsupportedOps=[Op{action=MERGESHARDS, hints={COLL_SHARD=[{
   [junit4]   2>   "first":"testMergeIntegration_collection",
   [junit4]   2>   "second":"shard2"}, {
   [junit4]   2>   "first":"testMergeIntegration_collection",
   [junit4]   2>   "second":"shard1"}]}}], properties.BEFORE_ACTION=[compute_plan, execute_plan], source=index_size_trigger, properties.AFTER_ACTION=[compute_plan]}, config={
   [junit4]   2>   "trigger":"index_size_trigger",
   [junit4]   2>   "stage":[
   [junit4]   2>     "STARTED",
   [junit4]   2>     "ABORTED",
   [junit4]   2>     "SUCCEEDED",
   [junit4]   2>     "FAILED"],
   [junit4]   2>   "afterAction":[
   [junit4]   2>     "compute_plan",
   [junit4]   2>     "execute_plan"],
   [junit4]   2>   "class":"org.apache.solr.cloud.autoscaling.IndexSizeTriggerTest$CapturingTriggerListener",
   [junit4]   2>   "beforeAction":[
   [junit4]   2>     "compute_plan",
   [junit4]   2>     "execute_plan"]}, message='null'}
   [junit4]   2> 10110 DEBUG (AutoscalingActionExecutor-32-thread-1) [    ] o.a.s.c.a.ExecutePlanAction -- processing event: {
   [junit4]   2>   "id":"50d330a0b3de7T7o355zwky2xt479ew84m6fwm5",
   [junit4]   2>   "source":"index_size_trigger",
   [junit4]   2>   "eventTime":1421887746555367,
   [junit4]   2>   "eventType":"INDEXSIZE",
   [junit4]   2>   "properties":{
   [junit4]   2>     "__start__":1,
   [junit4]   2>     "aboveSize":{},
   [junit4]   2>     "belowSize":{"testMergeIntegration_collection":[
   [junit4]   2>         "{\"core_node1\":{\n    \"core\":\"testMergeIntegration_collection_shard1_replica_n1\",\n    \"leader\":\"true\",\n    \"SEARCHER.searcher.maxDoc\":7,\n    \"SEARCHER.searcher.deletedDocs\":5,\n    \"INDEX.sizeInBytes\":1,\n    \"__docs__\":2,\n    \"violationType\":\"belowDocs\",\n    \"node_name\":\"127.0.0.1:10001_solr\",\n    \"state\":\"active\",\n    \"type\":\"NRT\",\n    \"SEARCHER.searcher.numDocs\":2,\n    \"__bytes__\":1,\n    \"shard\":\"shard1\",\n    \"collection\":\"testMergeIntegration_collection\"}}",
   [junit4]   2>         "{\"core_node3\":{\n    \"core\":\"testMergeIntegration_collection_shard2_replica_n3\",\n    \"leader\":\"true\",\n    \"SEARCHER.searcher.maxDoc\":3,\n    \"SEARCHER.searcher.deletedDocs\":0,\n    \"INDEX.sizeInBytes\":1,\n    \"__docs__\":3,\n    \"violationType\":\"belowDocs\",\n    \"node_name\":\"127.0.0.1:10001_solr\",\n    \"state\":\"active\",\n    \"type\":\"NRT\",\n    \"SEARCHER.searcher.numDocs\":3,\n    \"__bytes__\":1,\n    \"shard\":\"shard2\",\n    \"collection\":\"testMergeIntegration_collection\"}}"]},
   [junit4]   2>     "_enqueue_time_":1421897121534617,
   [junit4]   2>     "requestedOps":["Op{action=MERGESHARDS, hints={COLL_SHARD=[{\n  \"first\":\"testMergeIntegration_collection\",\n  \"second\":\"shard2\"}, {\n  \"first\":\"testMergeIntegration_collection\",\n  \"second\":\"shard1\"}]}}"]}} with context properties: {AFTER_ACTION=[compute_plan], unsupportedOps=[Op{action=MERGESHARDS, hints={COLL_SHARD=[{
   [junit4]   2>   "first":"testMergeIntegration_collection",
   [junit4]   2>   "second":"shard2"}, {
   [junit4]   2>   "first":"testMergeIntegration_collection",
   [junit4]   2>   "second":"shard1"}]}}], BEFORE_ACTION=[compute_plan, execute_plan]}
   [junit4]   2> 10111 INFO  (AutoscalingActionExecutor-32-thread-1) [    ] o.a.s.c.a.ExecutePlanAction No operations to execute for event: {
   [junit4]   2>   "id":"50d330a0b3de7T7o355zwky2xt479ew84m6fwm5",
   [junit4]   2>   "source":"index_size_trigger",
   [junit4]   2>   "eventTime":1421887746555367,
   [junit4]   2>   "eventType":"INDEXSIZE",
   [junit4]   2>   "properties":{
   [junit4]   2>     "__start__":1,
   [junit4]   2>     "aboveSize":{},
   [junit4]   2>     "belowSize":{"testMergeIntegration_collection":[
   [junit4]   2>         "{\"core_node1\":{\n    \"core\":\"testMergeIntegration_collection_shard1_replica_n1\",\n    \"leader\":\"true\",\n    \"SEARCHER.searcher.maxDoc\":7,\n    \"SEARCHER.searcher.deletedDocs\":5,\n    \"INDEX.sizeInBytes\":1,\n    \"__docs__\":2,\n    \"violationType\":\"belowDocs\",\n    \"node_name\":\"127.0.0.1:10001_solr\",\n    \"state\":\"active\",\n    \"type\":\"NRT\",\n    \"SEARCHER.searcher.numDocs\":2,\n    \"__bytes__\":1,\n    \"shard\":\"shard1\",\n    \"collection\":\"testMergeIntegration_collection\"}}",
   [junit4]   2>         "{\"core_node3\":{\n    \"core\":\"testMergeIntegration_collection_shard2_replica_n3\",\n    \"leader\":\"true\",\n    \"SEARCHER.searcher.maxDoc\":3,\n    \"SEARCHER.searcher.deletedDocs\":0,\n    \"INDEX.sizeInBytes\":1,\n    \"__docs__\":3,\n    \"violationType\":\"belowDocs\",\n    \"node_name\":\"127.0.0.1:10001_solr\",\n    \"state\":\"active\",\n    \"type\":\"NRT\",\n    \"SEARCHER.searcher.numDocs\":3,\n    \"__bytes__\":1,\n    \"shard\":\"shard2\",\n    \"collection\":\"testMergeIntegration_collection\"}}"]},
   [junit4]   2>     "_enqueue_time_":1421897121534617,
   [junit4]   2>     "requestedOps":["Op{action=MERGESHARDS, hints={COLL_SHARD=[{\n  \"first\":\"testMergeIntegration_collection\",\n  \"second\":\"shard2\"}, {\n  \"first\":\"testMergeIntegration_collection\",\n  \"second\":\"shard1\"}]}}"]}}
   [junit4]   2> 10111 INFO  (AutoscalingActionExecutor-32-thread-1) [    ] o.a.s.c.a.IndexSizeTriggerTest =======> CapturedEvent{timestamp=1421901891571767, stage=AFTER_ACTION, actionName='execute_plan', event={
   [junit4]   2>   "id":"50d330a0b3de7T7o355zwky2xt479ew84m6fwm5",
   [junit4]   2>   "source":"index_size_trigger",
   [junit4]   2>   "eventTime":1421887746555367,
   [junit4]   2>   "eventType":"INDEXSIZE",
   [junit4]   2>   "properties":{
   [junit4]   2>     "__start__":1,
   [junit4]   2>     "aboveSize":{},
   [junit4]   2>     "belowSize":{"testMergeIntegration_collection":[
   [junit4]   2>         "{\"core_node1\":{\n    \"core\":\"testMergeIntegration_collection_shard1_replica_n1\",\n    \"leader\":\"true\",\n    \"SEARCHER.searcher.maxDoc\":7,\n    \"SEARCHER.searcher.deletedDocs\":5,\n    \"INDEX.sizeInBytes\":1,\n    \"__docs__\":2,\n    \"violationType\":\"belowDocs\",\n    \"node_name\":\"127.0.0.1:10001_solr\",\n    \"state\":\"active\",\n    \"type\":\"NRT\",\n    \"SEARCHER.searcher.numDocs\":2,\n    \"__bytes__\":1,\n    \"shard\":\"shard1\",\n    \"collection\":\"testMergeIntegration_collection\"}}",
   [junit4]   2>         "{\"core_node3\":{\n    \"core\":\"testMergeIntegration_collection_shard2_replica_n3\",\n    \"leader\":\"true\",\n    \"SEARCHER.searcher.maxDoc\":3,\n    \"SEARCHER.searcher.deletedDocs\":0,\n    \"INDEX.sizeInBytes\":1,\n    \"__docs__\":3,\n    \"violationType\":\"belowDocs\",\n    \"node_name\":\"127.0.0.1:10001_solr\",\n    \"state\":\"active\",\n    \"type\":\"NRT\",\n    \"SEARCHER.searcher.numDocs\":3,\n    \"__bytes__\":1,\n    \"shard\":\"shard2\",\n    \"collection\":\"testMergeIntegration_collection\"}}"]},
   [junit4]   2>     "_enqueue_time_":1421897121534617,
   [junit4]   2>     "requestedOps":["Op{action=MERGESHARDS, hints={COLL_SHARD=[{\n  \"first\":\"testMergeIntegration_collection\",\n  \"second\":\"shard2\"}, {\n  \"first\":\"testMergeIntegration_collection\",\n  \"second\":\"shard1\"}]}}"]}}, context={properties.unsupportedOps=[Op{action=MERGESHARDS, hints={COLL_SHARD=[{
   [junit4]   2>   "first":"testMergeIntegration_collection",
   [junit4]   2>   "second":"shard2"}, {
   [junit4]   2>   "first":"testMergeIntegration_collection",
   [junit4]   2>   "second":"shard1"}]}}], properties.BEFORE_ACTION=[compute_plan, execute_plan], source=index_size_trigger, properties.AFTER_ACTION=[compute_plan, execute_plan]}, config={
   [junit4]   2>   "trigger":"index_size_trigger",
   [junit4]   2>   "stage":[
   [junit4]   2>     "STARTED",
   [junit4]   2>     "ABORTED",
   [junit4]   2>     "SUCCEEDED",
   [junit4]   2>     "FAILED"],
   [junit4]   2>   "afterAction":[
   [junit4]   2>     "compute_plan",
   [junit4]   2>     "execute_plan"],
   [junit4]   2>   "class":"org.apache.solr.cloud.autoscaling.IndexSizeTriggerTest$CapturingTriggerListener",
   [junit4]   2>   "beforeAction":[
   [junit4]   2>     "compute_plan",
   [junit4]   2>     "execute_plan"]}, message='null'}
   [junit4]   2> 10112 INFO  (AutoscalingActionExecutor-32-thread-1) [    ] o.a.s.c.a.IndexSizeTriggerTest =======> CapturedEvent{timestamp=1421901950833217, stage=SUCCEEDED, actionName='null', event={
   [junit4]   2>   "id":"50d330a0b3de7T7o355zwky2xt479ew84m6fwm5",
   [junit4]   2>   "source":"index_size_trigger",
   [junit4]   2>   "eventTime":1421887746555367,
   [junit4]   2>   "eventType":"INDEXSIZE",
   [junit4]   2>   "properties":{
   [junit4]   2>     "__start__":1,
   [junit4]   2>     "aboveSize":{},
   [junit4]   2>     "belowSize":{"testMergeIntegration_collection":[
   [junit4]   2>         "{\"core_node1\":{\n    \"core\":\"testMergeIntegration_collection_shard1_replica_n1\",\n    \"leader\":\"true\",\n    \"SEARCHER.searcher.maxDoc\":7,\n    \"SEARCHER.searcher.deletedDocs\":5,\n    \"INDEX.sizeInBytes\":1,\n    \"__docs__\":2,\n    \"violationType\":\"belowDocs\",\n    \"node_name\":\"127.0.0.1:10001_solr\",\n    \"state\":\"active\",\n    \"type\":\"NRT\",\n    \"SEARCHER.searcher.numDocs\":2,\n    \"__bytes__\":1,\n    \"shard\":\"shard1\",\n    \"collection\":\"testMergeIntegration_collection\"}}",
   [junit4]   2>         "{\"core_node3\":{\n    \"core\":\"testMergeIntegration_collection_shard2_replica_n3\",\n    \"leader\":\"true\",\n    \"SEARCHER.searcher.maxDoc\":3,\n    \"SEARCHER.searcher.deletedDocs\":0,\n    \"INDEX.sizeInBytes\":1,\n    \"__docs__\":3,\n    \"violationType\":\"belowDocs\",\n    \"node_name\":\"127.0.0.1:10001_solr\",\n    \"state\":\"active\",\n    \"type\":\"NRT\",\n    \"SEARCHER.searcher.numDocs\":3,\n    \"__bytes__\":1,\n    \"shard\":\"shard2\",\n    \"collection\":\"testMergeIntegration_collection\"}}"]},
   [junit4]   2>     "_enqueue_time_":1421897121534617,
   [junit4]   2>     "requestedOps":["Op{action=MERGESHARDS, hints={COLL_SHARD=[{\n  \"first\":\"testMergeIntegration_collection\",\n  \"second\":\"shard2\"}, {\n  \"first\":\"testMergeIntegration_collection\",\n  \"second\":\"shard1\"}]}}"]}}, context={}, config={
   [junit4]   2>   "trigger":"index_size_trigger",
   [junit4]   2>   "stage":[
   [junit4]   2>     "STARTED",
   [junit4]   2>     "ABORTED",
   [junit4]   2>     "SUCCEEDED",
   [junit4]   2>     "FAILED"],
   [junit4]   2>   "afterAction":[
   [junit4]   2>     "compute_plan",
   [junit4]   2>     "execute_plan"],
   [junit4]   2>   "class":"org.apache.solr.cloud.autoscaling.IndexSizeTriggerTest$CapturingTriggerListener",
   [junit4]   2>   "beforeAction":[
   [junit4]   2>     "compute_plan",
   [junit4]   2>     "execute_plan"]}, message='null'}
   [junit4]   2> 10118 INFO  (TEST-IndexSizeTriggerTest.testMergeIntegration-seed#[454C9BBDC3034E4D]) [    ] o.a.s.c.a.IndexSizeTriggerTest #######################################
   [junit4]   2> ############ CLUSTER STATE ############
   [junit4]   2> #######################################
   [junit4]   2> ## Live nodes:		2
   [junit4]   2> ## Empty nodes:	0
   [junit4]   2> ## Dead nodes:		0
   [junit4]   2> ## Collections:	[testMergeIntegration_collection]
   [junit4]   2> DocCollection(testMergeIntegration_collection//clusterstate.json/19)={
   [junit4]   2>   "replicationFactor":"2",
   [junit4]   2>   "pullReplicas":"0",
   [junit4]   2>   "router":{"name":"compositeId"},
   [junit4]   2>   "maxShardsPerNode":"2",
   [junit4]   2>   "autoAddReplicas":"false",
   [junit4]   2>   "nrtReplicas":"2",
   [junit4]   2>   "tlogReplicas":"0",
   [junit4]   2>   "autoCreated":"true",
   [junit4]   2>   "shards":{
   [junit4]   2>     "shard2":{
   [junit4]   2>       "replicas":{
   [junit4]   2>         "core_node3":{
   [junit4]   2>           "core":"testMergeIntegration_collection_shard2_replica_n3",
   [junit4]   2>           "leader":"true",
   [junit4]   2>           "SEARCHER.searcher.maxDoc":3,
   [junit4]   2>           "SEARCHER.searcher.deletedDocs":0,
   [junit4]   2>           "INDEX.sizeInBytes":1,
   [junit4]   2>           "node_name":"127.0.0.1:10001_solr",
   [junit4]   2>           "state":"active",
   [junit4]   2>           "type":"NRT",
   [junit4]   2>           "SEARCHER.searcher.numDocs":3},
   [junit4]   2>         "core_node4":{
   [junit4]   2>           "core":"testMergeIntegration_collection_shard2_replica_n4",
   [junit4]   2>           "SEARCHER.searcher.maxDoc":3,
   [junit4]   2>           "SEARCHER.searcher.deletedDocs":0,
   [junit4]   2>           "INDEX.sizeInBytes":1,
   [junit4]   2>           "node_name":"127.0.0.1:10000_solr",
   [junit4]   2>           "state":"active",
   [junit4]   2>           "type":"NRT",
   [junit4]   2>           "SEARCHER.searcher.numDocs":3}},
   [junit4]   2>       "range":"0-7fffffff",
   [junit4]   2>       "state":"active"},
   [junit4]   2>     "shard1":{
   [junit4]   2>       "replicas":{
   [junit4]   2>         "core_node1":{
   [junit4]   2>           "core":"testMergeIntegration_collection_shard1_replica_n1",
   [junit4]   2>           "leader":"true",
   [junit4]   2>           "SEARCHER.searcher.maxDoc":7,
   [junit4]   2>           "SEARCHER.searcher.deletedDocs":5,
   [junit4]   2>           "INDEX.sizeInBytes":1,
   [junit4]   2>           "node_name":"127.0.0.1:10001_solr",
   [junit4]   2>           "state":"active",
   [junit4]   2>           "type":"NRT",
   [junit4]   2>           "SEARCHER.searcher.numDocs":2},
   [junit4]   2>         "core_node2":{
   [junit4]   2>           "core":"testMergeIntegration_collection_shard1_replica_n2",
   [junit4]   2>           "SEARCHER.searcher.maxDoc":7,
   [junit4]   2>           "SEARCHER.searcher.deletedDocs":5,
   [junit4]   2>           "INDEX.sizeInBytes":1,
   [junit4]   2>           "node_name":"127.0.0.1:10000_solr",
   [junit4]   2>           "state":"active",
   [junit4]   2>           "type":"NRT",
   [junit4]   2>           "SEARCHER.searcher.numDocs":2}},
   [junit4]   2>       "range":"80000000-ffffffff",
   [junit4]   2>       "state":"active"}}}
   [junit4]   2> ## Max replicas per node:	2
   [junit4]   2> ## Min replicas per node:	2
   [junit4]   2> ## Total replicas:		4
   [junit4]   2> ## * testMergeIntegration_collection		4
   [junit4]   2> ##		- active           4
   [junit4]   2> ######### Solr op counts ##########
   [junit4]   2> ##		- CREATE             1
   [junit4]   2> ##		- autoscaling        3
   [junit4]   2> ##		- update            18
   [junit4]   2> ######### Autoscaling event counts ###########
   [junit4]   2> ## * Trigger: index_size_trigger
   [junit4]   2> ##		- STARTED         1
   [junit4]   2> 
   [junit4]   2> 10119 DEBUG (TEST-IndexSizeTriggerTest.testMergeIntegration-seed#[454C9BBDC3034E4D]) [    ] o.a.s.c.a.OverseerTriggerThread Refreshing /autoscaling.json with znode version 4
   [junit4]   2> 10119 DEBUG (Simulated OverseerAutoScalingTriggerThread) [    ] o.a.s.c.a.OverseerTriggerThread Processed trigger updates upto znodeVersion 4
   [junit4]   2> 10119 DEBUG (Simulated OverseerAutoScalingTriggerThread) [    ] o.a.s.c.a.OverseerTriggerThread -- clean old nodeLost markers
   [junit4]   2> 10120 DEBUG (Simulated OverseerAutoScalingTriggerThread) [    ] o.a.s.c.a.OverseerTriggerThread -- clean old nodeAdded markers
   [junit4]   2> 10120 DEBUG (Simulated OverseerAutoScalingTriggerThread) [    ] o.a.s.c.a.OverseerTriggerThread Current znodeVersion 4, lastZnodeVersion 4
   [junit4]   2> 10148 DEBUG (AutoscalingActionExecutor-32-thread-1) [    ] o.a.s.c.a.ScheduledTriggers -- processing took 4691 ms for event id=50d330a0b3de7T7o355zwky2xt479ew84m6fwm5
   [junit4]   2> 10220 INFO  (TEST-IndexSizeTriggerTest.testMergeIntegration-seed#[454C9BBDC3034E4D]) [    ] o.a.s.SolrTestCaseJ4 ###Ending testMergeIntegration
   [junit4]   2> 10259 INFO  (TEST-IndexSizeTriggerTest.testTrigger-seed#[454C9BBDC3034E4D]) [    ] o.a.s.SolrTestCaseJ4 ###Starting testTrigger
   [junit4]   2> 10324 DEBUG (simCloudManagerPool-30-thread-36) [    ] o.a.s.c.a.s.SimClusterStateProvider -- elected new leader for testTrigger_collection / shard1: {"core_node1":{
   [junit4]   2>     "core":"testTrigger_collection_shard1_replica_n1",
   [junit4]   2>     "leader":"true",
   [junit4]   2>     "SEARCHER.searcher.maxDoc":0,
   [junit4]   2>     "SEARCHER.searcher.deletedDocs":0,
   [junit4]   2>     "INDEX.sizeInBytes":1,
   [junit4]   2>     "node_name":"127.0.0.1:10000_solr",
   [junit4]   2>     "state":"active",
   [junit4]   2>     "type":"NRT",
   [junit4]   2>     "SEARCHER.searcher.numDocs":0,
   [junit4]   2>     "shard":"shard1",
   [junit4]   2>     "collection":"testTrigger_collection"}}
   [junit4]   2> 10476 INFO  (TEST-IndexSizeTriggerTest.testTrigger-seed#[454C9BBDC3034E4D]) [    ] o.a.s.c.a.IndexSizeTriggerTest #######################################
   [junit4]   2> ############ CLUSTER STATE ############
   [junit4]   2> #######################################
   [junit4]   2> ## Live nodes:		2
   [junit4]   2> ## Empty nodes:	0
   [junit4]   2> ## Dead nodes:		0
   [junit4]   2> ## Collections:	[testTrigger_collection]
   [junit4]   2> DocCollection(testTrigger_collection//clusterstate.json/49)={
   [junit4]   2>   "replicationFactor":"2",
   [junit4]   2>   "pullReplicas":"0",
   [junit4]   2>   "router":{"name":"compositeId"},
   [junit4]   2>   "maxShardsPerNode":"2",
   [junit4]   2>   "autoAddReplicas":"false",
   [junit4]   2>   "nrtReplicas":"2",
   [junit4]   2>   "tlogReplicas":"0",
   [junit4]   2>   "autoCreated":"true",
   [junit4]   2>   "shards":{
   [junit4]   2>     "shard2":{
   [junit4]   2>       "replicas":{
   [junit4]   2>         "core_node3":{
   [junit4]   2>           "core":"testTrigger_collection_shard2_replica_n3",
   [junit4]   2>           "SEARCHER.searcher.maxDoc":11,
   [junit4]   2>           "SEARCHER.searcher.deletedDocs":0,
   [junit4]   2>           "INDEX.sizeInBytes":1,
   [junit4]   2>           "node_name":"127.0.0.1:10000_solr",
   [junit4]   2>           "state":"active",
   [junit4]   2>           "type":"NRT",
   [junit4]   2>           "SEARCHER.searcher.numDocs":11},
   [junit4]   2>         "core_node4":{
   [junit4]   2>           "core":"testTrigger_collection_shard2_replica_n4",
   [junit4]   2>           "SEARCHER.searcher.maxDoc":11,
   [junit4]   2>           "SEARCHER.searcher.deletedDocs":0,
   [junit4]   2>           "INDEX.sizeInBytes":1,
   [junit4]   2>           "node_name":"127.0.0.1:10001_solr",
   [junit4]   2>           "state":"active",
   [junit4]   2>           "type":"NRT",
   [junit4]   2>           "SEARCHER.searcher.numDocs":11}},
   [junit4]   2>       "range":"0-7fffffff",
   [junit4]   2>       "state":"active"},
   [junit4]   2>     "shard1":{
   [junit4]   2>       "replicas":{
   [junit4]   2>         "core_node1":{
   [junit4]   2>           "core":"testTrigger_collection_shard1_replica_n1",
   [junit4]   2>           "leader":"true",
   [junit4]   2>           "SEARCHER.searcher.maxDoc":14,
   [junit4]   2>           "SEARCHER.searcher.deletedDocs":0,
   [junit4]   2>           "INDEX.sizeInBytes":1,
   [junit4]   2>           "node_name":"127.0.0.1:10000_solr",
   [junit4]   2>           "state":"active",
   [junit4]   2>           "type":"NRT",
   [junit4]   2>           "SEARCHER.searcher.numDocs":14},
   [junit4]   2>         "core_node2":{
   [junit4]   2>           "core":"testTrigger_collection_shard1_replica_n2",
   [junit4]   2>           "SEARCHER.searcher.maxDoc":14,
   [junit4]   2>           "SEARCHER.searcher.deletedDocs":0,
   [junit4]   2>           "INDEX.sizeInBytes":1,
   [junit4]   2>           "node_name":"127.0.0.1:10001_solr",
   [junit4]   2>           "state":"active",
   [junit4]   2>           "type":"NRT",
   [junit4]   2>           "SEARCHER.searcher.numDocs":14}},
   [junit4]   2>       "range":"80000000-ffffffff",
   [junit4]   2>       "state":"active"}}}
   [junit4]   2> ## Max replicas per node:	2
   [junit4]   2> ## Min replicas per node:	2
   [junit4]   2> ## Total replicas:		4
   [junit4]   2> ## * testTrigger_collection		4
   [junit4]   2> ##		- active           4
   [junit4]   2> ######### Solr op counts ##########
   [junit4]   2> ##		- CREATE             1
   [junit4]   2> ##		- update            27
   [junit4]   2> ######### Autoscaling event counts ###########
   [junit4]   2> ## * Trigger: index_size_trigger
   [junit4]   2> ##		- STARTED         1
   [junit4]   2> ##		- SUCCEEDED       1
   [junit4]   2> 
   [junit4]   2> 10476 DEBUG (TEST-IndexSizeTriggerTest.testTrigger-seed#[454C9BBDC3034E4D]) [    ] o.a.s.c.a.OverseerTriggerThread Refreshing /autoscaling.json with znode version 5
   [junit4]   2> 10476 DEBUG (Simulated OverseerAutoScalingTriggerThread) [    ] o.a.s.c.a.OverseerTriggerThread Processed trigger updates upto znodeVersion 5
   [junit4]   2> 10476 DEBUG (Simulated OverseerAutoScalingTriggerThread) [    ] o.a.s.c.a.OverseerTriggerThread -- clean old nodeLost markers
   [junit4]   2> 10476 DEBUG (Simulated OverseerAutoScalingTriggerThread) [    ] o.a.s.c.a.OverseerTriggerThread -- clean old nodeAdded markers
   [junit4]   2> 10476 DEBUG (Simulated OverseerAutoScalingTriggerThread) [    ] o.a.s.c.a.OverseerTriggerThread Current znodeVersion 5, lastZnodeVersion 5
   [junit4]   2> 10577 INFO  (TEST-IndexSizeTriggerTest.testTrigger-seed#[454C9BBDC3034E4D]) [    ] o.a.s.SolrTestCaseJ4 ###Ending testTrigger
   [junit4]   2> NOTE: reproduce with: ant test  -Dtestcase=IndexSizeTriggerTest -Dtests.method=testTrigger -Dtests.seed=454C9BBDC3034E4D -Dtests.multiplier=3 -Dtests.slow=true -Dtests.locale=ar-OM -Dtests.timezone=Europe/Madrid -Dtests.asserts=true -Dtests.file.encoding=UTF-8
   [junit4] FAILURE 0.36s J1 | IndexSizeTriggerTest.testTrigger <<<
   [junit4]    > Throwable #1: java.lang.AssertionError: number of ops expected:<2> but was:<1>
   [junit4]    > 	at __randomizedtesting.SeedInfo.seed([454C9BBDC3034E4D:2687AD3F5ACC3D60]:0)
   [junit4]    > 	at org.apache.solr.cloud.autoscaling.IndexSizeTriggerTest.testTrigger(IndexSizeTriggerTest.java:187)
   [junit4]    > 	at java.lang.Thread.run(Thread.java:748)
   [junit4]   2> 10597 INFO  (TEST-IndexSizeTriggerTest.testSplitIntegration-seed#[454C9BBDC3034E4D]) [    ] o.a.s.SolrTestCaseJ4 ###Starting testSplitIntegration
   [junit4]   2> 10641 DEBUG (simCloudManagerPool-30-thread-68) [    ] o.a.s.c.a.s.SimClusterStateProvider -- elected new leader for testSplitIntegration_collection / shard2: {"core_node3":{
   [junit4]   2>     "core":"testSplitIntegration_collection_shard2_replica_n3",
   [junit4]   2>     "leader":"true",
   [junit4]   2>     "SEARCHER.searcher.maxDoc":0,
   [junit4]   2>     "SEARCHER.searcher.deletedDocs":0,
   [junit4]   2>     "INDEX.sizeInBytes":1,
   [junit4]   2>     "node_name":"127.0.0.1:10000_solr",
   [junit4]   2>     "state":"active",
   [junit4]   2>     "type":"NRT",
   [junit4]   2>     "SEARCHER.searcher.numDocs":0,
   [junit4]   2>     "shard":"shard2",
   [junit4]   2>     "collection":"testSplitIntegration_collection"}}
   [junit4]   2> 10641 DEBUG (simCloudManagerPool-30-thread-69) [    ] o.a.s.c.a.s.SimClusterStateProvider -- elected new leader for testSplitIntegration_collection / shard1: {"core_node1":{
   [junit4]   2>     "core":"testSplitIntegration_collection_shard1_replica_n1",
   [junit4]   2>     "leader":"true",
   [junit4]   2>     "SEARCHER.searcher.maxDoc":0,
   [junit4]   2>     "SEARCHER.searcher.deletedDocs":0,
   [junit4]   2>     "INDEX.sizeInBytes":1,
   [junit4]   2>     "node_name":"127.0.0.1:10000_solr",
   [junit4]   2>     "state":"active",
   [junit4]   2>     "type":"NRT",
   [junit4]   2>     "SEARCHER.searcher.numDocs":0,
   [junit4]   2>     "shard":"shard1",
   [junit4]   2>     "collection":"testSplitIntegration_collection"}}
   [junit4]   2> 10652 DEBUG (simCloudManagerPool-30-thread-70) [    ] o.a.s.c.a.AutoScalingHandler Verified autoscaling configuration
   [junit4]   2> 10652 DEBUG (simCloudManagerPool-30-thread-70) [    ] o.a.s.c.a.OverseerTriggerThread Refreshing /autoscaling.json with znode version 6
   [junit4]   2> 10652 DEBUG (Simulated OverseerAutoScalingTriggerThread) [    ] o.a.s.c.a.OverseerTriggerThread Processed trigger updates upto znodeVersion 6
   [junit4]   2> 10653 DEBUG (Simulated OverseerAutoScalingTriggerThread) [    ] o.a.s.c.a.OverseerTriggerThread -- clean old nodeLost markers
   [junit4]   2> 10653 DEBUG (Simulated OverseerAutoScalingTriggerThread) [    ] o.a.s.c.a.OverseerTriggerThread -- clean old nodeAdded markers
   [junit4]   2> 10653 DEBUG (Simulated OverseerAutoScalingTriggerThread) [    ] o.a.s.c.a.OverseerTriggerThread Current znodeVersion 6, lastZnodeVersion 6
   [junit4]   2> 10653 DEBUG (simCloudManagerPool-30-thread-71) [    ] o.a.s.c.a.AutoScalingHandler Verified autoscaling configuration
   [junit4]   2> 10654 DEBUG (simCloudManagerPool-30-thread-71) [    ] o.a.s.c.a.OverseerTriggerThread Refreshing /autoscaling.json with znode version 7
   [junit4]   2> 10654 DEBUG (Simulated OverseerAutoScalingTriggerThread) [    ] o.a.s.c.a.OverseerTriggerThread Processed trigger updates upto znodeVersion 7
   [junit4]   2> 10654 DEBUG (Simulated OverseerAutoScalingTriggerThread) [    ] o.a.s.c.a.OverseerTriggerThread -- clean old nodeLost markers
   [junit4]   2> 10654 DEBUG (Simulated OverseerAutoScalingTriggerThread) [    ] o.a.s.c.a.OverseerTriggerThread -- clean old nodeAdded markers
   [junit4]   2> 10654 DEBUG (Simulated OverseerAutoScalingTriggerThread) [    ] o.a.s.c.a.OverseerTriggerThread Current znodeVersion 7, lastZnodeVersion 7
   [junit4]   2> 10655 DEBUG (simCloudManagerPool-30-thread-72) [    ] o.a.s.c.a.AutoScalingHandler Verified autoscaling configuration
   [junit4]   2> 10656 DEBUG (simCloudManagerPool-30-thread-72) [    ] o.a.s.c.a.OverseerTriggerThread Refreshing /autoscaling.json with znode version 8
   [junit4]   2> 10656 DEBUG (Simulated OverseerAutoScalingTriggerThread) [    ] o.a.s.c.a.OverseerTriggerThread Processed trigger updates upto znodeVersion 8
   [junit4]   2> 10656 DEBUG (Simulated OverseerAutoScalingTriggerThread) [    ] o.a.s.c.a.OverseerTriggerThread -- clean old nodeLost markers
   [junit4]   2> 10656 DEBUG (Simulated OverseerAutoScalingTriggerThread) [    ] o.a.s.c.a.OverseerTriggerThread -- clean old nodeAdded markers
   [junit4]   2> 10656 DEBUG (Simulated OverseerAutoScalingTriggerThread) [    ] o.a.s.c.a.OverseerTriggerThread Current znodeVersion 8, lastZnodeVersion 8
   [junit4]   2> 10725 DEBUG (ScheduledTrigger-22-thread-4) [    ] o.a.s.c.a.NodeLostTrigger Running NodeLostTrigger: .auto_add_replicas with currently live nodes: 2
   [junit4]   2> 10729 DEBUG (ScheduledTrigger-31-thread-1) [    ] o.a.s.c.a.ScheduledTriggers ++++++++ Cooldown inactive - processing event: {
   [junit4]   2>   "id":"50d3ca473967dT7o355zwky2xt479ew84m6fwm9",
   [junit4]   2>   "source":"index_size_trigger",
   [junit4]   2>   "eventTime":1421928991790717,
   [junit4]   2>   "eventType":"INDEXSIZE",
   [junit4]   2>   "properties":{
   [junit4]   2>     "aboveSize":{"testSplitIntegration_collection":[
   [junit4]   2>         "{\"core_node1\":{\n    \"core\":\"testSplitIntegration_collection_shard1_replica_n1\",\n    \"leader\":\"true\",\n    \"SEARCHER.searcher.maxDoc\":14,\n    \"SEARCHER.searcher.deletedDocs\":0,\n    \"INDEX.sizeInBytes\":1,\n    \"__docs__\":14,\n    \"violationType\":\"aboveDocs\",\n    \"node_name\":\"127.0.0.1:10000_solr\",\n    \"state\":\"active\",\n    \"type\":\"NRT\",\n    \"SEARCHER.searcher.numDocs\":14,\n    \"__bytes__\":1,\n    \"shard\":\"shard1\",\n    \"collection\":\"testSplitIntegration_collection\"}}",
   [junit4]   2>         "{\"core_node3\":{\n    \"core\":\"testSplitIntegration_collection_shard2_replica_n3\",\n    \"leader\":\"true\",\n    \"SEARCHER.searcher.maxDoc\":11,\n    \"SEARCHER.searcher.deletedDocs\":0,\n    \"INDEX.sizeInBytes\":1,\n    \"__docs__\":11,\n    \"violationType\":\"aboveDocs\",\n    \"node_name\":\"127.0.0.1:10000_solr\",\n    \"state\":\"active\",\n    \"type\":\"NRT\",\n    \"SEARCHER.searcher.numDocs\":11,\n    \"__bytes__\":1,\n    \"shard\":\"shard2\",\n    \"collection\":\"testSplitIntegration_collection\"}}"]},
   [junit4]   2>     "belowSize":{},
   [junit4]   2>     "requestedOps":[
   [junit4]   2>       "Op{action=SPLITSHARD, hints={COLL_SHARD=[{\n  \"first\":\"testSplitIntegration_collection\",\n  \"second\":\"shard1\"}]}}",
   [junit4]   2>       "Op{action=SPLITSHARD, hints={COLL_SHARD=[{\n  \"first\":\"testSplitIntegration_collection\",\n  \"second\":\"shard2\"}]}}"]}}
   [junit4]   2> 10730 DEBUG (ScheduledTrigger-31-thread-1) [    ] o.a.s.c.a.ScheduledTriggers Pausing all triggers: [index_size_trigger]
   [junit4]   2> 10731 INFO  (ScheduledTrigger-31-thread-1) [    ] o.a.s.c.a.IndexSizeTriggerTest =======> CapturedEvent{timestamp=1421932867069417, stage=STARTED, actionName='null', event={
   [junit4]   2>   "id":"50d3ca473967dT7o355zwky2xt479ew84m6fwm9",
   [junit4]   2>   "source":"index_size_trigger",
   [junit4]   2>   "eventTime":1421928991790717,
   [junit4]   2>   "eventType":"INDEXSIZE",
   [junit4]   2>   "properties":{
   [junit4]   2>     "aboveSize":{"testSplitIntegration_collection":[
   [junit4]   2>         "{\"core_node1\":{\n    \"core\":\"testSplitIntegration_collection_shard1_replica_n1\",\n    \"leader\":\"true\",\n    \"SEARCHER.searcher.maxDoc\":14,\n    \"SEARCHER.searcher.deletedDocs\":0,\n    \"INDEX.sizeInBytes\":1,\n    \"__docs__\":14,\n    \"violationType\":\"aboveDocs\",\n    \"node_name\":\"127.0.0.1:10000_solr\",\n    \"state\":\"active\",\n    \"type\":\"NRT\",\n    \"SEARCHER.searcher.numDocs\":14,\n    \"__bytes__\":1,\n    \"shard\":\"shard1\",\n    \"collection\":\"testSplitIntegration_collection\"}}",
   [junit4]   2>         "{\"core_node3\":{\n    \"core\":\"testSplitIntegration_collection_shard2_replica_n3\",\n    \"leader\":\"true\",\n    \"SEARCHER.searcher.maxDoc\":11,\n    \"SEARCHER.searcher.deletedDocs\":0,\n    \"INDEX.sizeInBytes\":1,\n    \"__docs__\":11,\n    \"violationType\":\"aboveDocs\",\n    \"node_name\":\"127.0.0.1:10000_solr\",\n    \"state\":\"active\",\n    \"type\":\"NRT\",\n    \"SEARCHER.searcher.numDocs\":11,\n    \"__bytes__\":1,\n    \"shard\":\"shard2\",\n    \"collection\":\"testSplitIntegration_collection\"}}"]},
   [junit4]   2>     "belowSize":{},
   [junit4]   2>     "_enqueue_time_":1421932843985317,
   [junit4]   2>     "requestedOps":[
   [junit4]   2>       "Op{action=SPLITSHARD, hints={COLL_SHARD=[{\n  \"first\":\"testSplitIntegration_collection\",\n  \"second\":\"shard1\"}]}}",
   [junit4]   2>       "Op{action=SPLITSHARD, hints={COLL_SHARD=[{\n  \"first\":\"testSplitIntegration_collection\",\n  \"second\":\"shard2\"}]}}"]}}, context={}, config={
   [junit4]   2>   "trigger":"index_size_trigger",
   [junit4]   2>   "stage":[
   [junit4]   2>     "STARTED",
   [junit4]   2>     "ABORTED",
   [junit4]   2>     "SUCCEEDED",
   [junit4]   2>     "FAILED"],
   [junit4]   2>   "afterAction":[
   [junit4]   2>     "compute_plan",
   [junit4]   2>     "execute_plan"],
   [junit4]   2>   "class":"org.apache.solr.cloud.autoscaling.IndexSizeTriggerTest$CapturingTriggerListener",
   [junit4]   2>   "beforeAction":[
   [junit4]   2>     "compute_plan",
   [junit4]   2>     "execute_plan"]}, message='null'}
   [junit4]   2> 10732 DEBUG (AutoscalingActionExecutor-32-thread-1) [    ] o.a.s.c.a.ScheduledTriggers -- processing actions for {
   [junit4]   2>   "id":"50d3ca473967dT7o355zwky2xt479ew84m6fwm9",
   [junit4]   2>   "source":"index_size_trigger",
   [junit4]   2>   "eventTime":1421928991790717,
   [junit4]   2>   "eventType":"INDEXSIZE",
   [junit4]   2>   "properties":{
   [junit4]   2>     "aboveSize":{"testSplitIntegration_collection":[
   [junit4]   2>         "{\"core_node1\":{\n    \"core\":\"testSplitIntegration_collection_shard1_replica_n1\",\n    \"leader\":\"true\",\n    \"SEARCHER.searcher.maxDoc\":14,\n    \"SEARCHER.searcher.deletedDocs\":0,\n    \"INDEX.sizeInBytes\":1,\n    \"__docs__\":14,\n    \"violationType\":\"aboveDocs\",\n    \"node_name\":\"127.0.0.1:10000_solr\",\n    \"state\":\"active\",\n    \"type\":\"NRT\",\n    \"SEARCHER.searcher.numDocs\":14,\n    \"__bytes__\":1,\n    \"shard\":\"shard1\",\n    \"collection\":\"testSplitIntegration_collection\"}}",
   [junit4]   2>         "{\"core_node3\":{\n    \"core\":\"testSplitIntegration_collection_shard2_replica_n3\",\n    \"leader\":\"true\",\n    \"SEARCHER.searcher.maxDoc\":11,\n    \"SEARCHER.searcher.deletedDocs\":0,\n    \"INDEX.sizeInBytes\":1,\n    \"__docs__\":11,\n    \"violationType\":\"aboveDocs\",\n    \"node_name\":\"127.0.0.1:10000_solr\",\n    \"state\":\"active\",\n    \"type\":\"NRT\",\n    \"SEARCHER.searcher.numDocs\":11,\n    \"__bytes__\":1,\n    \"shard\":\"shard2\",\n    \"collection\":\"testSplitIntegration_collection\"}}"]},
   [junit4]   2>     "b

[...truncated too long message...]

id = null] for registry solr.jetty / com.codahale.metrics.MetricRegistry@21faea30
   [junit4]   2> 8777 INFO  (jetty-closer-2-thread-2) [    ] o.a.s.c.ZkController Remove node as live in ZooKeeper:/live_nodes/127.0.0.1:46213_solr
   [junit4]   2> 8779 INFO  (jetty-closer-2-thread-1) [    ] o.a.s.c.ZkController Remove node as live in ZooKeeper:/live_nodes/127.0.0.1:37435_solr
   [junit4]   2> 8779 INFO  (zkCallback-28-thread-1) [    ] o.a.s.c.c.ZkStateReader Updated live nodes from ZooKeeper... (2) -> (1)
   [junit4]   2> 8780 INFO  (zkCallback-19-thread-1) [    ] o.a.s.c.c.ZkStateReader Updated live nodes from ZooKeeper... (2) -> (1)
   [junit4]   2> 8780 INFO  (jetty-closer-2-thread-2) [    ] o.a.s.m.SolrMetricManager Closing metric reporters for registry=solr.cluster, tag=null
   [junit4]   2> 8785 INFO  (zkCallback-17-thread-1) [    ] o.a.s.c.c.ZkStateReader Updated live nodes from ZooKeeper... (2) -> (1)
   [junit4]   2> 8789 INFO  (zkCallback-28-thread-1) [    ] o.a.s.c.c.ZkStateReader Updated live nodes from ZooKeeper... (1) -> (0)
   [junit4]   2> 8789 INFO  (zkCallback-19-thread-1) [    ] o.a.s.c.c.ZkStateReader Updated live nodes from ZooKeeper... (1) -> (0)
   [junit4]   2> 8790 INFO  (jetty-closer-2-thread-1) [    ] o.a.s.m.SolrMetricManager Closing metric reporters for registry=solr.cluster, tag=null
   [junit4]   2> 8790 INFO  (zkCallback-17-thread-1) [    ] o.a.s.c.c.ZkStateReader Updated live nodes from ZooKeeper... (1) -> (0)
   [junit4]   2> 8798 INFO  (zkCallback-33-thread-2) [    ] o.a.s.c.c.ZkStateReader Updated live nodes from ZooKeeper... (2) -> (0)
   [junit4]   2> 8800 INFO  (jetty-closer-2-thread-1) [    ] o.a.s.c.Overseer Overseer (id=72151010568437765-127.0.0.1:37435_solr-n_0000000000) closing
   [junit4]   2> 8801 WARN  (OverseerAutoScalingTriggerThread-72151010568437765-127.0.0.1:37435_solr-n_0000000000) [    ] o.a.s.c.a.OverseerTriggerThread OverseerTriggerThread woken up but we are closed, exiting.
   [junit4]   2> 8801 INFO  (OverseerStateUpdate-72151010568437765-127.0.0.1:37435_solr-n_0000000000) [    ] o.a.s.c.Overseer Overseer Loop exiting : 127.0.0.1:37435_solr
   [junit4]   2> 8805 INFO  (jetty-closer-2-thread-2) [    ] o.a.s.c.TransientSolrCoreCacheDefault Allocating transient cache for 2147483647 transient cores
   [junit4]   2> 8805 DEBUG (jetty-closer-2-thread-1) [    ] o.a.s.c.a.ScheduledTriggers Shutting down scheduled thread pool executor now
   [junit4]   2> 8806 DEBUG (jetty-closer-2-thread-1) [    ] o.a.s.c.a.ScheduledTriggers Shutting down action executor now
   [junit4]   2> 8806 DEBUG (jetty-closer-2-thread-1) [    ] o.a.s.c.a.ScheduledTriggers Awaiting termination for action executor
   [junit4]   2> 8806 DEBUG (jetty-closer-2-thread-1) [    ] o.a.s.c.a.ScheduledTriggers Awaiting termination for scheduled thread pool executor
   [junit4]   2> 8806 DEBUG (jetty-closer-2-thread-1) [    ] o.a.s.c.a.ScheduledTriggers ScheduledTriggers closed completely
   [junit4]   2> 8806 DEBUG (jetty-closer-2-thread-1) [    ] o.a.s.c.a.OverseerTriggerThread OverseerTriggerThread has been closed explicitly
   [junit4]   2> 8809 WARN  (NIOServerCxn.Factory:0.0.0.0/0.0.0.0:0) [    ] o.a.z.s.NIOServerCnxn Unable to read additional data from client sessionid 0x10054f63b1e0007, likely client has closed socket
   [junit4]   2> 8813 INFO  (jetty-closer-2-thread-2) [    ] o.e.j.s.h.ContextHandler Stopped o.e.j.s.ServletContextHandler@dd20eb8{/solr,null,UNAVAILABLE}
   [junit4]   2> 8813 INFO  (jetty-closer-2-thread-1) [    ] o.e.j.s.h.ContextHandler Stopped o.e.j.s.ServletContextHandler@69d26310{/solr,null,UNAVAILABLE}
   [junit4]   2> 8813 INFO  (jetty-closer-2-thread-1) [    ] o.e.j.s.session node0 Stopped scavenging
   [junit4]   2> 8813 INFO  (jetty-closer-2-thread-2) [    ] o.e.j.s.session node0 Stopped scavenging
   [junit4]   2> 8815 ERROR (SUITE-IndexSizeTriggerTest-seed#[454C9BBDC3034E4D]-worker) [    ] o.a.z.s.ZooKeeperServer ZKShutdownHandler is not registered, so ZooKeeper server won't take any action on ERROR or SHUTDOWN server state changes
   [junit4]   2> 8816 INFO  (SUITE-IndexSizeTriggerTest-seed#[454C9BBDC3034E4D]-worker) [    ] o.a.s.c.ZkTestServer connecting to 127.0.0.1:46501 46501
   [junit4]   2> 8865 INFO  (Thread-1) [    ] o.a.s.c.ZkTestServer connecting to 127.0.0.1:46501 46501
   [junit4]   2> 8867 WARN  (Thread-1) [    ] o.a.s.c.ZkTestServer Watch limit violations: 
   [junit4]   2> Maximum concurrent create/delete watches above limit:
   [junit4]   2> 
   [junit4]   2> 	5	/solr/aliases.json
   [junit4]   2> 	2	/solr/security.json
   [junit4]   2> 
   [junit4]   2> Maximum concurrent data watches above limit:
   [junit4]   2> 
   [junit4]   2> 	5	/solr/clusterstate.json
   [junit4]   2> 	5	/solr/clusterprops.json
   [junit4]   2> 
   [junit4]   2> Maximum concurrent children watches above limit:
   [junit4]   2> 
   [junit4]   2> 	5	/solr/live_nodes
   [junit4]   2> 	5	/solr/collections
   [junit4]   2> 
   [junit4]   2> NOTE: leaving temporary files on disk at: /home/jenkins/workspace/Lucene-Solr-7.x-Linux/solr/build/solr-core/test/J2/temp/solr.cloud.autoscaling.IndexSizeTriggerTest_454C9BBDC3034E4D-001
   [junit4]   2> May 12, 2018 9:10:35 PM com.carrotsearch.randomizedtesting.ThreadLeakControl checkThreadLeaks
   [junit4]   2> WARNING: Will linger awaiting termination of 1 leaked thread(s).
   [junit4]   2> NOTE: test params are: codec=Asserting(Lucene70): {}, docValues:{}, maxPointsInLeafNode=1628, maxMBSortInHeap=7.527065679590679, sim=RandomSimilarity(queryNorm=false): {}, locale=ar-OM, timezone=Europe/Madrid
   [junit4]   2> NOTE: Linux 4.13.0-39-generic amd64/Oracle Corporation 1.8.0_162 (64-bit)/cpus=8,threads=1,free=449839096,total=536870912
   [junit4]   2> NOTE: All tests run in this JVM: [IndexSizeTriggerTest]
   [junit4] Completed [2/5 (2!)] on J2 in 8.62s, 4 tests, 1 failure <<< FAILURES!
   [junit4] 
   [junit4] Duplicate suite name used with XML reports: org.apache.solr.cloud.autoscaling.IndexSizeTriggerTest. This may confuse tools that process XML reports. Set 'ignoreDuplicateSuites' to true to skip this message.
   [junit4] Suite: org.apache.solr.cloud.autoscaling.IndexSizeTriggerTest
   [junit4] OK      0.54s J0 | IndexSizeTriggerTest.testMergeIntegration
   [junit4] OK      0.28s J0 | IndexSizeTriggerTest.testTrigger
   [junit4] OK      0.58s J0 | IndexSizeTriggerTest.testSplitIntegration
   [junit4] OK      0.15s J0 | IndexSizeTriggerTest.testMixedBounds
   [junit4] Completed [3/5 (2!)] on J0 in 11.76s, 4 tests
   [junit4] 
   [junit4] Suite: org.apache.solr.cloud.autoscaling.IndexSizeTriggerTest
   [junit4] OK      0.33s J1 | IndexSizeTriggerTest.testMergeIntegration
   [junit4] OK      0.28s J1 | IndexSizeTriggerTest.testTrigger
   [junit4] OK      0.54s J1 | IndexSizeTriggerTest.testSplitIntegration
   [junit4] OK      0.15s J1 | IndexSizeTriggerTest.testMixedBounds
   [junit4] Completed [4/5 (2!)] on J1 in 3.73s, 4 tests
   [junit4] 
   [junit4] Suite: org.apache.solr.cloud.autoscaling.IndexSizeTriggerTest
   [junit4] OK      0.33s J2 | IndexSizeTriggerTest.testMergeIntegration
   [junit4] OK      0.31s J2 | IndexSizeTriggerTest.testTrigger
   [junit4] OK      0.53s J2 | IndexSizeTriggerTest.testSplitIntegration
   [junit4] OK      0.15s J2 | IndexSizeTriggerTest.testMixedBounds
   [junit4] Completed [5/5 (2!)] on J2 in 3.66s, 4 tests
   [junit4] 
   [junit4] 
   [junit4] Tests with failures [seed: 454C9BBDC3034E4D]:
   [junit4]   - org.apache.solr.cloud.autoscaling.IndexSizeTriggerTest.testTrigger
   [junit4]   - org.apache.solr.cloud.autoscaling.IndexSizeTriggerTest.testTrigger
   [junit4]   - org.apache.solr.cloud.autoscaling.IndexSizeTriggerTest.testSplitIntegration
   [junit4] 
   [junit4] 
   [junit4] JVM J0:     0.68 ..    13.27 =    12.59s
   [junit4] JVM J1:     0.70 ..    14.24 =    13.55s
   [junit4] JVM J2:     0.69 ..    14.26 =    13.57s
   [junit4] Execution time total: 14 seconds
   [junit4] Tests summary: 5 suites, 20 tests, 1 error, 2 failures

BUILD FAILED
/home/jenkins/workspace/Lucene-Solr-7.x-Linux/lucene/common-build.xml:1568: The following error occurred while executing this line:
/home/jenkins/workspace/Lucene-Solr-7.x-Linux/lucene/common-build.xml:1092: There were test failures: 5 suites, 20 tests, 1 error, 2 failures [seed: 454C9BBDC3034E4D]

Total time: 15 seconds

[repro] Setting last failure code to 256

[repro] Failures:
[repro]   0/5 failed: org.apache.lucene.index.TestConcurrentMergeScheduler
[repro]   2/5 failed: org.apache.solr.cloud.autoscaling.IndexSizeTriggerTest
[repro] Exiting with code 256
+ mv lucene/build lucene/build.repro
+ mv solr/build solr/build.repro
+ mv lucene/build.orig lucene/build
+ mv solr/build.orig solr/build
Archiving artifacts
Setting ANT_1_8_2_HOME=/var/lib/jenkins/tools/hudson.tasks.Ant_AntInstallation/ANT_1.8.2
[WARNINGS] Parsing warnings in console log with parser Java Compiler (javac)
Setting ANT_1_8_2_HOME=/var/lib/jenkins/tools/hudson.tasks.Ant_AntInstallation/ANT_1.8.2
Setting ANT_1_8_2_HOME=/var/lib/jenkins/tools/hudson.tasks.Ant_AntInstallation/ANT_1.8.2
<Git Blamer> Using GitBlamer to create author and commit information for all warnings.
<Git Blamer> GIT_COMMIT=92b4a935dc48d58613a158a441b701e09ccc5047, workspace=/var/lib/jenkins/workspace/Lucene-Solr-7.x-Linux
[WARNINGS] Computing warning deltas based on reference build #1889
Recording test results
Setting ANT_1_8_2_HOME=/var/lib/jenkins/tools/hudson.tasks.Ant_AntInstallation/ANT_1.8.2
Build step 'Publish JUnit test result report' changed build result to UNSTABLE
Email was triggered for: Unstable (Test Failures)
Sending email for trigger: Unstable (Test Failures)
Setting ANT_1_8_2_HOME=/var/lib/jenkins/tools/hudson.tasks.Ant_AntInstallation/ANT_1.8.2
Setting ANT_1_8_2_HOME=/var/lib/jenkins/tools/hudson.tasks.Ant_AntInstallation/ANT_1.8.2
Setting ANT_1_8_2_HOME=/var/lib/jenkins/tools/hudson.tasks.Ant_AntInstallation/ANT_1.8.2
Setting ANT_1_8_2_HOME=/var/lib/jenkins/tools/hudson.tasks.Ant_AntInstallation/ANT_1.8.2

Mime
View raw message