lucene-dev mailing list archives

Site index · List index
Message view « Date » · « Thread »
Top « Date » · « Thread »
From Apache Jenkins Server <jenk...@builds.apache.org>
Subject [JENKINS] Lucene-Solr-Tests-master - Build # 2542 - Unstable
Date Wed, 23 May 2018 22:15:19 GMT
Build: https://builds.apache.org/job/Lucene-Solr-Tests-master/2542/

4 tests failed.
FAILED:  org.apache.solr.cloud.autoscaling.SearchRateTriggerIntegrationTest.testDeleteNode

Error Message:
unexpected DELETENODE status: {responseHeader={status=0,QTime=17},status={state=notfound,msg=Did not find [search_rate_trigger3/218b7c52c2583aTdpf5box5uhk9dvhokzp6ywnm8/0] in any tasks queue}}

Stack Trace:
java.lang.AssertionError: unexpected DELETENODE status: {responseHeader={status=0,QTime=17},status={state=notfound,msg=Did not find [search_rate_trigger3/218b7c52c2583aTdpf5box5uhk9dvhokzp6ywnm8/0] in any tasks queue}}
	at __randomizedtesting.SeedInfo.seed([E150F31FDF8F2D5E:C3C23D9DE845A223]:0)
	at org.junit.Assert.fail(Assert.java:93)
	at org.apache.solr.cloud.autoscaling.SearchRateTriggerIntegrationTest.lambda$testDeleteNode$6(SearchRateTriggerIntegrationTest.java:668)
	at java.util.ArrayList.forEach(ArrayList.java:1257)
	at org.apache.solr.cloud.autoscaling.SearchRateTriggerIntegrationTest.testDeleteNode(SearchRateTriggerIntegrationTest.java:660)
	at sun.reflect.NativeMethodAccessorImpl.invoke0(Native Method)
	at sun.reflect.NativeMethodAccessorImpl.invoke(NativeMethodAccessorImpl.java:62)
	at sun.reflect.DelegatingMethodAccessorImpl.invoke(DelegatingMethodAccessorImpl.java:43)
	at java.lang.reflect.Method.invoke(Method.java:498)
	at com.carrotsearch.randomizedtesting.RandomizedRunner.invoke(RandomizedRunner.java:1737)
	at com.carrotsearch.randomizedtesting.RandomizedRunner$8.evaluate(RandomizedRunner.java:934)
	at com.carrotsearch.randomizedtesting.RandomizedRunner$9.evaluate(RandomizedRunner.java:970)
	at com.carrotsearch.randomizedtesting.RandomizedRunner$10.evaluate(RandomizedRunner.java:984)
	at com.carrotsearch.randomizedtesting.rules.SystemPropertiesRestoreRule$1.evaluate(SystemPropertiesRestoreRule.java:57)
	at org.apache.lucene.util.TestRuleSetupTeardownChained$1.evaluate(TestRuleSetupTeardownChained.java:49)
	at org.apache.lucene.util.AbstractBeforeAfterRule$1.evaluate(AbstractBeforeAfterRule.java:45)
	at org.apache.lucene.util.TestRuleThreadAndTestName$1.evaluate(TestRuleThreadAndTestName.java:48)
	at org.apache.lucene.util.TestRuleIgnoreAfterMaxFailures$1.evaluate(TestRuleIgnoreAfterMaxFailures.java:64)
	at org.apache.lucene.util.TestRuleMarkFailure$1.evaluate(TestRuleMarkFailure.java:47)
	at com.carrotsearch.randomizedtesting.rules.StatementAdapter.evaluate(StatementAdapter.java:36)
	at com.carrotsearch.randomizedtesting.ThreadLeakControl$StatementRunner.run(ThreadLeakControl.java:368)
	at com.carrotsearch.randomizedtesting.ThreadLeakControl.forkTimeoutingTask(ThreadLeakControl.java:817)
	at com.carrotsearch.randomizedtesting.ThreadLeakControl$3.evaluate(ThreadLeakControl.java:468)
	at com.carrotsearch.randomizedtesting.RandomizedRunner.runSingleTest(RandomizedRunner.java:943)
	at com.carrotsearch.randomizedtesting.RandomizedRunner$5.evaluate(RandomizedRunner.java:829)
	at com.carrotsearch.randomizedtesting.RandomizedRunner$6.evaluate(RandomizedRunner.java:879)
	at com.carrotsearch.randomizedtesting.RandomizedRunner$7.evaluate(RandomizedRunner.java:890)
	at com.carrotsearch.randomizedtesting.rules.StatementAdapter.evaluate(StatementAdapter.java:36)
	at com.carrotsearch.randomizedtesting.rules.SystemPropertiesRestoreRule$1.evaluate(SystemPropertiesRestoreRule.java:57)
	at org.apache.lucene.util.AbstractBeforeAfterRule$1.evaluate(AbstractBeforeAfterRule.java:45)
	at com.carrotsearch.randomizedtesting.rules.StatementAdapter.evaluate(StatementAdapter.java:36)
	at org.apache.lucene.util.TestRuleStoreClassName$1.evaluate(TestRuleStoreClassName.java:41)
	at com.carrotsearch.randomizedtesting.rules.NoShadowingOrOverridesOnMethodsRule$1.evaluate(NoShadowingOrOverridesOnMethodsRule.java:40)
	at com.carrotsearch.randomizedtesting.rules.NoShadowingOrOverridesOnMethodsRule$1.evaluate(NoShadowingOrOverridesOnMethodsRule.java:40)
	at com.carrotsearch.randomizedtesting.rules.StatementAdapter.evaluate(StatementAdapter.java:36)
	at com.carrotsearch.randomizedtesting.rules.StatementAdapter.evaluate(StatementAdapter.java:36)
	at com.carrotsearch.randomizedtesting.rules.StatementAdapter.evaluate(StatementAdapter.java:36)
	at org.apache.lucene.util.TestRuleAssertionsRequired$1.evaluate(TestRuleAssertionsRequired.java:53)
	at org.apache.lucene.util.TestRuleMarkFailure$1.evaluate(TestRuleMarkFailure.java:47)
	at org.apache.lucene.util.TestRuleIgnoreAfterMaxFailures$1.evaluate(TestRuleIgnoreAfterMaxFailures.java:64)
	at org.apache.lucene.util.TestRuleIgnoreTestSuites$1.evaluate(TestRuleIgnoreTestSuites.java:54)
	at com.carrotsearch.randomizedtesting.rules.StatementAdapter.evaluate(StatementAdapter.java:36)
	at com.carrotsearch.randomizedtesting.ThreadLeakControl$StatementRunner.run(ThreadLeakControl.java:368)
	at java.lang.Thread.run(Thread.java:748)


FAILED:  org.apache.solr.cloud.autoscaling.SearchRateTriggerTest.testTrigger

Error Message:
expected:<1> but was:<2>

Stack Trace:
java.lang.AssertionError: expected:<1> but was:<2>
	at __randomizedtesting.SeedInfo.seed([E150F31FDF8F2D5E:829BC59D46405E73]:0)
	at org.junit.Assert.fail(Assert.java:93)
	at org.junit.Assert.failNotEquals(Assert.java:647)
	at org.junit.Assert.assertEquals(Assert.java:128)
	at org.junit.Assert.assertEquals(Assert.java:472)
	at org.junit.Assert.assertEquals(Assert.java:456)
	at org.apache.solr.cloud.autoscaling.SearchRateTriggerTest.testTrigger(SearchRateTriggerTest.java:133)
	at sun.reflect.NativeMethodAccessorImpl.invoke0(Native Method)
	at sun.reflect.NativeMethodAccessorImpl.invoke(NativeMethodAccessorImpl.java:62)
	at sun.reflect.DelegatingMethodAccessorImpl.invoke(DelegatingMethodAccessorImpl.java:43)
	at java.lang.reflect.Method.invoke(Method.java:498)
	at com.carrotsearch.randomizedtesting.RandomizedRunner.invoke(RandomizedRunner.java:1737)
	at com.carrotsearch.randomizedtesting.RandomizedRunner$8.evaluate(RandomizedRunner.java:934)
	at com.carrotsearch.randomizedtesting.RandomizedRunner$9.evaluate(RandomizedRunner.java:970)
	at com.carrotsearch.randomizedtesting.RandomizedRunner$10.evaluate(RandomizedRunner.java:984)
	at com.carrotsearch.randomizedtesting.rules.SystemPropertiesRestoreRule$1.evaluate(SystemPropertiesRestoreRule.java:57)
	at org.apache.lucene.util.TestRuleSetupTeardownChained$1.evaluate(TestRuleSetupTeardownChained.java:49)
	at org.apache.lucene.util.AbstractBeforeAfterRule$1.evaluate(AbstractBeforeAfterRule.java:45)
	at org.apache.lucene.util.TestRuleThreadAndTestName$1.evaluate(TestRuleThreadAndTestName.java:48)
	at org.apache.lucene.util.TestRuleIgnoreAfterMaxFailures$1.evaluate(TestRuleIgnoreAfterMaxFailures.java:64)
	at org.apache.lucene.util.TestRuleMarkFailure$1.evaluate(TestRuleMarkFailure.java:47)
	at com.carrotsearch.randomizedtesting.rules.StatementAdapter.evaluate(StatementAdapter.java:36)
	at com.carrotsearch.randomizedtesting.ThreadLeakControl$StatementRunner.run(ThreadLeakControl.java:368)
	at com.carrotsearch.randomizedtesting.ThreadLeakControl.forkTimeoutingTask(ThreadLeakControl.java:817)
	at com.carrotsearch.randomizedtesting.ThreadLeakControl$3.evaluate(ThreadLeakControl.java:468)
	at com.carrotsearch.randomizedtesting.RandomizedRunner.runSingleTest(RandomizedRunner.java:943)
	at com.carrotsearch.randomizedtesting.RandomizedRunner$5.evaluate(RandomizedRunner.java:829)
	at com.carrotsearch.randomizedtesting.RandomizedRunner$6.evaluate(RandomizedRunner.java:879)
	at com.carrotsearch.randomizedtesting.RandomizedRunner$7.evaluate(RandomizedRunner.java:890)
	at com.carrotsearch.randomizedtesting.rules.StatementAdapter.evaluate(StatementAdapter.java:36)
	at com.carrotsearch.randomizedtesting.rules.SystemPropertiesRestoreRule$1.evaluate(SystemPropertiesRestoreRule.java:57)
	at org.apache.lucene.util.AbstractBeforeAfterRule$1.evaluate(AbstractBeforeAfterRule.java:45)
	at com.carrotsearch.randomizedtesting.rules.StatementAdapter.evaluate(StatementAdapter.java:36)
	at org.apache.lucene.util.TestRuleStoreClassName$1.evaluate(TestRuleStoreClassName.java:41)
	at com.carrotsearch.randomizedtesting.rules.NoShadowingOrOverridesOnMethodsRule$1.evaluate(NoShadowingOrOverridesOnMethodsRule.java:40)
	at com.carrotsearch.randomizedtesting.rules.NoShadowingOrOverridesOnMethodsRule$1.evaluate(NoShadowingOrOverridesOnMethodsRule.java:40)
	at com.carrotsearch.randomizedtesting.rules.StatementAdapter.evaluate(StatementAdapter.java:36)
	at com.carrotsearch.randomizedtesting.rules.StatementAdapter.evaluate(StatementAdapter.java:36)
	at com.carrotsearch.randomizedtesting.rules.StatementAdapter.evaluate(StatementAdapter.java:36)
	at org.apache.lucene.util.TestRuleAssertionsRequired$1.evaluate(TestRuleAssertionsRequired.java:53)
	at org.apache.lucene.util.TestRuleMarkFailure$1.evaluate(TestRuleMarkFailure.java:47)
	at org.apache.lucene.util.TestRuleIgnoreAfterMaxFailures$1.evaluate(TestRuleIgnoreAfterMaxFailures.java:64)
	at org.apache.lucene.util.TestRuleIgnoreTestSuites$1.evaluate(TestRuleIgnoreTestSuites.java:54)
	at com.carrotsearch.randomizedtesting.rules.StatementAdapter.evaluate(StatementAdapter.java:36)
	at com.carrotsearch.randomizedtesting.ThreadLeakControl$StatementRunner.run(ThreadLeakControl.java:368)
	at java.lang.Thread.run(Thread.java:748)


FAILED:  junit.framework.TestSuite.org.apache.solr.handler.component.CustomHighlightComponentTest

Error Message:
Could not find collection:collection59

Stack Trace:
java.lang.AssertionError: Could not find collection:collection59
	at __randomizedtesting.SeedInfo.seed([E150F31FDF8F2D5E]:0)
	at org.junit.Assert.fail(Assert.java:93)
	at org.junit.Assert.assertTrue(Assert.java:43)
	at org.junit.Assert.assertNotNull(Assert.java:526)
	at org.apache.solr.cloud.AbstractDistribZkTestBase.waitForRecoveriesToFinish(AbstractDistribZkTestBase.java:155)
	at org.apache.solr.handler.component.CustomHighlightComponentTest.setupCluster(CustomHighlightComponentTest.java:126)
	at sun.reflect.NativeMethodAccessorImpl.invoke0(Native Method)
	at sun.reflect.NativeMethodAccessorImpl.invoke(NativeMethodAccessorImpl.java:62)
	at sun.reflect.DelegatingMethodAccessorImpl.invoke(DelegatingMethodAccessorImpl.java:43)
	at java.lang.reflect.Method.invoke(Method.java:498)
	at com.carrotsearch.randomizedtesting.RandomizedRunner.invoke(RandomizedRunner.java:1737)
	at com.carrotsearch.randomizedtesting.RandomizedRunner$6.evaluate(RandomizedRunner.java:874)
	at com.carrotsearch.randomizedtesting.RandomizedRunner$7.evaluate(RandomizedRunner.java:890)
	at com.carrotsearch.randomizedtesting.rules.StatementAdapter.evaluate(StatementAdapter.java:36)
	at com.carrotsearch.randomizedtesting.rules.SystemPropertiesRestoreRule$1.evaluate(SystemPropertiesRestoreRule.java:57)
	at org.apache.lucene.util.AbstractBeforeAfterRule$1.evaluate(AbstractBeforeAfterRule.java:45)
	at com.carrotsearch.randomizedtesting.rules.StatementAdapter.evaluate(StatementAdapter.java:36)
	at org.apache.lucene.util.TestRuleStoreClassName$1.evaluate(TestRuleStoreClassName.java:41)
	at com.carrotsearch.randomizedtesting.rules.NoShadowingOrOverridesOnMethodsRule$1.evaluate(NoShadowingOrOverridesOnMethodsRule.java:40)
	at com.carrotsearch.randomizedtesting.rules.NoShadowingOrOverridesOnMethodsRule$1.evaluate(NoShadowingOrOverridesOnMethodsRule.java:40)
	at com.carrotsearch.randomizedtesting.rules.StatementAdapter.evaluate(StatementAdapter.java:36)
	at com.carrotsearch.randomizedtesting.rules.StatementAdapter.evaluate(StatementAdapter.java:36)
	at com.carrotsearch.randomizedtesting.rules.StatementAdapter.evaluate(StatementAdapter.java:36)
	at org.apache.lucene.util.TestRuleAssertionsRequired$1.evaluate(TestRuleAssertionsRequired.java:53)
	at org.apache.lucene.util.TestRuleMarkFailure$1.evaluate(TestRuleMarkFailure.java:47)
	at org.apache.lucene.util.TestRuleIgnoreAfterMaxFailures$1.evaluate(TestRuleIgnoreAfterMaxFailures.java:64)
	at org.apache.lucene.util.TestRuleIgnoreTestSuites$1.evaluate(TestRuleIgnoreTestSuites.java:54)
	at com.carrotsearch.randomizedtesting.rules.StatementAdapter.evaluate(StatementAdapter.java:36)
	at com.carrotsearch.randomizedtesting.ThreadLeakControl$StatementRunner.run(ThreadLeakControl.java:368)
	at java.lang.Thread.run(Thread.java:748)


FAILED:  org.apache.solr.common.cloud.TestCollectionStateWatchers.testCanWaitForNonexistantCollection

Error Message:
waitForState was not triggered by collection creation

Stack Trace:
java.lang.AssertionError: waitForState was not triggered by collection creation
	at __randomizedtesting.SeedInfo.seed([6E9D75B85AB4581F:C5BDEE0E37EA9C34]:0)
	at org.junit.Assert.fail(Assert.java:93)
	at org.junit.Assert.assertTrue(Assert.java:43)
	at org.apache.solr.common.cloud.TestCollectionStateWatchers.testCanWaitForNonexistantCollection(TestCollectionStateWatchers.java:206)
	at sun.reflect.NativeMethodAccessorImpl.invoke0(Native Method)
	at sun.reflect.NativeMethodAccessorImpl.invoke(NativeMethodAccessorImpl.java:62)
	at sun.reflect.DelegatingMethodAccessorImpl.invoke(DelegatingMethodAccessorImpl.java:43)
	at java.lang.reflect.Method.invoke(Method.java:498)
	at com.carrotsearch.randomizedtesting.RandomizedRunner.invoke(RandomizedRunner.java:1737)
	at com.carrotsearch.randomizedtesting.RandomizedRunner$8.evaluate(RandomizedRunner.java:934)
	at com.carrotsearch.randomizedtesting.RandomizedRunner$9.evaluate(RandomizedRunner.java:970)
	at com.carrotsearch.randomizedtesting.RandomizedRunner$10.evaluate(RandomizedRunner.java:984)
	at com.carrotsearch.randomizedtesting.rules.SystemPropertiesRestoreRule$1.evaluate(SystemPropertiesRestoreRule.java:57)
	at org.apache.lucene.util.TestRuleSetupTeardownChained$1.evaluate(TestRuleSetupTeardownChained.java:49)
	at org.apache.lucene.util.AbstractBeforeAfterRule$1.evaluate(AbstractBeforeAfterRule.java:45)
	at org.apache.lucene.util.TestRuleThreadAndTestName$1.evaluate(TestRuleThreadAndTestName.java:48)
	at org.apache.lucene.util.TestRuleIgnoreAfterMaxFailures$1.evaluate(TestRuleIgnoreAfterMaxFailures.java:64)
	at org.apache.lucene.util.TestRuleMarkFailure$1.evaluate(TestRuleMarkFailure.java:47)
	at com.carrotsearch.randomizedtesting.rules.StatementAdapter.evaluate(StatementAdapter.java:36)
	at com.carrotsearch.randomizedtesting.ThreadLeakControl$StatementRunner.run(ThreadLeakControl.java:368)
	at com.carrotsearch.randomizedtesting.ThreadLeakControl.forkTimeoutingTask(ThreadLeakControl.java:817)
	at com.carrotsearch.randomizedtesting.ThreadLeakControl$3.evaluate(ThreadLeakControl.java:468)
	at com.carrotsearch.randomizedtesting.RandomizedRunner.runSingleTest(RandomizedRunner.java:943)
	at com.carrotsearch.randomizedtesting.RandomizedRunner$5.evaluate(RandomizedRunner.java:829)
	at com.carrotsearch.randomizedtesting.RandomizedRunner$6.evaluate(RandomizedRunner.java:879)
	at com.carrotsearch.randomizedtesting.RandomizedRunner$7.evaluate(RandomizedRunner.java:890)
	at com.carrotsearch.randomizedtesting.rules.StatementAdapter.evaluate(StatementAdapter.java:36)
	at com.carrotsearch.randomizedtesting.rules.SystemPropertiesRestoreRule$1.evaluate(SystemPropertiesRestoreRule.java:57)
	at org.apache.lucene.util.AbstractBeforeAfterRule$1.evaluate(AbstractBeforeAfterRule.java:45)
	at com.carrotsearch.randomizedtesting.rules.StatementAdapter.evaluate(StatementAdapter.java:36)
	at org.apache.lucene.util.TestRuleStoreClassName$1.evaluate(TestRuleStoreClassName.java:41)
	at com.carrotsearch.randomizedtesting.rules.NoShadowingOrOverridesOnMethodsRule$1.evaluate(NoShadowingOrOverridesOnMethodsRule.java:40)
	at com.carrotsearch.randomizedtesting.rules.NoShadowingOrOverridesOnMethodsRule$1.evaluate(NoShadowingOrOverridesOnMethodsRule.java:40)
	at com.carrotsearch.randomizedtesting.rules.StatementAdapter.evaluate(StatementAdapter.java:36)
	at com.carrotsearch.randomizedtesting.rules.StatementAdapter.evaluate(StatementAdapter.java:36)
	at com.carrotsearch.randomizedtesting.rules.StatementAdapter.evaluate(StatementAdapter.java:36)
	at org.apache.lucene.util.TestRuleAssertionsRequired$1.evaluate(TestRuleAssertionsRequired.java:53)
	at org.apache.lucene.util.TestRuleMarkFailure$1.evaluate(TestRuleMarkFailure.java:47)
	at org.apache.lucene.util.TestRuleIgnoreAfterMaxFailures$1.evaluate(TestRuleIgnoreAfterMaxFailures.java:64)
	at org.apache.lucene.util.TestRuleIgnoreTestSuites$1.evaluate(TestRuleIgnoreTestSuites.java:54)
	at com.carrotsearch.randomizedtesting.rules.StatementAdapter.evaluate(StatementAdapter.java:36)
	at com.carrotsearch.randomizedtesting.ThreadLeakControl$StatementRunner.run(ThreadLeakControl.java:368)
	at java.lang.Thread.run(Thread.java:748)




Build Log:
[...truncated 12767 lines...]
   [junit4] Suite: org.apache.solr.cloud.autoscaling.SearchRateTriggerIntegrationTest
   [junit4]   2> Creating dataDir: /home/jenkins/jenkins-slave/workspace/Lucene-Solr-Tests-master/solr/build/solr-core/test/J1/temp/solr.cloud.autoscaling.SearchRateTriggerIntegrationTest_E150F31FDF8F2D5E-001/init-core-data-001
   [junit4]   2> 1035552 WARN  (SUITE-SearchRateTriggerIntegrationTest-seed#[E150F31FDF8F2D5E]-worker) [    ] o.a.s.SolrTestCaseJ4 startTrackingSearchers: numOpens=39 numCloses=39
   [junit4]   2> 1035552 INFO  (SUITE-SearchRateTriggerIntegrationTest-seed#[E150F31FDF8F2D5E]-worker) [    ] o.a.s.SolrTestCaseJ4 Using PointFields (NUMERIC_POINTS_SYSPROP=true) w/NUMERIC_DOCVALUES_SYSPROP=false
   [junit4]   2> 1035554 INFO  (SUITE-SearchRateTriggerIntegrationTest-seed#[E150F31FDF8F2D5E]-worker) [    ] o.a.s.SolrTestCaseJ4 Randomized ssl (false) and clientAuth (true) via: @org.apache.solr.util.RandomizeSSL(reason=, ssl=NaN, value=NaN, clientAuth=NaN)
   [junit4]   2> 1035554 INFO  (SUITE-SearchRateTriggerIntegrationTest-seed#[E150F31FDF8F2D5E]-worker) [    ] o.a.s.SolrTestCaseJ4 SecureRandom sanity checks: test.solr.allowed.securerandom=null & java.security.egd=file:/dev/./urandom
   [junit4]   2> 1035554 INFO  (SUITE-SearchRateTriggerIntegrationTest-seed#[E150F31FDF8F2D5E]-worker) [    ] o.a.s.c.MiniSolrCloudCluster Starting cluster of 5 servers in /home/jenkins/jenkins-slave/workspace/Lucene-Solr-Tests-master/solr/build/solr-core/test/J1/temp/solr.cloud.autoscaling.SearchRateTriggerIntegrationTest_E150F31FDF8F2D5E-001/tempDir-001
   [junit4]   2> 1035555 INFO  (SUITE-SearchRateTriggerIntegrationTest-seed#[E150F31FDF8F2D5E]-worker) [    ] o.a.s.c.ZkTestServer STARTING ZK TEST SERVER
   [junit4]   2> 1035555 INFO  (Thread-705) [    ] o.a.s.c.ZkTestServer client port:0.0.0.0/0.0.0.0:0
   [junit4]   2> 1035555 INFO  (Thread-705) [    ] o.a.s.c.ZkTestServer Starting server
   [junit4]   2> 1035726 INFO  (SUITE-SearchRateTriggerIntegrationTest-seed#[E150F31FDF8F2D5E]-worker) [    ] o.a.s.c.ZkTestServer start zk server on port:38996
   [junit4]   2> 1035728 WARN  (NIOServerCxn.Factory:0.0.0.0/0.0.0.0:0) [    ] o.a.z.s.NIOServerCnxn Exception causing close of session 0x0: ZooKeeperServer not running
   [junit4]   2> 1035758 ERROR (Thread-705) [    ] o.a.z.s.ZooKeeperServer ZKShutdownHandler is not registered, so ZooKeeper server won't take any action on ERROR or SHUTDOWN server state changes
   [junit4]   2> 1037323 INFO  (zkConnectionManagerCallback-3071-thread-1) [    ] o.a.s.c.c.ConnectionManager zkClient has connected
   [junit4]   2> 1037338 INFO  (jetty-launcher-3068-thread-1) [    ] o.e.j.s.Server jetty-9.4.10.v20180503; built: 2018-05-03T15:56:21.710Z; git: daa59876e6f384329b122929e70a80934569428c; jvm 1.8.0_172-b11
   [junit4]   2> 1037354 INFO  (jetty-launcher-3068-thread-2) [    ] o.e.j.s.Server jetty-9.4.10.v20180503; built: 2018-05-03T15:56:21.710Z; git: daa59876e6f384329b122929e70a80934569428c; jvm 1.8.0_172-b11
   [junit4]   2> 1037356 INFO  (jetty-launcher-3068-thread-3) [    ] o.e.j.s.Server jetty-9.4.10.v20180503; built: 2018-05-03T15:56:21.710Z; git: daa59876e6f384329b122929e70a80934569428c; jvm 1.8.0_172-b11
   [junit4]   2> 1037372 INFO  (jetty-launcher-3068-thread-4) [    ] o.e.j.s.Server jetty-9.4.10.v20180503; built: 2018-05-03T15:56:21.710Z; git: daa59876e6f384329b122929e70a80934569428c; jvm 1.8.0_172-b11
   [junit4]   2> 1037375 INFO  (jetty-launcher-3068-thread-5) [    ] o.e.j.s.Server jetty-9.4.10.v20180503; built: 2018-05-03T15:56:21.710Z; git: daa59876e6f384329b122929e70a80934569428c; jvm 1.8.0_172-b11
   [junit4]   2> 1037377 INFO  (jetty-launcher-3068-thread-4) [    ] o.e.j.s.session DefaultSessionIdManager workerName=node0
   [junit4]   2> 1037377 INFO  (jetty-launcher-3068-thread-4) [    ] o.e.j.s.session No SessionScavenger set, using defaults
   [junit4]   2> 1037377 INFO  (jetty-launcher-3068-thread-4) [    ] o.e.j.s.session node0 Scavenging every 660000ms
   [junit4]   2> 1037377 INFO  (jetty-launcher-3068-thread-4) [    ] o.e.j.s.h.ContextHandler Started o.e.j.s.ServletContextHandler@34d1ebb8{/solr,null,AVAILABLE}
   [junit4]   2> 1037379 INFO  (jetty-launcher-3068-thread-3) [    ] o.e.j.s.session DefaultSessionIdManager workerName=node0
   [junit4]   2> 1037379 INFO  (jetty-launcher-3068-thread-3) [    ] o.e.j.s.session No SessionScavenger set, using defaults
   [junit4]   2> 1037379 INFO  (jetty-launcher-3068-thread-3) [    ] o.e.j.s.session node0 Scavenging every 660000ms
   [junit4]   2> 1037379 INFO  (jetty-launcher-3068-thread-4) [    ] o.e.j.s.AbstractConnector Started ServerConnector@2cd2e5fd{HTTP/1.1,[http/1.1]}{127.0.0.1:36910}
   [junit4]   2> 1037379 INFO  (jetty-launcher-3068-thread-4) [    ] o.e.j.s.Server Started @1037580ms
   [junit4]   2> 1037379 INFO  (jetty-launcher-3068-thread-4) [    ] o.a.s.c.s.e.JettySolrRunner Jetty properties: {hostContext=/solr, hostPort=36910}
   [junit4]   2> 1037379 INFO  (jetty-launcher-3068-thread-3) [    ] o.e.j.s.h.ContextHandler Started o.e.j.s.ServletContextHandler@5d322bfc{/solr,null,AVAILABLE}
   [junit4]   2> 1037379 ERROR (jetty-launcher-3068-thread-4) [    ] o.a.s.u.StartupLoggingUtils Missing Java Option solr.log.dir. Logging may be missing or incomplete.
   [junit4]   2> 1037379 INFO  (jetty-launcher-3068-thread-4) [    ] o.a.s.s.SolrDispatchFilter Using logger factory org.apache.logging.slf4j.Log4jLoggerFactory
   [junit4]   2> 1037379 INFO  (jetty-launcher-3068-thread-4) [    ] o.a.s.s.SolrDispatchFilter  ___      _       Welcome to Apache Solr™ version 8.0.0
   [junit4]   2> 1037379 INFO  (jetty-launcher-3068-thread-3) [    ] o.e.j.s.AbstractConnector Started ServerConnector@378a8159{HTTP/1.1,[http/1.1]}{127.0.0.1:44043}
   [junit4]   2> 1037379 INFO  (jetty-launcher-3068-thread-4) [    ] o.a.s.s.SolrDispatchFilter / __| ___| |_ _   Starting in cloud mode on port null
   [junit4]   2> 1037379 INFO  (jetty-launcher-3068-thread-3) [    ] o.e.j.s.Server Started @1037581ms
   [junit4]   2> 1037379 INFO  (jetty-launcher-3068-thread-4) [    ] o.a.s.s.SolrDispatchFilter \__ \/ _ \ | '_|  Install dir: null
   [junit4]   2> 1037396 INFO  (jetty-launcher-3068-thread-4) [    ] o.a.s.s.SolrDispatchFilter |___/\___/_|_|    Start time: 2018-05-23T19:43:31.835Z
   [junit4]   2> 1037396 INFO  (jetty-launcher-3068-thread-3) [    ] o.a.s.c.s.e.JettySolrRunner Jetty properties: {hostContext=/solr, hostPort=44043}
   [junit4]   2> 1037396 ERROR (jetty-launcher-3068-thread-3) [    ] o.a.s.u.StartupLoggingUtils Missing Java Option solr.log.dir. Logging may be missing or incomplete.
   [junit4]   2> 1037396 INFO  (jetty-launcher-3068-thread-3) [    ] o.a.s.s.SolrDispatchFilter Using logger factory org.apache.logging.slf4j.Log4jLoggerFactory
   [junit4]   2> 1037396 INFO  (jetty-launcher-3068-thread-3) [    ] o.a.s.s.SolrDispatchFilter  ___      _       Welcome to Apache Solr™ version 8.0.0
   [junit4]   2> 1037396 INFO  (jetty-launcher-3068-thread-3) [    ] o.a.s.s.SolrDispatchFilter / __| ___| |_ _   Starting in cloud mode on port null
   [junit4]   2> 1037396 INFO  (jetty-launcher-3068-thread-3) [    ] o.a.s.s.SolrDispatchFilter \__ \/ _ \ | '_|  Install dir: null
   [junit4]   2> 1037396 INFO  (jetty-launcher-3068-thread-3) [    ] o.a.s.s.SolrDispatchFilter |___/\___/_|_|    Start time: 2018-05-23T19:43:31.835Z
   [junit4]   2> 1037417 INFO  (jetty-launcher-3068-thread-5) [    ] o.e.j.s.session DefaultSessionIdManager workerName=node0
   [junit4]   2> 1037417 INFO  (jetty-launcher-3068-thread-5) [    ] o.e.j.s.session No SessionScavenger set, using defaults
   [junit4]   2> 1037417 INFO  (jetty-launcher-3068-thread-5) [    ] o.e.j.s.session node0 Scavenging every 660000ms
   [junit4]   2> 1037417 INFO  (jetty-launcher-3068-thread-5) [    ] o.e.j.s.h.ContextHandler Started o.e.j.s.ServletContextHandler@3b33fe51{/solr,null,AVAILABLE}
   [junit4]   2> 1037418 INFO  (jetty-launcher-3068-thread-5) [    ] o.e.j.s.AbstractConnector Started ServerConnector@4ed59644{HTTP/1.1,[http/1.1]}{127.0.0.1:38102}
   [junit4]   2> 1037418 INFO  (jetty-launcher-3068-thread-5) [    ] o.e.j.s.Server Started @1037619ms
   [junit4]   2> 1037418 INFO  (jetty-launcher-3068-thread-5) [    ] o.a.s.c.s.e.JettySolrRunner Jetty properties: {hostContext=/solr, hostPort=38102}
   [junit4]   2> 1037418 ERROR (jetty-launcher-3068-thread-5) [    ] o.a.s.u.StartupLoggingUtils Missing Java Option solr.log.dir. Logging may be missing or incomplete.
   [junit4]   2> 1037418 INFO  (jetty-launcher-3068-thread-5) [    ] o.a.s.s.SolrDispatchFilter Using logger factory org.apache.logging.slf4j.Log4jLoggerFactory
   [junit4]   2> 1037418 INFO  (jetty-launcher-3068-thread-5) [    ] o.a.s.s.SolrDispatchFilter  ___      _       Welcome to Apache Solr™ version 8.0.0
   [junit4]   2> 1037418 INFO  (jetty-launcher-3068-thread-5) [    ] o.a.s.s.SolrDispatchFilter / __| ___| |_ _   Starting in cloud mode on port null
   [junit4]   2> 1037418 INFO  (jetty-launcher-3068-thread-5) [    ] o.a.s.s.SolrDispatchFilter \__ \/ _ \ | '_|  Install dir: null
   [junit4]   2> 1037418 INFO  (jetty-launcher-3068-thread-5) [    ] o.a.s.s.SolrDispatchFilter |___/\___/_|_|    Start time: 2018-05-23T19:43:31.857Z
   [junit4]   2> 1037466 INFO  (jetty-launcher-3068-thread-1) [    ] o.e.j.s.session DefaultSessionIdManager workerName=node0
   [junit4]   2> 1037466 INFO  (jetty-launcher-3068-thread-1) [    ] o.e.j.s.session No SessionScavenger set, using defaults
   [junit4]   2> 1037466 INFO  (jetty-launcher-3068-thread-1) [    ] o.e.j.s.session node0 Scavenging every 600000ms
   [junit4]   2> 1037467 INFO  (jetty-launcher-3068-thread-1) [    ] o.e.j.s.h.ContextHandler Started o.e.j.s.ServletContextHandler@1aaad0c9{/solr,null,AVAILABLE}
   [junit4]   2> 1037467 INFO  (jetty-launcher-3068-thread-1) [    ] o.e.j.s.AbstractConnector Started ServerConnector@34f91ac9{HTTP/1.1,[http/1.1]}{127.0.0.1:35876}
   [junit4]   2> 1037467 INFO  (jetty-launcher-3068-thread-1) [    ] o.e.j.s.Server Started @1037669ms
   [junit4]   2> 1037467 INFO  (jetty-launcher-3068-thread-1) [    ] o.a.s.c.s.e.JettySolrRunner Jetty properties: {hostContext=/solr, hostPort=35876}
   [junit4]   2> 1037467 ERROR (jetty-launcher-3068-thread-1) [    ] o.a.s.u.StartupLoggingUtils Missing Java Option solr.log.dir. Logging may be missing or incomplete.
   [junit4]   2> 1037467 INFO  (jetty-launcher-3068-thread-1) [    ] o.a.s.s.SolrDispatchFilter Using logger factory org.apache.logging.slf4j.Log4jLoggerFactory
   [junit4]   2> 1037467 INFO  (jetty-launcher-3068-thread-1) [    ] o.a.s.s.SolrDispatchFilter  ___      _       Welcome to Apache Solr™ version 8.0.0
   [junit4]   2> 1037467 INFO  (jetty-launcher-3068-thread-1) [    ] o.a.s.s.SolrDispatchFilter / __| ___| |_ _   Starting in cloud mode on port null
   [junit4]   2> 1037467 INFO  (jetty-launcher-3068-thread-1) [    ] o.a.s.s.SolrDispatchFilter \__ \/ _ \ | '_|  Install dir: null
   [junit4]   2> 1037467 INFO  (jetty-launcher-3068-thread-1) [    ] o.a.s.s.SolrDispatchFilter |___/\___/_|_|    Start time: 2018-05-23T19:43:31.906Z
   [junit4]   2> 1037607 INFO  (zkConnectionManagerCallback-3075-thread-1) [    ] o.a.s.c.c.ConnectionManager zkClient has connected
   [junit4]   2> 1037607 INFO  (zkConnectionManagerCallback-3077-thread-1) [    ] o.a.s.c.c.ConnectionManager zkClient has connected
   [junit4]   2> 1037608 INFO  (jetty-launcher-3068-thread-5) [    ] o.a.s.s.SolrDispatchFilter solr.xml found in ZooKeeper. Loading...
   [junit4]   2> 1037608 INFO  (jetty-launcher-3068-thread-4) [    ] o.a.s.s.SolrDispatchFilter solr.xml found in ZooKeeper. Loading...
   [junit4]   2> 1037612 INFO  (jetty-launcher-3068-thread-2) [    ] o.e.j.s.session DefaultSessionIdManager workerName=node0
   [junit4]   2> 1037612 INFO  (jetty-launcher-3068-thread-2) [    ] o.e.j.s.session No SessionScavenger set, using defaults
   [junit4]   2> 1037612 INFO  (jetty-launcher-3068-thread-2) [    ] o.e.j.s.session node0 Scavenging every 600000ms
   [junit4]   2> 1037612 INFO  (jetty-launcher-3068-thread-2) [    ] o.e.j.s.h.ContextHandler Started o.e.j.s.ServletContextHandler@194266c{/solr,null,AVAILABLE}
   [junit4]   2> 1037613 INFO  (jetty-launcher-3068-thread-2) [    ] o.e.j.s.AbstractConnector Started ServerConnector@6b9625a0{HTTP/1.1,[http/1.1]}{127.0.0.1:40819}
   [junit4]   2> 1037613 INFO  (jetty-launcher-3068-thread-2) [    ] o.e.j.s.Server Started @1037814ms
   [junit4]   2> 1037613 INFO  (jetty-launcher-3068-thread-2) [    ] o.a.s.c.s.e.JettySolrRunner Jetty properties: {hostContext=/solr, hostPort=40819}
   [junit4]   2> 1037613 ERROR (jetty-launcher-3068-thread-2) [    ] o.a.s.u.StartupLoggingUtils Missing Java Option solr.log.dir. Logging may be missing or incomplete.
   [junit4]   2> 1037613 INFO  (jetty-launcher-3068-thread-2) [    ] o.a.s.s.SolrDispatchFilter Using logger factory org.apache.logging.slf4j.Log4jLoggerFactory
   [junit4]   2> 1037613 INFO  (jetty-launcher-3068-thread-2) [    ] o.a.s.s.SolrDispatchFilter  ___      _       Welcome to Apache Solr™ version 8.0.0
   [junit4]   2> 1037613 INFO  (jetty-launcher-3068-thread-2) [    ] o.a.s.s.SolrDispatchFilter / __| ___| |_ _   Starting in cloud mode on port null
   [junit4]   2> 1037613 INFO  (jetty-launcher-3068-thread-2) [    ] o.a.s.s.SolrDispatchFilter \__ \/ _ \ | '_|  Install dir: null
   [junit4]   2> 1037613 INFO  (jetty-launcher-3068-thread-2) [    ] o.a.s.s.SolrDispatchFilter |___/\___/_|_|    Start time: 2018-05-23T19:43:32.052Z
   [junit4]   2> 1037633 INFO  (zkConnectionManagerCallback-3073-thread-1) [    ] o.a.s.c.c.ConnectionManager zkClient has connected
   [junit4]   2> 1037680 INFO  (jetty-launcher-3068-thread-3) [    ] o.a.s.s.SolrDispatchFilter solr.xml found in ZooKeeper. Loading...
   [junit4]   2> 1037680 INFO  (zkConnectionManagerCallback-3079-thread-1) [    ] o.a.s.c.c.ConnectionManager zkClient has connected
   [junit4]   2> 1037685 INFO  (jetty-launcher-3068-thread-1) [    ] o.a.s.s.SolrDispatchFilter solr.xml found in ZooKeeper. Loading...
   [junit4]   2> 1037721 WARN  (NIOServerCxn.Factory:0.0.0.0/0.0.0.0:0) [    ] o.a.z.s.NIOServerCnxn Unable to read additional data from client sessionid 0x10232c9a7890003, likely client has closed socket
   [junit4]   2> 1037774 INFO  (zkConnectionManagerCallback-3081-thread-1) [    ] o.a.s.c.c.ConnectionManager zkClient has connected
   [junit4]   2> 1037776 INFO  (jetty-launcher-3068-thread-5) [    ] o.a.s.c.ZkContainer Zookeeper client=127.0.0.1:38996/solr
   [junit4]   2> 1037796 INFO  (jetty-launcher-3068-thread-2) [    ] o.a.s.s.SolrDispatchFilter solr.xml found in ZooKeeper. Loading...
   [junit4]   2> 1037811 INFO  (jetty-launcher-3068-thread-4) [    ] o.a.s.c.ZkContainer Zookeeper client=127.0.0.1:38996/solr
   [junit4]   2> 1037923 INFO  (jetty-launcher-3068-thread-3) [    ] o.a.s.c.ZkContainer Zookeeper client=127.0.0.1:38996/solr
   [junit4]   2> 1037936 INFO  (zkConnectionManagerCallback-3086-thread-1) [    ] o.a.s.c.c.ConnectionManager zkClient has connected
   [junit4]   2> 1037996 INFO  (zkConnectionManagerCallback-3093-thread-1) [    ] o.a.s.c.c.ConnectionManager zkClient has connected
   [junit4]   2> 1037996 INFO  (zkConnectionManagerCallback-3089-thread-1) [    ] o.a.s.c.c.ConnectionManager zkClient has connected
   [junit4]   2> 1038028 INFO  (jetty-launcher-3068-thread-1) [    ] o.a.s.c.ZkContainer Zookeeper client=127.0.0.1:38996/solr
   [junit4]   2> 1038083 INFO  (zkConnectionManagerCallback-3099-thread-1) [    ] o.a.s.c.c.ConnectionManager zkClient has connected
   [junit4]   2> 1038084 INFO  (zkConnectionManagerCallback-3101-thread-1) [    ] o.a.s.c.c.ConnectionManager zkClient has connected
   [junit4]   2> 1038086 INFO  (zkConnectionManagerCallback-3103-thread-1) [    ] o.a.s.c.c.ConnectionManager zkClient has connected
   [junit4]   2> 1038136 INFO  (jetty-launcher-3068-thread-2) [    ] o.a.s.c.ZkContainer Zookeeper client=127.0.0.1:38996/solr
   [junit4]   2> 1038137 INFO  (zkConnectionManagerCallback-3095-thread-1) [    ] o.a.s.c.c.ConnectionManager zkClient has connected
   [junit4]   2> 1038193 INFO  (zkConnectionManagerCallback-3109-thread-1) [    ] o.a.s.c.c.ConnectionManager zkClient has connected
   [junit4]   2> 1038193 INFO  (zkConnectionManagerCallback-3107-thread-1) [    ] o.a.s.c.c.ConnectionManager zkClient has connected
   [junit4]   2> 1038209 WARN  (NIOServerCxn.Factory:0.0.0.0/0.0.0.0:0) [    ] o.a.z.s.NIOServerCnxn Unable to read additional data from client sessionid 0x10232c9a789000d, likely client has closed socket
   [junit4]   2> 1038320 INFO  (zkConnectionManagerCallback-3115-thread-1) [    ] o.a.s.c.c.ConnectionManager zkClient has connected
   [junit4]   2> 1038367 INFO  (jetty-launcher-3068-thread-4) [n:127.0.0.1:36910_solr    ] o.a.s.c.Overseer Overseer (id=null) closing
   [junit4]   2> 1038368 INFO  (jetty-launcher-3068-thread-4) [n:127.0.0.1:36910_solr    ] o.a.s.c.OverseerElectionContext I am going to be the leader 127.0.0.1:36910_solr
   [junit4]   2> 1038417 INFO  (jetty-launcher-3068-thread-4) [n:127.0.0.1:36910_solr    ] o.a.s.c.Overseer Overseer (id=72676385671938058-127.0.0.1:36910_solr-n_0000000000) starting
   [junit4]   2> 1038514 INFO  (zkConnectionManagerCallback-3126-thread-1) [    ] o.a.s.c.c.ConnectionManager zkClient has connected
   [junit4]   2> 1038517 INFO  (jetty-launcher-3068-thread-4) [n:127.0.0.1:36910_solr    ] o.a.s.c.s.i.ZkClientClusterStateProvider Cluster at 127.0.0.1:38996/solr ready
   [junit4]   2> 1038590 INFO  (jetty-launcher-3068-thread-4) [n:127.0.0.1:36910_solr    ] o.a.s.c.ZkController Register node as live in ZooKeeper:/live_nodes/127.0.0.1:36910_solr
   [junit4]   2> 1038601 DEBUG (OverseerAutoScalingTriggerThread-72676385671938058-127.0.0.1:36910_solr-n_0000000000) [    ] o.a.s.c.a.OverseerTriggerThread Adding .auto_add_replicas and .scheduled_maintenance triggers
   [junit4]   2> 1038624 INFO  (OverseerStateUpdate-72676385671938058-127.0.0.1:36910_solr-n_0000000000) [    ] o.a.s.c.c.ZkStateReader Updated live nodes from ZooKeeper... (0) -> (1)
   [junit4]   2> 1038665 DEBUG (OverseerAutoScalingTriggerThread-72676385671938058-127.0.0.1:36910_solr-n_0000000000) [    ] o.a.s.c.a.OverseerTriggerThread Refreshing /autoscaling.json with znode version 1
   [junit4]   2> 1038665 DEBUG (OverseerAutoScalingTriggerThread-72676385671938058-127.0.0.1:36910_solr-n_0000000000) [    ] o.a.s.c.a.OverseerTriggerThread Current znodeVersion 1, lastZnodeVersion -1
   [junit4]   2> 1038665 DEBUG (OverseerAutoScalingTriggerThread-72676385671938058-127.0.0.1:36910_solr-n_0000000000) [    ] o.a.s.c.a.OverseerTriggerThread Processed trigger updates upto znodeVersion 1
   [junit4]   2> 1038666 INFO  (zkCallback-3114-thread-1) [    ] o.a.s.c.c.ZkStateReader Updated live nodes from ZooKeeper... (0) -> (1)
   [junit4]   2> 1038666 INFO  (jetty-launcher-3068-thread-2) [n:127.0.0.1:40819_solr    ] o.a.s.c.Overseer Overseer (id=null) closing
   [junit4]   2> 1038670 INFO  (jetty-launcher-3068-thread-2) [n:127.0.0.1:40819_solr    ] o.a.s.c.TransientSolrCoreCacheDefault Allocating transient cache for 2147483647 transient cores
   [junit4]   2> 1038670 INFO  (jetty-launcher-3068-thread-2) [n:127.0.0.1:40819_solr    ] o.a.s.c.ZkController Register node as live in ZooKeeper:/live_nodes/127.0.0.1:40819_solr
   [junit4]   2> 1038672 INFO  (zkCallback-3114-thread-1) [    ] o.a.s.c.c.ZkStateReader Updated live nodes from ZooKeeper... (1) -> (2)
   [junit4]   2> 1038770 INFO  (zkCallback-3125-thread-1) [    ] o.a.s.c.c.ZkStateReader Updated live nodes from ZooKeeper... (0) -> (1)
   [junit4]   2> 1038771 INFO  (zkCallback-3125-thread-2) [    ] o.a.s.c.c.ZkStateReader Updated live nodes from ZooKeeper... (1) -> (2)
   [junit4]   2> 1038771 INFO  (zkCallback-3100-thread-1) [    ] o.a.s.c.c.ZkStateReader Updated live nodes from ZooKeeper... (1) -> (2)
   [junit4]   2> 1038794 DEBUG (OverseerAutoScalingTriggerThread-72676385671938058-127.0.0.1:36910_solr-n_0000000000) [    ] o.a.s.c.a.NodeLostTrigger NodeLostTrigger .auto_add_replicas - Initial livenodes: [127.0.0.1:40819_solr, 127.0.0.1:36910_solr]
   [junit4]   2> 1038807 DEBUG (ScheduledTrigger-1364-thread-1) [    ] o.a.s.c.a.NodeLostTrigger Running NodeLostTrigger: .auto_add_replicas with currently live nodes: 2
   [junit4]   2> 1038827 DEBUG (OverseerAutoScalingTriggerThread-72676385671938058-127.0.0.1:36910_solr-n_0000000000) [    ] o.a.s.c.a.OverseerTriggerThread -- clean old nodeAdded markers
   [junit4]   2> 1038828 DEBUG (OverseerAutoScalingTriggerThread-72676385671938058-127.0.0.1:36910_solr-n_0000000000) [    ] o.a.s.c.a.OverseerTriggerThread Current znodeVersion 1, lastZnodeVersion 1
   [junit4]   2> 1038975 INFO  (jetty-launcher-3068-thread-1) [n:127.0.0.1:35876_solr    ] o.a.s.c.c.ZkStateReader Updated live nodes from ZooKeeper... (0) -> (2)
   [junit4]   2> 1038977 INFO  (jetty-launcher-3068-thread-1) [n:127.0.0.1:35876_solr    ] o.a.s.c.Overseer Overseer (id=null) closing
   [junit4]   2> 1038995 INFO  (jetty-launcher-3068-thread-1) [n:127.0.0.1:35876_solr    ] o.a.s.c.TransientSolrCoreCacheDefault Allocating transient cache for 2147483647 transient cores
   [junit4]   2> 1038995 INFO  (jetty-launcher-3068-thread-1) [n:127.0.0.1:35876_solr    ] o.a.s.c.ZkController Register node as live in ZooKeeper:/live_nodes/127.0.0.1:35876_solr
   [junit4]   2> 1038996 INFO  (zkCallback-3114-thread-1) [    ] o.a.s.c.c.ZkStateReader Updated live nodes from ZooKeeper... (2) -> (3)
   [junit4]   2> 1039096 INFO  (zkCallback-3102-thread-1) [    ] o.a.s.c.c.ZkStateReader Updated live nodes from ZooKeeper... (2) -> (3)
   [junit4]   2> 1039148 INFO  (zkCallback-3125-thread-2) [    ] o.a.s.c.c.ZkStateReader Updated live nodes from ZooKeeper... (2) -> (3)
   [junit4]   2> 1039148 INFO  (zkCallback-3100-thread-2) [    ] o.a.s.c.c.ZkStateReader Updated live nodes from ZooKeeper... (2) -> (3)
   [junit4]   2> 1039536 INFO  (jetty-launcher-3068-thread-4) [n:127.0.0.1:36910_solr    ] o.a.s.m.r.SolrJmxReporter JMX monitoring for 'solr_36910.solr.node' (registry 'solr.node') enabled at server: com.sun.jmx.mbeanserver.JmxMBeanServer@38126b0a
   [junit4]   2> 1039644 INFO  (jetty-launcher-3068-thread-4) [n:127.0.0.1:36910_solr    ] o.a.s.m.r.SolrJmxReporter JMX monitoring for 'solr_36910.solr.jvm' (registry 'solr.jvm') enabled at server: com.sun.jmx.mbeanserver.JmxMBeanServer@38126b0a
   [junit4]   2> 1039645 INFO  (jetty-launcher-3068-thread-4) [n:127.0.0.1:36910_solr    ] o.a.s.m.r.SolrJmxReporter JMX monitoring for 'solr_36910.solr.jetty' (registry 'solr.jetty') enabled at server: com.sun.jmx.mbeanserver.JmxMBeanServer@38126b0a
   [junit4]   2> 1039646 INFO  (jetty-launcher-3068-thread-4) [n:127.0.0.1:36910_solr    ] o.a.s.c.CorePropertiesLocator Found 0 core definitions underneath /home/jenkins/jenkins-slave/workspace/Lucene-Solr-Tests-master/solr/build/solr-core/test/J1/temp/solr.cloud.autoscaling.SearchRateTriggerIntegrationTest_E150F31FDF8F2D5E-001/tempDir-001/node4/.
   [junit4]   2> 1040145 DEBUG (ScheduledTrigger-1364-thread-3) [    ] o.a.s.c.a.NodeLostTrigger Running NodeLostTrigger: .auto_add_replicas with currently live nodes: 3
   [junit4]   2> 1040354 INFO  (jetty-launcher-3068-thread-5) [n:127.0.0.1:38102_solr    ] o.a.s.c.c.ZkStateReader Updated live nodes from ZooKeeper... (0) -> (3)
   [junit4]   2> 1040356 INFO  (jetty-launcher-3068-thread-5) [n:127.0.0.1:38102_solr    ] o.a.s.c.Overseer Overseer (id=null) closing
   [junit4]   2> 1040391 INFO  (jetty-launcher-3068-thread-5) [n:127.0.0.1:38102_solr    ] o.a.s.c.TransientSolrCoreCacheDefault Allocating transient cache for 2147483647 transient cores
   [junit4]   2> 1040391 INFO  (jetty-launcher-3068-thread-5) [n:127.0.0.1:38102_solr    ] o.a.s.c.ZkController Register node as live in ZooKeeper:/live_nodes/127.0.0.1:38102_solr
   [junit4]   2> 1040414 INFO  (zkCallback-3125-thread-2) [    ] o.a.s.c.c.ZkStateReader Updated live nodes from ZooKeeper... (3) -> (4)
   [junit4]   2> 1040414 INFO  (zkCallback-3100-thread-1) [    ] o.a.s.c.c.ZkStateReader Updated live nodes from ZooKeeper... (3) -> (4)
   [junit4]   2> 1040430 INFO  (zkCallback-3114-thread-1) [    ] o.a.s.c.c.ZkStateReader Updated live nodes from ZooKeeper... (3) -> (4)
   [junit4]   2> 1040430 INFO  (zkCallback-3102-thread-1) [    ] o.a.s.c.c.ZkStateReader Updated live nodes from ZooKeeper... (3) -> (4)
   [junit4]   2> 1040444 INFO  (zkCallback-3094-thread-1) [    ] o.a.s.c.c.ZkStateReader Updated live nodes from ZooKeeper... (3) -> (4)
   [junit4]   2> 1040451 INFO  (jetty-launcher-3068-thread-3) [n:127.0.0.1:44043_solr    ] o.a.s.c.c.ZkStateReader Updated live nodes from ZooKeeper... (0) -> (4)
   [junit4]   2> 1040452 INFO  (jetty-launcher-3068-thread-3) [n:127.0.0.1:44043_solr    ] o.a.s.c.Overseer Overseer (id=null) closing
   [junit4]   2> 1040466 INFO  (jetty-launcher-3068-thread-3) [n:127.0.0.1:44043_solr    ] o.a.s.c.TransientSolrCoreCacheDefault Allocating transient cache for 2147483647 transient cores
   [junit4]   2> 1040466 INFO  (jetty-launcher-3068-thread-3) [n:127.0.0.1:44043_solr    ] o.a.s.c.ZkController Register node as live in ZooKeeper:/live_nodes/127.0.0.1:44043_solr
   [junit4]   2> 1040467 INFO  (zkCallback-3125-thread-2) [    ] o.a.s.c.c.ZkStateReader Updated live nodes from ZooKeeper... (4) -> (5)
   [junit4]   2> 1040468 INFO  (zkCallback-3094-thread-1) [    ] o.a.s.c.c.ZkStateReader Updated live nodes from ZooKeeper... (4) -> (5)
   [junit4]   2> 1040471 INFO  (zkCallback-3114-thread-1) [    ] o.a.s.c.c.ZkStateReader Updated live nodes from ZooKeeper... (4) -> (5)
   [junit4]   2> 1040487 INFO  (zkCallback-3102-thread-1) [    ] o.a.s.c.c.ZkStateReader Updated live nodes from ZooKeeper... (4) -> (5)
   [junit4]   2> 1040487 INFO  (zkCallback-3100-thread-1) [    ] o.a.s.c.c.ZkStateReader Updated live nodes from ZooKeeper... (4) -> (5)
   [junit4]   2> 1040605 INFO  (zkCallback-3106-thread-1) [    ] o.a.s.c.c.ZkStateReader Updated live nodes from ZooKeeper... (4) -> (5)
   [junit4]   2> 1041299 INFO  (jetty-launcher-3068-thread-2) [n:127.0.0.1:40819_solr    ] o.a.s.m.r.SolrJmxReporter JMX monitoring for 'solr_40819.solr.node' (registry 'solr.node') enabled at server: com.sun.jmx.mbeanserver.JmxMBeanServer@38126b0a
   [junit4]   2> 1041309 INFO  (jetty-launcher-3068-thread-1) [n:127.0.0.1:35876_solr    ] o.a.s.m.r.SolrJmxReporter JMX monitoring for 'solr_35876.solr.node' (registry 'solr.node') enabled at server: com.sun.jmx.mbeanserver.JmxMBeanServer@38126b0a
   [junit4]   2> 1041328 INFO  (jetty-launcher-3068-thread-1) [n:127.0.0.1:35876_solr    ] o.a.s.m.r.SolrJmxReporter JMX monitoring for 'solr_35876.solr.jvm' (registry 'solr.jvm') enabled at server: com.sun.jmx.mbeanserver.JmxMBeanServer@38126b0a
   [junit4]   2> 1041328 INFO  (jetty-launcher-3068-thread-1) [n:127.0.0.1:35876_solr    ] o.a.s.m.r.SolrJmxReporter JMX monitoring for 'solr_35876.solr.jetty' (registry 'solr.jetty') enabled at server: com.sun.jmx.mbeanserver.JmxMBeanServer@38126b0a
   [junit4]   2> 1041333 DEBUG (ScheduledTrigger-1364-thread-2) [    ] o.a.s.c.a.NodeLostTrigger Running NodeLostTrigger: .auto_add_replicas with currently live nodes: 5
   [junit4]   2> 1041346 INFO  (jetty-launcher-3068-thread-1) [n:127.0.0.1:35876_solr    ] o.a.s.c.CorePropertiesLocator Found 0 core definitions underneath /home/jenkins/jenkins-slave/workspace/Lucene-Solr-Tests-master/solr/build/solr-core/test/J1/temp/solr.cloud.autoscaling.SearchRateTriggerIntegrationTest_E150F31FDF8F2D5E-001/tempDir-001/node1/.
   [junit4]   2> 1041396 INFO  (jetty-launcher-3068-thread-2) [n:127.0.0.1:40819_solr    ] o.a.s.m.r.SolrJmxReporter JMX monitoring for 'solr_40819.solr.jvm' (registry 'solr.jvm') enabled at server: com.sun.jmx.mbeanserver.JmxMBeanServer@38126b0a
   [junit4]   2> 1041396 INFO  (jetty-launcher-3068-thread-2) [n:127.0.0.1:40819_solr    ] o.a.s.m.r.SolrJmxReporter JMX monitoring for 'solr_40819.solr.jetty' (registry 'solr.jetty') enabled at server: com.sun.jmx.mbeanserver.JmxMBeanServer@38126b0a
   [junit4]   2> 1041398 INFO  (jetty-launcher-3068-thread-2) [n:127.0.0.1:40819_solr    ] o.a.s.c.CorePropertiesLocator Found 0 core definitions underneath /home/jenkins/jenkins-slave/workspace/Lucene-Solr-Tests-master/solr/build/solr-core/test/J1/temp/solr.cloud.autoscaling.SearchRateTriggerIntegrationTest_E150F31FDF8F2D5E-001/tempDir-001/node2/.
   [junit4]   2> 1041399 INFO  (zkConnectionManagerCallback-3131-thread-1) [    ] o.a.s.c.c.ConnectionManager zkClient has connected
   [junit4]   2> 1041400 INFO  (jetty-launcher-3068-thread-1) [n:127.0.0.1:35876_solr    ] o.a.s.c.c.ZkStateReader Updated live nodes from ZooKeeper... (0) -> (5)
   [junit4]   2> 1041401 INFO  (jetty-launcher-3068-thread-1) [n:127.0.0.1:35876_solr    ] o.a.s.c.s.i.ZkClientClusterStateProvider Cluster at 127.0.0.1:38996/solr ready
   [junit4]   2> 1041540 INFO  (zkConnectionManagerCallback-3136-thread-1) [    ] o.a.s.c.c.ConnectionManager zkClient has connected
   [junit4]   2> 1041553 INFO  (jetty-launcher-3068-thread-2) [n:127.0.0.1:40819_solr    ] o.a.s.c.c.ZkStateReader Updated live nodes from ZooKeeper... (0) -> (5)
   [junit4]   2> 1041554 INFO  (jetty-launcher-3068-thread-2) [n:127.0.0.1:40819_solr    ] o.a.s.c.s.i.ZkClientClusterStateProvider Cluster at 127.0.0.1:38996/solr ready
   [junit4]   2> 1041708 INFO  (jetty-launcher-3068-thread-3) [n:127.0.0.1:44043_solr    ] o.a.s.m.r.SolrJmxReporter JMX monitoring for 'solr_44043.solr.node' (registry 'solr.node') enabled at server: com.sun.jmx.mbeanserver.JmxMBeanServer@38126b0a
   [junit4]   2> 1041723 INFO  (jetty-launcher-3068-thread-5) [n:127.0.0.1:38102_solr    ] o.a.s.m.r.SolrJmxReporter JMX monitoring for 'solr_38102.solr.node' (registry 'solr.node') enabled at server: com.sun.jmx.mbeanserver.JmxMBeanServer@38126b0a
   [junit4]   2> 1041759 INFO  (jetty-launcher-3068-thread-5) [n:127.0.0.1:38102_solr    ] o.a.s.m.r.SolrJmxReporter JMX monitoring for 'solr_38102.solr.jvm' (registry 'solr.jvm') enabled at server: com.sun.jmx.mbeanserver.JmxMBeanServer@38126b0a
   [junit4]   2> 1041759 INFO  (jetty-launcher-3068-thread-5) [n:127.0.0.1:38102_solr    ] o.a.s.m.r.SolrJmxReporter JMX monitoring for 'solr_38102.solr.jetty' (registry 'solr.jetty') enabled at server: com.sun.jmx.mbeanserver.JmxMBeanServer@38126b0a
   [junit4]   2> 1041779 INFO  (jetty-launcher-3068-thread-5) [n:127.0.0.1:38102_solr    ] o.a.s.c.CorePropertiesLocator Found 0 core definitions underneath /home/jenkins/jenkins-slave/workspace/Lucene-Solr-Tests-master/solr/build/solr-core/test/J1/temp/solr.cloud.autoscaling.SearchRateTriggerIntegrationTest_E150F31FDF8F2D5E-001/tempDir-001/node5/.
   [junit4]   2> 1041790 INFO  (jetty-launcher-3068-thread-3) [n:127.0.0.1:44043_solr    ] o.a.s.m.r.SolrJmxReporter JMX monitoring for 'solr_44043.solr.jvm' (registry 'solr.jvm') enabled at server: com.sun.jmx.mbeanserver.JmxMBeanServer@38126b0a
   [junit4]   2> 1041790 INFO  (jetty-launcher-3068-thread-3) [n:127.0.0.1:44043_solr    ] o.a.s.m.r.SolrJmxReporter JMX monitoring for 'solr_44043.solr.jetty' (registry 'solr.jetty') enabled at server: com.sun.jmx.mbeanserver.JmxMBeanServer@38126b0a
   [junit4]   2> 1041791 INFO  (jetty-launcher-3068-thread-3) [n:127.0.0.1:44043_solr    ] o.a.s.c.CorePropertiesLocator Found 0 core definitions underneath /home/jenkins/jenkins-slave/workspace/Lucene-Solr-Tests-master/solr/build/solr-core/test/J1/temp/solr.cloud.autoscaling.SearchRateTriggerIntegrationTest_E150F31FDF8F2D5E-001/tempDir-001/node3/.
   [junit4]   2> 1041868 INFO  (zkConnectionManagerCallback-3146-thread-1) [    ] o.a.s.c.c.ConnectionManager zkClient has connected
   [junit4]   2> 1041877 INFO  (zkConnectionManagerCallback-3144-thread-1) [    ] o.a.s.c.c.ConnectionManager zkClient has connected
   [junit4]   2> 1041879 INFO  (jetty-launcher-3068-thread-3) [n:127.0.0.1:44043_solr    ] o.a.s.c.c.ZkStateReader Updated live nodes from ZooKeeper... (0) -> (5)
   [junit4]   2> 1041880 INFO  (jetty-launcher-3068-thread-3) [n:127.0.0.1:44043_solr    ] o.a.s.c.s.i.ZkClientClusterStateProvider Cluster at 127.0.0.1:38996/solr ready
   [junit4]   2> 1041906 INFO  (jetty-launcher-3068-thread-5) [n:127.0.0.1:38102_solr    ] o.a.s.c.c.ZkStateReader Updated live nodes from ZooKeeper... (0) -> (5)
   [junit4]   2> 1041907 INFO  (jetty-launcher-3068-thread-5) [n:127.0.0.1:38102_solr    ] o.a.s.c.s.i.ZkClientClusterStateProvider Cluster at 127.0.0.1:38996/solr ready
   [junit4]   2> 1042349 DEBUG (ScheduledTrigger-1364-thread-1) [    ] o.a.s.c.a.NodeLostTrigger Running NodeLostTrigger: .auto_add_replicas with currently live nodes: 5
   [junit4]   2> 1042356 INFO  (zkConnectionManagerCallback-3148-thread-1) [    ] o.a.s.c.c.ConnectionManager zkClient has connected
   [junit4]   2> 1042392 INFO  (zkConnectionManagerCallback-3153-thread-1) [    ] o.a.s.c.c.ConnectionManager zkClient has connected
   [junit4]   2> 1042393 INFO  (SUITE-SearchRateTriggerIntegrationTest-seed#[E150F31FDF8F2D5E]-worker) [    ] o.a.s.c.c.ZkStateReader Updated live nodes from ZooKeeper... (0) -> (5)
   [junit4]   2> 1042393 INFO  (SUITE-SearchRateTriggerIntegrationTest-seed#[E150F31FDF8F2D5E]-worker) [    ] o.a.s.c.s.i.ZkClientClusterStateProvider Cluster at 127.0.0.1:38996/solr ready
   [junit4]   2> 1042530 INFO  (qtp284530026-7119) [n:127.0.0.1:35876_solr    ] o.a.s.s.HttpSolrCall [admin] webapp=null path=/admin/metrics params={prefix=CONTAINER.fs.usableSpace,CORE.coreName&wt=javabin&version=2&group=solr.node,solr.core} status=0 QTime=25
   [junit4]   2> 1042580 INFO  (qtp1113662698-7104) [n:127.0.0.1:36910_solr    ] o.a.s.s.HttpSolrCall [admin] webapp=null path=/admin/metrics params={prefix=CONTAINER.fs.usableSpace,CORE.coreName&wt=javabin&version=2&group=solr.node,solr.core} status=0 QTime=0
   [junit4]   2> 1042607 INFO  (qtp2111441421-7132) [n:127.0.0.1:38102_solr    ] o.a.s.s.HttpSolrCall [admin] webapp=null path=/admin/metrics params={prefix=CONTAINER.fs.usableSpace,CORE.coreName&wt=javabin&version=2&group=solr.node,solr.core} status=0 QTime=0
   [junit4]   2> 1042609 INFO  (qtp417329697-7138) [n:127.0.0.1:40819_solr    ] o.a.s.s.HttpSolrCall [admin] webapp=null path=/admin/metrics params={prefix=CONTAINER.fs.usableSpace,CORE.coreName&wt=javabin&version=2&group=solr.node,solr.core} status=0 QTime=0
   [junit4]   2> 1042646 INFO  (qtp1412248551-7116) [n:127.0.0.1:44043_solr    ] o.a.s.s.HttpSolrCall [admin] webapp=null path=/admin/metrics params={prefix=CONTAINER.fs.usableSpace,CORE.coreName&wt=javabin&version=2&group=solr.node,solr.core} status=0 QTime=0
   [junit4]   2> 1042647 DEBUG (qtp1113662698-7123) [n:127.0.0.1:36910_solr    ] o.a.s.c.a.AutoScalingHandler Verified autoscaling configuration
   [junit4]   2> 1042648 INFO  (qtp1113662698-7123) [n:127.0.0.1:36910_solr    ] o.a.s.s.HttpSolrCall [admin] webapp=null path=/cluster/autoscaling params={wt=javabin&version=2} status=0 QTime=208
   [junit4]   2> 1042648 DEBUG (zkCallback-3125-thread-2) [    ] o.a.s.c.a.OverseerTriggerThread Refreshing /autoscaling.json with znode version 2
   [junit4]   2> 1042651 DEBUG (OverseerAutoScalingTriggerThread-72676385671938058-127.0.0.1:36910_solr-n_0000000000) [    ] o.a.s.c.a.OverseerTriggerThread Processed trigger updates upto znodeVersion 2
   [junit4]   2> 1042682 DEBUG (OverseerAutoScalingTriggerThread-72676385671938058-127.0.0.1:36910_solr-n_0000000000) [    ] o.a.s.c.a.OverseerTriggerThread -- clean old nodeAdded markers
   [junit4]   2> 1042683 DEBUG (OverseerAutoScalingTriggerThread-72676385671938058-127.0.0.1:36910_solr-n_0000000000) [    ] o.a.s.c.a.OverseerTriggerThread Current znodeVersion 2, lastZnodeVersion 2
   [junit4]   2> 1042834 INFO  (TEST-SearchRateTriggerIntegrationTest.testDeleteNode-seed#[E150F31FDF8F2D5E]) [    ] o.a.s.SolrTestCaseJ4 ###Starting testDeleteNode
   [junit4]   2> 1042836 INFO  (TEST-SearchRateTriggerIntegrationTest.testDeleteNode-seed#[E150F31FDF8F2D5E]) [    ] o.a.s.c.c.ZkStateReader Updated live nodes from ZooKeeper... (0) -> (5)
   [junit4]   2> 1042837 INFO  (TEST-SearchRateTriggerIntegrationTest.testDeleteNode-seed#[E150F31FDF8F2D5E]) [    ] o.a.s.c.a.SearchRateTriggerIntegrationTest /autoscaling.json reset, new znode version 3
   [junit4]   2> 1042849 DEBUG (zkCallback-3125-thread-2) [    ] o.a.s.c.a.OverseerTriggerThread Refreshing /autoscaling.json with znode version 3
   [junit4]   2> 1042850 DEBUG (OverseerAutoScalingTriggerThread-72676385671938058-127.0.0.1:36910_solr-n_0000000000) [    ] o.a.s.c.a.OverseerTriggerThread Processed trigger updates upto znodeVersion 3
   [junit4]   2> 1042866 DEBUG (OverseerAutoScalingTriggerThread-72676385671938058-127.0.0.1:36910_solr-n_0000000000) [    ] o.a.s.c.a.OverseerTriggerThread -- clean old nodeLost markers
   [junit4]   2> 1042879 DEBUG (OverseerAutoScalingTriggerThread-72676385671938058-127.0.0.1:36910_solr-n_0000000000) [    ] o.a.s.c.a.OverseerTriggerThread -- clean old nodeAdded markers
   [junit4]   2> 1042879 DEBUG (OverseerAutoScalingTriggerThread-72676385671938058-127.0.0.1:36910_solr-n_0000000000) [    ] o.a.s.c.a.OverseerTriggerThread Current znodeVersion 3, lastZnodeVersion 3
   [junit4]   2> 1047860 INFO  (qtp2111441421-7112) [n:127.0.0.1:38102_solr    ] o.a.s.h.a.CollectionsHandler Invoked Collection Action :create with params replicationFactor=2&collection.configName=conf&name=deleteNode_collection&nrtReplicas=2&action=CREATE&numShards=1&wt=javabin&version=2 and sendToOCPQueue=true
   [junit4]   2> 1047870 INFO  (OverseerThreadFactory-1366-thread-1) [    ] o.a.s.c.a.c.CreateCollectionCmd Create collection deleteNode_collection
   [junit4]   2> 1048019 INFO  (OverseerStateUpdate-72676385671938058-127.0.0.1:36910_solr-n_0000000000) [    ] o.a.s.c.o.SliceMutator createReplica() {
   [junit4]   2>   "operation":"ADDREPLICA",
   [junit4]   2>   "collection":"deleteNode_collection",
   [junit4]   2>   "shard":"shard1",
   [junit4]   2>   "core":"deleteNode_collection_shard1_replica_n1",
   [junit4]   2>   "state":"down",
   [junit4]   2>   "base_url":"http://127.0.0.1:35876/solr",
   [junit4]   2>   "type":"NRT",
   [junit4]   2>   "waitForFinalState":"false"} 
   [junit4]   2> 1048021 INFO  (OverseerStateUpdate-72676385671938058-127.0.0.1:36910_solr-n_0000000000) [    ] o.a.s.c.o.SliceMutator createReplica() {
   [junit4]   2>   "operation":"ADDREPLICA",
   [junit4]   2>   "collection":"deleteNode_collection",
   [junit4]   2>   "shard":"shard1",
   [junit4]   2>   "core":"deleteNode_collection_shard1_replica_n2",
   [junit4]   2>   "state":"down",
   [junit4]   2>   "base_url":"http://127.0.0.1:38102/solr",
   [junit4]   2>   "type":"NRT",
   [junit4]   2>   "waitForFinalState":"false"} 
   [junit4]   2> 1048249 INFO  (qtp284530026-7099) [n:127.0.0.1:35876_solr    x:deleteNode_collection_shard1_replica_n1] o.a.s.h.a.CoreAdminOperation core create command qt=/admin/cores&coreNodeName=core_node3&collection.configName=conf&newCollection=true&name=deleteNode_collection_shard1_replica_n1&action=CREATE&numShards=1&collection=deleteNode_collection&shard=shard1&wt=javabin&version=2&replicaType=NRT
   [junit4]   2> 1048249 INFO  (qtp2111441421-7113) [n:127.0.0.1:38102_solr    x:deleteNode_collection_shard1_replica_n2] o.a.s.h.a.CoreAdminOperation core create command qt=/admin/cores&coreNodeName=core_node4&collection.configName=conf&newCollection=true&name=deleteNode_collection_shard1_replica_n2&action=CREATE&numShards=1&collection=deleteNode_collection&shard=shard1&wt=javabin&version=2&replicaType=NRT
   [junit4]   2> 1049357 INFO  (qtp284530026-7099) [n:127.0.0.1:35876_solr c:deleteNode_collection s:shard1 r:core_node3 x:deleteNode_collection_shard1_replica_n1] o.a.s.c.SolrConfig Using Lucene MatchVersion: 8.0.0
   [junit4]   2> 1049384 INFO  (qtp284530026-7099) [n:127.0.0.1:35876_solr c:deleteNode_collection s:shard1 r:core_node3 x:deleteNode_collection_shard1_replica_n1] o.a.s.s.IndexSchema [deleteNode_collection_shard1_replica_n1] Schema name=minimal
   [junit4]   2> 1049404 INFO  (qtp2111441421-7113) [n:127.0.0.1:38102_solr c:deleteNode_collection s:shard1 r:core_node4 x:deleteNode_collection_shard1_replica_n2] o.a.s.c.SolrConfig Using Lucene MatchVersion: 8.0.0
   [junit4]   2> 1049443 INFO  (qtp284530026-7099) [n:127.0.0.1:35876_solr c:deleteNode_collection s:shard1 r:core_node3 x:deleteNode_collection_shard1_replica_n1] o.a.s.s.IndexSchema Loaded schema minimal/1.1 with uniqueid field id
   [junit4]   2> 1049443 INFO  (qtp284530026-7099) [n:127.0.0.1:35876_solr c:deleteNode_collection s:shard1 r:core_node3 x:deleteNode_collection_shard1_replica_n1] o.a.s.c.CoreContainer Creating SolrCore 'deleteNode_collection_shard1_replica_n1' using configuration from collection deleteNode_collection, trusted=true
   [junit4]   2> 1049493 INFO  (qtp2111441421-7113) [n:127.0.0.1:38102_solr c:deleteNode_collection s:shard1 r:core_node4 x:deleteNode_collection_shard1_replica_n2] o.a.s.s.IndexSchema [deleteNode_collection_shard1_replica_n2] Schema name=minimal
   [junit4]   2> 1049507 INFO  (qtp284530026-7099) [n:127.0.0.1:35876_solr c:deleteNode_collection s:shard1 r:core_node3 x:deleteNode_collection_shard1_replica_n1] o.a.s.m.r.SolrJmxReporter JMX monitoring for 'solr_35876.solr.core.deleteNode_collection.shard1.replica_n1' (registry 'solr.core.deleteNode_collection.shard1.replica_n1') enabled at server: com.sun.jmx.mbeanserver.JmxMBeanServer@38126b0a
   [junit4]   2> 1049508 INFO  (qtp284530026-7099) [n:127.0.0.1:35876_solr c:deleteNode_collection s:shard1 r:core_node3 x:deleteNode_collection_shard1_replica_n1] o.a.s.c.SolrCore solr.RecoveryStrategy.Builder
   [junit4]   2> 1049508 INFO  (qtp284530026-7099) [n:127.0.0.1:35876_solr c:deleteNode_collection s:shard1 r:core_node3 x:deleteNode_collection_shard1_replica_n1] o.a.s.c.SolrCore [[deleteNode_collection_shard1_replica_n1] ] Opening new SolrCore at [/home/jenkins/jenkins-slave/workspace/Lucene-Solr-Tests-master/solr/build/solr-core/test/J1/temp/solr.cloud.autoscaling.SearchRateTriggerIntegrationTest_E150F31FDF8F2D5E-001/tempDir-001/node1/deleteNode_collection_shard1_replica_n1], dataDir=[/home/jenkins/jenkins-slave/workspace/Lucene-Solr-Tests-master/solr/build/solr-core/test/J1/temp/solr.cloud.autoscaling.SearchRateTriggerIntegrationTest_E150F31FDF8F2D5E-001/tempDir-001/node1/./deleteNode_collection_shard1_replica_n1/data/]
   [junit4]   2> 1049509 INFO  (qtp2111441421-7113) [n:127.0.0.1:38102_solr c:deleteNode_collection s:shard1 r:core_node4 x:deleteNode_collection_shard1_replica_n2] o.a.s.s.IndexSchema Loaded schema minimal/1.1 with uniqueid field id
   [junit4]   2> 1049510 INFO  (qtp2111441421-7113) [n:127.0.0.1:38102_solr c:deleteNode_collection s:shard1 r:core_node4 x:deleteNode_collection_shard1_replica_n2] o.a.s.c.CoreContainer Creating SolrCore 'deleteNode_collection_shard1_replica_n2' using configuration from collection deleteNode_collection, trusted=true
   [junit4]   2> 1049510 INFO  (qtp2111441421-7113) [n:127.0.0.1:38102_solr c:deleteNode_collection s:shard1 r:core_node4 x:deleteNode_collection_shard1_replica_n2] o.a.s.m.r.SolrJmxReporter JMX monitoring for 'solr_38102.solr.core.deleteNode_collection.shard1.replica_n2' (registry 'solr.core.deleteNode_collection.shard1.replica_n2') enabled at server: com.sun.jmx.mbeanserver.JmxMBeanServer@38126b0a
   [junit4]   2> 1049510 INFO  (qtp2111441421-7113) [n:127.0.0.1:38102_solr c:deleteNode_collection s:shard1 r:core_node4 x:deleteNode_collection_shard1_replica_n2] o.a.s.c.SolrCore solr.RecoveryStrategy.Builder
   [junit4]   2> 1049510 INFO  (qtp2111441421-7113) [n:127.0.0.1:38102_solr c:deleteNode_collection s:shard1 r:core_node4 x:deleteNode_collection_shard1_replica_n2] o.a.s.c.SolrCore [[deleteNode_collection_shard1_replica_n2] ] Opening new SolrCore at [/home/jenkins/jenkins-slave/workspace/Lucene-Solr-Tests-master/solr/build/solr-core/test/J1/temp/solr.cloud.autoscaling.SearchRateTriggerIntegrationTest_E150F31FDF8F2D5E-001/tempDir-001/node5/deleteNode_collection_shard1_replica_n2], dataDir=[/home/jenkins/jenkins-slave/workspace/Lucene-Solr-Tests-master/solr/build/solr-core/test/J1/temp/solr.cloud.autoscaling.SearchRateTriggerIntegrationTest_E150F31FDF8F2D5E-001/tempDir-001/node5/./deleteNode_collection_shard1_replica_n2/data/]
   [junit4]   2> 1049930 INFO  (qtp284530026-7099) [n:127.0.0.1:35876_solr c:deleteNode_collection s:shard1 r:core_node3 x:deleteNode_collection_shard1_replica_n1] o.a.s.u.UpdateHandler Using UpdateLog implementation: org.apache.solr.update.UpdateLog
   [junit4]   2> 1049930 INFO  (qtp284530026-7099) [n:127.0.0.1:35876_solr c:deleteNode_collection s:shard1 r:core_node3 x:deleteNode_collection_shard1_replica_n1] o.a.s.u.UpdateLog Initializing UpdateLog: dataDir=null defaultSyncLevel=FLUSH numRecordsToKeep=100 maxNumLogsToKeep=10 numVersionBuckets=65536
   [junit4]   2> 1049931 INFO  (qtp284530026-7099) [n:127.0.0.1:35876_solr c:deleteNode_collection s:shard1 r:core_node3 x:deleteNode_collection_shard1_replica_n1] o.a.s.u.CommitTracker Hard AutoCommit: disabled
   [junit4]   2> 1049931 INFO  (qtp284530026-7099) [n:127.0.0.1:35876_solr c:deleteNode_collection s:shard1 r:core_node3 x:deleteNode_collection_shard1_replica_n1] o.a.s.u.CommitTracker Soft AutoCommit: disabled
   [junit4]   2> 1049933 INFO  (qtp284530026-7099) [n:127.0.0.1:35876_solr c:deleteNode_collection s:shard1 r:core_node3 x:deleteNode_collection_shard1_replica_n1] o.a.s.s.SolrIndexSearcher Opening [Searcher@6af28e0[deleteNode_collection_shard1_replica_n1] main]
   [junit4]   2> 1049948 INFO  (qtp2111441421-7113) [n:127.0.0.1:38102_solr c:deleteNode_collection s:shard1 r:core_node4 x:deleteNode_collection_shard1_replica_n2] o.a.s.u.UpdateHandler Using UpdateLog implementation: org.apache.solr.update.UpdateLog
   [junit4]   2> 1049948 INFO  (qtp2111441421-7113) [n:127.0.0.1:38102_solr c:deleteNode_collection s:shard1 r:core_node4 x:deleteNode_collection_shard1_replica_n2] o.a.s.u.UpdateLog Initializing UpdateLog: dataDir=null defaultSyncLevel=FLUSH numRecordsToKeep=100 maxNumLogsToKeep=10 numVersionBuckets=65536
   [junit4]   2> 1049951 INFO  (qtp284530026-7099) [n:127.0.0.1:35876_solr c:deleteNode_collection s:shard1 r:core_node3 x:deleteNode_collection_shard1_replica_n1] o.a.s.r.ManagedResourceStorage Configured ZooKeeperStorageIO with znodeBase: /configs/conf
   [junit4]   2> 1049951 INFO  (qtp284530026-7099) [n:127.0.0.1:35876_solr c:deleteNode_collection s:shard1 r:core_node3 x:deleteNode_collection_shard1_replica_n1] o.a.s.r.ManagedResourceStorage Loaded null at path _rest_managed.json using ZooKeeperStorageIO:path=/configs/conf
   [junit4]   2> 1049952 INFO  (qtp284530026-7099) [n:127.0.0.1:35876_solr c:deleteNode_collection s:shard1 r:core_node3 x:deleteNode_collection_shard1_replica_n1] o.a.s.h.ReplicationHandler Commits will be reserved for 10000ms.
   [junit4]   2> 1050069 INFO  (qtp2111441421-7113) [n:127.0.0.1:38102_solr c:deleteNode_collection s:shard1 r:core_node4 x:deleteNode_collection_shard1_replica_n2] o.a.s.u.CommitTracker Hard AutoCommit: disabled
   [junit4]   2> 1050069 INFO  (qtp2111441421-7113) [n:127.0.0.1:38102_solr c:deleteNode_collection s:shard1 r:core_node4 x:deleteNode_collection_shard1_replica_n2] o.a.s.u.CommitTracker Soft AutoCommit: disabled
   [junit4]   2> 1050070 INFO  (searcherExecutor-1377-thread-1-processing-n:127.0.0.1:35876_solr x:deleteNode_collection_shard1_replica_n1 c:deleteNode_collection s:shard1 r:core_node3) [n:127.0.0.1:35876_solr c:deleteNode_collection s:shard1 r:core_node3 x:deleteNode_collection_shard1_replica_n1] o.a.s.c.SolrCore [deleteNode_collection_shard1_replica_n1] Registered new searcher Searcher@6af28e0[deleteNode_collection_shard1_replica_n1] main{ExitableDirectoryReader(UninvertingDirectoryReader())}
   [junit4]   2> 1050071 INFO  (qtp2111441421-7113) [n:127.0.0.1:38102_solr c:deleteNode_collection s:shard1 r:core_node4 x:deleteNode_collection_shard1_replica_n2] o.a.s.s.SolrIndexSearcher Opening [Searcher@12e4464b[deleteNode_collection_shard1_replica_n2] main]
   [junit4]   2> 1050072 INFO  (qtp284530026-7099) [n:127.0.0.1:35876_solr c:deleteNode_collection s:shard1 r:core_node3 x:deleteNode_collection_shard1_replica_n1] o.a.s.u.UpdateLog Could not find max version in index or recent updates, using new clock 1601285258751246336
   [junit4]   2> 1050075 INFO  (qtp2111441421-7113) [n:127.0.0.1:38102_solr c:deleteNode_collection s:shard1 r:core_node4 x:deleteNode_collection_shard1_replica_n2] o.a.s.r.ManagedResourceStorage Configured ZooKeeperStorageIO with znodeBase: /configs/conf
   [junit4]   2> 1050075 INFO  (qtp2111441421-7113) [n:127.0.0.1:38102_solr c:deleteNode_collection s:shard1 r:core_node4 x:deleteNode_collection_shard1_replica_n2] o.a.s.r.ManagedResourceStorage Loaded null at path _rest_managed.json using ZooKeeperStorageIO:path=/configs/conf
   [junit4]   2> 1050090 INFO  (qtp284530026-7099) [n:127.0.0.1:35876_solr c:deleteNode_collection s:shard1 r:core_node3 x:deleteNode_collection_shard1_replica_n1] o.a.s.c.ZkShardTerms Successful update of terms at /collections/deleteNode_collection/terms/shard1 to Terms{values={core_node3=0}, version=0}
   [junit4]   2> 1050092 INFO  (qtp2111441421-7113) [n:127.0.0.1:38102_solr c:deleteNode_collection s:shard1 r:core_node4 x:deleteNode_collection_shard1_replica_n2] o.a.s.h.ReplicationHandler Commits will be reserved for 10000ms.
   [junit4]   2> 1050093 INFO  (qtp2111441421-7113) [n:127.0.0.1:38102_solr c:deleteNode_collection s:shard1 r:core_node4 x:deleteNode_collection_shard1_replica_n2] o.a.s.u.UpdateLog Could not find max version in index or recent updates, using new clock 1601285258773266432
   [junit4]   2> 1050134 INFO  (searcherExecutor-1378-thread-1-processing-n:127.0.0.1:38102_solr x:deleteNode_collection_shard1_replica_n2 c:deleteNode_collection s:shard1 r:core_node4) [n:127.0.0.1:38102_solr c:deleteNode_collection s:shard1 r:core_node4 x:deleteNode_collection_shard1_replica_n2] o.a.s.c.SolrCore [deleteNode_collection_shard1_replica_n2] Registered new searcher Searcher@12e4464b[deleteNode_collection_shard1_replica_n2] main{ExitableDirectoryReader(UninvertingDirectoryReader())}
   [junit4]   2> 1050152 INFO  (qtp284530026-7099) [n:127.0.0.1:35876_solr c:deleteNode_collection s:shard1 r:core_node3 x:deleteNode_collection_shard1_replica_n1] o.a.s.c.ShardLeaderElectionContext Waiting until we see more replicas up for shard shard1: total=2 found=1 timeoutin=9997ms
   [junit4]   2> 1050166 INFO  (qtp2111441421-7113) [n:127.0.0.1:38102_solr c:deleteNode_collection s:shard1 r:core_node4 x:deleteNode_collection_shard1_replica_n2] o.a.s.c.ZkShardTerms Successful update of terms at /collections/deleteNode_collection/terms/shard1 to Terms{values={core_node3=0, core_node4=0}, version=1}
   [junit4]   2> 1050653 INFO  (qtp284530026-7099) [n:127.0.0.1:35876_solr c:deleteNode_collection s:shard1 r:core_node3 x:deleteNode_collection_shard1_replica_n1] o.a.s.c.ShardLeaderElectionContext Enough replicas found to continue.
   [junit4]   2> 1050653 INFO  (qtp284530026-7099) [n:127.0.0.1:35876_solr c:deleteNode_collection s:shard1 r:core_node3 x:deleteNode_collection_shard1_replica_n1] o.a.s.c.ShardLeaderElectionContext I may be the new leader - try and sync
   [junit4]   2> 1050653 INFO  (qtp284530026-7099) [n:127.0.0.1:35876_solr c:deleteNode_collection s:shard1 r:core_node3 x:deleteNode_collection_shard1_replica_n1] o.a.s.c.SyncStrategy Sync replicas to http://127.0.0.1:35876/solr/deleteNode_collection_shard1_replica_n1/
   [junit4]   2> 1050654 INFO  (qtp284530026-7099) [n:127.0.0.1:35876_solr c:deleteNode_collection s:shard1 r:core_node3 x:deleteNode_collection_shard1_replica_n1] o.a.s.u.PeerSync PeerSync: core=deleteNode_collection_shard1_replica_n1 url=http://127.0.0.1:35876/solr START replicas=[http://127.0.0.1:38102/solr/deleteNode_collection_shard1_replica_n2/] nUpdates=100
   [junit4]   2> 1050657 INFO  (qtp2111441421-7131) [n:127.0.0.1:38102_solr c:deleteNode_collection s:shard1 r:core_node4 x:deleteNode_collection_shard1_replica_n2] o.a.s.c.S.Request [deleteNode_collection_shard1_replica_n2]  webapp=/solr path=/get params={distrib=false&qt=/get&fingerprint=false&getVersions=100&wt=javabin&version=2} status=0 QTime=1
   [junit4]   2> 1050954 INFO  (qtp284530026-7099) [n:127.0.0.1:35876_solr c:deleteNode_collection s:shard1 r:core_node3 x:deleteNode_collection_shard1_replica_n1] o.a.s.u.PeerSync PeerSync: core=deleteNode_collection_shard1_replica_n1 url=http://127.0.0.1:35876/solr DONE.  We have no versions.  sync failed.
   [junit4]   2> 1050954 INFO  (qtp284530026-7099) [n:127.0.0.1:35876_solr c:deleteNode_collection s:shard1 r:core_node3 x:deleteNode_collection_shard1_replica_n1] o.a.s.c.SyncStrategy Leader's attempt to sync with shard failed, moving to the next candidate
   [junit4]   2> 1050954 INFO  (qtp284530026-7099) [n:127.0.0.1:35876_solr c:deleteNode_collection s:shard1 r:core_node3 x:deleteNode_collection_shard1_replica_n1] o.a.s.c.ShardLeaderElectionContext We failed sync, but we have no versions - we can't sync in that case - we were active before, so become leader anyway
   [junit4]   2> 1050954 INFO  (qtp284530026-7099) [n:127.0.0.1:35876_solr c:deleteNode_collection s:shard1 r:core_node3 x:deleteNode_collection_shard1_replica_n1] o.a.s.c.ShardLeaderElectionContext Found all replicas participating in election, clear LIR
   [junit4]   2> 1050959 INFO  (qtp284530026-7099) [n:127.0.0.1:35876_solr c:deleteNode_collection s:shard1 r:core_node3 x:deleteNode_collection_shard1_replica_n1] o.a.s.c.ShardLeaderElectionContext I am the new leader: http://127.0.0.1:35876/solr/deleteNode_collection_shard1_replica_n1/ shard1
   [junit4]   2> 1051062 INFO  (qtp284530026-7099) [n:127.0.0.1:35876_solr c:deleteNode_collection s:shard1 r:core_node3 x:deleteNode_collection_shard1_replica_n1] o.a.s.c.ZkController I am the leader, no recovery necessary
   [junit4]   2> 1051064 INFO  (qtp284530026-7099) [n:127.0.0.1:35876_solr c:deleteNode_collection s:shard1 r:core_node3 x:deleteNode_collection_shard1_replica_n1] o.a.s.s.HttpSolrCall [admin] webapp=null path=/admin/cores params={qt=/admin/cores&coreNodeName=core_node3&collection.configName=conf&newCollection=true&name=deleteNode_collection_shard1_replica_n1&action=CREATE&numShards=1&collection=deleteNode_collection&shard=shard1&wt=javabin&version=2&replicaType=NRT} status=0 QTime=2815
   [junit4]   2> 1051164 INFO  (zkCallback-3102-thread-1) [    ] o.a.s.c.c.ZkStateReader A cluster state change: [WatchedEvent state:SyncConnected type:NodeDataChanged path:/collections/deleteNode_collection/state.json] for collection [deleteNode_collection] has occurred - updating... (live nodes size: [5])
   [junit4]   2> 1051171 INFO  (qtp2111441421-7113) [n:127.0.0.1:38102_solr c:deleteNode_collection s:shard1 r:core_node4 x:deleteNode_collection_shard1_replica_n2] o.a.s.s.HttpSolrCall [admin] webapp=null path=/admin/cores params={qt=/admin/cores&coreNodeName=core_node4&collection.configName=conf&newCollection=true&name=deleteNode_collection_shard1_replica_n2&action=CREATE&numShards=1&collection=deleteNode_collection&shard=shard1&wt=javabin&version=2&replicaType=NRT} status=0 QTime=2921
   [junit4]   2> 1051197 INFO  (qtp2111441421-7112) [n:127.0.0.1:38102_solr    ] o.a.s.h.a.CollectionsHandler Wait for new collection to be active for at most 30 seconds. Check all shard replicas
   [junit4]   2> 1051271 INFO  (zkCallback-3102-thread-1) [    ] o.a.s.c.c.ZkStateReader A cluster state change: [WatchedEvent state:SyncConnected type:NodeDataChanged path:/collections/deleteNode_collection/state.json] for collection [deleteNode_collection] has occurred - updating... (live nodes size: [5])
   [junit4]   2> 1051271 INFO  (zkCallback-3094-thread-1) [    ] o.a.s.c.c.ZkStateReader A cluster state change: [WatchedEvent state:SyncConnected type:NodeDataChanged path:/collections/deleteNode_collection/state.json] for collection [deleteNode_collection] has occurred - updating... (live nodes size: [5])
   [junit4]   2> 1051898 INFO  (OverseerCollectionConfigSetProcessor-72676385671938058-127.0.0.1:36910_solr-n_0000000000) [    ] o.a.s.c.OverseerTaskQueue Response ZK path: /overseer/collection-queue-work/qnr-0000000000 doesn't exist.  Requestor may have disconnected from ZooKeeper
   [junit4]   2> 1052226 INFO  (qtp2111441421-7112) [n:127.0.0.1:38102_solr    ] o.a.s.s.HttpSolrCall [admin] webapp=null path=/admin/collections params={replicationFactor=2&collection.configName=conf&name=deleteNode_collection&nrtReplicas=2&action=CREATE&numShards=1&wt=javabin&version=2} status=0 QTime=4366
   [junit4]   2> 1052279 INFO  (qtp2111441421-7132) [n:127.0.0.1:38102_solr    ] o.a.s.h.a.CollectionsHandler Invoked Collection Action :addreplica with params action=ADDREPLICA&collection=deleteNode_collection&shard=shard1&type=NRT&wt=javabin&version=2 and sendToOCPQueue=true
   [junit4]   2> 1052334 INFO  (OverseerThreadFactory-1366-thread-2) [ c:deleteNode_collection s:shard1  ] o.a.s.c.a.c.AddReplicaCmd Node Identified 127.0.0.1:44043_solr for creating new replica
   [junit4]   2> 1052354 INFO  (OverseerStateUpdate-72676385671938058-127.0.0.1:36910_solr-n_0000000000) [    ] o.a.s.c.o.SliceMutator createReplica() {
   [junit4]   2>   "operation":"addreplica",
   [junit4]   2>   "collection":"deleteNode_collection",
   [junit4]   2>   "shard":"shard1",
   [junit4]   2>   "core":"deleteNode_collection_shard1_replica_n5",
   [junit4]   2>   "state":"down",
   [junit4]   2>   "base_url":"http://127.0.0.1:44043/solr",
   [junit4]   2>   "node_name":"127.0.0.1:44043_solr",
   [junit4]   2>   "type":"NRT"} 
   [junit4]   2> 1052458 INFO  (zkCallback-3102-thread-1) [    ] o.a.s.c.c.ZkStateReader A cluster state change: [WatchedEvent state:SyncConnected type:NodeDataChanged path:/collections/deleteNode_collection/state.json] for collection [deleteNode_collection] has occurred - updating... (live nodes size: [5])
   [junit4]   2> 1052458 INFO  (zkCallback-3094-thread-1) [    ] o.a.s.c.c.ZkStateReader A cluster state change: [WatchedEvent state:SyncConnected type:NodeDataChanged path:/collections/deleteNode_collection/state.json] for collection [deleteNode_collection] has occurred - updating... (live nodes size: [5])
   [junit4]   2> 1052569 INFO  (qtp1412248551-7101) [n:127.0.0.1:44043_solr    x:deleteNode_collection_shard1_replica_n5] o.a.s.h.a.CoreAdminOperation core create command qt=/admin/cores&coreNodeName=core_node6&collection.configName=conf&name=deleteNode_collection_shard1_replica_n5&action=CREATE&collection=deleteNode_collection&shard=shard1&wt=javabin&version=2&replicaType=NRT
   [junit4]   2> 1052710 INFO  (qtp1412248551-7101) [n:127.0.0.1:44043_solr c:deleteNode_collection s:shard1 r:core_node6 x:deleteNode_collection_shard1_replica_n5] o.a.s.c.SolrConfig Using Lucene MatchVersion: 8.0.0
   [junit4]   2> 1052731 INFO  (qtp1412248551-7101) [n:127.0.0.1:44043_solr c:deleteNode_collection s:shard1 r:core_node6 x:deleteNode_collection_shard1_replica_n5] o.a.s.s.IndexSchema [deleteNode_collection_shard1_replica_n5] Schema name=minimal
   [junit4]   2> 1052750 INFO  (zkCallback-3102-thread-1) [    ] o.a.s.c.c.ZkStateReader A cluster state change: [WatchedEvent state:SyncConnected type:NodeDataChanged path:/collections/deleteNode_collection/state.json] for collection [deleteNode_collection] has occurred - updating... (live nodes size: [5])
   [junit4]   2> 1052750 INFO  (zkCallback-3094-thread-1) [    ] o.a.s.c.c.ZkStateReader A cluster state change: [WatchedEvent state:SyncConnected type:NodeDataChanged path:/collections/deleteNode_collection/state.json] for collection [deleteNode_collection] has occurred - updating... (live nodes size: [5])
   [junit4]   2> 1052752 INFO  (qtp1412248551-7101) [n:127.0.0.1:44043_solr c:deleteNode_collection s:shard1 r:core_node6 x:deleteNode_collection_shard1_replica_n5] o.a.s.s.IndexSchema Loaded schema minimal/1.1 with uniqueid field id
   [junit4]   2> 1052752 INFO  (qtp1412248551-7101) [n:127.0.0.1:44043_solr c:deleteNode_collection s:shard1 r:core_node6 x:deleteNode_collection_shard1_replica_n5] o.a.s.c.CoreContainer Creating SolrCore 'deleteNode_collection_shard1_replica_n5' using configuration from collection deleteNode_collection, trusted=true
   [junit4]   2> 1052753 INFO  (qtp1412248551-7101) [n:127.0.0.1:44043_solr c:deleteNode_collection s:shard1 r:core_node6 x:deleteNode_collection_shard1_replica_n5] o.a.s.m.r.SolrJmxReporter JMX monitoring for 'solr_44043.solr.core.deleteNode_collection.shard1.replica_n5' (registry 'solr.core.deleteNode_collection.shard1.replica_n5') enabled at server: com.sun.jmx.mbeanserver.JmxMBeanServer@38126b0a
   [junit4]   2> 1052753 INFO  (qtp1412248551-7101) [n:127.0.0.1:44043_solr c:deleteNode_collection s:shard1 r:core_node6 x:deleteNode_collection_shard1_replica_n5] o.a.s.c.SolrCore solr.RecoveryStrategy.Builder
   [junit4]   2> 1052765 INFO  (qtp1412248551-7101) [n:127.0.0.1:44043_solr c:deleteNode_collection s:shard1 r:core_node6 x:deleteNode_collection_shard1_replica_n5] o.a.s.c.SolrCore [[deleteNode_collection_shard1_replica_n5] ] Opening new SolrCore at [/home/jenkins/jenkins-slave/workspace/Lucene-Solr-Tests-master/solr/build/solr-core/test/J1/temp/solr.cloud.autoscaling.SearchRateTriggerIntegrationTest_E150F31FDF8F2D5E-001/tempDir-001/node3/deleteNode_collection_shard1_replica_n5], dataDir=[/home/jenkins/jenkins-slave/workspace/Lucene-Solr-Tests-master/solr/build/solr-core/test/J1/temp/solr.cloud.autoscaling.SearchRateTriggerIntegrationTest_E150F31FDF8F2D5E-001/tempDir-001/node3/./deleteNode_collection_shard1_replica_n5/data/]
   [junit4]   2> 1053022 INFO  (qtp1412248551-7101) [n:127.0.0.1:44043_solr c:deleteNode_collection s:shard1 r:core_node6 x:deleteNode_collection_shard1_replica_n5] o.a.s.u.UpdateHandler Using UpdateLog implementation: org.apache.solr.update.UpdateLog
   [junit4]   2> 1053022 INFO  (qtp1412248551-7101) [n:127.0.0.1:44043_solr c:deleteNode_collection s:shard1 r:core_node6 x:deleteNode_collection_shard1_replica_n5] o.a.s.u.UpdateLog Initializing UpdateLog: dataDir=null defaultSyncLevel=FLUSH numRecordsToKeep=100 maxNumLogsToKeep=10 numVersionBuckets=65536
   [junit4]   2> 1053023 INFO  (qtp1412248551-7101) [n:127.0.0.1:44043_solr c:deleteNode_collection s:shard1 r:core_node6 x:deleteNode_collection_shard1_replica_n5] o.a.s.u.CommitTracker Hard AutoCommit: disabled
   [junit4]   2> 1053023 INFO  (qtp1412248551-7101) [n:127.0.0.1:44043_solr c:deleteNode_collection s:shard1 r:core_node6 x:deleteNode_collection_shard1_replica_n5] o.a.s.u.CommitTracker Soft AutoCommit: disabled
   [junit4]   2> 1053025 INFO  (qtp1412248551-7101) [n:127.0.0.1:44043_solr c:deleteNode_collection s:shard1 r:core_node6 x:deleteNode_collection_shard1_replica_n5] o.a.s.s.SolrIndexSearcher Opening [Searcher@1b8c7d13[deleteNode_collection_shard1_replica_n5] main]
   [junit4]   2> 1053038 INFO  (qtp1412248551-7101) [n:127.0.0.1:44043_solr c:deleteNode_collection s:shard1 r:core_node6 x:deleteNode_collection_shard1_replica_n5] o.a.s.r.ManagedResourceStorage Configured ZooKeeperStorageIO with znodeBase: /configs/conf
   [junit4]   2> 1053039 INFO  (qtp1412248551-7101) [n:127.0.0.1:44043_solr c:deleteNode_collection s:shard1 r:core_node6 x:deleteNode_collection_shard1_replica_n5] o.a.s.r.ManagedResourceStorage Loaded null at path _rest_managed.json using ZooKeeperStorageIO:path=/configs/conf
   [junit4]   2> 1053039 INFO  (qtp1412248551-7101) [n:127.0.0.1:44043_solr c:deleteNode_collection s:shard1 r:core_node6 x:deleteNode_collection_shard1_replica_n5] o.a.s.h.ReplicationHandler Commits will be reserved for 10000ms.
   [junit4]   2> 1053058 INFO  (searcherExecutor-1387-thread-1-processing-n:127.0.0.1:44043_solr x:deleteNode_collection_shard1_replica_n5 c:deleteNode_collection s:shard1 r:core_node6) [n:127.0.0.1:44043_solr c:deleteNode_collection s:shard1 r:core_node6 x:deleteNode_collection_shard1_replica_n5] o.a.s.c.SolrCore [deleteNode_collection_shard1_replica_n5] Registered new searcher Searcher@1b8c7d13[deleteNode_collection_shard1_replica_n5] main{ExitableDirectoryReader(UninvertingDirectoryReader())}
   [junit4]   2> 1053058 INFO  (qtp1412248551-7101) [n:127.0.0.1:44043_solr c:deleteNode_collection s:shard1 r:core_node6 x:deleteNode_collection_shard1_replica_n5] o.a.s.u.UpdateLog Could not find max version in index or recent updates, using new clock 1601285261882294272
   [junit4]   2> 1053104 INFO  (qtp1412248551-7101) [n:127.0.0.1:44043_solr c:deleteNode_collection s:shard1 r:core_node6 x:deleteNode_collection_shard1_replica_n5] o.a.s.c.ZkShardTerms Successful update of terms at /collections/deleteNode_collection/terms/shard1 to Terms{values={core_node6=0, core_node3=0, core_node4=0}, version=2}
   [junit4]   2> 1053128 INFO  (qtp1412248551-7101) [n:127.0.0.1:44043_solr c:deleteNode_collection s:shard1 r:core_node6 x:deleteNode_collection_shard1_replica_n5] o.a.s.c.ZkController Core needs to recover:deleteNode_collection_shard1_replica_n5
   [junit4]   2> 1053132 INFO  (updateExecutor-3090-thread-1-processing-n:127.0.0.1:44043_solr x:deleteNode_collection_shard1_replica_n5 c:deleteNode_collection s:shard1 r:core_node6) [n:127.0.0.1:44043_solr c:deleteNode_collection s:shard1 r:core_node6 x:deleteNode_collection_shard1_replica_n5] o.a.s.u.DefaultSolrCoreState Running recovery
   [junit4]   2> 1053156 INFO  (recoveryExecutor-3091-thread-1-processing-n:127.0.0.1:44043_solr x:deleteNode_collection_shard1_replica_n5 c:deleteNode_collection s:shard1 r:core_node6) [n:127.0.0.1:44043_solr c:deleteNode_collection s:shard1 r:core_node6 x:deleteNode_collection_shard1_replica_n5] o.a.s.c.RecoveryStrategy Starting recovery process. recoveringAfterStartup=true
   [junit4]   2> 1053156 INFO  (recoveryExecutor-3091-thread-1-processing-n:127.0.0.1:44043_solr x:deleteNode_collection_shard1_replica_n5 c:deleteNode_collection s:shard1 r:core_node6) [n:127.0.0.1:44043_solr c:deleteNode_collection s:shard1 r:core_node6 x:deleteNode_collection_shard1_replica_n5] o.a.s.c.RecoveryStrategy ###### startupVersions=[[]]
   [junit4]   2> 1053159 INFO  (qtp1412248551-7101) [n:127.0.0.1:44043_solr c:deleteNode_collection s:shard1 r:core_node6 x:deleteNode_collection_shard1_replica_n5] o.a.s.s.HttpSolrCall [admin] webapp=null path=/admin/cores params={qt=/admin/cores&coreNodeName=core_node6&collection.configName=conf&name=deleteNode_collection_shard1_replica_n5&action=CREATE&collection=deleteNode_collection&shard=shard1&wt=javabin&version=2&replicaType=NRT} status=0 QTime=589
   [junit4]   2> 1053176 INFO  (qtp284530026-7100) [n:127.0.0.1:35876_solr c:deleteNode_collection s:shard1 r:core_node3 x:deleteNode_collection_shard1_replica_n1] o.a.s.c.S.Request [deleteNode_collection_shard1_replica_n1]  webapp=/solr path=/admin/ping params={wt=javabin&version=2} hits=0 status=0 QTime=0
   [junit4]   2> 1053176 INFO  (qtp284530026-7100) [n:127.0.0.1:35876_solr c:deleteNode_collection s:shard1 r:core_node3 x:deleteNode_collection_shard1_replica_n1] o.a.s.c.S.Request [deleteNode_collection_shard1_replica_n1]  webapp=/solr path=/admin/ping params={wt=javabin&version=2} status=0 QTime=0
   [junit4]   2> 1053188 INFO  (recoveryExecutor-3091-thread-1-processing-n:127.0.0.1:44043_solr x:deleteNode_collection_shard1_replica_n5 c:deleteNode_collection s:shard1 r:core_node6) [n:127.0.0.1:44043_solr c:deleteNode_collection s:shard1 r:core_node6 x:deleteNode_collection_shard1_replica_n5] o.a.s.c.RecoveryStrategy Begin buffering updates. core=[deleteNode_collection_shard1_replica_n5]
   [junit4]   2> 1053188 INFO  (recoveryExecutor-3091-thread-1-processing-n:127.0.0.1:44043_solr x:deleteNode_collection_shard1_replica_n5 c:deleteNode_collection s:shard1 r:core_node6) [n:127.0.0.1:44043_solr c:deleteNode_collection s:shard1 r:core_node6 x:deleteNode_collection_shard1_replica_n5] o.a.s.u.UpdateLog Starting to buffer updates. FSUpdateLog{state=ACTIVE, tlog=null}
   [junit4]   2> 1053188 INFO  (recoveryExecutor-3091-thread-1-processing-n:127.0.0.1:44043_solr x:deleteNode_collection_shard1_replica_n5 c:deleteNode_collection s:shard1 r:core_node6) [n:127.0.0.1:44043_solr c:deleteNode_collection s:shard1 r:core_node6 x:deleteNode_collection_shard1_replica_n5] o.a.s.c.RecoveryStrategy Publishing state of core [deleteNode_collection_shard1_replica_n5] as recovering, leader is [http://127.0.0.1:35876/solr/deleteNode_collection_shard1_replica_n1/] and I am [http://127.0.0.1:44043/solr/deleteNode_collection_shard1_replica_n5/]
   [junit4]   2> 1053190 INFO  (recoveryExecutor-3091-thread-1-processing-n:127.0.0.1:44043_solr x:deleteNode_collection_shard1_replica_n5 c:deleteNode_collection s:shard1 r:core_node6) [n:127.0.0.1:44043_solr c:deleteNode_collection s:shard1 r:core_node6 x:deleteNode_collection_shard1_replica_n5] o.a.s.c.ZkShardTerms Successful update of terms at /collections/deleteNode_collection/terms/shard1 to Terms{values={core_node6=0, core_node6_recovering=0, core_node3=0, core_node4=0}, version=3}
   [junit4]   2> 1053209 INFO  (qtp2111441421-7132) [n:127.0.0.1:38102_solr c:deleteNode_collection   ] o.a.s.s.HttpSolrCall [admin] webapp=null path=/admin/collections params={action=ADDREPLICA&collection=deleteNode_collection&shard=shard1&type=NRT&wt=javabin&version=2} status=0 QTime=930
   [junit4]   2> 1053210 INFO  (qtp2111441421-7131) [n:127.0.0.1:38102_solr    ] o.a.s.h.a.CollectionsHandler Invoked Collection Action :addreplica with params action=ADDREPLICA&collection=deleteNode_collection&shard=shard1&type=TLOG&wt=javabin&version=2 and sendToOCPQueue=true
   [junit4]   2> 1053221 INFO  (recoveryExecutor-3091-thread-1-processing-n:127.0.0.1:44043_solr x:deleteNode_collection_shard1_replica_n5 c:deleteNode_collection s:shard1 r:core_node6) [n:127.0.0.1:44043_solr c:deleteNode_collection s:shard1 r:core_node6 x:deleteNode_collection_shard1_replica_n5] o.a.s.c.RecoveryStrategy Sending prep recovery command to [http://127.0.0.1:35876/solr]; [WaitForState: action=PREPRECOVERY&core=deleteNode_collection_shard1_replica_n1&nodeName=127.0.0.1:44043_solr&coreNodeName=core_node6&state=recovering&checkLive=true&onlyIfLeader=true&onlyIfLeaderActive=true]
   [junit4]   2> 1053233 INFO  (qtp284530026-7140) [n:127.0.0.1:35876_solr    x:deleteNode_collection_shard1_replica_n1] o.a.s.h.a.PrepRecoveryOp Going to wait for coreNodeName: core_node6, state: recovering, checkLive: true, onlyIfLeader: true, onlyIfLeaderActive: true, maxTime: 183 s
   [junit4]   2> 1053237 INFO  (qtp284530026-7140) [n:127.0.0.1:35876_solr    x:deleteNode_collection_shard1_replica_n1] o.a.s.h.a.PrepRecoveryOp In WaitForState(recovering): collection=deleteNode_collection, shard=shard1, thisCore=deleteNode_collection_shard1_replica_n1, leaderDoesNotNeedRecovery=false, isLeader? true, live=true, checkLive=true, currentState=down, localState=active, nodeName=127.0.0.1:44043_solr, coreNodeName=core_node6, onlyIfActiveCheckResult=false, nodeProps: core_node6:{"core":"deleteNode_collection_shard1_replica_n5","base_url":"http://127.0.0.1:44043/solr","node_name":"127.0.0.1:44043_solr","state":"down","type":"NRT","force_set_state":"false"}
   [junit4]   2> 1053238 INFO  (OverseerCollectionConfigSetProcessor-72676385671938058-127.0.0.1:36910_solr-n_0000000000) [    ] o.a.s.c.OverseerTaskQueue Response ZK path: /overseer/collection-queue-work/qnr-0000000002 doesn't exist.  Requestor may have disconnected from ZooKeeper
   [junit4]   2> 1053239 INFO  (OverseerThreadFactory-1366-thread-3) [ c:deleteNode_collection s:shard1  ] o.a.s.c.a.c.AddReplicaCmd Node Identified 127.0.0.1:40819_solr for creating new replica
   [junit4]   2> 1053261 INFO  (OverseerStateUpdate-72676385671938058-127.0.0.1:36910_solr-n_0000000000) [    ] o.a.s.c.o.SliceMutator createReplica() {
   [junit4]   2>   "operation":"addreplica",
   [junit4]   2>   "collection":"deleteNode_collection",
   [junit4]   2>   "shard":"shard1",
   [junit4]   2>   "core":"deleteNode_collection_shard1_replica_t7",
   [junit4]   2>   "state":"down",
   [junit4]   2>   "base_url":"http://127.0.0.1:40819/solr",
   [junit4]   2>   "node_name":"127.0.0.1:40819_solr",
   [junit4]   2>   "type":"TLOG"} 
   [junit4]   2> 1053366 INFO  (zkCallback-3094-thread-1) [    ] o.a.s.c.c.ZkStateReader A cluster state change: [WatchedEvent state:SyncConnected type:NodeDataChanged path:/collections/deleteNode_collection/state.json] for collection [deleteNode_collection] has occurred - updating... (live nodes size: [5])
   [junit4]   2> 1053367 INFO  (zkCallback-3106-thread-1) [    ] o.a.s.c.c.ZkStateReader A cluster state change: [WatchedEvent state:SyncConnected type:NodeDataChanged path:/collections/deleteNode_collection/state.json] for collection [deleteNode_collection] has occurred - updating... (live nodes size: [5])
   [junit4]   2> 1053367 INFO  (zkCallback-3102-thread-1) [    ] o.a.s.c.c.ZkStateReader A cluster state change: [WatchedEvent state:SyncConnected type:NodeDataChanged path:/collections/deleteNode_collection/state.json] for collection [deleteNode_collection] has occurred - updating... (live nodes size: [5])
   [junit4]   2> 1053367 INFO  (zkCallback-3106-thread-2) [    ] o.a.s.c.c.ZkStateReader A cluster state change: [WatchedEvent state:SyncConnected type:NodeDataChanged path:/collections/deleteNode_collection/state.json] for collection [deleteNode_collection] has occurred - updating... (live nodes size: [5])
   [junit4]   2> 1053471 INFO  (qtp417329697-7102) [n:127.0.0.1:40819_solr    x:deleteNode_collection_shard1_replica_t7] o.a.s.h.a.CoreAdminOperation core create command qt=/admin/cores&coreNodeName=core_node8&collection.configName=conf&name=deleteNode_collection_shard1_re

[...truncated too long message...]

.xml

resolve:

ivy-availability-check:
[loadresource] Do not set property disallowed.ivy.jars.list as its length is 0.

-ivy-fail-disallowed-ivy-version:

ivy-fail:

ivy-configure:
[ivy:configure] :: loading settings :: file = /home/jenkins/jenkins-slave/workspace/Lucene-Solr-Tests-master/lucene/top-level-ivy-settings.xml

resolve:

ivy-availability-check:
[loadresource] Do not set property disallowed.ivy.jars.list as its length is 0.

-ivy-fail-disallowed-ivy-version:

ivy-fail:

ivy-configure:
[ivy:configure] :: loading settings :: file = /home/jenkins/jenkins-slave/workspace/Lucene-Solr-Tests-master/lucene/top-level-ivy-settings.xml

resolve:

ivy-availability-check:
[loadresource] Do not set property disallowed.ivy.jars.list as its length is 0.

-ivy-fail-disallowed-ivy-version:

ivy-fail:

ivy-configure:
[ivy:configure] :: loading settings :: file = /home/jenkins/jenkins-slave/workspace/Lucene-Solr-Tests-master/lucene/top-level-ivy-settings.xml

resolve:

ivy-availability-check:
[loadresource] Do not set property disallowed.ivy.jars.list as its length is 0.

-ivy-fail-disallowed-ivy-version:

ivy-fail:

ivy-configure:
[ivy:configure] :: loading settings :: file = /home/jenkins/jenkins-slave/workspace/Lucene-Solr-Tests-master/lucene/top-level-ivy-settings.xml

resolve:

jar-checksums:
    [mkdir] Created dir: /home/jenkins/jenkins-slave/workspace/Lucene-Solr-Tests-master/lucene/null1668313485
     [copy] Copying 39 files to /home/jenkins/jenkins-slave/workspace/Lucene-Solr-Tests-master/lucene/null1668313485
   [delete] Deleting directory /home/jenkins/jenkins-slave/workspace/Lucene-Solr-Tests-master/lucene/null1668313485

resolve-example:

ivy-availability-check:
[loadresource] Do not set property disallowed.ivy.jars.list as its length is 0.

-ivy-fail-disallowed-ivy-version:

ivy-fail:

ivy-configure:
[ivy:configure] :: loading settings :: file = /home/jenkins/jenkins-slave/workspace/Lucene-Solr-Tests-master/lucene/top-level-ivy-settings.xml

resolve:

resolve-server:

ivy-availability-check:
[loadresource] Do not set property disallowed.ivy.jars.list as its length is 0.

-ivy-fail-disallowed-ivy-version:

ivy-fail:

ivy-fail:

ivy-configure:
[ivy:configure] :: loading settings :: file = /home/jenkins/jenkins-slave/workspace/Lucene-Solr-Tests-master/lucene/top-level-ivy-settings.xml

resolve:

resolve:

ivy-availability-check:
[loadresource] Do not set property disallowed.ivy.jars.list as its length is 0.

-ivy-fail-disallowed-ivy-version:

ivy-fail:

ivy-fail:

ivy-configure:
[ivy:configure] :: loading settings :: file = /home/jenkins/jenkins-slave/workspace/Lucene-Solr-Tests-master/lucene/top-level-ivy-settings.xml

resolve:

ivy-availability-check:
[loadresource] Do not set property disallowed.ivy.jars.list as its length is 0.

-ivy-fail-disallowed-ivy-version:

ivy-fail:

ivy-fail:

ivy-configure:
[ivy:configure] :: loading settings :: file = /home/jenkins/jenkins-slave/workspace/Lucene-Solr-Tests-master/lucene/top-level-ivy-settings.xml

resolve:

ivy-availability-check:
[loadresource] Do not set property disallowed.ivy.jars.list as its length is 0.

-ivy-fail-disallowed-ivy-version:

ivy-fail:

ivy-configure:
[ivy:configure] :: loading settings :: file = /home/jenkins/jenkins-slave/workspace/Lucene-Solr-Tests-master/lucene/top-level-ivy-settings.xml

resolve:

ivy-availability-check:
[loadresource] Do not set property disallowed.ivy.jars.list as its length is 0.

-ivy-fail-disallowed-ivy-version:

ivy-fail:

ivy-fail:

ivy-configure:
[ivy:configure] :: loading settings :: file = /home/jenkins/jenkins-slave/workspace/Lucene-Solr-Tests-master/lucene/top-level-ivy-settings.xml

resolve:

ivy-availability-check:
[loadresource] Do not set property disallowed.ivy.jars.list as its length is 0.

-ivy-fail-disallowed-ivy-version:

ivy-fail:

ivy-configure:
[ivy:configure] :: loading settings :: file = /home/jenkins/jenkins-slave/workspace/Lucene-Solr-Tests-master/lucene/top-level-ivy-settings.xml

resolve:

ivy-availability-check:
[loadresource] Do not set property disallowed.ivy.jars.list as its length is 0.

-ivy-fail-disallowed-ivy-version:

ivy-fail:

ivy-fail:

ivy-configure:
[ivy:configure] :: loading settings :: file = /home/jenkins/jenkins-slave/workspace/Lucene-Solr-Tests-master/lucene/top-level-ivy-settings.xml

resolve:

ivy-availability-check:
[loadresource] Do not set property disallowed.ivy.jars.list as its length is 0.

-ivy-fail-disallowed-ivy-version:

ivy-fail:

ivy-fail:

ivy-configure:
[ivy:configure] :: loading settings :: file = /home/jenkins/jenkins-slave/workspace/Lucene-Solr-Tests-master/lucene/top-level-ivy-settings.xml

resolve:

ivy-availability-check:
[loadresource] Do not set property disallowed.ivy.jars.list as its length is 0.

-ivy-fail-disallowed-ivy-version:

ivy-fail:

ivy-fail:

ivy-configure:
[ivy:configure] :: loading settings :: file = /home/jenkins/jenkins-slave/workspace/Lucene-Solr-Tests-master/lucene/top-level-ivy-settings.xml

resolve:

ivy-availability-check:
[loadresource] Do not set property disallowed.ivy.jars.list as its length is 0.

-ivy-fail-disallowed-ivy-version:

ivy-fail:

ivy-fail:

ivy-configure:
[ivy:configure] :: loading settings :: file = /home/jenkins/jenkins-slave/workspace/Lucene-Solr-Tests-master/lucene/top-level-ivy-settings.xml

resolve:

ivy-availability-check:
[loadresource] Do not set property disallowed.ivy.jars.list as its length is 0.

-ivy-fail-disallowed-ivy-version:

ivy-fail:

ivy-fail:

ivy-configure:
[ivy:configure] :: loading settings :: file = /home/jenkins/jenkins-slave/workspace/Lucene-Solr-Tests-master/lucene/top-level-ivy-settings.xml

resolve:

ivy-availability-check:
[loadresource] Do not set property disallowed.ivy.jars.list as its length is 0.

-ivy-fail-disallowed-ivy-version:

ivy-fail:

ivy-fail:

ivy-configure:
[ivy:configure] :: loading settings :: file = /home/jenkins/jenkins-slave/workspace/Lucene-Solr-Tests-master/lucene/top-level-ivy-settings.xml

resolve:

ivy-availability-check:
[loadresource] Do not set property disallowed.ivy.jars.list as its length is 0.

-ivy-fail-disallowed-ivy-version:

ivy-fail:

ivy-fail:

ivy-configure:
[ivy:configure] :: loading settings :: file = /home/jenkins/jenkins-slave/workspace/Lucene-Solr-Tests-master/lucene/top-level-ivy-settings.xml

resolve:

ivy-availability-check:
[loadresource] Do not set property disallowed.ivy.jars.list as its length is 0.

-ivy-fail-disallowed-ivy-version:

ivy-fail:

ivy-fail:

ivy-configure:
[ivy:configure] :: loading settings :: file = /home/jenkins/jenkins-slave/workspace/Lucene-Solr-Tests-master/lucene/top-level-ivy-settings.xml

resolve:

ivy-availability-check:
[loadresource] Do not set property disallowed.ivy.jars.list as its length is 0.

-ivy-fail-disallowed-ivy-version:

ivy-fail:

ivy-fail:

ivy-configure:
[ivy:configure] :: loading settings :: file = /home/jenkins/jenkins-slave/workspace/Lucene-Solr-Tests-master/lucene/top-level-ivy-settings.xml

resolve:

ivy-availability-check:
[loadresource] Do not set property disallowed.ivy.jars.list as its length is 0.

-ivy-fail-disallowed-ivy-version:

ivy-fail:

ivy-fail:

ivy-configure:
[ivy:configure] :: loading settings :: file = /home/jenkins/jenkins-slave/workspace/Lucene-Solr-Tests-master/lucene/top-level-ivy-settings.xml

resolve:

ivy-availability-check:
[loadresource] Do not set property disallowed.ivy.jars.list as its length is 0.

-ivy-fail-disallowed-ivy-version:

ivy-fail:

ivy-fail:

ivy-configure:
[ivy:configure] :: loading settings :: file = /home/jenkins/jenkins-slave/workspace/Lucene-Solr-Tests-master/lucene/top-level-ivy-settings.xml

resolve:

jar-checksums:
    [mkdir] Created dir: /home/jenkins/jenkins-slave/workspace/Lucene-Solr-Tests-master/solr/null1102782349
     [copy] Copying 246 files to /home/jenkins/jenkins-slave/workspace/Lucene-Solr-Tests-master/solr/null1102782349
   [delete] Deleting directory /home/jenkins/jenkins-slave/workspace/Lucene-Solr-Tests-master/solr/null1102782349

check-working-copy:
[ivy:cachepath] :: resolving dependencies :: org.eclipse.jgit#org.eclipse.jgit-caller;working
[ivy:cachepath] 	confs: [default]
[ivy:cachepath] 	found org.eclipse.jgit#org.eclipse.jgit;4.6.0.201612231935-r in public
[ivy:cachepath] 	found com.jcraft#jsch;0.1.53 in public
[ivy:cachepath] 	found com.googlecode.javaewah#JavaEWAH;1.1.6 in public
[ivy:cachepath] 	found org.apache.httpcomponents#httpclient;4.3.6 in public
[ivy:cachepath] 	found org.apache.httpcomponents#httpcore;4.3.3 in public
[ivy:cachepath] 	found commons-logging#commons-logging;1.1.3 in public
[ivy:cachepath] 	found commons-codec#commons-codec;1.6 in public
[ivy:cachepath] 	found org.slf4j#slf4j-api;1.7.2 in public
[ivy:cachepath] :: resolution report :: resolve 98ms :: artifacts dl 4ms
	---------------------------------------------------------------------
	|                  |            modules            ||   artifacts   |
	|       conf       | number| search|dwnlded|evicted|| number|dwnlded|
	---------------------------------------------------------------------
	|      default     |   8   |   0   |   0   |   0   ||   8   |   0   |
	---------------------------------------------------------------------
[wc-checker] Initializing working copy...
[wc-checker] SLF4J: Failed to load class "org.slf4j.impl.StaticLoggerBinder".
[wc-checker] SLF4J: Defaulting to no-operation (NOP) logger implementation
[wc-checker] SLF4J: See http://www.slf4j.org/codes.html#StaticLoggerBinder for further details.
[wc-checker] Checking working copy status...

-jenkins-base:

BUILD SUCCESSFUL
Total time: 296 minutes 35 seconds
Archiving artifacts
WARN: No artifacts found that match the file pattern "**/*.events,heapdumps/**,**/hs_err_pid*". Configuration error?
WARN: java.lang.InterruptedException: no matches found within 10000
Recording test results
Build step 'Publish JUnit test result report' changed build result to UNSTABLE
Email was triggered for: Unstable (Test Failures)
Sending email for trigger: Unstable (Test Failures)

Mime
View raw message