lucene-dev mailing list archives

Site index · List index
Message view « Date » · « Thread »
Top « Date » · « Thread »
From Policeman Jenkins Server <jenk...@thetaphi.de>
Subject [JENKINS] Lucene-Solr-7.x-Linux (64bit/jdk-10) - Build # 1968 - Still Unstable!
Date Thu, 24 May 2018 08:07:18 GMT
Build: https://jenkins.thetaphi.de/job/Lucene-Solr-7.x-Linux/1968/
Java: 64bit/jdk-10 -XX:+UseCompressedOops -XX:+UseG1GC

6 tests failed.
FAILED:  org.apache.solr.cloud.autoscaling.IndexSizeTriggerTest.testTrigger

Error Message:
number of ops expected:<2> but was:<1>

Stack Trace:
java.lang.AssertionError: number of ops expected:<2> but was:<1>
	at __randomizedtesting.SeedInfo.seed([4659082834CF5C58:25923EAAAD002F75]:0)
	at org.junit.Assert.fail(Assert.java:93)
	at org.junit.Assert.failNotEquals(Assert.java:647)
	at org.junit.Assert.assertEquals(Assert.java:128)
	at org.junit.Assert.assertEquals(Assert.java:472)
	at org.apache.solr.cloud.autoscaling.IndexSizeTriggerTest.testTrigger(IndexSizeTriggerTest.java:187)
	at java.base/jdk.internal.reflect.NativeMethodAccessorImpl.invoke0(Native Method)
	at java.base/jdk.internal.reflect.NativeMethodAccessorImpl.invoke(NativeMethodAccessorImpl.java:62)
	at java.base/jdk.internal.reflect.DelegatingMethodAccessorImpl.invoke(DelegatingMethodAccessorImpl.java:43)
	at java.base/java.lang.reflect.Method.invoke(Method.java:564)
	at com.carrotsearch.randomizedtesting.RandomizedRunner.invoke(RandomizedRunner.java:1737)
	at com.carrotsearch.randomizedtesting.RandomizedRunner$8.evaluate(RandomizedRunner.java:934)
	at com.carrotsearch.randomizedtesting.RandomizedRunner$9.evaluate(RandomizedRunner.java:970)
	at com.carrotsearch.randomizedtesting.RandomizedRunner$10.evaluate(RandomizedRunner.java:984)
	at com.carrotsearch.randomizedtesting.rules.SystemPropertiesRestoreRule$1.evaluate(SystemPropertiesRestoreRule.java:57)
	at org.apache.lucene.util.TestRuleSetupTeardownChained$1.evaluate(TestRuleSetupTeardownChained.java:49)
	at org.apache.lucene.util.AbstractBeforeAfterRule$1.evaluate(AbstractBeforeAfterRule.java:45)
	at org.apache.lucene.util.TestRuleThreadAndTestName$1.evaluate(TestRuleThreadAndTestName.java:48)
	at org.apache.lucene.util.TestRuleIgnoreAfterMaxFailures$1.evaluate(TestRuleIgnoreAfterMaxFailures.java:64)
	at org.apache.lucene.util.TestRuleMarkFailure$1.evaluate(TestRuleMarkFailure.java:47)
	at com.carrotsearch.randomizedtesting.rules.StatementAdapter.evaluate(StatementAdapter.java:36)
	at com.carrotsearch.randomizedtesting.ThreadLeakControl$StatementRunner.run(ThreadLeakControl.java:368)
	at com.carrotsearch.randomizedtesting.ThreadLeakControl.forkTimeoutingTask(ThreadLeakControl.java:817)
	at com.carrotsearch.randomizedtesting.ThreadLeakControl$3.evaluate(ThreadLeakControl.java:468)
	at com.carrotsearch.randomizedtesting.RandomizedRunner.runSingleTest(RandomizedRunner.java:943)
	at com.carrotsearch.randomizedtesting.RandomizedRunner$5.evaluate(RandomizedRunner.java:829)
	at com.carrotsearch.randomizedtesting.RandomizedRunner$6.evaluate(RandomizedRunner.java:879)
	at com.carrotsearch.randomizedtesting.RandomizedRunner$7.evaluate(RandomizedRunner.java:890)
	at com.carrotsearch.randomizedtesting.rules.StatementAdapter.evaluate(StatementAdapter.java:36)
	at com.carrotsearch.randomizedtesting.rules.SystemPropertiesRestoreRule$1.evaluate(SystemPropertiesRestoreRule.java:57)
	at org.apache.lucene.util.AbstractBeforeAfterRule$1.evaluate(AbstractBeforeAfterRule.java:45)
	at com.carrotsearch.randomizedtesting.rules.StatementAdapter.evaluate(StatementAdapter.java:36)
	at org.apache.lucene.util.TestRuleStoreClassName$1.evaluate(TestRuleStoreClassName.java:41)
	at com.carrotsearch.randomizedtesting.rules.NoShadowingOrOverridesOnMethodsRule$1.evaluate(NoShadowingOrOverridesOnMethodsRule.java:40)
	at com.carrotsearch.randomizedtesting.rules.NoShadowingOrOverridesOnMethodsRule$1.evaluate(NoShadowingOrOverridesOnMethodsRule.java:40)
	at com.carrotsearch.randomizedtesting.rules.StatementAdapter.evaluate(StatementAdapter.java:36)
	at com.carrotsearch.randomizedtesting.rules.StatementAdapter.evaluate(StatementAdapter.java:36)
	at org.apache.lucene.util.TestRuleAssertionsRequired$1.evaluate(TestRuleAssertionsRequired.java:53)
	at org.apache.lucene.util.TestRuleMarkFailure$1.evaluate(TestRuleMarkFailure.java:47)
	at org.apache.lucene.util.TestRuleIgnoreAfterMaxFailures$1.evaluate(TestRuleIgnoreAfterMaxFailures.java:64)
	at org.apache.lucene.util.TestRuleIgnoreTestSuites$1.evaluate(TestRuleIgnoreTestSuites.java:54)
	at com.carrotsearch.randomizedtesting.rules.StatementAdapter.evaluate(StatementAdapter.java:36)
	at com.carrotsearch.randomizedtesting.ThreadLeakControl$StatementRunner.run(ThreadLeakControl.java:368)
	at java.base/java.lang.Thread.run(Thread.java:844)


FAILED:  org.apache.solr.cloud.autoscaling.IndexSizeTriggerTest.testSplitIntegration

Error Message:
last state: DocCollection(testSplitIntegration_collection//clusterstate.json/71)={   "replicationFactor":"2",   "pullReplicas":"0",   "router":{"name":"compositeId"},   "maxShardsPerNode":"2",   "autoAddReplicas":"false",   "nrtReplicas":"2",   "tlogReplicas":"0",   "autoCreated":"true",   "shards":{     "shard2":{       "replicas":{         "core_node3":{           "core":"testSplitIntegration_collection_shard2_replica_n3",           "leader":"true",           "SEARCHER.searcher.maxDoc":11,           "SEARCHER.searcher.deletedDocs":0,           "INDEX.sizeInBytes":1,           "node_name":"127.0.0.1:10001_solr",           "state":"active",           "type":"NRT",           "SEARCHER.searcher.numDocs":11},         "core_node4":{           "core":"testSplitIntegration_collection_shard2_replica_n4",           "SEARCHER.searcher.maxDoc":11,           "SEARCHER.searcher.deletedDocs":0,           "INDEX.sizeInBytes":1,           "node_name":"127.0.0.1:10000_solr",           "state":"active",           "type":"NRT",           "SEARCHER.searcher.numDocs":11}},       "range":"0-7fffffff",       "state":"active"},     "shard1":{       "stateTimestamp":"1527148994592157150",       "replicas":{         "core_node1":{           "core":"testSplitIntegration_collection_shard1_replica_n1",           "leader":"true",           "SEARCHER.searcher.maxDoc":14,           "SEARCHER.searcher.deletedDocs":0,           "INDEX.sizeInBytes":1,           "node_name":"127.0.0.1:10001_solr",           "state":"active",           "type":"NRT",           "SEARCHER.searcher.numDocs":14},         "core_node2":{           "core":"testSplitIntegration_collection_shard1_replica_n2",           "SEARCHER.searcher.maxDoc":14,           "SEARCHER.searcher.deletedDocs":0,           "INDEX.sizeInBytes":1,           "node_name":"127.0.0.1:10000_solr",           "state":"active",           "type":"NRT",           "SEARCHER.searcher.numDocs":14}},       "range":"80000000-ffffffff",       "state":"inactive"},     "shard1_1":{       "parent":"shard1",       "stateTimestamp":"1527148994608233150",       "range":"c0000000-ffffffff",       "state":"active",       "replicas":{         "core_node10":{           "leader":"true",           "core":"testSplitIntegration_collection_shard1_1_replica1",           "SEARCHER.searcher.maxDoc":6,           "SEARCHER.searcher.deletedDocs":0,           "INDEX.sizeInBytes":1,           "node_name":"127.0.0.1:10000_solr",           "base_url":"http://127.0.0.1:10000/solr",           "state":"active",           "type":"NRT",           "SEARCHER.searcher.numDocs":6},         "core_node9":{           "core":"testSplitIntegration_collection_shard1_1_replica0",           "SEARCHER.searcher.maxDoc":6,           "SEARCHER.searcher.deletedDocs":0,           "INDEX.sizeInBytes":1,           "node_name":"127.0.0.1:10001_solr",           "base_url":"http://127.0.0.1:10001/solr",           "state":"active",           "type":"NRT",           "SEARCHER.searcher.numDocs":6}}},     "shard1_0":{       "parent":"shard1",       "stateTimestamp":"1527148994607911750",       "range":"80000000-bfffffff",       "state":"active",       "replicas":{         "core_node7":{           "leader":"true",           "core":"testSplitIntegration_collection_shard1_0_replica0",           "SEARCHER.searcher.maxDoc":7,           "SEARCHER.searcher.deletedDocs":0,           "INDEX.sizeInBytes":1,           "node_name":"127.0.0.1:10001_solr",           "base_url":"http://127.0.0.1:10001/solr",           "state":"active",           "type":"NRT",           "SEARCHER.searcher.numDocs":7},         "core_node8":{           "core":"testSplitIntegration_collection_shard1_0_replica1",           "SEARCHER.searcher.maxDoc":7,           "SEARCHER.searcher.deletedDocs":0,           "INDEX.sizeInBytes":1,           "node_name":"127.0.0.1:10000_solr",           "base_url":"http://127.0.0.1:10000/solr",           "state":"active",           "type":"NRT",           "SEARCHER.searcher.numDocs":7}}}}}

Stack Trace:
java.util.concurrent.TimeoutException: last state: DocCollection(testSplitIntegration_collection//clusterstate.json/71)={
  "replicationFactor":"2",
  "pullReplicas":"0",
  "router":{"name":"compositeId"},
  "maxShardsPerNode":"2",
  "autoAddReplicas":"false",
  "nrtReplicas":"2",
  "tlogReplicas":"0",
  "autoCreated":"true",
  "shards":{
    "shard2":{
      "replicas":{
        "core_node3":{
          "core":"testSplitIntegration_collection_shard2_replica_n3",
          "leader":"true",
          "SEARCHER.searcher.maxDoc":11,
          "SEARCHER.searcher.deletedDocs":0,
          "INDEX.sizeInBytes":1,
          "node_name":"127.0.0.1:10001_solr",
          "state":"active",
          "type":"NRT",
          "SEARCHER.searcher.numDocs":11},
        "core_node4":{
          "core":"testSplitIntegration_collection_shard2_replica_n4",
          "SEARCHER.searcher.maxDoc":11,
          "SEARCHER.searcher.deletedDocs":0,
          "INDEX.sizeInBytes":1,
          "node_name":"127.0.0.1:10000_solr",
          "state":"active",
          "type":"NRT",
          "SEARCHER.searcher.numDocs":11}},
      "range":"0-7fffffff",
      "state":"active"},
    "shard1":{
      "stateTimestamp":"1527148994592157150",
      "replicas":{
        "core_node1":{
          "core":"testSplitIntegration_collection_shard1_replica_n1",
          "leader":"true",
          "SEARCHER.searcher.maxDoc":14,
          "SEARCHER.searcher.deletedDocs":0,
          "INDEX.sizeInBytes":1,
          "node_name":"127.0.0.1:10001_solr",
          "state":"active",
          "type":"NRT",
          "SEARCHER.searcher.numDocs":14},
        "core_node2":{
          "core":"testSplitIntegration_collection_shard1_replica_n2",
          "SEARCHER.searcher.maxDoc":14,
          "SEARCHER.searcher.deletedDocs":0,
          "INDEX.sizeInBytes":1,
          "node_name":"127.0.0.1:10000_solr",
          "state":"active",
          "type":"NRT",
          "SEARCHER.searcher.numDocs":14}},
      "range":"80000000-ffffffff",
      "state":"inactive"},
    "shard1_1":{
      "parent":"shard1",
      "stateTimestamp":"1527148994608233150",
      "range":"c0000000-ffffffff",
      "state":"active",
      "replicas":{
        "core_node10":{
          "leader":"true",
          "core":"testSplitIntegration_collection_shard1_1_replica1",
          "SEARCHER.searcher.maxDoc":6,
          "SEARCHER.searcher.deletedDocs":0,
          "INDEX.sizeInBytes":1,
          "node_name":"127.0.0.1:10000_solr",
          "base_url":"http://127.0.0.1:10000/solr",
          "state":"active",
          "type":"NRT",
          "SEARCHER.searcher.numDocs":6},
        "core_node9":{
          "core":"testSplitIntegration_collection_shard1_1_replica0",
          "SEARCHER.searcher.maxDoc":6,
          "SEARCHER.searcher.deletedDocs":0,
          "INDEX.sizeInBytes":1,
          "node_name":"127.0.0.1:10001_solr",
          "base_url":"http://127.0.0.1:10001/solr",
          "state":"active",
          "type":"NRT",
          "SEARCHER.searcher.numDocs":6}}},
    "shard1_0":{
      "parent":"shard1",
      "stateTimestamp":"1527148994607911750",
      "range":"80000000-bfffffff",
      "state":"active",
      "replicas":{
        "core_node7":{
          "leader":"true",
          "core":"testSplitIntegration_collection_shard1_0_replica0",
          "SEARCHER.searcher.maxDoc":7,
          "SEARCHER.searcher.deletedDocs":0,
          "INDEX.sizeInBytes":1,
          "node_name":"127.0.0.1:10001_solr",
          "base_url":"http://127.0.0.1:10001/solr",
          "state":"active",
          "type":"NRT",
          "SEARCHER.searcher.numDocs":7},
        "core_node8":{
          "core":"testSplitIntegration_collection_shard1_0_replica1",
          "SEARCHER.searcher.maxDoc":7,
          "SEARCHER.searcher.deletedDocs":0,
          "INDEX.sizeInBytes":1,
          "node_name":"127.0.0.1:10000_solr",
          "base_url":"http://127.0.0.1:10000/solr",
          "state":"active",
          "type":"NRT",
          "SEARCHER.searcher.numDocs":7}}}}}
	at __randomizedtesting.SeedInfo.seed([4659082834CF5C58:7FD7B1681B3095A6]:0)
	at org.apache.solr.cloud.CloudTestUtils.waitForState(CloudTestUtils.java:111)
	at org.apache.solr.cloud.autoscaling.IndexSizeTriggerTest.testSplitIntegration(IndexSizeTriggerTest.java:299)
	at java.base/jdk.internal.reflect.NativeMethodAccessorImpl.invoke0(Native Method)
	at java.base/jdk.internal.reflect.NativeMethodAccessorImpl.invoke(NativeMethodAccessorImpl.java:62)
	at java.base/jdk.internal.reflect.DelegatingMethodAccessorImpl.invoke(DelegatingMethodAccessorImpl.java:43)
	at java.base/java.lang.reflect.Method.invoke(Method.java:564)
	at com.carrotsearch.randomizedtesting.RandomizedRunner.invoke(RandomizedRunner.java:1737)
	at com.carrotsearch.randomizedtesting.RandomizedRunner$8.evaluate(RandomizedRunner.java:934)
	at com.carrotsearch.randomizedtesting.RandomizedRunner$9.evaluate(RandomizedRunner.java:970)
	at com.carrotsearch.randomizedtesting.RandomizedRunner$10.evaluate(RandomizedRunner.java:984)
	at com.carrotsearch.randomizedtesting.rules.SystemPropertiesRestoreRule$1.evaluate(SystemPropertiesRestoreRule.java:57)
	at org.apache.lucene.util.TestRuleSetupTeardownChained$1.evaluate(TestRuleSetupTeardownChained.java:49)
	at org.apache.lucene.util.AbstractBeforeAfterRule$1.evaluate(AbstractBeforeAfterRule.java:45)
	at org.apache.lucene.util.TestRuleThreadAndTestName$1.evaluate(TestRuleThreadAndTestName.java:48)
	at org.apache.lucene.util.TestRuleIgnoreAfterMaxFailures$1.evaluate(TestRuleIgnoreAfterMaxFailures.java:64)
	at org.apache.lucene.util.TestRuleMarkFailure$1.evaluate(TestRuleMarkFailure.java:47)
	at com.carrotsearch.randomizedtesting.rules.StatementAdapter.evaluate(StatementAdapter.java:36)
	at com.carrotsearch.randomizedtesting.ThreadLeakControl$StatementRunner.run(ThreadLeakControl.java:368)
	at com.carrotsearch.randomizedtesting.ThreadLeakControl.forkTimeoutingTask(ThreadLeakControl.java:817)
	at com.carrotsearch.randomizedtesting.ThreadLeakControl$3.evaluate(ThreadLeakControl.java:468)
	at com.carrotsearch.randomizedtesting.RandomizedRunner.runSingleTest(RandomizedRunner.java:943)
	at com.carrotsearch.randomizedtesting.RandomizedRunner$5.evaluate(RandomizedRunner.java:829)
	at com.carrotsearch.randomizedtesting.RandomizedRunner$6.evaluate(RandomizedRunner.java:879)
	at com.carrotsearch.randomizedtesting.RandomizedRunner$7.evaluate(RandomizedRunner.java:890)
	at com.carrotsearch.randomizedtesting.rules.StatementAdapter.evaluate(StatementAdapter.java:36)
	at com.carrotsearch.randomizedtesting.rules.SystemPropertiesRestoreRule$1.evaluate(SystemPropertiesRestoreRule.java:57)
	at org.apache.lucene.util.AbstractBeforeAfterRule$1.evaluate(AbstractBeforeAfterRule.java:45)
	at com.carrotsearch.randomizedtesting.rules.StatementAdapter.evaluate(StatementAdapter.java:36)
	at org.apache.lucene.util.TestRuleStoreClassName$1.evaluate(TestRuleStoreClassName.java:41)
	at com.carrotsearch.randomizedtesting.rules.NoShadowingOrOverridesOnMethodsRule$1.evaluate(NoShadowingOrOverridesOnMethodsRule.java:40)
	at com.carrotsearch.randomizedtesting.rules.NoShadowingOrOverridesOnMethodsRule$1.evaluate(NoShadowingOrOverridesOnMethodsRule.java:40)
	at com.carrotsearch.randomizedtesting.rules.StatementAdapter.evaluate(StatementAdapter.java:36)
	at com.carrotsearch.randomizedtesting.rules.StatementAdapter.evaluate(StatementAdapter.java:36)
	at org.apache.lucene.util.TestRuleAssertionsRequired$1.evaluate(TestRuleAssertionsRequired.java:53)
	at org.apache.lucene.util.TestRuleMarkFailure$1.evaluate(TestRuleMarkFailure.java:47)
	at org.apache.lucene.util.TestRuleIgnoreAfterMaxFailures$1.evaluate(TestRuleIgnoreAfterMaxFailures.java:64)
	at org.apache.lucene.util.TestRuleIgnoreTestSuites$1.evaluate(TestRuleIgnoreTestSuites.java:54)
	at com.carrotsearch.randomizedtesting.rules.StatementAdapter.evaluate(StatementAdapter.java:36)
	at com.carrotsearch.randomizedtesting.ThreadLeakControl$StatementRunner.run(ThreadLeakControl.java:368)
	at java.base/java.lang.Thread.run(Thread.java:844)


FAILED:  org.apache.solr.cloud.autoscaling.IndexSizeTriggerTest.testTrigger

Error Message:
waitFor not elapsed but produced an event

Stack Trace:
java.lang.AssertionError: waitFor not elapsed but produced an event
	at __randomizedtesting.SeedInfo.seed([4659082834CF5C58:25923EAAAD002F75]:0)
	at org.junit.Assert.fail(Assert.java:93)
	at org.junit.Assert.assertTrue(Assert.java:43)
	at org.junit.Assert.assertNull(Assert.java:551)
	at org.apache.solr.cloud.autoscaling.IndexSizeTriggerTest.testTrigger(IndexSizeTriggerTest.java:180)
	at java.base/jdk.internal.reflect.NativeMethodAccessorImpl.invoke0(Native Method)
	at java.base/jdk.internal.reflect.NativeMethodAccessorImpl.invoke(NativeMethodAccessorImpl.java:62)
	at java.base/jdk.internal.reflect.DelegatingMethodAccessorImpl.invoke(DelegatingMethodAccessorImpl.java:43)
	at java.base/java.lang.reflect.Method.invoke(Method.java:564)
	at com.carrotsearch.randomizedtesting.RandomizedRunner.invoke(RandomizedRunner.java:1737)
	at com.carrotsearch.randomizedtesting.RandomizedRunner$8.evaluate(RandomizedRunner.java:934)
	at com.carrotsearch.randomizedtesting.RandomizedRunner$9.evaluate(RandomizedRunner.java:970)
	at com.carrotsearch.randomizedtesting.RandomizedRunner$10.evaluate(RandomizedRunner.java:984)
	at com.carrotsearch.randomizedtesting.rules.SystemPropertiesRestoreRule$1.evaluate(SystemPropertiesRestoreRule.java:57)
	at org.apache.lucene.util.TestRuleSetupTeardownChained$1.evaluate(TestRuleSetupTeardownChained.java:49)
	at org.apache.lucene.util.AbstractBeforeAfterRule$1.evaluate(AbstractBeforeAfterRule.java:45)
	at org.apache.lucene.util.TestRuleThreadAndTestName$1.evaluate(TestRuleThreadAndTestName.java:48)
	at org.apache.lucene.util.TestRuleIgnoreAfterMaxFailures$1.evaluate(TestRuleIgnoreAfterMaxFailures.java:64)
	at org.apache.lucene.util.TestRuleMarkFailure$1.evaluate(TestRuleMarkFailure.java:47)
	at com.carrotsearch.randomizedtesting.rules.StatementAdapter.evaluate(StatementAdapter.java:36)
	at com.carrotsearch.randomizedtesting.ThreadLeakControl$StatementRunner.run(ThreadLeakControl.java:368)
	at com.carrotsearch.randomizedtesting.ThreadLeakControl.forkTimeoutingTask(ThreadLeakControl.java:817)
	at com.carrotsearch.randomizedtesting.ThreadLeakControl$3.evaluate(ThreadLeakControl.java:468)
	at com.carrotsearch.randomizedtesting.RandomizedRunner.runSingleTest(RandomizedRunner.java:943)
	at com.carrotsearch.randomizedtesting.RandomizedRunner$5.evaluate(RandomizedRunner.java:829)
	at com.carrotsearch.randomizedtesting.RandomizedRunner$6.evaluate(RandomizedRunner.java:879)
	at com.carrotsearch.randomizedtesting.RandomizedRunner$7.evaluate(RandomizedRunner.java:890)
	at com.carrotsearch.randomizedtesting.rules.StatementAdapter.evaluate(StatementAdapter.java:36)
	at com.carrotsearch.randomizedtesting.rules.SystemPropertiesRestoreRule$1.evaluate(SystemPropertiesRestoreRule.java:57)
	at org.apache.lucene.util.AbstractBeforeAfterRule$1.evaluate(AbstractBeforeAfterRule.java:45)
	at com.carrotsearch.randomizedtesting.rules.StatementAdapter.evaluate(StatementAdapter.java:36)
	at org.apache.lucene.util.TestRuleStoreClassName$1.evaluate(TestRuleStoreClassName.java:41)
	at com.carrotsearch.randomizedtesting.rules.NoShadowingOrOverridesOnMethodsRule$1.evaluate(NoShadowingOrOverridesOnMethodsRule.java:40)
	at com.carrotsearch.randomizedtesting.rules.NoShadowingOrOverridesOnMethodsRule$1.evaluate(NoShadowingOrOverridesOnMethodsRule.java:40)
	at com.carrotsearch.randomizedtesting.rules.StatementAdapter.evaluate(StatementAdapter.java:36)
	at com.carrotsearch.randomizedtesting.rules.StatementAdapter.evaluate(StatementAdapter.java:36)
	at org.apache.lucene.util.TestRuleAssertionsRequired$1.evaluate(TestRuleAssertionsRequired.java:53)
	at org.apache.lucene.util.TestRuleMarkFailure$1.evaluate(TestRuleMarkFailure.java:47)
	at org.apache.lucene.util.TestRuleIgnoreAfterMaxFailures$1.evaluate(TestRuleIgnoreAfterMaxFailures.java:64)
	at org.apache.lucene.util.TestRuleIgnoreTestSuites$1.evaluate(TestRuleIgnoreTestSuites.java:54)
	at com.carrotsearch.randomizedtesting.rules.StatementAdapter.evaluate(StatementAdapter.java:36)
	at com.carrotsearch.randomizedtesting.ThreadLeakControl$StatementRunner.run(ThreadLeakControl.java:368)
	at java.base/java.lang.Thread.run(Thread.java:844)


FAILED:  org.apache.solr.cloud.autoscaling.IndexSizeTriggerTest.testSplitIntegration

Error Message:
last state: DocCollection(testSplitIntegration_collection//clusterstate.json/70)={   "replicationFactor":"2",   "pullReplicas":"0",   "router":{"name":"compositeId"},   "maxShardsPerNode":"2",   "autoAddReplicas":"false",   "nrtReplicas":"2",   "tlogReplicas":"0",   "autoCreated":"true",   "shards":{     "shard2":{       "replicas":{         "core_node3":{           "core":"testSplitIntegration_collection_shard2_replica_n3",           "leader":"true",           "SEARCHER.searcher.maxDoc":11,           "SEARCHER.searcher.deletedDocs":0,           "INDEX.sizeInBytes":1,           "node_name":"127.0.0.1:10001_solr",           "state":"active",           "type":"NRT",           "SEARCHER.searcher.numDocs":11},         "core_node4":{           "core":"testSplitIntegration_collection_shard2_replica_n4",           "SEARCHER.searcher.maxDoc":11,           "SEARCHER.searcher.deletedDocs":0,           "INDEX.sizeInBytes":1,           "node_name":"127.0.0.1:10000_solr",           "state":"active",           "type":"NRT",           "SEARCHER.searcher.numDocs":11}},       "range":"0-7fffffff",       "state":"active"},     "shard1":{       "stateTimestamp":"1527147094914731750",       "replicas":{         "core_node1":{           "core":"testSplitIntegration_collection_shard1_replica_n1",           "leader":"true",           "SEARCHER.searcher.maxDoc":14,           "SEARCHER.searcher.deletedDocs":0,           "INDEX.sizeInBytes":1,           "node_name":"127.0.0.1:10001_solr",           "state":"active",           "type":"NRT",           "SEARCHER.searcher.numDocs":14},         "core_node2":{           "core":"testSplitIntegration_collection_shard1_replica_n2",           "SEARCHER.searcher.maxDoc":14,           "SEARCHER.searcher.deletedDocs":0,           "INDEX.sizeInBytes":1,           "node_name":"127.0.0.1:10000_solr",           "state":"active",           "type":"NRT",           "SEARCHER.searcher.numDocs":14}},       "range":"80000000-ffffffff",       "state":"inactive"},     "shard1_1":{       "parent":"shard1",       "stateTimestamp":"1527147094929025900",       "range":"c0000000-ffffffff",       "state":"active",       "replicas":{         "core_node10":{           "leader":"true",           "core":"testSplitIntegration_collection_shard1_1_replica1",           "SEARCHER.searcher.maxDoc":6,           "SEARCHER.searcher.deletedDocs":0,           "INDEX.sizeInBytes":1,           "node_name":"127.0.0.1:10000_solr",           "base_url":"http://127.0.0.1:10000/solr",           "state":"active",           "type":"NRT",           "SEARCHER.searcher.numDocs":6},         "core_node9":{           "core":"testSplitIntegration_collection_shard1_1_replica0",           "SEARCHER.searcher.maxDoc":6,           "SEARCHER.searcher.deletedDocs":0,           "INDEX.sizeInBytes":1,           "node_name":"127.0.0.1:10001_solr",           "base_url":"http://127.0.0.1:10001/solr",           "state":"active",           "type":"NRT",           "SEARCHER.searcher.numDocs":6}}},     "shard1_0":{       "parent":"shard1",       "stateTimestamp":"1527147094928738450",       "range":"80000000-bfffffff",       "state":"active",       "replicas":{         "core_node7":{           "leader":"true",           "core":"testSplitIntegration_collection_shard1_0_replica0",           "SEARCHER.searcher.maxDoc":7,           "SEARCHER.searcher.deletedDocs":0,           "INDEX.sizeInBytes":1,           "node_name":"127.0.0.1:10001_solr",           "base_url":"http://127.0.0.1:10001/solr",           "state":"active",           "type":"NRT",           "SEARCHER.searcher.numDocs":7},         "core_node8":{           "core":"testSplitIntegration_collection_shard1_0_replica1",           "SEARCHER.searcher.maxDoc":7,           "SEARCHER.searcher.deletedDocs":0,           "INDEX.sizeInBytes":1,           "node_name":"127.0.0.1:10000_solr",           "base_url":"http://127.0.0.1:10000/solr",           "state":"active",           "type":"NRT",           "SEARCHER.searcher.numDocs":7}}}}}

Stack Trace:
java.util.concurrent.TimeoutException: last state: DocCollection(testSplitIntegration_collection//clusterstate.json/70)={
  "replicationFactor":"2",
  "pullReplicas":"0",
  "router":{"name":"compositeId"},
  "maxShardsPerNode":"2",
  "autoAddReplicas":"false",
  "nrtReplicas":"2",
  "tlogReplicas":"0",
  "autoCreated":"true",
  "shards":{
    "shard2":{
      "replicas":{
        "core_node3":{
          "core":"testSplitIntegration_collection_shard2_replica_n3",
          "leader":"true",
          "SEARCHER.searcher.maxDoc":11,
          "SEARCHER.searcher.deletedDocs":0,
          "INDEX.sizeInBytes":1,
          "node_name":"127.0.0.1:10001_solr",
          "state":"active",
          "type":"NRT",
          "SEARCHER.searcher.numDocs":11},
        "core_node4":{
          "core":"testSplitIntegration_collection_shard2_replica_n4",
          "SEARCHER.searcher.maxDoc":11,
          "SEARCHER.searcher.deletedDocs":0,
          "INDEX.sizeInBytes":1,
          "node_name":"127.0.0.1:10000_solr",
          "state":"active",
          "type":"NRT",
          "SEARCHER.searcher.numDocs":11}},
      "range":"0-7fffffff",
      "state":"active"},
    "shard1":{
      "stateTimestamp":"1527147094914731750",
      "replicas":{
        "core_node1":{
          "core":"testSplitIntegration_collection_shard1_replica_n1",
          "leader":"true",
          "SEARCHER.searcher.maxDoc":14,
          "SEARCHER.searcher.deletedDocs":0,
          "INDEX.sizeInBytes":1,
          "node_name":"127.0.0.1:10001_solr",
          "state":"active",
          "type":"NRT",
          "SEARCHER.searcher.numDocs":14},
        "core_node2":{
          "core":"testSplitIntegration_collection_shard1_replica_n2",
          "SEARCHER.searcher.maxDoc":14,
          "SEARCHER.searcher.deletedDocs":0,
          "INDEX.sizeInBytes":1,
          "node_name":"127.0.0.1:10000_solr",
          "state":"active",
          "type":"NRT",
          "SEARCHER.searcher.numDocs":14}},
      "range":"80000000-ffffffff",
      "state":"inactive"},
    "shard1_1":{
      "parent":"shard1",
      "stateTimestamp":"1527147094929025900",
      "range":"c0000000-ffffffff",
      "state":"active",
      "replicas":{
        "core_node10":{
          "leader":"true",
          "core":"testSplitIntegration_collection_shard1_1_replica1",
          "SEARCHER.searcher.maxDoc":6,
          "SEARCHER.searcher.deletedDocs":0,
          "INDEX.sizeInBytes":1,
          "node_name":"127.0.0.1:10000_solr",
          "base_url":"http://127.0.0.1:10000/solr",
          "state":"active",
          "type":"NRT",
          "SEARCHER.searcher.numDocs":6},
        "core_node9":{
          "core":"testSplitIntegration_collection_shard1_1_replica0",
          "SEARCHER.searcher.maxDoc":6,
          "SEARCHER.searcher.deletedDocs":0,
          "INDEX.sizeInBytes":1,
          "node_name":"127.0.0.1:10001_solr",
          "base_url":"http://127.0.0.1:10001/solr",
          "state":"active",
          "type":"NRT",
          "SEARCHER.searcher.numDocs":6}}},
    "shard1_0":{
      "parent":"shard1",
      "stateTimestamp":"1527147094928738450",
      "range":"80000000-bfffffff",
      "state":"active",
      "replicas":{
        "core_node7":{
          "leader":"true",
          "core":"testSplitIntegration_collection_shard1_0_replica0",
          "SEARCHER.searcher.maxDoc":7,
          "SEARCHER.searcher.deletedDocs":0,
          "INDEX.sizeInBytes":1,
          "node_name":"127.0.0.1:10001_solr",
          "base_url":"http://127.0.0.1:10001/solr",
          "state":"active",
          "type":"NRT",
          "SEARCHER.searcher.numDocs":7},
        "core_node8":{
          "core":"testSplitIntegration_collection_shard1_0_replica1",
          "SEARCHER.searcher.maxDoc":7,
          "SEARCHER.searcher.deletedDocs":0,
          "INDEX.sizeInBytes":1,
          "node_name":"127.0.0.1:10000_solr",
          "base_url":"http://127.0.0.1:10000/solr",
          "state":"active",
          "type":"NRT",
          "SEARCHER.searcher.numDocs":7}}}}}
	at __randomizedtesting.SeedInfo.seed([4659082834CF5C58:7FD7B1681B3095A6]:0)
	at org.apache.solr.cloud.CloudTestUtils.waitForState(CloudTestUtils.java:111)
	at org.apache.solr.cloud.autoscaling.IndexSizeTriggerTest.testSplitIntegration(IndexSizeTriggerTest.java:299)
	at java.base/jdk.internal.reflect.NativeMethodAccessorImpl.invoke0(Native Method)
	at java.base/jdk.internal.reflect.NativeMethodAccessorImpl.invoke(NativeMethodAccessorImpl.java:62)
	at java.base/jdk.internal.reflect.DelegatingMethodAccessorImpl.invoke(DelegatingMethodAccessorImpl.java:43)
	at java.base/java.lang.reflect.Method.invoke(Method.java:564)
	at com.carrotsearch.randomizedtesting.RandomizedRunner.invoke(RandomizedRunner.java:1737)
	at com.carrotsearch.randomizedtesting.RandomizedRunner$8.evaluate(RandomizedRunner.java:934)
	at com.carrotsearch.randomizedtesting.RandomizedRunner$9.evaluate(RandomizedRunner.java:970)
	at com.carrotsearch.randomizedtesting.RandomizedRunner$10.evaluate(RandomizedRunner.java:984)
	at com.carrotsearch.randomizedtesting.rules.SystemPropertiesRestoreRule$1.evaluate(SystemPropertiesRestoreRule.java:57)
	at org.apache.lucene.util.TestRuleSetupTeardownChained$1.evaluate(TestRuleSetupTeardownChained.java:49)
	at org.apache.lucene.util.AbstractBeforeAfterRule$1.evaluate(AbstractBeforeAfterRule.java:45)
	at org.apache.lucene.util.TestRuleThreadAndTestName$1.evaluate(TestRuleThreadAndTestName.java:48)
	at org.apache.lucene.util.TestRuleIgnoreAfterMaxFailures$1.evaluate(TestRuleIgnoreAfterMaxFailures.java:64)
	at org.apache.lucene.util.TestRuleMarkFailure$1.evaluate(TestRuleMarkFailure.java:47)
	at com.carrotsearch.randomizedtesting.rules.StatementAdapter.evaluate(StatementAdapter.java:36)
	at com.carrotsearch.randomizedtesting.ThreadLeakControl$StatementRunner.run(ThreadLeakControl.java:368)
	at com.carrotsearch.randomizedtesting.ThreadLeakControl.forkTimeoutingTask(ThreadLeakControl.java:817)
	at com.carrotsearch.randomizedtesting.ThreadLeakControl$3.evaluate(ThreadLeakControl.java:468)
	at com.carrotsearch.randomizedtesting.RandomizedRunner.runSingleTest(RandomizedRunner.java:943)
	at com.carrotsearch.randomizedtesting.RandomizedRunner$5.evaluate(RandomizedRunner.java:829)
	at com.carrotsearch.randomizedtesting.RandomizedRunner$6.evaluate(RandomizedRunner.java:879)
	at com.carrotsearch.randomizedtesting.RandomizedRunner$7.evaluate(RandomizedRunner.java:890)
	at com.carrotsearch.randomizedtesting.rules.StatementAdapter.evaluate(StatementAdapter.java:36)
	at com.carrotsearch.randomizedtesting.rules.SystemPropertiesRestoreRule$1.evaluate(SystemPropertiesRestoreRule.java:57)
	at org.apache.lucene.util.AbstractBeforeAfterRule$1.evaluate(AbstractBeforeAfterRule.java:45)
	at com.carrotsearch.randomizedtesting.rules.StatementAdapter.evaluate(StatementAdapter.java:36)
	at org.apache.lucene.util.TestRuleStoreClassName$1.evaluate(TestRuleStoreClassName.java:41)
	at com.carrotsearch.randomizedtesting.rules.NoShadowingOrOverridesOnMethodsRule$1.evaluate(NoShadowingOrOverridesOnMethodsRule.java:40)
	at com.carrotsearch.randomizedtesting.rules.NoShadowingOrOverridesOnMethodsRule$1.evaluate(NoShadowingOrOverridesOnMethodsRule.java:40)
	at com.carrotsearch.randomizedtesting.rules.StatementAdapter.evaluate(StatementAdapter.java:36)
	at com.carrotsearch.randomizedtesting.rules.StatementAdapter.evaluate(StatementAdapter.java:36)
	at org.apache.lucene.util.TestRuleAssertionsRequired$1.evaluate(TestRuleAssertionsRequired.java:53)
	at org.apache.lucene.util.TestRuleMarkFailure$1.evaluate(TestRuleMarkFailure.java:47)
	at org.apache.lucene.util.TestRuleIgnoreAfterMaxFailures$1.evaluate(TestRuleIgnoreAfterMaxFailures.java:64)
	at org.apache.lucene.util.TestRuleIgnoreTestSuites$1.evaluate(TestRuleIgnoreTestSuites.java:54)
	at com.carrotsearch.randomizedtesting.rules.StatementAdapter.evaluate(StatementAdapter.java:36)
	at com.carrotsearch.randomizedtesting.ThreadLeakControl$StatementRunner.run(ThreadLeakControl.java:368)
	at java.base/java.lang.Thread.run(Thread.java:844)


FAILED:  org.apache.solr.cloud.autoscaling.IndexSizeTriggerTest.testMergeIntegration

Error Message:
did not finish processing in time

Stack Trace:
java.lang.AssertionError: did not finish processing in time
	at __randomizedtesting.SeedInfo.seed([4659082834CF5C58:15E04A98D6DEC9A2]:0)
	at org.junit.Assert.fail(Assert.java:93)
	at org.junit.Assert.assertTrue(Assert.java:43)
	at org.apache.solr.cloud.autoscaling.IndexSizeTriggerTest.testMergeIntegration(IndexSizeTriggerTest.java:404)
	at java.base/jdk.internal.reflect.NativeMethodAccessorImpl.invoke0(Native Method)
	at java.base/jdk.internal.reflect.NativeMethodAccessorImpl.invoke(NativeMethodAccessorImpl.java:62)
	at java.base/jdk.internal.reflect.DelegatingMethodAccessorImpl.invoke(DelegatingMethodAccessorImpl.java:43)
	at java.base/java.lang.reflect.Method.invoke(Method.java:564)
	at com.carrotsearch.randomizedtesting.RandomizedRunner.invoke(RandomizedRunner.java:1737)
	at com.carrotsearch.randomizedtesting.RandomizedRunner$8.evaluate(RandomizedRunner.java:934)
	at com.carrotsearch.randomizedtesting.RandomizedRunner$9.evaluate(RandomizedRunner.java:970)
	at com.carrotsearch.randomizedtesting.RandomizedRunner$10.evaluate(RandomizedRunner.java:984)
	at com.carrotsearch.randomizedtesting.rules.SystemPropertiesRestoreRule$1.evaluate(SystemPropertiesRestoreRule.java:57)
	at org.apache.lucene.util.TestRuleSetupTeardownChained$1.evaluate(TestRuleSetupTeardownChained.java:49)
	at org.apache.lucene.util.AbstractBeforeAfterRule$1.evaluate(AbstractBeforeAfterRule.java:45)
	at org.apache.lucene.util.TestRuleThreadAndTestName$1.evaluate(TestRuleThreadAndTestName.java:48)
	at org.apache.lucene.util.TestRuleIgnoreAfterMaxFailures$1.evaluate(TestRuleIgnoreAfterMaxFailures.java:64)
	at org.apache.lucene.util.TestRuleMarkFailure$1.evaluate(TestRuleMarkFailure.java:47)
	at com.carrotsearch.randomizedtesting.rules.StatementAdapter.evaluate(StatementAdapter.java:36)
	at com.carrotsearch.randomizedtesting.ThreadLeakControl$StatementRunner.run(ThreadLeakControl.java:368)
	at com.carrotsearch.randomizedtesting.ThreadLeakControl.forkTimeoutingTask(ThreadLeakControl.java:817)
	at com.carrotsearch.randomizedtesting.ThreadLeakControl$3.evaluate(ThreadLeakControl.java:468)
	at com.carrotsearch.randomizedtesting.RandomizedRunner.runSingleTest(RandomizedRunner.java:943)
	at com.carrotsearch.randomizedtesting.RandomizedRunner$5.evaluate(RandomizedRunner.java:829)
	at com.carrotsearch.randomizedtesting.RandomizedRunner$6.evaluate(RandomizedRunner.java:879)
	at com.carrotsearch.randomizedtesting.RandomizedRunner$7.evaluate(RandomizedRunner.java:890)
	at com.carrotsearch.randomizedtesting.rules.StatementAdapter.evaluate(StatementAdapter.java:36)
	at com.carrotsearch.randomizedtesting.rules.SystemPropertiesRestoreRule$1.evaluate(SystemPropertiesRestoreRule.java:57)
	at org.apache.lucene.util.AbstractBeforeAfterRule$1.evaluate(AbstractBeforeAfterRule.java:45)
	at com.carrotsearch.randomizedtesting.rules.StatementAdapter.evaluate(StatementAdapter.java:36)
	at org.apache.lucene.util.TestRuleStoreClassName$1.evaluate(TestRuleStoreClassName.java:41)
	at com.carrotsearch.randomizedtesting.rules.NoShadowingOrOverridesOnMethodsRule$1.evaluate(NoShadowingOrOverridesOnMethodsRule.java:40)
	at com.carrotsearch.randomizedtesting.rules.NoShadowingOrOverridesOnMethodsRule$1.evaluate(NoShadowingOrOverridesOnMethodsRule.java:40)
	at com.carrotsearch.randomizedtesting.rules.StatementAdapter.evaluate(StatementAdapter.java:36)
	at com.carrotsearch.randomizedtesting.rules.StatementAdapter.evaluate(StatementAdapter.java:36)
	at org.apache.lucene.util.TestRuleAssertionsRequired$1.evaluate(TestRuleAssertionsRequired.java:53)
	at org.apache.lucene.util.TestRuleMarkFailure$1.evaluate(TestRuleMarkFailure.java:47)
	at org.apache.lucene.util.TestRuleIgnoreAfterMaxFailures$1.evaluate(TestRuleIgnoreAfterMaxFailures.java:64)
	at org.apache.lucene.util.TestRuleIgnoreTestSuites$1.evaluate(TestRuleIgnoreTestSuites.java:54)
	at com.carrotsearch.randomizedtesting.rules.StatementAdapter.evaluate(StatementAdapter.java:36)
	at com.carrotsearch.randomizedtesting.ThreadLeakControl$StatementRunner.run(ThreadLeakControl.java:368)
	at java.base/java.lang.Thread.run(Thread.java:844)


FAILED:  org.apache.solr.cloud.autoscaling.SearchRateTriggerTest.testTrigger

Error Message:
expected:<1> but was:<2>

Stack Trace:
java.lang.AssertionError: expected:<1> but was:<2>
	at __randomizedtesting.SeedInfo.seed([4659082834CF5C58:25923EAAAD002F75]:0)
	at org.junit.Assert.fail(Assert.java:93)
	at org.junit.Assert.failNotEquals(Assert.java:647)
	at org.junit.Assert.assertEquals(Assert.java:128)
	at org.junit.Assert.assertEquals(Assert.java:472)
	at org.junit.Assert.assertEquals(Assert.java:456)
	at org.apache.solr.cloud.autoscaling.SearchRateTriggerTest.testTrigger(SearchRateTriggerTest.java:133)
	at java.base/jdk.internal.reflect.NativeMethodAccessorImpl.invoke0(Native Method)
	at java.base/jdk.internal.reflect.NativeMethodAccessorImpl.invoke(NativeMethodAccessorImpl.java:62)
	at java.base/jdk.internal.reflect.DelegatingMethodAccessorImpl.invoke(DelegatingMethodAccessorImpl.java:43)
	at java.base/java.lang.reflect.Method.invoke(Method.java:564)
	at com.carrotsearch.randomizedtesting.RandomizedRunner.invoke(RandomizedRunner.java:1737)
	at com.carrotsearch.randomizedtesting.RandomizedRunner$8.evaluate(RandomizedRunner.java:934)
	at com.carrotsearch.randomizedtesting.RandomizedRunner$9.evaluate(RandomizedRunner.java:970)
	at com.carrotsearch.randomizedtesting.RandomizedRunner$10.evaluate(RandomizedRunner.java:984)
	at com.carrotsearch.randomizedtesting.rules.SystemPropertiesRestoreRule$1.evaluate(SystemPropertiesRestoreRule.java:57)
	at org.apache.lucene.util.TestRuleSetupTeardownChained$1.evaluate(TestRuleSetupTeardownChained.java:49)
	at org.apache.lucene.util.AbstractBeforeAfterRule$1.evaluate(AbstractBeforeAfterRule.java:45)
	at org.apache.lucene.util.TestRuleThreadAndTestName$1.evaluate(TestRuleThreadAndTestName.java:48)
	at org.apache.lucene.util.TestRuleIgnoreAfterMaxFailures$1.evaluate(TestRuleIgnoreAfterMaxFailures.java:64)
	at org.apache.lucene.util.TestRuleMarkFailure$1.evaluate(TestRuleMarkFailure.java:47)
	at com.carrotsearch.randomizedtesting.rules.StatementAdapter.evaluate(StatementAdapter.java:36)
	at com.carrotsearch.randomizedtesting.ThreadLeakControl$StatementRunner.run(ThreadLeakControl.java:368)
	at com.carrotsearch.randomizedtesting.ThreadLeakControl.forkTimeoutingTask(ThreadLeakControl.java:817)
	at com.carrotsearch.randomizedtesting.ThreadLeakControl$3.evaluate(ThreadLeakControl.java:468)
	at com.carrotsearch.randomizedtesting.RandomizedRunner.runSingleTest(RandomizedRunner.java:943)
	at com.carrotsearch.randomizedtesting.RandomizedRunner$5.evaluate(RandomizedRunner.java:829)
	at com.carrotsearch.randomizedtesting.RandomizedRunner$6.evaluate(RandomizedRunner.java:879)
	at com.carrotsearch.randomizedtesting.RandomizedRunner$7.evaluate(RandomizedRunner.java:890)
	at com.carrotsearch.randomizedtesting.rules.StatementAdapter.evaluate(StatementAdapter.java:36)
	at com.carrotsearch.randomizedtesting.rules.SystemPropertiesRestoreRule$1.evaluate(SystemPropertiesRestoreRule.java:57)
	at org.apache.lucene.util.AbstractBeforeAfterRule$1.evaluate(AbstractBeforeAfterRule.java:45)
	at com.carrotsearch.randomizedtesting.rules.StatementAdapter.evaluate(StatementAdapter.java:36)
	at org.apache.lucene.util.TestRuleStoreClassName$1.evaluate(TestRuleStoreClassName.java:41)
	at com.carrotsearch.randomizedtesting.rules.NoShadowingOrOverridesOnMethodsRule$1.evaluate(NoShadowingOrOverridesOnMethodsRule.java:40)
	at com.carrotsearch.randomizedtesting.rules.NoShadowingOrOverridesOnMethodsRule$1.evaluate(NoShadowingOrOverridesOnMethodsRule.java:40)
	at com.carrotsearch.randomizedtesting.rules.StatementAdapter.evaluate(StatementAdapter.java:36)
	at com.carrotsearch.randomizedtesting.rules.StatementAdapter.evaluate(StatementAdapter.java:36)
	at org.apache.lucene.util.TestRuleAssertionsRequired$1.evaluate(TestRuleAssertionsRequired.java:53)
	at org.apache.lucene.util.TestRuleMarkFailure$1.evaluate(TestRuleMarkFailure.java:47)
	at org.apache.lucene.util.TestRuleIgnoreAfterMaxFailures$1.evaluate(TestRuleIgnoreAfterMaxFailures.java:64)
	at org.apache.lucene.util.TestRuleIgnoreTestSuites$1.evaluate(TestRuleIgnoreTestSuites.java:54)
	at com.carrotsearch.randomizedtesting.rules.StatementAdapter.evaluate(StatementAdapter.java:36)
	at com.carrotsearch.randomizedtesting.ThreadLeakControl$StatementRunner.run(ThreadLeakControl.java:368)
	at java.base/java.lang.Thread.run(Thread.java:844)




Build Log:
[...truncated 13574 lines...]
   [junit4] Suite: org.apache.solr.cloud.autoscaling.IndexSizeTriggerTest
   [junit4]   2> 651133 INFO  (SUITE-IndexSizeTriggerTest-seed#[4659082834CF5C58]-worker) [    ] o.a.s.SolrTestCaseJ4 SecureRandom sanity checks: test.solr.allowed.securerandom=null & java.security.egd=file:/dev/./urandom
   [junit4]   2> Creating dataDir: /home/jenkins/workspace/Lucene-Solr-7.x-Linux/solr/build/solr-core/test/J0/temp/solr.cloud.autoscaling.IndexSizeTriggerTest_4659082834CF5C58-001/init-core-data-001
   [junit4]   2> 651134 WARN  (SUITE-IndexSizeTriggerTest-seed#[4659082834CF5C58]-worker) [    ] o.a.s.SolrTestCaseJ4 startTrackingSearchers: numOpens=1 numCloses=1
   [junit4]   2> 651135 INFO  (SUITE-IndexSizeTriggerTest-seed#[4659082834CF5C58]-worker) [    ] o.a.s.SolrTestCaseJ4 Using TrieFields (NUMERIC_POINTS_SYSPROP=false) w/NUMERIC_DOCVALUES_SYSPROP=false
   [junit4]   2> 651135 INFO  (SUITE-IndexSizeTriggerTest-seed#[4659082834CF5C58]-worker) [    ] o.a.s.SolrTestCaseJ4 Randomized ssl (true) and clientAuth (true) via: @org.apache.solr.util.RandomizeSSL(reason="", ssl=0.0/0.0, value=0.0/0.0, clientAuth=0.0/0.0)
   [junit4]   2> 651136 INFO  (SUITE-IndexSizeTriggerTest-seed#[4659082834CF5C58]-worker) [    ] o.a.s.c.MiniSolrCloudCluster Starting cluster of 2 servers in /home/jenkins/workspace/Lucene-Solr-7.x-Linux/solr/build/solr-core/test/J0/temp/solr.cloud.autoscaling.IndexSizeTriggerTest_4659082834CF5C58-001/tempDir-001
   [junit4]   2> 651137 INFO  (SUITE-IndexSizeTriggerTest-seed#[4659082834CF5C58]-worker) [    ] o.a.s.c.ZkTestServer STARTING ZK TEST SERVER
   [junit4]   2> 651137 INFO  (Thread-2580) [    ] o.a.s.c.ZkTestServer client port:0.0.0.0/0.0.0.0:0
   [junit4]   2> 651137 INFO  (Thread-2580) [    ] o.a.s.c.ZkTestServer Starting server
   [junit4]   2> 651166 ERROR (Thread-2580) [    ] o.a.z.s.ZooKeeperServer ZKShutdownHandler is not registered, so ZooKeeper server won't take any action on ERROR or SHUTDOWN server state changes
   [junit4]   2> 651237 INFO  (SUITE-IndexSizeTriggerTest-seed#[4659082834CF5C58]-worker) [    ] o.a.s.c.ZkTestServer start zk server on port:40367
   [junit4]   2> 651238 INFO  (zkConnectionManagerCallback-2466-thread-1) [    ] o.a.s.c.c.ConnectionManager zkClient has connected
   [junit4]   2> 651243 INFO  (jetty-launcher-2463-thread-2) [    ] o.e.j.s.Server jetty-9.4.10.v20180503; built: 2018-05-03T15:56:21.710Z; git: daa59876e6f384329b122929e70a80934569428c; jvm 10+46
   [junit4]   2> 651243 INFO  (jetty-launcher-2463-thread-1) [    ] o.e.j.s.Server jetty-9.4.10.v20180503; built: 2018-05-03T15:56:21.710Z; git: daa59876e6f384329b122929e70a80934569428c; jvm 10+46
   [junit4]   2> 651243 INFO  (jetty-launcher-2463-thread-1) [    ] o.e.j.s.session DefaultSessionIdManager workerName=node0
   [junit4]   2> 651243 INFO  (jetty-launcher-2463-thread-2) [    ] o.e.j.s.session DefaultSessionIdManager workerName=node0
   [junit4]   2> 651243 INFO  (jetty-launcher-2463-thread-1) [    ] o.e.j.s.session No SessionScavenger set, using defaults
   [junit4]   2> 651243 INFO  (jetty-launcher-2463-thread-2) [    ] o.e.j.s.session No SessionScavenger set, using defaults
   [junit4]   2> 651243 INFO  (jetty-launcher-2463-thread-1) [    ] o.e.j.s.session node0 Scavenging every 600000ms
   [junit4]   2> 651243 INFO  (jetty-launcher-2463-thread-2) [    ] o.e.j.s.session node0 Scavenging every 600000ms
   [junit4]   2> 651243 INFO  (jetty-launcher-2463-thread-1) [    ] o.e.j.s.h.ContextHandler Started o.e.j.s.ServletContextHandler@28de9440{/solr,null,AVAILABLE}
   [junit4]   2> 651243 INFO  (jetty-launcher-2463-thread-2) [    ] o.e.j.s.h.ContextHandler Started o.e.j.s.ServletContextHandler@746a4b0c{/solr,null,AVAILABLE}
   [junit4]   2> 651245 INFO  (jetty-launcher-2463-thread-1) [    ] o.e.j.s.AbstractConnector Started ServerConnector@5053ec10{SSL,[ssl, http/1.1]}{127.0.0.1:38461}
   [junit4]   2> 651245 INFO  (jetty-launcher-2463-thread-2) [    ] o.e.j.s.AbstractConnector Started ServerConnector@44d1e81e{SSL,[ssl, http/1.1]}{127.0.0.1:33555}
   [junit4]   2> 651245 INFO  (jetty-launcher-2463-thread-1) [    ] o.e.j.s.Server Started @651270ms
   [junit4]   2> 651245 INFO  (jetty-launcher-2463-thread-2) [    ] o.e.j.s.Server Started @651270ms
   [junit4]   2> 651245 INFO  (jetty-launcher-2463-thread-2) [    ] o.a.s.c.s.e.JettySolrRunner Jetty properties: {hostContext=/solr, hostPort=33555}
   [junit4]   2> 651245 INFO  (jetty-launcher-2463-thread-1) [    ] o.a.s.c.s.e.JettySolrRunner Jetty properties: {hostContext=/solr, hostPort=38461}
   [junit4]   2> 651246 ERROR (jetty-launcher-2463-thread-2) [    ] o.a.s.u.StartupLoggingUtils Missing Java Option solr.log.dir. Logging may be missing or incomplete.
   [junit4]   2> 651246 ERROR (jetty-launcher-2463-thread-1) [    ] o.a.s.u.StartupLoggingUtils Missing Java Option solr.log.dir. Logging may be missing or incomplete.
   [junit4]   2> 651246 INFO  (jetty-launcher-2463-thread-2) [    ] o.a.s.s.SolrDispatchFilter Using logger factory org.apache.logging.slf4j.Log4jLoggerFactory
   [junit4]   2> 651246 INFO  (jetty-launcher-2463-thread-1) [    ] o.a.s.s.SolrDispatchFilter Using logger factory org.apache.logging.slf4j.Log4jLoggerFactory
   [junit4]   2> 651246 INFO  (jetty-launcher-2463-thread-2) [    ] o.a.s.s.SolrDispatchFilter  ___      _       Welcome to Apache Solr? version 7.4.0
   [junit4]   2> 651246 INFO  (jetty-launcher-2463-thread-1) [    ] o.a.s.s.SolrDispatchFilter  ___      _       Welcome to Apache Solr? version 7.4.0
   [junit4]   2> 651246 INFO  (jetty-launcher-2463-thread-2) [    ] o.a.s.s.SolrDispatchFilter / __| ___| |_ _   Starting in cloud mode on port null
   [junit4]   2> 651246 INFO  (jetty-launcher-2463-thread-1) [    ] o.a.s.s.SolrDispatchFilter / __| ___| |_ _   Starting in cloud mode on port null
   [junit4]   2> 651246 INFO  (jetty-launcher-2463-thread-2) [    ] o.a.s.s.SolrDispatchFilter \__ \/ _ \ | '_|  Install dir: null
   [junit4]   2> 651246 INFO  (jetty-launcher-2463-thread-1) [    ] o.a.s.s.SolrDispatchFilter \__ \/ _ \ | '_|  Install dir: null
   [junit4]   2> 651246 INFO  (jetty-launcher-2463-thread-2) [    ] o.a.s.s.SolrDispatchFilter |___/\___/_|_|    Start time: 2018-05-24T07:30:35.348246Z
   [junit4]   2> 651246 INFO  (jetty-launcher-2463-thread-1) [    ] o.a.s.s.SolrDispatchFilter |___/\___/_|_|    Start time: 2018-05-24T07:30:35.348255Z
   [junit4]   2> 651254 INFO  (zkConnectionManagerCallback-2470-thread-1) [    ] o.a.s.c.c.ConnectionManager zkClient has connected
   [junit4]   2> 651254 INFO  (zkConnectionManagerCallback-2469-thread-1) [    ] o.a.s.c.c.ConnectionManager zkClient has connected
   [junit4]   2> 651254 INFO  (jetty-launcher-2463-thread-1) [    ] o.a.s.s.SolrDispatchFilter solr.xml found in ZooKeeper. Loading...
   [junit4]   2> 651254 INFO  (jetty-launcher-2463-thread-2) [    ] o.a.s.s.SolrDispatchFilter solr.xml found in ZooKeeper. Loading...
   [junit4]   2> 651275 INFO  (jetty-launcher-2463-thread-1) [    ] o.a.s.c.ZkContainer Zookeeper client=127.0.0.1:40367/solr
   [junit4]   2> 651278 INFO  (jetty-launcher-2463-thread-2) [    ] o.a.s.c.ZkContainer Zookeeper client=127.0.0.1:40367/solr
   [junit4]   2> 651281 INFO  (zkConnectionManagerCallback-2475-thread-1) [    ] o.a.s.c.c.ConnectionManager zkClient has connected
   [junit4]   2> 651308 INFO  (zkConnectionManagerCallback-2478-thread-1) [    ] o.a.s.c.c.ConnectionManager zkClient has connected
   [junit4]   2> 651308 INFO  (zkConnectionManagerCallback-2480-thread-1) [    ] o.a.s.c.c.ConnectionManager zkClient has connected
   [junit4]   2> 651323 INFO  (zkConnectionManagerCallback-2482-thread-1) [    ] o.a.s.c.c.ConnectionManager zkClient has connected
   [junit4]   2> 651327 INFO  (jetty-launcher-2463-thread-2) [n:127.0.0.1:33555_solr    ] o.a.s.c.Overseer Overseer (id=null) closing
   [junit4]   2> 651328 INFO  (jetty-launcher-2463-thread-2) [n:127.0.0.1:33555_solr    ] o.a.s.c.OverseerElectionContext I am going to be the leader 127.0.0.1:33555_solr
   [junit4]   2> 651328 INFO  (jetty-launcher-2463-thread-2) [n:127.0.0.1:33555_solr    ] o.a.s.c.Overseer Overseer (id=72079099475001350-127.0.0.1:33555_solr-n_0000000000) starting
   [junit4]   2> 651362 INFO  (jetty-launcher-2463-thread-1) [n:127.0.0.1:38461_solr    ] o.a.s.c.Overseer Overseer (id=null) closing
   [junit4]   2> 651364 INFO  (zkConnectionManagerCallback-2491-thread-1) [    ] o.a.s.c.c.ConnectionManager zkClient has connected
   [junit4]   2> 651366 INFO  (jetty-launcher-2463-thread-1) [n:127.0.0.1:38461_solr    ] o.a.s.c.ZkController Register node as live in ZooKeeper:/live_nodes/127.0.0.1:38461_solr
   [junit4]   2> 651366 INFO  (jetty-launcher-2463-thread-2) [n:127.0.0.1:33555_solr    ] o.a.s.c.s.i.ZkClientClusterStateProvider Cluster at 127.0.0.1:40367/solr ready
   [junit4]   2> 651366 INFO  (zkCallback-2490-thread-1) [    ] o.a.s.c.c.ZkStateReader Updated live nodes from ZooKeeper... (0) -> (1)
   [junit4]   2> 651370 INFO  (OverseerStateUpdate-72079099475001350-127.0.0.1:33555_solr-n_0000000000) [    ] o.a.s.c.c.ZkStateReader Updated live nodes from ZooKeeper... (0) -> (1)
   [junit4]   2> 651378 INFO  (zkCallback-2479-thread-1) [    ] o.a.s.c.c.ZkStateReader Updated live nodes from ZooKeeper... (0) -> (1)
   [junit4]   2> 651382 DEBUG (OverseerAutoScalingTriggerThread-72079099475001350-127.0.0.1:33555_solr-n_0000000000) [    ] o.a.s.c.a.OverseerTriggerThread Adding .auto_add_replicas and .scheduled_maintenance triggers
   [junit4]   2> 651382 INFO  (jetty-launcher-2463-thread-2) [n:127.0.0.1:33555_solr    ] o.a.s.c.TransientSolrCoreCacheDefault Allocating transient cache for 2147483647 transient cores
   [junit4]   2> 651382 DEBUG (OverseerAutoScalingTriggerThread-72079099475001350-127.0.0.1:33555_solr-n_0000000000) [    ] o.a.s.c.a.OverseerTriggerThread Refreshing /autoscaling.json with znode version 1
   [junit4]   2> 651382 INFO  (jetty-launcher-2463-thread-2) [n:127.0.0.1:33555_solr    ] o.a.s.c.ZkController Register node as live in ZooKeeper:/live_nodes/127.0.0.1:33555_solr
   [junit4]   2> 651382 DEBUG (OverseerAutoScalingTriggerThread-72079099475001350-127.0.0.1:33555_solr-n_0000000000) [    ] o.a.s.c.a.OverseerTriggerThread Current znodeVersion 1, lastZnodeVersion -1
   [junit4]   2> 651382 DEBUG (OverseerAutoScalingTriggerThread-72079099475001350-127.0.0.1:33555_solr-n_0000000000) [    ] o.a.s.c.a.OverseerTriggerThread Processed trigger updates upto znodeVersion 1
   [junit4]   2> 651383 INFO  (zkCallback-2490-thread-1) [    ] o.a.s.c.c.ZkStateReader Updated live nodes from ZooKeeper... (1) -> (2)
   [junit4]   2> 651383 INFO  (zkCallback-2479-thread-1) [    ] o.a.s.c.c.ZkStateReader Updated live nodes from ZooKeeper... (1) -> (2)
   [junit4]   2> 651383 INFO  (zkCallback-2481-thread-1) [    ] o.a.s.c.c.ZkStateReader Updated live nodes from ZooKeeper... (1) -> (2)
   [junit4]   2> 651384 DEBUG (OverseerAutoScalingTriggerThread-72079099475001350-127.0.0.1:33555_solr-n_0000000000) [    ] o.a.s.c.a.NodeLostTrigger NodeLostTrigger .auto_add_replicas - Initial livenodes: [127.0.0.1:38461_solr, 127.0.0.1:33555_solr]
   [junit4]   2> 651385 DEBUG (ScheduledTrigger-3338-thread-1) [    ] o.a.s.c.a.NodeLostTrigger Running NodeLostTrigger: .auto_add_replicas with currently live nodes: 2
   [junit4]   2> 651393 DEBUG (OverseerAutoScalingTriggerThread-72079099475001350-127.0.0.1:33555_solr-n_0000000000) [    ] o.a.s.c.a.OverseerTriggerThread -- clean old nodeAdded markers
   [junit4]   2> 651394 DEBUG (OverseerAutoScalingTriggerThread-72079099475001350-127.0.0.1:33555_solr-n_0000000000) [    ] o.a.s.c.a.OverseerTriggerThread Current znodeVersion 1, lastZnodeVersion 1
   [junit4]   2> 651491 INFO  (jetty-launcher-2463-thread-2) [n:127.0.0.1:33555_solr    ] o.a.s.m.r.SolrJmxReporter JMX monitoring for 'solr_33555.solr.node' (registry 'solr.node') enabled at server: com.sun.jmx.mbeanserver.JmxMBeanServer@353835fa
   [junit4]   2> 651498 INFO  (jetty-launcher-2463-thread-2) [n:127.0.0.1:33555_solr    ] o.a.s.m.r.SolrJmxReporter JMX monitoring for 'solr_33555.solr.jvm' (registry 'solr.jvm') enabled at server: com.sun.jmx.mbeanserver.JmxMBeanServer@353835fa
   [junit4]   2> 651498 INFO  (jetty-launcher-2463-thread-2) [n:127.0.0.1:33555_solr    ] o.a.s.m.r.SolrJmxReporter JMX monitoring for 'solr_33555.solr.jetty' (registry 'solr.jetty') enabled at server: com.sun.jmx.mbeanserver.JmxMBeanServer@353835fa
   [junit4]   2> 651499 INFO  (jetty-launcher-2463-thread-2) [n:127.0.0.1:33555_solr    ] o.a.s.c.CorePropertiesLocator Found 0 core definitions underneath /home/jenkins/workspace/Lucene-Solr-7.x-Linux/solr/build/solr-core/test/J0/temp/solr.cloud.autoscaling.IndexSizeTriggerTest_4659082834CF5C58-001/tempDir-001/node2/.
   [junit4]   2> 651585 INFO  (jetty-launcher-2463-thread-1) [n:127.0.0.1:38461_solr    ] o.a.s.m.r.SolrJmxReporter JMX monitoring for 'solr_38461.solr.node' (registry 'solr.node') enabled at server: com.sun.jmx.mbeanserver.JmxMBeanServer@353835fa
   [junit4]   2> 651594 INFO  (jetty-launcher-2463-thread-1) [n:127.0.0.1:38461_solr    ] o.a.s.m.r.SolrJmxReporter JMX monitoring for 'solr_38461.solr.jvm' (registry 'solr.jvm') enabled at server: com.sun.jmx.mbeanserver.JmxMBeanServer@353835fa
   [junit4]   2> 651594 INFO  (jetty-launcher-2463-thread-1) [n:127.0.0.1:38461_solr    ] o.a.s.m.r.SolrJmxReporter JMX monitoring for 'solr_38461.solr.jetty' (registry 'solr.jetty') enabled at server: com.sun.jmx.mbeanserver.JmxMBeanServer@353835fa
   [junit4]   2> 651595 INFO  (jetty-launcher-2463-thread-1) [n:127.0.0.1:38461_solr    ] o.a.s.c.CorePropertiesLocator Found 0 core definitions underneath /home/jenkins/workspace/Lucene-Solr-7.x-Linux/solr/build/solr-core/test/J0/temp/solr.cloud.autoscaling.IndexSizeTriggerTest_4659082834CF5C58-001/tempDir-001/node1/.
   [junit4]   2> 651607 INFO  (zkConnectionManagerCallback-2496-thread-1) [    ] o.a.s.c.c.ConnectionManager zkClient has connected
   [junit4]   2> 651607 INFO  (jetty-launcher-2463-thread-1) [n:127.0.0.1:38461_solr    ] o.a.s.c.c.ZkStateReader Updated live nodes from ZooKeeper... (0) -> (2)
   [junit4]   2> 651608 INFO  (jetty-launcher-2463-thread-1) [n:127.0.0.1:38461_solr    ] o.a.s.c.s.i.ZkClientClusterStateProvider Cluster at 127.0.0.1:40367/solr ready
   [junit4]   2> 651633 INFO  (zkConnectionManagerCallback-2498-thread-1) [    ] o.a.s.c.c.ConnectionManager zkClient has connected
   [junit4]   2> 651641 INFO  (zkConnectionManagerCallback-2503-thread-1) [    ] o.a.s.c.c.ConnectionManager zkClient has connected
   [junit4]   2> 651642 INFO  (SUITE-IndexSizeTriggerTest-seed#[4659082834CF5C58]-worker) [    ] o.a.s.c.c.ZkStateReader Updated live nodes from ZooKeeper... (0) -> (2)
   [junit4]   2> 651643 INFO  (SUITE-IndexSizeTriggerTest-seed#[4659082834CF5C58]-worker) [    ] o.a.s.c.s.i.ZkClientClusterStateProvider Cluster at 127.0.0.1:40367/solr ready
   [junit4]   2> 651658 DEBUG (Simulated OverseerAutoScalingTriggerThread) [    ] o.a.s.c.a.OverseerTriggerThread Adding .auto_add_replicas and .scheduled_maintenance triggers
   [junit4]   2> 651658 DEBUG (Simulated OverseerAutoScalingTriggerThread) [    ] o.a.s.c.a.OverseerTriggerThread Refreshing /autoscaling.json with znode version 0
   [junit4]   2> 651658 DEBUG (Simulated OverseerAutoScalingTriggerThread) [    ] o.a.s.c.a.OverseerTriggerThread Current znodeVersion 0, lastZnodeVersion -1
   [junit4]   2> 651658 DEBUG (Simulated OverseerAutoScalingTriggerThread) [    ] o.a.s.c.a.OverseerTriggerThread Processed trigger updates upto znodeVersion 0
   [junit4]   2> 651661 DEBUG (Simulated OverseerAutoScalingTriggerThread) [    ] o.a.s.c.a.NodeLostTrigger NodeLostTrigger .auto_add_replicas - Initial livenodes: [127.0.0.1:10001_solr, 127.0.0.1:10000_solr]
   [junit4]   2> 651663 DEBUG (Simulated OverseerAutoScalingTriggerThread) [    ] o.a.s.c.a.OverseerTriggerThread -- clean old nodeAdded markers
   [junit4]   2> 651663 DEBUG (Simulated OverseerAutoScalingTriggerThread) [    ] o.a.s.c.a.OverseerTriggerThread Current znodeVersion 0, lastZnodeVersion 0
   [junit4]   2> 651663 DEBUG (ScheduledTrigger-3347-thread-2) [    ] o.a.s.c.a.NodeLostTrigger Running NodeLostTrigger: .auto_add_replicas with currently live nodes: 2
   [junit4]   2> 651688 DEBUG (ScheduledTrigger-3347-thread-3) [    ] o.a.s.c.a.NodeLostTrigger Running NodeLostTrigger: .auto_add_replicas with currently live nodes: 2
   [junit4]   2> 651709 DEBUG (ScheduledTrigger-3347-thread-4) [    ] o.a.s.c.a.NodeLostTrigger Running NodeLostTrigger: .auto_add_replicas with currently live nodes: 2
   [junit4]   2> 651729 DEBUG (ScheduledTrigger-3347-thread-3) [    ] o.a.s.c.a.NodeLostTrigger Running NodeLostTrigger: .auto_add_replicas with currently live nodes: 2
   [junit4]   2> 651749 DEBUG (ScheduledTrigger-3347-thread-4) [    ] o.a.s.c.a.NodeLostTrigger Running NodeLostTrigger: .auto_add_replicas with currently live nodes: 2
   [junit4]   2> 651769 DEBUG (ScheduledTrigger-3347-thread-1) [    ] o.a.s.c.a.NodeLostTrigger Running NodeLostTrigger: .auto_add_replicas with currently live nodes: 2
   [junit4]   2> 651790 DEBUG (ScheduledTrigger-3347-thread-4) [    ] o.a.s.c.a.NodeLostTrigger Running NodeLostTrigger: .auto_add_replicas with currently live nodes: 2
   [junit4]   2> 651810 DEBUG (ScheduledTrigger-3347-thread-3) [    ] o.a.s.c.a.NodeLostTrigger Running NodeLostTrigger: .auto_add_replicas with currently live nodes: 2
   [junit4]   2> 651830 DEBUG (ScheduledTrigger-3347-thread-3) [    ] o.a.s.c.a.NodeLostTrigger Running NodeLostTrigger: .auto_add_replicas with currently live nodes: 2
   [junit4]   2> 651850 DEBUG (ScheduledTrigger-3347-thread-1) [    ] o.a.s.c.a.NodeLostTrigger Running NodeLostTrigger: .auto_add_replicas with currently live nodes: 2
   [junit4]   2> 651869 INFO  (TEST-IndexSizeTriggerTest.testTrigger-seed#[4659082834CF5C58]) [    ] o.a.s.SolrTestCaseJ4 ###Starting testTrigger
   [junit4]   2> 651870 DEBUG (ScheduledTrigger-3347-thread-2) [    ] o.a.s.c.a.NodeLostTrigger Running NodeLostTrigger: .auto_add_replicas with currently live nodes: 2
   [junit4]   2> 651890 DEBUG (ScheduledTrigger-3347-thread-3) [    ] o.a.s.c.a.NodeLostTrigger Running NodeLostTrigger: .auto_add_replicas with currently live nodes: 2
   [junit4]   2> 651913 DEBUG (ScheduledTrigger-3347-thread-3) [    ] o.a.s.c.a.NodeLostTrigger Running NodeLostTrigger: .auto_add_replicas with currently live nodes: 2
   [junit4]   2> 651934 DEBUG (ScheduledTrigger-3347-thread-4) [    ] o.a.s.c.a.NodeLostTrigger Running NodeLostTrigger: .auto_add_replicas with currently live nodes: 2
   [junit4]   2> 651947 DEBUG (simCloudManagerPool-3346-thread-6) [    ] o.a.s.c.a.s.SimClusterStateProvider -- elected new leader for testTrigger_collection / shard2: {"core_node3":{
   [junit4]   2>     "core":"testTrigger_collection_shard2_replica_n3",
   [junit4]   2>     "leader":"true",
   [junit4]   2>     "SEARCHER.searcher.maxDoc":0,
   [junit4]   2>     "SEARCHER.searcher.deletedDocs":0,
   [junit4]   2>     "INDEX.sizeInBytes":1,
   [junit4]   2>     "node_name":"127.0.0.1:10001_solr",
   [junit4]   2>     "state":"active",
   [junit4]   2>     "type":"NRT",
   [junit4]   2>     "SEARCHER.searcher.numDocs":0,
   [junit4]   2>     "shard":"shard2",
   [junit4]   2>     "collection":"testTrigger_collection"}}
   [junit4]   2> 651947 DEBUG (simCloudManagerPool-3346-thread-7) [    ] o.a.s.c.a.s.SimClusterStateProvider -- elected new leader for testTrigger_collection / shard1: {"core_node1":{
   [junit4]   2>     "core":"testTrigger_collection_shard1_replica_n1",
   [junit4]   2>     "leader":"true",
   [junit4]   2>     "SEARCHER.searcher.maxDoc":0,
   [junit4]   2>     "SEARCHER.searcher.deletedDocs":0,
   [junit4]   2>     "INDEX.sizeInBytes":1,
   [junit4]   2>     "node_name":"127.0.0.1:10001_solr",
   [junit4]   2>     "state":"active",
   [junit4]   2>     "type":"NRT",
   [junit4]   2>     "SEARCHER.searcher.numDocs":0,
   [junit4]   2>     "shard":"shard1",
   [junit4]   2>     "collection":"testTrigger_collection"}}
   [junit4]   2> 651954 DEBUG (ScheduledTrigger-3347-thread-1) [    ] o.a.s.c.a.NodeLostTrigger Running NodeLostTrigger: .auto_add_replicas with currently live nodes: 2
   [junit4]   2> 651974 DEBUG (ScheduledTrigger-3347-thread-1) [    ] o.a.s.c.a.NodeLostTrigger Running NodeLostTrigger: .auto_add_replicas with currently live nodes: 2
   [junit4]   2> 651994 DEBUG (ScheduledTrigger-3347-thread-3) [    ] o.a.s.c.a.NodeLostTrigger Running NodeLostTrigger: .auto_add_replicas with currently live nodes: 2
   [junit4]   2> 652014 DEBUG (ScheduledTrigger-3347-thread-3) [    ] o.a.s.c.a.NodeLostTrigger Running NodeLostTrigger: .auto_add_replicas with currently live nodes: 2
   [junit4]   2> 652035 DEBUG (ScheduledTrigger-3347-thread-3) [    ] o.a.s.c.a.NodeLostTrigger Running NodeLostTrigger: .auto_add_replicas with currently live nodes: 2
   [junit4]   2> 652055 DEBUG (ScheduledTrigger-3347-thread-1) [    ] o.a.s.c.a.NodeLostTrigger Running NodeLostTrigger: .auto_add_replicas with currently live nodes: 2
   [junit4]   2> 652075 DEBUG (ScheduledTrigger-3347-thread-2) [    ] o.a.s.c.a.NodeLostTrigger Running NodeLostTrigger: .auto_add_replicas with currently live nodes: 2
   [junit4]   2> 652095 DEBUG (ScheduledTrigger-3347-thread-1) [    ] o.a.s.c.a.NodeLostTrigger Running NodeLostTrigger: .auto_add_replicas with currently live nodes: 2
   [junit4]   2> 652115 DEBUG (ScheduledTrigger-3347-thread-2) [    ] o.a.s.c.a.NodeLostTrigger Running NodeLostTrigger: .auto_add_replicas with currently live nodes: 2
   [junit4]   2> 652136 DEBUG (ScheduledTrigger-3347-thread-3) [    ] o.a.s.c.a.NodeLostTrigger Running NodeLostTrigger: .auto_add_replicas with currently live nodes: 2
   [junit4]   2> 652152 INFO  (TEST-IndexSizeTriggerTest.testTrigger-seed#[4659082834CF5C58]) [    ] o.a.s.c.a.IndexSizeTriggerTest #######################################
   [junit4]   2> ############ CLUSTER STATE ############
   [junit4]   2> #######################################
   [junit4]   2> ## Live nodes:		2
   [junit4]   2> ## Empty nodes:	0
   [junit4]   2> ## Dead nodes:		0
   [junit4]   2> ## Collections:	[testTrigger_collection]
   [junit4]   2> DocCollection(testTrigger_collection//clusterstate.json/28)={
   [junit4]   2>   "replicationFactor":"2",
   [junit4]   2>   "pullReplicas":"0",
   [junit4]   2>   "router":{"name":"compositeId"},
   [junit4]   2>   "maxShardsPerNode":"2",
   [junit4]   2>   "autoAddReplicas":"false",
   [junit4]   2>   "nrtReplicas":"2",
   [junit4]   2>   "tlogReplicas":"0",
   [junit4]   2>   "autoCreated":"true",
   [junit4]   2>   "shards":{
   [junit4]   2>     "shard2":{
   [junit4]   2>       "replicas":{
   [junit4]   2>         "core_node3":{
   [junit4]   2>           "core":"testTrigger_collection_shard2_replica_n3",
   [junit4]   2>           "leader":"true",
   [junit4]   2>           "SEARCHER.searcher.maxDoc":11,
   [junit4]   2>           "SEARCHER.searcher.deletedDocs":0,
   [junit4]   2>           "INDEX.sizeInBytes":1,
   [junit4]   2>           "node_name":"127.0.0.1:10001_solr",
   [junit4]   2>           "state":"active",
   [junit4]   2>           "type":"NRT",
   [junit4]   2>           "SEARCHER.searcher.numDocs":11},
   [junit4]   2>         "core_node4":{
   [junit4]   2>           "core":"testTrigger_collection_shard2_replica_n4",
   [junit4]   2>           "SEARCHER.searcher.maxDoc":11,
   [junit4]   2>           "SEARCHER.searcher.deletedDocs":0,
   [junit4]   2>           "INDEX.sizeInBytes":1,
   [junit4]   2>           "node_name":"127.0.0.1:10000_solr",
   [junit4]   2>           "state":"active",
   [junit4]   2>           "type":"NRT",
   [junit4]   2>           "SEARCHER.searcher.numDocs":11}},
   [junit4]   2>       "range":"0-7fffffff",
   [junit4]   2>       "state":"active"},
   [junit4]   2>     "shard1":{
   [junit4]   2>       "replicas":{
   [junit4]   2>         "core_node1":{
   [junit4]   2>           "core":"testTrigger_collection_shard1_replica_n1",
   [junit4]   2>           "leader":"true",
   [junit4]   2>           "SEARCHER.searcher.maxDoc":14,
   [junit4]   2>           "SEARCHER.searcher.deletedDocs":0,
   [junit4]   2>           "INDEX.sizeInBytes":1,
   [junit4]   2>           "node_name":"127.0.0.1:10001_solr",
   [junit4]   2>           "state":"active",
   [junit4]   2>           "type":"NRT",
   [junit4]   2>           "SEARCHER.searcher.numDocs":14},
   [junit4]   2>         "core_node2":{
   [junit4]   2>           "core":"testTrigger_collection_shard1_replica_n2",
   [junit4]   2>           "SEARCHER.searcher.maxDoc":14,
   [junit4]   2>           "SEARCHER.searcher.deletedDocs":0,
   [junit4]   2>           "INDEX.sizeInBytes":1,
   [junit4]   2>           "node_name":"127.0.0.1:10000_solr",
   [junit4]   2>           "state":"active",
   [junit4]   2>           "type":"NRT",
   [junit4]   2>           "SEARCHER.searcher.numDocs":14}},
   [junit4]   2>       "range":"80000000-ffffffff",
   [junit4]   2>       "state":"active"}}}
   [junit4]   2> ## Max replicas per node:	2
   [junit4]   2> ## Min replicas per node:	2
   [junit4]   2> ## Total replicas:		4
   [junit4]   2> ## * testTrigger_collection		4
   [junit4]   2> ##		- active           4
   [junit4]   2> ######### Solr op counts ##########
   [junit4]   2> ##		- CREATE             1
   [junit4]   2> ##		- update            26
   [junit4]   2> ######### Autoscaling event counts ###########
   [junit4]   2> 
   [junit4]   2> 652152 DEBUG (TEST-IndexSizeTriggerTest.testTrigger-seed#[4659082834CF5C58]) [    ] o.a.s.c.a.OverseerTriggerThread Refreshing /autoscaling.json with znode version 1
   [junit4]   2> 652152 DEBUG (Simulated OverseerAutoScalingTriggerThread) [    ] o.a.s.c.a.OverseerTriggerThread Processed trigger updates upto znodeVersion 1
   [junit4]   2> 652152 DEBUG (Simulated OverseerAutoScalingTriggerThread) [    ] o.a.s.c.a.OverseerTriggerThread -- clean old nodeLost markers
   [junit4]   2> 652152 DEBUG (Simulated OverseerAutoScalingTriggerThread) [    ] o.a.s.c.a.OverseerTriggerThread -- clean old nodeAdded markers
   [junit4]   2> 652152 DEBUG (Simulated OverseerAutoScalingTriggerThread) [    ] o.a.s.c.a.OverseerTriggerThread Current znodeVersion 1, lastZnodeVersion 1
   [junit4]   2> 652253 INFO  (TEST-IndexSizeTriggerTest.testTrigger-seed#[4659082834CF5C58]) [    ] o.a.s.SolrTestCaseJ4 ###Ending testTrigger
   [junit4]   2> NOTE: reproduce with: ant test  -Dtestcase=IndexSizeTriggerTest -Dtests.method=testTrigger -Dtests.seed=4659082834CF5C58 -Dtests.multiplier=3 -Dtests.slow=true -Dtests.locale=kn-IN -Dtests.timezone=Europe/Simferopol -Dtests.asserts=true -Dtests.file.encoding=ISO-8859-1
   [junit4] FAILURE 0.40s J0 | IndexSizeTriggerTest.testTrigger <<<
   [junit4]    > Throwable #1: java.lang.AssertionError: waitFor not elapsed but produced an event
   [junit4]    > 	at __randomizedtesting.SeedInfo.seed([4659082834CF5C58:25923EAAAD002F75]:0)
   [junit4]    > 	at org.apache.solr.cloud.autoscaling.IndexSizeTriggerTest.testTrigger(IndexSizeTriggerTest.java:180)
   [junit4]    > 	at java.base/jdk.internal.reflect.NativeMethodAccessorImpl.invoke0(Native Method)
   [junit4]    > 	at java.base/jdk.internal.reflect.NativeMethodAccessorImpl.invoke(NativeMethodAccessorImpl.java:62)
   [junit4]    > 	at java.base/jdk.internal.reflect.DelegatingMethodAccessorImpl.invoke(DelegatingMethodAccessorImpl.java:43)
   [junit4]    > 	at java.base/java.lang.reflect.Method.invoke(Method.java:564)
   [junit4]    > 	at java.base/java.lang.Thread.run(Thread.java:844)
   [junit4]   2> 652265 INFO  (TEST-IndexSizeTriggerTest.testMixedBounds-seed#[4659082834CF5C58]) [    ] o.a.s.SolrTestCaseJ4 ###Starting testMixedBounds
   [junit4]   2> 652265 WARN  (TEST-IndexSizeTriggerTest.testMixedBounds-seed#[4659082834CF5C58]) [    ] o.a.s.c.a.IndexSizeTriggerTest Requires SOLR-12208
   [junit4]   2> 652265 INFO  (TEST-IndexSizeTriggerTest.testMixedBounds-seed#[4659082834CF5C58]) [    ] o.a.s.c.a.IndexSizeTriggerTest #######################################
   [junit4]   2> ############ CLUSTER STATE ############
   [junit4]   2> #######################################
   [junit4]   2> ## Live nodes:		2
   [junit4]   2> ## Empty nodes:	2
   [junit4]   2> ## Dead nodes:		0
   [junit4]   2> ## Collections:	[]
   [junit4]   2> ## Max replicas per node:	0
   [junit4]   2> ## Min replicas per node:	0
   [junit4]   2> ## Total replicas:		0
   [junit4]   2> ######### Solr op counts ##########
   [junit4]   2> ######### Autoscaling event counts ###########
   [junit4]   2> 
   [junit4]   2> 652265 DEBUG (TEST-IndexSizeTriggerTest.testMixedBounds-seed#[4659082834CF5C58]) [    ] o.a.s.c.a.OverseerTriggerThread Refreshing /autoscaling.json with znode version 2
   [junit4]   2> 652265 DEBUG (Simulated OverseerAutoScalingTriggerThread) [    ] o.a.s.c.a.OverseerTriggerThread Processed trigger updates upto znodeVersion 2
   [junit4]   2> 652265 DEBUG (Simulated OverseerAutoScalingTriggerThread) [    ] o.a.s.c.a.OverseerTriggerThread -- clean old nodeLost markers
   [junit4]   2> 652265 DEBUG (Simulated OverseerAutoScalingTriggerThread) [    ] o.a.s.c.a.OverseerTriggerThread -- clean old nodeAdded markers
   [junit4]   2> 652265 DEBUG (Simulated OverseerAutoScalingTriggerThread) [    ] o.a.s.c.a.OverseerTriggerThread Current znodeVersion 2, lastZnodeVersion 2
   [junit4]   2> 652366 INFO  (TEST-IndexSizeTriggerTest.testMixedBounds-seed#[4659082834CF5C58]) [    ] o.a.s.SolrTestCaseJ4 ###Ending testMixedBounds
   [junit4]   2> 652386 INFO  (TEST-IndexSizeTriggerTest.testSplitIntegration-seed#[4659082834CF5C58]) [    ] o.a.s.SolrTestCaseJ4 ###Starting testSplitIntegration
   [junit4]   2> 652391 DEBUG (ScheduledTrigger-3338-thread-3) [    ] o.a.s.c.a.NodeLostTrigger Running NodeLostTrigger: .auto_add_replicas with currently live nodes: 2
   [junit4]   2> 652482 DEBUG (simCloudManagerPool-3346-thread-40) [    ] o.a.s.c.a.s.SimClusterStateProvider -- elected new leader for testSplitIntegration_collection / shard1: {"core_node1":{
   [junit4]   2>     "core":"testSplitIntegration_collection_shard1_replica_n1",
   [junit4]   2>     "leader":"true",
   [junit4]   2>     "SEARCHER.searcher.maxDoc":0,
   [junit4]   2>     "SEARCHER.searcher.deletedDocs":0,
   [junit4]   2>     "INDEX.sizeInBytes":1,
   [junit4]   2>     "node_name":"127.0.0.1:10001_solr",
   [junit4]   2>     "state":"active",
   [junit4]   2>     "type":"NRT",
   [junit4]   2>     "SEARCHER.searcher.numDocs":0,
   [junit4]   2>     "shard":"shard1",
   [junit4]   2>     "collection":"testSplitIntegration_collection"}}
   [junit4]   2> 652482 DEBUG (simCloudManagerPool-3346-thread-39) [    ] o.a.s.c.a.s.SimClusterStateProvider -- elected new leader for testSplitIntegration_collection / shard2: {"core_node3":{
   [junit4]   2>     "core":"testSplitIntegration_collection_shard2_replica_n3",
   [junit4]   2>     "leader":"true",
   [junit4]   2>     "SEARCHER.searcher.maxDoc":0,
   [junit4]   2>     "SEARCHER.searcher.deletedDocs":0,
   [junit4]   2>     "INDEX.sizeInBytes":1,
   [junit4]   2>     "node_name":"127.0.0.1:10001_solr",
   [junit4]   2>     "state":"active",
   [junit4]   2>     "type":"NRT",
   [junit4]   2>     "SEARCHER.searcher.numDocs":0,
   [junit4]   2>     "shard":"shard2",
   [junit4]   2>     "collection":"testSplitIntegration_collection"}}
   [junit4]   2> 652511 DEBUG (simCloudManagerPool-3346-thread-41) [    ] o.a.s.c.a.AutoScalingHandler Verified autoscaling configuration
   [junit4]   2> 652511 DEBUG (simCloudManagerPool-3346-thread-41) [    ] o.a.s.c.a.OverseerTriggerThread Refreshing /autoscaling.json with znode version 3
   [junit4]   2> 652511 DEBUG (Simulated OverseerAutoScalingTriggerThread) [    ] o.a.s.c.a.OverseerTriggerThread Processed trigger updates upto znodeVersion 3
   [junit4]   2> 652512 DEBUG (Simulated OverseerAutoScalingTriggerThread) [    ] o.a.s.c.a.OverseerTriggerThread -- clean old nodeLost markers
   [junit4]   2> 652512 DEBUG (Simulated OverseerAutoScalingTriggerThread) [    ] o.a.s.c.a.OverseerTriggerThread -- clean old nodeAdded markers
   [junit4]   2> 652512 DEBUG (Simulated OverseerAutoScalingTriggerThread) [    ] o.a.s.c.a.OverseerTriggerThread Current znodeVersion 3, lastZnodeVersion 3
   [junit4]   2> 652513 DEBUG (simCloudManagerPool-3346-thread-42) [    ] o.a.s.c.a.AutoScalingHandler Verified autoscaling configuration
   [junit4]   2> 652513 DEBUG (simCloudManagerPool-3346-thread-42) [    ] o.a.s.c.a.OverseerTriggerThread Refreshing /autoscaling.json with znode version 4
   [junit4]   2> 652513 DEBUG (Simulated OverseerAutoScalingTriggerThread) [    ] o.a.s.c.a.OverseerTriggerThread Processed trigger updates upto znodeVersion 4
   [junit4]   2> 652513 DEBUG (Simulated OverseerAutoScalingTriggerThread) [    ] o.a.s.c.a.OverseerTriggerThread -- clean old nodeLost markers
   [junit4]   2> 652513 DEBUG (Simulated OverseerAutoScalingTriggerThread) [    ] o.a.s.c.a.OverseerTriggerThread -- clean old nodeAdded markers
   [junit4]   2> 652513 DEBUG (Simulated OverseerAutoScalingTriggerThread) [    ] o.a.s.c.a.OverseerTriggerThread Current znodeVersion 4, lastZnodeVersion 4
   [junit4]   2> 652518 DEBUG (simCloudManagerPool-3346-thread-43) [    ] o.a.s.c.a.AutoScalingHandler Verified autoscaling configuration
   [junit4]   2> 652518 DEBUG (simCloudManagerPool-3346-thread-43) [    ] o.a.s.c.a.OverseerTriggerThread Refreshing /autoscaling.json with znode version 5
   [junit4]   2> 652518 DEBUG (Simulated OverseerAutoScalingTriggerThread) [    ] o.a.s.c.a.OverseerTriggerThread Processed trigger updates upto znodeVersion 5
   [junit4]   2> 652519 DEBUG (Simulated OverseerAutoScalingTriggerThread) [    ] o.a.s.c.a.OverseerTriggerThread -- clean old nodeLost markers
   [junit4]   2> 652519 DEBUG (Simulated OverseerAutoScalingTriggerThread) [    ] o.a.s.c.a.OverseerTriggerThread -- clean old nodeAdded markers
   [junit4]   2> 652519 DEBUG (Simulated OverseerAutoScalingTriggerThread) [    ] o.a.s.c.a.OverseerTriggerThread Current znodeVersion 5, lastZnodeVersion 5
   [junit4]   2> 652666 DEBUG (ScheduledTrigger-3347-thread-2) [    ] o.a.s.c.a.ScheduledTriggers ++++++++ Cooldown inactive - processing event: {
   [junit4]   2>   "id":"12a7cdeff57e6Tav6u9tb5hgg0a78auxlmbm0tj",
   [junit4]   2>   "source":"index_size_trigger",
   [junit4]   2>   "eventTime":328190782298086,
   [junit4]   2>   "eventType":"INDEXSIZE",
   [junit4]   2>   "properties":{
   [junit4]   2>     "aboveSize":{"testSplitIntegration_collection":["{\"core_node1\":{\n    \"core\":\"testSplitIntegration_collection_shard1_replica_n1\",\n    \"leader\":\"true\",\n    \"SEARCHER.searcher.maxDoc\":11,\n    \"SEARCHER.searcher.deletedDocs\":0,\n    \"INDEX.sizeInBytes\":1,\n    \"__docs__\":11,\n    \"violationType\":\"aboveDocs\",\n    \"node_name\":\"127.0.0.1:10001_solr\",\n    \"state\":\"active\",\n    \"type\":\"NRT\",\n    \"SEARCHER.searcher.numDocs\":11,\n    \"__bytes__\":1,\n    \"shard\":\"shard1\",\n    \"collection\":\"testSplitIntegration_collection\"}}"]},
   [junit4]   2>     "belowSize":{},
   [junit4]   2>     "requestedOps":["Op{action=SPLITSHARD, hints={COLL_SHARD=[{\n  \"first\":\"testSplitIntegration_collection\",\n  \"second\":\"shard1\"}]}}"]}}
   [junit4]   2> 652674 DEBUG (ScheduledTrigger-3347-thread-2) [    ] o.a.s.c.a.ScheduledTriggers Pausing all triggers: [index_size_trigger]
   [junit4]   2> 652675 INFO  (ScheduledTrigger-3347-thread-2) [    ] o.a.s.c.a.IndexSizeTriggerTest =======> CapturedEvent{timestamp=328198912178686, stage=STARTED, actionName='null', event={
   [junit4]   2>   "id":"12a7cdeff57e6Tav6u9tb5hgg0a78auxlmbm0tj",
   [junit4]   2>   "source":"index_size_trigger",
   [junit4]   2>   "eventTime":328190782298086,
   [junit4]   2>   "eventType":"INDEXSIZE",
   [junit4]   2>   "properties":{
   [junit4]   2>     "aboveSize":{"testSplitIntegration_collection":["{\"core_node1\":{\n    \"core\":\"testSplitIntegration_collection_shard1_replica_n1\",\n    \"leader\":\"true\",\n    \"SEARCHER.searcher.maxDoc\":11,\n    \"SEARCHER.searcher.deletedDocs\":0,\n    \"INDEX.sizeInBytes\":1,\n    \"__docs__\":11,\n    \"violationType\":\"aboveDocs\",\n    \"node_name\":\"127.0.0.1:10001_solr\",\n    \"state\":\"active\",\n    \"type\":\"NRT\",\n    \"SEARCHER.searcher.numDocs\":11,\n    \"__bytes__\":1,\n    \"shard\":\"shard1\",\n    \"collection\":\"testSplitIntegration_collection\"}}"]},
   [junit4]   2>     "belowSize":{},
   [junit4]   2>     "_enqueue_time_":328198872823236,
   [junit4]   2>     "requestedOps":["Op{action=SPLITSHARD, hints={COLL_SHARD=[{\n  \"first\":\"testSplitIntegration_collection\",\n  \"second\":\"shard1\"}]}}"]}}, context={}, config={
   [junit4]   2>   "trigger":"index_size_trigger",
   [junit4]   2>   "stage":[
   [junit4]   2>     "STARTED",
   [junit4]   2>     "ABORTED",
   [junit4]   2>     "SUCCEEDED",
   [junit4]   2>     "FAILED"],
   [junit4]   2>   "afterAction":[
   [junit4]   2>     "compute_plan",
   [junit4]   2>     "execute_plan"],
   [junit4]   2>   "class":"org.apache.solr.cloud.autoscaling.IndexSizeTriggerTest$CapturingTriggerListener",
   [junit4]   2>   "beforeAction":[
   [junit4]   2>     "compute_plan",
   [junit4]   2>     "execute_plan"]}, message='null'}
   [junit4]   2> 652678 DEBUG (AutoscalingActionExecutor-3348-thread-1) [    ] o.a.s.c.a.ScheduledTriggers -- processing actions for {
   [junit4]   2>   "id":"12a7cdeff57e6Tav6u9tb5hgg0a78auxlmbm0tj",
   [junit4]   2>   "source":"index_size_trigger",
   [junit4]   2>   "eventTime":328190782298086,
   [junit4]   2>   "eventType":"INDEXSIZE",
   [junit4]   2>   "properties":{
   [junit4]   2>     "aboveSize":{"testSplitIntegration_collection":["{\"core_node1\":{\n    \"core\":\"testSplitIntegration_collection_shard1_replica_n1\",\n    \"leader\":\"true\",\n    \"SEARCHER.searcher.maxDoc\":11,\n    \"SEARCHER.searcher.deletedDocs\":0,\n    \"INDEX.sizeInBytes\":1,\n    \"__docs__\":11,\n    \"violationType\":\"aboveDocs\",\n    \"node_name\":\"127.0.0.1:10001_solr\",\n    \"state\":\"active\",\n    \"type\":\"NRT\",\n    \"SEARCHER.searcher.numDocs\":11,\n    \"__bytes__\":1,\n    \"shard\":\"shard1\",\n    \"collection\":\"testSplitIntegration_collection\"}}"]},
   [junit4]   2>     "belowSize":{},
   [junit4]   2>     "_enqueue_time_":328198872823236,
   [junit4]   2>     "requestedOps":["Op{action=SPLITSHARD, hints={COLL_SHARD=[{\n  \"first\":\"testSplitIntegration_collection\",\n  \"second\":\"shard1\"}]}}"]}}
   [junit4]   2> 652679 INFO  (AutoscalingActionExecutor-3348-thread-1) [    ] o.a.s.c.a.IndexSizeTriggerTest =======> CapturedEvent{timestamp=328199099046536, stage=BEFORE_ACTION, actionName='compute_plan', event={
   [junit4]   2>   "id":"12a7cdeff57e6Tav6u9tb5hgg0a78auxlmbm0tj",
   [junit4]   2>   "source":"index_size_trigger",
   [junit4]   2>   "eventTime":328190782298086,
   [junit4]   2>   "eventType":"INDEXSIZE",
   [junit4]   2>   "properties":{
   [junit4]   2>     "aboveSize":{"testSplitIntegration_collection":["{\"core_node1\":{\n    \"core\":\"testSplitIntegration_collection_shard1_replica_n1\",\n    \"leader\":\"true\",\n    \"SEARCHER.searcher.maxDoc\":11,\n    \"SEARCHER.searcher.deletedDocs\":0,\n    \"INDEX.sizeInBytes\":1,\n    \"__docs__\":11,\n    \"violationType\":\"aboveDocs\",\n    \"node_name\":\"127.0.0.1:10001_solr\",\n    \"state\":\"active\",\n    \"type\":\"NRT\",\n    \"SEARCHER.searcher.numDocs\":11,\n    \"__bytes__\":1,\n    \"shard\":\"shard1\",\n    \"collection\":\"testSplitIntegration_collection\"}}"]},
   [junit4]   2>     "belowSize":{},
   [junit4]   2>     "_enqueue_time_":328198872823236,
   [junit4]   2>     "requestedOps":["Op{action=SPLITSHARD, hints={COLL_SHARD=[{\n  \"first\":\"testSplitIntegration_collection\",\n  \"second\":\"shard1\"}]}}"]}}, context={properties.BEFORE_ACTION=[compute_plan], source=index_size_trigger}, config={
   [junit4]   2>   "trigger":"index_size_trigger",
   [junit4]   2>   "stage":[
   [junit4]   2>     "STARTED",
   [junit4]   2>     "ABORTED",
   [junit4]   2>     "SUCCEEDED",
   [junit4]   2>     "FAILED"],
   [junit4]   2>   "afterAction":[
   [junit4]   2>     "compute_plan",
   [junit4]   2>     "execute_plan"],
   [junit4]   2>   "class":"org.apache.solr.cloud.autoscaling.IndexSizeTriggerTest$CapturingTriggerListener",
   [junit4]   2>   "beforeAction":[
   [junit4]   2>     "compute_plan",
   [junit4]   2>     "execute_plan"]}, message='null'}
   [junit4]   2> 652679 DEBUG (AutoscalingActionExecutor-3348-thread-1) [    ] o.a.s.c.a.ComputePlanAction -- processing event: {
   [junit4]   2>   "id":"12a7cdeff57e6Tav6u9tb5hgg0a78auxlmbm0tj",
   [junit4]   2>   "source":"index_size_trigger",
   [junit4]   2>   "eventTime":328190782298086,
   [junit4]   2>   "eventType":"INDEXSIZE",
   [junit4]   2>   "properties":{
   [junit4]   2>     "aboveSize":{"testSplitIntegration_collection":["{\"core_node1\":{\n    \"core\":\"testSplitIntegration_collection_shard1_replica_n1\",\n    \"leader\":\"true\",\n    \"SEARCHER.searcher.maxDoc\":11,\n    \"SEARCHER.searcher.deletedDocs\":0,\n    \"INDEX.sizeInBytes\":1,\n    \"__docs__\":11,\n    \"violationType\":\"aboveDocs\",\n    \"node_name\":\"127.0.0.1:10001_solr\",\n    \"state\":\"active\",\n    \"type\":\"NRT\",\n    \"SEARCHER.searcher.numDocs\":11,\n    \"__bytes__\":1,\n    \"shard\":\"shard1\",\n    \"collection\":\"testSplitIntegration_collection\"}}"]},
   [junit4]   2>     "belowSize":{},
   [junit4]   2>     "_enqueue_time_":328198872823236,
   [junit4]   2>     "requestedOps":["Op{action=SPLITSHARD, hints={COLL_SHARD=[{\n  \"first\":\"testSplitIntegration_collection\",\n  \"second\":\"shard1\"}]}}"]}} with context properties: {BEFORE_ACTION=[compute_plan]}
   [junit4]   2> 652681 INFO  (AutoscalingActionExecutor-3348-thread-1) [    ] o.a.s.c.a.ComputePlanAction Computed Plan: action=SPLITSHARD&collection=testSplitIntegration_collection&shard=shard1
   [junit4]   2> 652681 INFO  (AutoscalingActionExecutor-3348-thread-1) [    ] o.a.s.c.s.c.a.PolicyHelper returnSession, curr-time 328199232 sessionWrapper.createTime 328199168647636, this.sessionWrapper.createTime 328199168647636 
   [junit4]   2> 652681 INFO  (AutoscalingActionExecutor-3348-thread-1) [    ] o.a.s.c.a.IndexSizeTriggerTest =======> CapturedEvent{timestamp=328199235047086, stage=AFTER_ACTION, actionName='compute_plan', event={
   [junit4]   2>   "id":"12a7cdeff57e6Tav6u9tb5hgg0a78auxlmbm0tj",
   [junit4]   2>   "source":"index_size_trigger",
   [junit4]   2>   "eventTime":328190782298086,
   [junit4]   2>   "eventType":"INDEXSIZE",
   [junit4]   2>   "properties":{
   [junit4]   2>     "__start__":1,
   [junit4]   2>     "aboveSize":{"testSplitIntegration_collection":["{\"core_node1\":{\n    \"core\":\"testSplitIntegration_collection_shard1_replica_n1\",\n    \"leader\":\"true\",\n    \"SEARCHER.searcher.maxDoc\":11,\n    \"SEARCHER.searcher.deletedDocs\":0,\n    \"INDEX.sizeInBytes\":1,\n    \"__docs__\":11,\n    \"violationType\":\"aboveDocs\",\n    \"node_name\":\"127.0.0.1:10001_solr\",\n    \"state\":\"active\",\n    \"type\":\"NRT\",\n    \"SEARCHER.searcher.numDocs\":11,\n    \"__bytes__\":1,\n    \"shard\":\"shard1\",\n    \"collection\":\"testSplitIntegration_collection\"}}"]},
   [junit4]   2>     "belowSize":{},
   [junit4]   2>     "_enqueue_time_":328198872823236,
   [junit4]   2>     "requestedOps":["Op{action=SPLITSHARD, hints={COLL_SHARD=[{\n  \"first\":\"testSplitIntegration_collection\",\n  \"second\":\"shard1\"}]}}"]}}, context={properties.operations=[{class=org.apache.solr.client.solrj.request.CollectionAdminRequest$SplitShard, method=GET, params.action=SPLITSHARD, params.collection=testSplitIntegration_collection, params.shard=shard1}], properties.BEFORE_ACTION=[compute_plan], source=index_size_trigger, properties.AFTER_ACTION=[compute_plan]}, config={
   [junit4]   2>   "trigger":"index_size_trigger",
   [junit4]   2>   "stage":[
   [junit4]   2>     "STARTED",
   [junit4]   2>     "ABORTED",
   [junit4]   2>     "SUCCEEDED",
   [junit4]   2>     "FAILED"],
   [junit4]   2>   "afterAction":[
   [junit4]   2>     "compute_plan",
   [junit4]   2>     "execute_plan"],
   [junit4]   2>   "class":"org.apache.solr.cloud.autoscaling.IndexSizeTriggerTest$CapturingTriggerListener",
   [junit4]   2>   "beforeAction":[
   [junit4]   2>     "compute_plan",
   [junit4]   2>     "execute_plan"]}, message='null'}
   [junit4]   2> 652681 INFO  (AutoscalingActionExecutor-3348-thread-1) [    ] o.a.s.c.a.IndexSizeTriggerTest =======> CapturedEvent{timestamp=328199248788986, stage=BEFORE_ACTION, actionName='execute_plan', event={
   [junit4]   2>   "id":"12a7cdeff57e6Tav6u9tb5hgg0a78auxlmbm0tj",
   [junit4]   2>   "source":"index_size_trigger",
   [junit4]   2>   "eventTime":328190782298086,
   [junit4]   2>   "eventType":"INDEXSIZE",
   [junit4]   2>   "properties":{
   [junit4]   2>     "__start__":1,
   [junit4]   2>     "aboveSize":{"testSplitIntegration_collection":["{\"core_node1\":{\n    \"core\":\"testSplitIntegration_collection_shard1_replica_n1\",\n    \"leader\":\"true\",\n    \"SEARCHER.searcher.maxDoc\":11,\n    \"SEARCHER.searcher.deletedDocs\":0,\n    \"INDEX.sizeInBytes\":1,\n    \"__docs__\":11,\n    \"violationType\":\"aboveDocs\",\n    \"node_name\":\"127.0.0.1:10001_solr\",\n    \"state\":\"active\",\n    \"type\":\"NRT\",\n    \"SEARCHER.searcher.numDocs\":11,\n    \"__bytes__\":1,\n    \"shard\":\"shard1\",\n    \"collection\":\"testSplitIntegration_collection\"}}"]},
   [junit4]   2>     "belowSize":{},
   [junit4]   2>     "_enqueue_time_":328198872823236,
   [junit4]   2>     "requestedOps":["Op{action=SPLITSHARD, hints={COLL_SHARD=[{\n  \"first\":\"testSplitIntegration_collection\",\n  \"second\":\"shard1\"}]}}"]}}, context={properties.operations=[{class=org.apache.solr.client.solrj.request.CollectionAdminRequest$SplitShard, method=GET, params.action=SPLITSHARD, params.collection=testSplitIntegration_collection, params.shard=shard1}], properties.BEFORE_ACTION=[compute_plan, execute_plan], source=index_size_trigger, properties.AFTER_ACTION=[compute_plan]}, config={
   [junit4]   2>   "trigger":"index_size_trigger",
   [junit4]   2>   "stage":[
   [junit4]   2>     "STARTED",
   [junit4]   2>     "ABORTED",
   [junit4]   2>     "SUCCEEDED",
   [junit4]   2>     "FAILED"],
   [junit4]   2>   "afterAction":[
   [junit4]   2>     "compute_plan",
   [junit4]   2>     "execute_plan"],
   [junit4]   2>   "class":"org.apache.solr.cloud.autoscaling.IndexSizeTriggerTest$CapturingTriggerListener",
   [junit4]   2>   "beforeAction":[
   [junit4]   2>     "compute_plan",
   [junit4]   2>     "execute_plan"]}, message='null'}
   [junit4]   2> 652682 DEBUG (AutoscalingActionExecutor-3348-thread-1) [    ] o.a.s.c.a.ExecutePlanAction -- processing event: {
   [junit4]   2>   "id":"12a7cdeff57e6Tav6u9tb5hgg0a78auxlmbm0tj",
   [junit4]   2>   "source":"index_size_trigger",
   [junit4]   2>   "eventTime":328190782298086,
   [junit4]   2>   "eventType":"INDEXSIZE",
   [junit4]   2>   "properties":{
   [junit4]   2>     "__start__":1,
   [junit4]   2>     "aboveSize":{"testSplitIntegration_collection":["{\"core_node1\":{\n    \"core\":\"testSplitIntegration_collection_shard1_replica_n1\",\n    \"leader\":\"true\",\n    \"SEARCHER.searcher.maxDoc\":11,\n    \"SEARCHER.searcher.deletedDocs\":0,\n    \"INDEX.sizeInBytes\":1,\n    \"__docs__\":11,\n    \"violationType\":\"aboveDocs\",\n    \"node_name\":\"127.0.0.1:10001_solr\",\n    \"state\":\"active\",\n    \"type\":\"NRT\",\n    \"SEARCHER.searcher.numDocs\":11,\n    \"__bytes__\":1,\n    \"shard\":\"shard1\",\n    \"collection\":\"testSplitIntegration_collection\"}}"]},
   [junit4]   2>     "belowSize":{},
   [junit4]   2>     "_enqueue_time_":328198872823236,
   [junit4]   2>     "requestedOps":["Op{action=SPLITSHARD, hints={COLL_SHARD=[{\n  \"first\":\"testSplitIntegration_collection\",\n  \"second\":\"shard1\"}]}}"]}} with context properties: {operations=[org.apache.solr.client.solrj.request.CollectionAdminRequest$SplitShard@336ceda], AFTER_ACTION=[compute_plan], BEFORE_ACTION=[compute_plan, execute_plan]}
   [junit4]   2> 652682 DEBUG (AutoscalingActionExecutor-3348-thread-1) [    ] o.a.s.c.a.ExecutePlanAction Executing operation: action=SPLITSHARD&collection=testSplitIntegration_collection&shard=shard1
   [

[...truncated too long message...]

pache.solr.metrics.reporters.SolrJmxReporter@8f645f: rootName = solr_43491, domain = solr.node, service url = null, agent id = null] for registry solr.node / com.codahale.metrics.MetricRegistry@6572fee4
   [junit4]   2> 103247 INFO  (jetty-closer-217-thread-2) [    ] o.a.s.c.CoreContainer Shutting down CoreContainer instance=666827903
   [junit4]   2> 103247 INFO  (jetty-closer-217-thread-2) [    ] o.a.s.m.SolrMetricManager Closing metric reporters for registry=solr.node, tag=null
   [junit4]   2> 103247 INFO  (jetty-closer-217-thread-2) [    ] o.a.s.m.r.SolrJmxReporter Closing reporter [org.apache.solr.metrics.reporters.SolrJmxReporter@7c28c019: rootName = solr_38449, domain = solr.node, service url = null, agent id = null] for registry solr.node / com.codahale.metrics.MetricRegistry@51c9d825
   [junit4]   2> 103251 INFO  (jetty-closer-217-thread-1) [    ] o.a.s.m.SolrMetricManager Closing metric reporters for registry=solr.jvm, tag=null
   [junit4]   2> 103251 INFO  (jetty-closer-217-thread-1) [    ] o.a.s.m.r.SolrJmxReporter Closing reporter [org.apache.solr.metrics.reporters.SolrJmxReporter@3d8005a2: rootName = solr_43491, domain = solr.jvm, service url = null, agent id = null] for registry solr.jvm / com.codahale.metrics.MetricRegistry@4c6208ac
   [junit4]   2> 103251 INFO  (jetty-closer-217-thread-2) [    ] o.a.s.m.SolrMetricManager Closing metric reporters for registry=solr.jvm, tag=null
   [junit4]   2> 103251 INFO  (jetty-closer-217-thread-2) [    ] o.a.s.m.r.SolrJmxReporter Closing reporter [org.apache.solr.metrics.reporters.SolrJmxReporter@3a229bd7: rootName = solr_38449, domain = solr.jvm, service url = null, agent id = null] for registry solr.jvm / com.codahale.metrics.MetricRegistry@4c6208ac
   [junit4]   2> 103253 INFO  (jetty-closer-217-thread-1) [    ] o.a.s.m.SolrMetricManager Closing metric reporters for registry=solr.jetty, tag=null
   [junit4]   2> 103253 INFO  (jetty-closer-217-thread-1) [    ] o.a.s.m.r.SolrJmxReporter Closing reporter [org.apache.solr.metrics.reporters.SolrJmxReporter@dfaff6e: rootName = solr_43491, domain = solr.jetty, service url = null, agent id = null] for registry solr.jetty / com.codahale.metrics.MetricRegistry@411260f7
   [junit4]   2> 103253 INFO  (jetty-closer-217-thread-2) [    ] o.a.s.m.SolrMetricManager Closing metric reporters for registry=solr.jetty, tag=null
   [junit4]   2> 103253 INFO  (jetty-closer-217-thread-2) [    ] o.a.s.m.r.SolrJmxReporter Closing reporter [org.apache.solr.metrics.reporters.SolrJmxReporter@7d26a80: rootName = solr_38449, domain = solr.jetty, service url = null, agent id = null] for registry solr.jetty / com.codahale.metrics.MetricRegistry@411260f7
   [junit4]   2> 103254 INFO  (jetty-closer-217-thread-2) [    ] o.a.s.c.ZkController Remove node as live in ZooKeeper:/live_nodes/127.0.0.1:38449_solr
   [junit4]   2> 103254 INFO  (jetty-closer-217-thread-1) [    ] o.a.s.c.ZkController Remove node as live in ZooKeeper:/live_nodes/127.0.0.1:43491_solr
   [junit4]   2> 103255 INFO  (jetty-closer-217-thread-2) [    ] o.a.s.m.SolrMetricManager Closing metric reporters for registry=solr.cluster, tag=null
   [junit4]   2> 103255 INFO  (zkCallback-232-thread-1) [    ] o.a.s.c.c.ZkStateReader Updated live nodes from ZooKeeper... (2) -> (0)
   [junit4]   2> 103255 INFO  (zkCallback-234-thread-1) [    ] o.a.s.c.c.ZkStateReader Updated live nodes from ZooKeeper... (2) -> (0)
   [junit4]   2> 103255 INFO  (jetty-closer-217-thread-2) [    ] o.a.s.c.TransientSolrCoreCacheDefault Allocating transient cache for 2147483647 transient cores
   [junit4]   2> 103255 INFO  (jetty-closer-217-thread-1) [    ] o.a.s.m.SolrMetricManager Closing metric reporters for registry=solr.cluster, tag=null
   [junit4]   2> 103255 INFO  (zkCallback-243-thread-1) [    ] o.a.s.c.c.ZkStateReader Updated live nodes from ZooKeeper... (2) -> (0)
   [junit4]   2> 103255 INFO  (zkCallback-248-thread-1) [    ] o.a.s.c.c.ZkStateReader Updated live nodes from ZooKeeper... (2) -> (0)
   [junit4]   2> 103256 INFO  (jetty-closer-217-thread-1) [    ] o.a.s.c.Overseer Overseer (id=72079228466233350-127.0.0.1:43491_solr-n_0000000000) closing
   [junit4]   2> 103256 INFO  (OverseerStateUpdate-72079228466233350-127.0.0.1:43491_solr-n_0000000000) [    ] o.a.s.c.Overseer Overseer Loop exiting : 127.0.0.1:43491_solr
   [junit4]   2> 103256 WARN  (OverseerAutoScalingTriggerThread-72079228466233350-127.0.0.1:43491_solr-n_0000000000) [    ] o.a.s.c.a.OverseerTriggerThread OverseerTriggerThread woken up but we are closed, exiting.
   [junit4]   2> 103256 DEBUG (jetty-closer-217-thread-1) [    ] o.a.s.c.a.ScheduledTriggers Shutting down scheduled thread pool executor now
   [junit4]   2> 103256 DEBUG (jetty-closer-217-thread-1) [    ] o.a.s.c.a.ScheduledTriggers Shutting down action executor now
   [junit4]   2> 103256 DEBUG (jetty-closer-217-thread-1) [    ] o.a.s.c.a.ScheduledTriggers Awaiting termination for action executor
   [junit4]   2> 103256 DEBUG (jetty-closer-217-thread-1) [    ] o.a.s.c.a.ScheduledTriggers Awaiting termination for scheduled thread pool executor
   [junit4]   2> 103256 DEBUG (jetty-closer-217-thread-1) [    ] o.a.s.c.a.ScheduledTriggers ScheduledTriggers closed completely
   [junit4]   2> 103256 DEBUG (jetty-closer-217-thread-1) [    ] o.a.s.c.a.OverseerTriggerThread OverseerTriggerThread has been closed explicitly
   [junit4]   2> 103257 INFO  (jetty-closer-217-thread-2) [    ] o.e.j.s.h.ContextHandler Stopped o.e.j.s.ServletContextHandler@119297da{/solr,null,UNAVAILABLE}
   [junit4]   2> 103257 INFO  (jetty-closer-217-thread-2) [    ] o.e.j.s.session node0 Stopped scavenging
   [junit4]   2> 103258 INFO  (jetty-closer-217-thread-1) [    ] o.e.j.s.h.ContextHandler Stopped o.e.j.s.ServletContextHandler@1705264d{/solr,null,UNAVAILABLE}
   [junit4]   2> 103258 INFO  (jetty-closer-217-thread-1) [    ] o.e.j.s.session node0 Stopped scavenging
   [junit4]   2> 103259 ERROR (SUITE-IndexSizeTriggerTest-seed#[4659082834CF5C58]-worker) [    ] o.a.z.s.ZooKeeperServer ZKShutdownHandler is not registered, so ZooKeeper server won't take any action on ERROR or SHUTDOWN server state changes
   [junit4]   2> 103259 INFO  (SUITE-IndexSizeTriggerTest-seed#[4659082834CF5C58]-worker) [    ] o.a.s.c.ZkTestServer connecting to 127.0.0.1:37493 37493
   [junit4]   2> 103378 INFO  (Thread-122) [    ] o.a.s.c.ZkTestServer connecting to 127.0.0.1:37493 37493
   [junit4]   2> 103379 WARN  (Thread-122) [    ] o.a.s.c.ZkTestServer Watch limit violations: 
   [junit4]   2> Maximum concurrent create/delete watches above limit:
   [junit4]   2> 
   [junit4]   2> 	5	/solr/aliases.json
   [junit4]   2> 	2	/solr/security.json
   [junit4]   2> 
   [junit4]   2> Maximum concurrent data watches above limit:
   [junit4]   2> 
   [junit4]   2> 	5	/solr/clusterstate.json
   [junit4]   2> 	5	/solr/clusterprops.json
   [junit4]   2> 
   [junit4]   2> Maximum concurrent children watches above limit:
   [junit4]   2> 
   [junit4]   2> 	5	/solr/live_nodes
   [junit4]   2> 	5	/solr/collections
   [junit4]   2> 
   [junit4]   2> NOTE: leaving temporary files on disk at: /home/jenkins/workspace/Lucene-Solr-7.x-Linux/solr/build/solr-core/test/J2/temp/solr.cloud.autoscaling.IndexSizeTriggerTest_4659082834CF5C58-002
   [junit4]   2> May 24, 2018 8:03:25 AM com.carrotsearch.randomizedtesting.ThreadLeakControl checkThreadLeaks
   [junit4]   2> WARNING: Will linger awaiting termination of 1 leaked thread(s).
   [junit4]   2> NOTE: test params are: codec=CheapBastard, sim=RandomSimilarity(queryNorm=true): {}, locale=en-NF, timezone=America/Maceio
   [junit4]   2> NOTE: Linux 4.13.0-41-generic amd64/Oracle Corporation 10 (64-bit)/cpus=8,threads=1,free=448447480,total=536870912
   [junit4]   2> NOTE: All tests run in this JVM: [IndexSizeTriggerTest, IndexSizeTriggerTest, SearchRateTriggerTest, IndexSizeTriggerTest, IndexSizeTriggerTest]
   [junit4] Completed [7/10 (2!)] on J2 in 3.01s, 4 tests, 1 failure <<< FAILURES!

[...truncated 31 lines...]
BUILD FAILED
/home/jenkins/workspace/Lucene-Solr-7.x-Linux/lucene/common-build.xml:1568: The following error occurred while executing this line:
/home/jenkins/workspace/Lucene-Solr-7.x-Linux/lucene/common-build.xml:1092: There were test failures: 10 suites, 35 tests, 1 error, 1 failure [seed: 4659082834CF5C58]

Total time: 2 minutes 50 seconds

[repro] Setting last failure code to 256

[repro] Failures:
[repro]   0/5 failed: org.apache.solr.cloud.autoscaling.SearchRateTriggerTest
[repro]   2/5 failed: org.apache.solr.cloud.autoscaling.IndexSizeTriggerTest
[repro] Exiting with code 256
+ mv lucene/build lucene/build.repro
+ mv solr/build solr/build.repro
+ mv lucene/build.orig lucene/build
+ mv solr/build.orig solr/build
Archiving artifacts
Setting ANT_1_8_2_HOME=/var/lib/jenkins/tools/hudson.tasks.Ant_AntInstallation/ANT_1.8.2
[WARNINGS] Parsing warnings in console log with parser Java Compiler (javac)
Setting ANT_1_8_2_HOME=/var/lib/jenkins/tools/hudson.tasks.Ant_AntInstallation/ANT_1.8.2
Setting ANT_1_8_2_HOME=/var/lib/jenkins/tools/hudson.tasks.Ant_AntInstallation/ANT_1.8.2
<Git Blamer> Using GitBlamer to create author and commit information for all warnings.
<Git Blamer> GIT_COMMIT=7f0b184c66d501e45f33ae8a52ba4603725d39f0, workspace=/var/lib/jenkins/workspace/Lucene-Solr-7.x-Linux
[WARNINGS] Computing warning deltas based on reference build #1967
Recording test results
Setting ANT_1_8_2_HOME=/var/lib/jenkins/tools/hudson.tasks.Ant_AntInstallation/ANT_1.8.2
Build step 'Publish JUnit test result report' changed build result to UNSTABLE
Email was triggered for: Unstable (Test Failures)
Sending email for trigger: Unstable (Test Failures)
Setting ANT_1_8_2_HOME=/var/lib/jenkins/tools/hudson.tasks.Ant_AntInstallation/ANT_1.8.2
Setting ANT_1_8_2_HOME=/var/lib/jenkins/tools/hudson.tasks.Ant_AntInstallation/ANT_1.8.2
Setting ANT_1_8_2_HOME=/var/lib/jenkins/tools/hudson.tasks.Ant_AntInstallation/ANT_1.8.2
Setting ANT_1_8_2_HOME=/var/lib/jenkins/tools/hudson.tasks.Ant_AntInstallation/ANT_1.8.2

Mime
View raw message