lucene-dev mailing list archives

Site index · List index
Message view « Date » · « Thread »
Top « Date » · « Thread »
From Policeman Jenkins Server <jenk...@thetaphi.de>
Subject [JENKINS] Lucene-Solr-master-Windows (64bit/jdk-10) - Build # 7320 - Still Unstable!
Date Thu, 17 May 2018 13:51:24 GMT
Build: https://jenkins.thetaphi.de/job/Lucene-Solr-master-Windows/7320/
Java: 64bit/jdk-10 -XX:+UseCompressedOops -XX:+UseG1GC

19 tests failed.
FAILED:  org.apache.lucene.store.TestSimpleFSDirectory.testCreateOutputWithPendingDeletes

Error Message:
C:\Users\jenkins\workspace\Lucene-Solr-master-Windows\lucene\build\core\test\J1\temp\lucene.store.TestSimpleFSDirectory_976D3D73E4F3D4F1-001\tempDir-006\file.txt

Stack Trace:
java.nio.file.AccessDeniedException: C:\Users\jenkins\workspace\Lucene-Solr-master-Windows\lucene\build\core\test\J1\temp\lucene.store.TestSimpleFSDirectory_976D3D73E4F3D4F1-001\tempDir-006\file.txt
	at __randomizedtesting.SeedInfo.seed([976D3D73E4F3D4F1:BEC83E6C77D06BAD]:0)
	at java.base/sun.nio.fs.WindowsException.translateToIOException(WindowsException.java:89)
	at java.base/sun.nio.fs.WindowsException.rethrowAsIOException(WindowsException.java:103)
	at java.base/sun.nio.fs.WindowsException.rethrowAsIOException(WindowsException.java:108)
	at java.base/sun.nio.fs.WindowsFileAttributeViews$Basic.readAttributes(WindowsFileAttributeViews.java:53)
	at java.base/sun.nio.fs.WindowsFileAttributeViews$Basic.readAttributes(WindowsFileAttributeViews.java:38)
	at org.apache.lucene.mockfile.WindowsFS.getKey(WindowsFS.java:55)
	at org.apache.lucene.mockfile.WindowsFS.onClose(WindowsFS.java:77)
	at org.apache.lucene.mockfile.HandleTrackingFS$5.close(HandleTrackingFS.java:249)
	at org.apache.lucene.store.SimpleFSDirectory$SimpleFSIndexInput.close(SimpleFSDirectory.java:119)
	at org.apache.lucene.util.IOUtils.close(IOUtils.java:88)
	at org.apache.lucene.util.IOUtils.close(IOUtils.java:76)
	at org.apache.lucene.store.TestSimpleFSDirectory.testCreateOutputWithPendingDeletes(TestSimpleFSDirectory.java:78)
	at java.base/jdk.internal.reflect.NativeMethodAccessorImpl.invoke0(Native Method)
	at java.base/jdk.internal.reflect.NativeMethodAccessorImpl.invoke(NativeMethodAccessorImpl.java:62)
	at java.base/jdk.internal.reflect.DelegatingMethodAccessorImpl.invoke(DelegatingMethodAccessorImpl.java:43)
	at java.base/java.lang.reflect.Method.invoke(Method.java:564)
	at com.carrotsearch.randomizedtesting.RandomizedRunner.invoke(RandomizedRunner.java:1737)
	at com.carrotsearch.randomizedtesting.RandomizedRunner$8.evaluate(RandomizedRunner.java:934)
	at com.carrotsearch.randomizedtesting.RandomizedRunner$9.evaluate(RandomizedRunner.java:970)
	at com.carrotsearch.randomizedtesting.RandomizedRunner$10.evaluate(RandomizedRunner.java:984)
	at org.apache.lucene.util.TestRuleSetupTeardownChained$1.evaluate(TestRuleSetupTeardownChained.java:49)
	at org.apache.lucene.util.AbstractBeforeAfterRule$1.evaluate(AbstractBeforeAfterRule.java:45)
	at org.apache.lucene.util.TestRuleThreadAndTestName$1.evaluate(TestRuleThreadAndTestName.java:48)
	at org.apache.lucene.util.TestRuleIgnoreAfterMaxFailures$1.evaluate(TestRuleIgnoreAfterMaxFailures.java:64)
	at org.apache.lucene.util.TestRuleMarkFailure$1.evaluate(TestRuleMarkFailure.java:47)
	at com.carrotsearch.randomizedtesting.rules.StatementAdapter.evaluate(StatementAdapter.java:36)
	at com.carrotsearch.randomizedtesting.ThreadLeakControl$StatementRunner.run(ThreadLeakControl.java:368)
	at com.carrotsearch.randomizedtesting.ThreadLeakControl.forkTimeoutingTask(ThreadLeakControl.java:817)
	at com.carrotsearch.randomizedtesting.ThreadLeakControl$3.evaluate(ThreadLeakControl.java:468)
	at com.carrotsearch.randomizedtesting.RandomizedRunner.runSingleTest(RandomizedRunner.java:943)
	at com.carrotsearch.randomizedtesting.RandomizedRunner$5.evaluate(RandomizedRunner.java:829)
	at com.carrotsearch.randomizedtesting.RandomizedRunner$6.evaluate(RandomizedRunner.java:879)
	at com.carrotsearch.randomizedtesting.RandomizedRunner$7.evaluate(RandomizedRunner.java:890)
	at org.apache.lucene.util.AbstractBeforeAfterRule$1.evaluate(AbstractBeforeAfterRule.java:45)
	at com.carrotsearch.randomizedtesting.rules.StatementAdapter.evaluate(StatementAdapter.java:36)
	at org.apache.lucene.util.TestRuleStoreClassName$1.evaluate(TestRuleStoreClassName.java:41)
	at com.carrotsearch.randomizedtesting.rules.NoShadowingOrOverridesOnMethodsRule$1.evaluate(NoShadowingOrOverridesOnMethodsRule.java:40)
	at com.carrotsearch.randomizedtesting.rules.NoShadowingOrOverridesOnMethodsRule$1.evaluate(NoShadowingOrOverridesOnMethodsRule.java:40)
	at com.carrotsearch.randomizedtesting.rules.StatementAdapter.evaluate(StatementAdapter.java:36)
	at com.carrotsearch.randomizedtesting.rules.StatementAdapter.evaluate(StatementAdapter.java:36)
	at org.apache.lucene.util.TestRuleAssertionsRequired$1.evaluate(TestRuleAssertionsRequired.java:53)
	at org.apache.lucene.util.TestRuleMarkFailure$1.evaluate(TestRuleMarkFailure.java:47)
	at org.apache.lucene.util.TestRuleIgnoreAfterMaxFailures$1.evaluate(TestRuleIgnoreAfterMaxFailures.java:64)
	at org.apache.lucene.util.TestRuleIgnoreTestSuites$1.evaluate(TestRuleIgnoreTestSuites.java:54)
	at com.carrotsearch.randomizedtesting.rules.StatementAdapter.evaluate(StatementAdapter.java:36)
	at com.carrotsearch.randomizedtesting.ThreadLeakControl$StatementRunner.run(ThreadLeakControl.java:368)
	at java.base/java.lang.Thread.run(Thread.java:844)


FAILED:  org.apache.lucene.store.TestSimpleFSDirectory.testRenameWithPendingDeletes

Error Message:
C:\Users\jenkins\workspace\Lucene-Solr-master-Windows\lucene\build\core\test\J1\temp\lucene.store.TestSimpleFSDirectory_976D3D73E4F3D4F1-001\tempDir-011\source.txt -> C:\Users\jenkins\workspace\Lucene-Solr-master-Windows\lucene\build\core\test\J1\temp\lucene.store.TestSimpleFSDirectory_976D3D73E4F3D4F1-001\tempDir-011\target.txt

Stack Trace:
java.nio.file.AccessDeniedException: C:\Users\jenkins\workspace\Lucene-Solr-master-Windows\lucene\build\core\test\J1\temp\lucene.store.TestSimpleFSDirectory_976D3D73E4F3D4F1-001\tempDir-011\source.txt -> C:\Users\jenkins\workspace\Lucene-Solr-master-Windows\lucene\build\core\test\J1\temp\lucene.store.TestSimpleFSDirectory_976D3D73E4F3D4F1-001\tempDir-011\target.txt
	at __randomizedtesting.SeedInfo.seed([976D3D73E4F3D4F1:218C880F006588EB]:0)
	at java.base/sun.nio.fs.WindowsException.translateToIOException(WindowsException.java:89)
	at java.base/sun.nio.fs.WindowsException.rethrowAsIOException(WindowsException.java:103)
	at java.base/sun.nio.fs.WindowsFileCopy.move(WindowsFileCopy.java:298)
	at java.base/sun.nio.fs.WindowsFileSystemProvider.move(WindowsFileSystemProvider.java:288)
	at org.apache.lucene.mockfile.FilterFileSystemProvider.move(FilterFileSystemProvider.java:147)
	at org.apache.lucene.mockfile.FilterFileSystemProvider.move(FilterFileSystemProvider.java:147)
	at org.apache.lucene.mockfile.FilterFileSystemProvider.move(FilterFileSystemProvider.java:147)
	at org.apache.lucene.mockfile.FilterFileSystemProvider.move(FilterFileSystemProvider.java:147)
	at org.apache.lucene.mockfile.FilterFileSystemProvider.move(FilterFileSystemProvider.java:147)
	at org.apache.lucene.mockfile.FilterFileSystemProvider.move(FilterFileSystemProvider.java:147)
	at org.apache.lucene.mockfile.WindowsFS.move(WindowsFS.java:129)
	at java.base/java.nio.file.Files.move(Files.java:1413)
	at org.apache.lucene.store.FSDirectory.rename(FSDirectory.java:303)
	at org.apache.lucene.store.TestSimpleFSDirectory.testRenameWithPendingDeletes(TestSimpleFSDirectory.java:54)
	at java.base/jdk.internal.reflect.NativeMethodAccessorImpl.invoke0(Native Method)
	at java.base/jdk.internal.reflect.NativeMethodAccessorImpl.invoke(NativeMethodAccessorImpl.java:62)
	at java.base/jdk.internal.reflect.DelegatingMethodAccessorImpl.invoke(DelegatingMethodAccessorImpl.java:43)
	at java.base/java.lang.reflect.Method.invoke(Method.java:564)
	at com.carrotsearch.randomizedtesting.RandomizedRunner.invoke(RandomizedRunner.java:1737)
	at com.carrotsearch.randomizedtesting.RandomizedRunner$8.evaluate(RandomizedRunner.java:934)
	at com.carrotsearch.randomizedtesting.RandomizedRunner$9.evaluate(RandomizedRunner.java:970)
	at com.carrotsearch.randomizedtesting.RandomizedRunner$10.evaluate(RandomizedRunner.java:984)
	at org.apache.lucene.util.TestRuleSetupTeardownChained$1.evaluate(TestRuleSetupTeardownChained.java:49)
	at org.apache.lucene.util.AbstractBeforeAfterRule$1.evaluate(AbstractBeforeAfterRule.java:45)
	at org.apache.lucene.util.TestRuleThreadAndTestName$1.evaluate(TestRuleThreadAndTestName.java:48)
	at org.apache.lucene.util.TestRuleIgnoreAfterMaxFailures$1.evaluate(TestRuleIgnoreAfterMaxFailures.java:64)
	at org.apache.lucene.util.TestRuleMarkFailure$1.evaluate(TestRuleMarkFailure.java:47)
	at com.carrotsearch.randomizedtesting.rules.StatementAdapter.evaluate(StatementAdapter.java:36)
	at com.carrotsearch.randomizedtesting.ThreadLeakControl$StatementRunner.run(ThreadLeakControl.java:368)
	at com.carrotsearch.randomizedtesting.ThreadLeakControl.forkTimeoutingTask(ThreadLeakControl.java:817)
	at com.carrotsearch.randomizedtesting.ThreadLeakControl$3.evaluate(ThreadLeakControl.java:468)
	at com.carrotsearch.randomizedtesting.RandomizedRunner.runSingleTest(RandomizedRunner.java:943)
	at com.carrotsearch.randomizedtesting.RandomizedRunner$5.evaluate(RandomizedRunner.java:829)
	at com.carrotsearch.randomizedtesting.RandomizedRunner$6.evaluate(RandomizedRunner.java:879)
	at com.carrotsearch.randomizedtesting.RandomizedRunner$7.evaluate(RandomizedRunner.java:890)
	at org.apache.lucene.util.AbstractBeforeAfterRule$1.evaluate(AbstractBeforeAfterRule.java:45)
	at com.carrotsearch.randomizedtesting.rules.StatementAdapter.evaluate(StatementAdapter.java:36)
	at org.apache.lucene.util.TestRuleStoreClassName$1.evaluate(TestRuleStoreClassName.java:41)
	at com.carrotsearch.randomizedtesting.rules.NoShadowingOrOverridesOnMethodsRule$1.evaluate(NoShadowingOrOverridesOnMethodsRule.java:40)
	at com.carrotsearch.randomizedtesting.rules.NoShadowingOrOverridesOnMethodsRule$1.evaluate(NoShadowingOrOverridesOnMethodsRule.java:40)
	at com.carrotsearch.randomizedtesting.rules.StatementAdapter.evaluate(StatementAdapter.java:36)
	at com.carrotsearch.randomizedtesting.rules.StatementAdapter.evaluate(StatementAdapter.java:36)
	at org.apache.lucene.util.TestRuleAssertionsRequired$1.evaluate(TestRuleAssertionsRequired.java:53)
	at org.apache.lucene.util.TestRuleMarkFailure$1.evaluate(TestRuleMarkFailure.java:47)
	at org.apache.lucene.util.TestRuleIgnoreAfterMaxFailures$1.evaluate(TestRuleIgnoreAfterMaxFailures.java:64)
	at org.apache.lucene.util.TestRuleIgnoreTestSuites$1.evaluate(TestRuleIgnoreTestSuites.java:54)
	at com.carrotsearch.randomizedtesting.rules.StatementAdapter.evaluate(StatementAdapter.java:36)
	at com.carrotsearch.randomizedtesting.ThreadLeakControl$StatementRunner.run(ThreadLeakControl.java:368)
	at java.base/java.lang.Thread.run(Thread.java:844)


FAILED:  org.apache.lucene.store.TestSimpleFSDirectory.testCreateOutputWithPendingDeletes

Error Message:
C:\Users\jenkins\workspace\Lucene-Solr-master-Windows\lucene\build\core\test\J0\temp\lucene.store.TestSimpleFSDirectory_976D3D73E4F3D4F1-002\tempDir-006\file.txt

Stack Trace:
java.nio.file.AccessDeniedException: C:\Users\jenkins\workspace\Lucene-Solr-master-Windows\lucene\build\core\test\J0\temp\lucene.store.TestSimpleFSDirectory_976D3D73E4F3D4F1-002\tempDir-006\file.txt
	at __randomizedtesting.SeedInfo.seed([976D3D73E4F3D4F1:BEC83E6C77D06BAD]:0)
	at java.base/sun.nio.fs.WindowsException.translateToIOException(WindowsException.java:89)
	at java.base/sun.nio.fs.WindowsException.rethrowAsIOException(WindowsException.java:103)
	at java.base/sun.nio.fs.WindowsException.rethrowAsIOException(WindowsException.java:108)
	at java.base/sun.nio.fs.WindowsFileAttributeViews$Basic.readAttributes(WindowsFileAttributeViews.java:53)
	at java.base/sun.nio.fs.WindowsFileAttributeViews$Basic.readAttributes(WindowsFileAttributeViews.java:38)
	at org.apache.lucene.mockfile.WindowsFS.getKey(WindowsFS.java:55)
	at org.apache.lucene.mockfile.WindowsFS.onClose(WindowsFS.java:77)
	at org.apache.lucene.mockfile.HandleTrackingFS$5.close(HandleTrackingFS.java:249)
	at org.apache.lucene.store.SimpleFSDirectory$SimpleFSIndexInput.close(SimpleFSDirectory.java:119)
	at org.apache.lucene.util.IOUtils.close(IOUtils.java:88)
	at org.apache.lucene.util.IOUtils.close(IOUtils.java:76)
	at org.apache.lucene.store.TestSimpleFSDirectory.testCreateOutputWithPendingDeletes(TestSimpleFSDirectory.java:78)
	at java.base/jdk.internal.reflect.NativeMethodAccessorImpl.invoke0(Native Method)
	at java.base/jdk.internal.reflect.NativeMethodAccessorImpl.invoke(NativeMethodAccessorImpl.java:62)
	at java.base/jdk.internal.reflect.DelegatingMethodAccessorImpl.invoke(DelegatingMethodAccessorImpl.java:43)
	at java.base/java.lang.reflect.Method.invoke(Method.java:564)
	at com.carrotsearch.randomizedtesting.RandomizedRunner.invoke(RandomizedRunner.java:1737)
	at com.carrotsearch.randomizedtesting.RandomizedRunner$8.evaluate(RandomizedRunner.java:934)
	at com.carrotsearch.randomizedtesting.RandomizedRunner$9.evaluate(RandomizedRunner.java:970)
	at com.carrotsearch.randomizedtesting.RandomizedRunner$10.evaluate(RandomizedRunner.java:984)
	at org.apache.lucene.util.TestRuleSetupTeardownChained$1.evaluate(TestRuleSetupTeardownChained.java:49)
	at org.apache.lucene.util.AbstractBeforeAfterRule$1.evaluate(AbstractBeforeAfterRule.java:45)
	at org.apache.lucene.util.TestRuleThreadAndTestName$1.evaluate(TestRuleThreadAndTestName.java:48)
	at org.apache.lucene.util.TestRuleIgnoreAfterMaxFailures$1.evaluate(TestRuleIgnoreAfterMaxFailures.java:64)
	at org.apache.lucene.util.TestRuleMarkFailure$1.evaluate(TestRuleMarkFailure.java:47)
	at com.carrotsearch.randomizedtesting.rules.StatementAdapter.evaluate(StatementAdapter.java:36)
	at com.carrotsearch.randomizedtesting.ThreadLeakControl$StatementRunner.run(ThreadLeakControl.java:368)
	at com.carrotsearch.randomizedtesting.ThreadLeakControl.forkTimeoutingTask(ThreadLeakControl.java:817)
	at com.carrotsearch.randomizedtesting.ThreadLeakControl$3.evaluate(ThreadLeakControl.java:468)
	at com.carrotsearch.randomizedtesting.RandomizedRunner.runSingleTest(RandomizedRunner.java:943)
	at com.carrotsearch.randomizedtesting.RandomizedRunner$5.evaluate(RandomizedRunner.java:829)
	at com.carrotsearch.randomizedtesting.RandomizedRunner$6.evaluate(RandomizedRunner.java:879)
	at com.carrotsearch.randomizedtesting.RandomizedRunner$7.evaluate(RandomizedRunner.java:890)
	at org.apache.lucene.util.AbstractBeforeAfterRule$1.evaluate(AbstractBeforeAfterRule.java:45)
	at com.carrotsearch.randomizedtesting.rules.StatementAdapter.evaluate(StatementAdapter.java:36)
	at org.apache.lucene.util.TestRuleStoreClassName$1.evaluate(TestRuleStoreClassName.java:41)
	at com.carrotsearch.randomizedtesting.rules.NoShadowingOrOverridesOnMethodsRule$1.evaluate(NoShadowingOrOverridesOnMethodsRule.java:40)
	at com.carrotsearch.randomizedtesting.rules.NoShadowingOrOverridesOnMethodsRule$1.evaluate(NoShadowingOrOverridesOnMethodsRule.java:40)
	at com.carrotsearch.randomizedtesting.rules.StatementAdapter.evaluate(StatementAdapter.java:36)
	at com.carrotsearch.randomizedtesting.rules.StatementAdapter.evaluate(StatementAdapter.java:36)
	at org.apache.lucene.util.TestRuleAssertionsRequired$1.evaluate(TestRuleAssertionsRequired.java:53)
	at org.apache.lucene.util.TestRuleMarkFailure$1.evaluate(TestRuleMarkFailure.java:47)
	at org.apache.lucene.util.TestRuleIgnoreAfterMaxFailures$1.evaluate(TestRuleIgnoreAfterMaxFailures.java:64)
	at org.apache.lucene.util.TestRuleIgnoreTestSuites$1.evaluate(TestRuleIgnoreTestSuites.java:54)
	at com.carrotsearch.randomizedtesting.rules.StatementAdapter.evaluate(StatementAdapter.java:36)
	at com.carrotsearch.randomizedtesting.ThreadLeakControl$StatementRunner.run(ThreadLeakControl.java:368)
	at java.base/java.lang.Thread.run(Thread.java:844)


FAILED:  org.apache.lucene.store.TestSimpleFSDirectory.testRenameWithPendingDeletes

Error Message:
C:\Users\jenkins\workspace\Lucene-Solr-master-Windows\lucene\build\core\test\J0\temp\lucene.store.TestSimpleFSDirectory_976D3D73E4F3D4F1-002\tempDir-011\source.txt -> C:\Users\jenkins\workspace\Lucene-Solr-master-Windows\lucene\build\core\test\J0\temp\lucene.store.TestSimpleFSDirectory_976D3D73E4F3D4F1-002\tempDir-011\target.txt

Stack Trace:
java.nio.file.AccessDeniedException: C:\Users\jenkins\workspace\Lucene-Solr-master-Windows\lucene\build\core\test\J0\temp\lucene.store.TestSimpleFSDirectory_976D3D73E4F3D4F1-002\tempDir-011\source.txt -> C:\Users\jenkins\workspace\Lucene-Solr-master-Windows\lucene\build\core\test\J0\temp\lucene.store.TestSimpleFSDirectory_976D3D73E4F3D4F1-002\tempDir-011\target.txt
	at __randomizedtesting.SeedInfo.seed([976D3D73E4F3D4F1:218C880F006588EB]:0)
	at java.base/sun.nio.fs.WindowsException.translateToIOException(WindowsException.java:89)
	at java.base/sun.nio.fs.WindowsException.rethrowAsIOException(WindowsException.java:103)
	at java.base/sun.nio.fs.WindowsFileCopy.move(WindowsFileCopy.java:298)
	at java.base/sun.nio.fs.WindowsFileSystemProvider.move(WindowsFileSystemProvider.java:288)
	at org.apache.lucene.mockfile.FilterFileSystemProvider.move(FilterFileSystemProvider.java:147)
	at org.apache.lucene.mockfile.FilterFileSystemProvider.move(FilterFileSystemProvider.java:147)
	at org.apache.lucene.mockfile.FilterFileSystemProvider.move(FilterFileSystemProvider.java:147)
	at org.apache.lucene.mockfile.FilterFileSystemProvider.move(FilterFileSystemProvider.java:147)
	at org.apache.lucene.mockfile.FilterFileSystemProvider.move(FilterFileSystemProvider.java:147)
	at org.apache.lucene.mockfile.FilterFileSystemProvider.move(FilterFileSystemProvider.java:147)
	at org.apache.lucene.mockfile.WindowsFS.move(WindowsFS.java:129)
	at java.base/java.nio.file.Files.move(Files.java:1413)
	at org.apache.lucene.store.FSDirectory.rename(FSDirectory.java:303)
	at org.apache.lucene.store.TestSimpleFSDirectory.testRenameWithPendingDeletes(TestSimpleFSDirectory.java:54)
	at java.base/jdk.internal.reflect.NativeMethodAccessorImpl.invoke0(Native Method)
	at java.base/jdk.internal.reflect.NativeMethodAccessorImpl.invoke(NativeMethodAccessorImpl.java:62)
	at java.base/jdk.internal.reflect.DelegatingMethodAccessorImpl.invoke(DelegatingMethodAccessorImpl.java:43)
	at java.base/java.lang.reflect.Method.invoke(Method.java:564)
	at com.carrotsearch.randomizedtesting.RandomizedRunner.invoke(RandomizedRunner.java:1737)
	at com.carrotsearch.randomizedtesting.RandomizedRunner$8.evaluate(RandomizedRunner.java:934)
	at com.carrotsearch.randomizedtesting.RandomizedRunner$9.evaluate(RandomizedRunner.java:970)
	at com.carrotsearch.randomizedtesting.RandomizedRunner$10.evaluate(RandomizedRunner.java:984)
	at org.apache.lucene.util.TestRuleSetupTeardownChained$1.evaluate(TestRuleSetupTeardownChained.java:49)
	at org.apache.lucene.util.AbstractBeforeAfterRule$1.evaluate(AbstractBeforeAfterRule.java:45)
	at org.apache.lucene.util.TestRuleThreadAndTestName$1.evaluate(TestRuleThreadAndTestName.java:48)
	at org.apache.lucene.util.TestRuleIgnoreAfterMaxFailures$1.evaluate(TestRuleIgnoreAfterMaxFailures.java:64)
	at org.apache.lucene.util.TestRuleMarkFailure$1.evaluate(TestRuleMarkFailure.java:47)
	at com.carrotsearch.randomizedtesting.rules.StatementAdapter.evaluate(StatementAdapter.java:36)
	at com.carrotsearch.randomizedtesting.ThreadLeakControl$StatementRunner.run(ThreadLeakControl.java:368)
	at com.carrotsearch.randomizedtesting.ThreadLeakControl.forkTimeoutingTask(ThreadLeakControl.java:817)
	at com.carrotsearch.randomizedtesting.ThreadLeakControl$3.evaluate(ThreadLeakControl.java:468)
	at com.carrotsearch.randomizedtesting.RandomizedRunner.runSingleTest(RandomizedRunner.java:943)
	at com.carrotsearch.randomizedtesting.RandomizedRunner$5.evaluate(RandomizedRunner.java:829)
	at com.carrotsearch.randomizedtesting.RandomizedRunner$6.evaluate(RandomizedRunner.java:879)
	at com.carrotsearch.randomizedtesting.RandomizedRunner$7.evaluate(RandomizedRunner.java:890)
	at org.apache.lucene.util.AbstractBeforeAfterRule$1.evaluate(AbstractBeforeAfterRule.java:45)
	at com.carrotsearch.randomizedtesting.rules.StatementAdapter.evaluate(StatementAdapter.java:36)
	at org.apache.lucene.util.TestRuleStoreClassName$1.evaluate(TestRuleStoreClassName.java:41)
	at com.carrotsearch.randomizedtesting.rules.NoShadowingOrOverridesOnMethodsRule$1.evaluate(NoShadowingOrOverridesOnMethodsRule.java:40)
	at com.carrotsearch.randomizedtesting.rules.NoShadowingOrOverridesOnMethodsRule$1.evaluate(NoShadowingOrOverridesOnMethodsRule.java:40)
	at com.carrotsearch.randomizedtesting.rules.StatementAdapter.evaluate(StatementAdapter.java:36)
	at com.carrotsearch.randomizedtesting.rules.StatementAdapter.evaluate(StatementAdapter.java:36)
	at org.apache.lucene.util.TestRuleAssertionsRequired$1.evaluate(TestRuleAssertionsRequired.java:53)
	at org.apache.lucene.util.TestRuleMarkFailure$1.evaluate(TestRuleMarkFailure.java:47)
	at org.apache.lucene.util.TestRuleIgnoreAfterMaxFailures$1.evaluate(TestRuleIgnoreAfterMaxFailures.java:64)
	at org.apache.lucene.util.TestRuleIgnoreTestSuites$1.evaluate(TestRuleIgnoreTestSuites.java:54)
	at com.carrotsearch.randomizedtesting.rules.StatementAdapter.evaluate(StatementAdapter.java:36)
	at com.carrotsearch.randomizedtesting.ThreadLeakControl$StatementRunner.run(ThreadLeakControl.java:368)
	at java.base/java.lang.Thread.run(Thread.java:844)


FAILED:  org.apache.lucene.store.TestSimpleFSDirectory.testCreateOutputWithPendingDeletes

Error Message:
C:\Users\jenkins\workspace\Lucene-Solr-master-Windows\lucene\build\core\test\J1\temp\lucene.store.TestSimpleFSDirectory_976D3D73E4F3D4F1-002\tempDir-006\file.txt

Stack Trace:
java.nio.file.AccessDeniedException: C:\Users\jenkins\workspace\Lucene-Solr-master-Windows\lucene\build\core\test\J1\temp\lucene.store.TestSimpleFSDirectory_976D3D73E4F3D4F1-002\tempDir-006\file.txt
	at __randomizedtesting.SeedInfo.seed([976D3D73E4F3D4F1:BEC83E6C77D06BAD]:0)
	at java.base/sun.nio.fs.WindowsException.translateToIOException(WindowsException.java:89)
	at java.base/sun.nio.fs.WindowsException.rethrowAsIOException(WindowsException.java:103)
	at java.base/sun.nio.fs.WindowsException.rethrowAsIOException(WindowsException.java:108)
	at java.base/sun.nio.fs.WindowsFileAttributeViews$Basic.readAttributes(WindowsFileAttributeViews.java:53)
	at java.base/sun.nio.fs.WindowsFileAttributeViews$Basic.readAttributes(WindowsFileAttributeViews.java:38)
	at org.apache.lucene.mockfile.WindowsFS.getKey(WindowsFS.java:55)
	at org.apache.lucene.mockfile.WindowsFS.onClose(WindowsFS.java:77)
	at org.apache.lucene.mockfile.HandleTrackingFS$5.close(HandleTrackingFS.java:249)
	at org.apache.lucene.store.SimpleFSDirectory$SimpleFSIndexInput.close(SimpleFSDirectory.java:119)
	at org.apache.lucene.util.IOUtils.close(IOUtils.java:88)
	at org.apache.lucene.util.IOUtils.close(IOUtils.java:76)
	at org.apache.lucene.store.TestSimpleFSDirectory.testCreateOutputWithPendingDeletes(TestSimpleFSDirectory.java:78)
	at java.base/jdk.internal.reflect.NativeMethodAccessorImpl.invoke0(Native Method)
	at java.base/jdk.internal.reflect.NativeMethodAccessorImpl.invoke(NativeMethodAccessorImpl.java:62)
	at java.base/jdk.internal.reflect.DelegatingMethodAccessorImpl.invoke(DelegatingMethodAccessorImpl.java:43)
	at java.base/java.lang.reflect.Method.invoke(Method.java:564)
	at com.carrotsearch.randomizedtesting.RandomizedRunner.invoke(RandomizedRunner.java:1737)
	at com.carrotsearch.randomizedtesting.RandomizedRunner$8.evaluate(RandomizedRunner.java:934)
	at com.carrotsearch.randomizedtesting.RandomizedRunner$9.evaluate(RandomizedRunner.java:970)
	at com.carrotsearch.randomizedtesting.RandomizedRunner$10.evaluate(RandomizedRunner.java:984)
	at org.apache.lucene.util.TestRuleSetupTeardownChained$1.evaluate(TestRuleSetupTeardownChained.java:49)
	at org.apache.lucene.util.AbstractBeforeAfterRule$1.evaluate(AbstractBeforeAfterRule.java:45)
	at org.apache.lucene.util.TestRuleThreadAndTestName$1.evaluate(TestRuleThreadAndTestName.java:48)
	at org.apache.lucene.util.TestRuleIgnoreAfterMaxFailures$1.evaluate(TestRuleIgnoreAfterMaxFailures.java:64)
	at org.apache.lucene.util.TestRuleMarkFailure$1.evaluate(TestRuleMarkFailure.java:47)
	at com.carrotsearch.randomizedtesting.rules.StatementAdapter.evaluate(StatementAdapter.java:36)
	at com.carrotsearch.randomizedtesting.ThreadLeakControl$StatementRunner.run(ThreadLeakControl.java:368)
	at com.carrotsearch.randomizedtesting.ThreadLeakControl.forkTimeoutingTask(ThreadLeakControl.java:817)
	at com.carrotsearch.randomizedtesting.ThreadLeakControl$3.evaluate(ThreadLeakControl.java:468)
	at com.carrotsearch.randomizedtesting.RandomizedRunner.runSingleTest(RandomizedRunner.java:943)
	at com.carrotsearch.randomizedtesting.RandomizedRunner$5.evaluate(RandomizedRunner.java:829)
	at com.carrotsearch.randomizedtesting.RandomizedRunner$6.evaluate(RandomizedRunner.java:879)
	at com.carrotsearch.randomizedtesting.RandomizedRunner$7.evaluate(RandomizedRunner.java:890)
	at org.apache.lucene.util.AbstractBeforeAfterRule$1.evaluate(AbstractBeforeAfterRule.java:45)
	at com.carrotsearch.randomizedtesting.rules.StatementAdapter.evaluate(StatementAdapter.java:36)
	at org.apache.lucene.util.TestRuleStoreClassName$1.evaluate(TestRuleStoreClassName.java:41)
	at com.carrotsearch.randomizedtesting.rules.NoShadowingOrOverridesOnMethodsRule$1.evaluate(NoShadowingOrOverridesOnMethodsRule.java:40)
	at com.carrotsearch.randomizedtesting.rules.NoShadowingOrOverridesOnMethodsRule$1.evaluate(NoShadowingOrOverridesOnMethodsRule.java:40)
	at com.carrotsearch.randomizedtesting.rules.StatementAdapter.evaluate(StatementAdapter.java:36)
	at com.carrotsearch.randomizedtesting.rules.StatementAdapter.evaluate(StatementAdapter.java:36)
	at org.apache.lucene.util.TestRuleAssertionsRequired$1.evaluate(TestRuleAssertionsRequired.java:53)
	at org.apache.lucene.util.TestRuleMarkFailure$1.evaluate(TestRuleMarkFailure.java:47)
	at org.apache.lucene.util.TestRuleIgnoreAfterMaxFailures$1.evaluate(TestRuleIgnoreAfterMaxFailures.java:64)
	at org.apache.lucene.util.TestRuleIgnoreTestSuites$1.evaluate(TestRuleIgnoreTestSuites.java:54)
	at com.carrotsearch.randomizedtesting.rules.StatementAdapter.evaluate(StatementAdapter.java:36)
	at com.carrotsearch.randomizedtesting.ThreadLeakControl$StatementRunner.run(ThreadLeakControl.java:368)
	at java.base/java.lang.Thread.run(Thread.java:844)


FAILED:  org.apache.lucene.store.TestSimpleFSDirectory.testRenameWithPendingDeletes

Error Message:
C:\Users\jenkins\workspace\Lucene-Solr-master-Windows\lucene\build\core\test\J1\temp\lucene.store.TestSimpleFSDirectory_976D3D73E4F3D4F1-002\tempDir-011\source.txt -> C:\Users\jenkins\workspace\Lucene-Solr-master-Windows\lucene\build\core\test\J1\temp\lucene.store.TestSimpleFSDirectory_976D3D73E4F3D4F1-002\tempDir-011\target.txt

Stack Trace:
java.nio.file.AccessDeniedException: C:\Users\jenkins\workspace\Lucene-Solr-master-Windows\lucene\build\core\test\J1\temp\lucene.store.TestSimpleFSDirectory_976D3D73E4F3D4F1-002\tempDir-011\source.txt -> C:\Users\jenkins\workspace\Lucene-Solr-master-Windows\lucene\build\core\test\J1\temp\lucene.store.TestSimpleFSDirectory_976D3D73E4F3D4F1-002\tempDir-011\target.txt
	at __randomizedtesting.SeedInfo.seed([976D3D73E4F3D4F1:218C880F006588EB]:0)
	at java.base/sun.nio.fs.WindowsException.translateToIOException(WindowsException.java:89)
	at java.base/sun.nio.fs.WindowsException.rethrowAsIOException(WindowsException.java:103)
	at java.base/sun.nio.fs.WindowsFileCopy.move(WindowsFileCopy.java:298)
	at java.base/sun.nio.fs.WindowsFileSystemProvider.move(WindowsFileSystemProvider.java:288)
	at org.apache.lucene.mockfile.FilterFileSystemProvider.move(FilterFileSystemProvider.java:147)
	at org.apache.lucene.mockfile.FilterFileSystemProvider.move(FilterFileSystemProvider.java:147)
	at org.apache.lucene.mockfile.FilterFileSystemProvider.move(FilterFileSystemProvider.java:147)
	at org.apache.lucene.mockfile.FilterFileSystemProvider.move(FilterFileSystemProvider.java:147)
	at org.apache.lucene.mockfile.FilterFileSystemProvider.move(FilterFileSystemProvider.java:147)
	at org.apache.lucene.mockfile.FilterFileSystemProvider.move(FilterFileSystemProvider.java:147)
	at org.apache.lucene.mockfile.WindowsFS.move(WindowsFS.java:129)
	at java.base/java.nio.file.Files.move(Files.java:1413)
	at org.apache.lucene.store.FSDirectory.rename(FSDirectory.java:303)
	at org.apache.lucene.store.TestSimpleFSDirectory.testRenameWithPendingDeletes(TestSimpleFSDirectory.java:54)
	at java.base/jdk.internal.reflect.NativeMethodAccessorImpl.invoke0(Native Method)
	at java.base/jdk.internal.reflect.NativeMethodAccessorImpl.invoke(NativeMethodAccessorImpl.java:62)
	at java.base/jdk.internal.reflect.DelegatingMethodAccessorImpl.invoke(DelegatingMethodAccessorImpl.java:43)
	at java.base/java.lang.reflect.Method.invoke(Method.java:564)
	at com.carrotsearch.randomizedtesting.RandomizedRunner.invoke(RandomizedRunner.java:1737)
	at com.carrotsearch.randomizedtesting.RandomizedRunner$8.evaluate(RandomizedRunner.java:934)
	at com.carrotsearch.randomizedtesting.RandomizedRunner$9.evaluate(RandomizedRunner.java:970)
	at com.carrotsearch.randomizedtesting.RandomizedRunner$10.evaluate(RandomizedRunner.java:984)
	at org.apache.lucene.util.TestRuleSetupTeardownChained$1.evaluate(TestRuleSetupTeardownChained.java:49)
	at org.apache.lucene.util.AbstractBeforeAfterRule$1.evaluate(AbstractBeforeAfterRule.java:45)
	at org.apache.lucene.util.TestRuleThreadAndTestName$1.evaluate(TestRuleThreadAndTestName.java:48)
	at org.apache.lucene.util.TestRuleIgnoreAfterMaxFailures$1.evaluate(TestRuleIgnoreAfterMaxFailures.java:64)
	at org.apache.lucene.util.TestRuleMarkFailure$1.evaluate(TestRuleMarkFailure.java:47)
	at com.carrotsearch.randomizedtesting.rules.StatementAdapter.evaluate(StatementAdapter.java:36)
	at com.carrotsearch.randomizedtesting.ThreadLeakControl$StatementRunner.run(ThreadLeakControl.java:368)
	at com.carrotsearch.randomizedtesting.ThreadLeakControl.forkTimeoutingTask(ThreadLeakControl.java:817)
	at com.carrotsearch.randomizedtesting.ThreadLeakControl$3.evaluate(ThreadLeakControl.java:468)
	at com.carrotsearch.randomizedtesting.RandomizedRunner.runSingleTest(RandomizedRunner.java:943)
	at com.carrotsearch.randomizedtesting.RandomizedRunner$5.evaluate(RandomizedRunner.java:829)
	at com.carrotsearch.randomizedtesting.RandomizedRunner$6.evaluate(RandomizedRunner.java:879)
	at com.carrotsearch.randomizedtesting.RandomizedRunner$7.evaluate(RandomizedRunner.java:890)
	at org.apache.lucene.util.AbstractBeforeAfterRule$1.evaluate(AbstractBeforeAfterRule.java:45)
	at com.carrotsearch.randomizedtesting.rules.StatementAdapter.evaluate(StatementAdapter.java:36)
	at org.apache.lucene.util.TestRuleStoreClassName$1.evaluate(TestRuleStoreClassName.java:41)
	at com.carrotsearch.randomizedtesting.rules.NoShadowingOrOverridesOnMethodsRule$1.evaluate(NoShadowingOrOverridesOnMethodsRule.java:40)
	at com.carrotsearch.randomizedtesting.rules.NoShadowingOrOverridesOnMethodsRule$1.evaluate(NoShadowingOrOverridesOnMethodsRule.java:40)
	at com.carrotsearch.randomizedtesting.rules.StatementAdapter.evaluate(StatementAdapter.java:36)
	at com.carrotsearch.randomizedtesting.rules.StatementAdapter.evaluate(StatementAdapter.java:36)
	at org.apache.lucene.util.TestRuleAssertionsRequired$1.evaluate(TestRuleAssertionsRequired.java:53)
	at org.apache.lucene.util.TestRuleMarkFailure$1.evaluate(TestRuleMarkFailure.java:47)
	at org.apache.lucene.util.TestRuleIgnoreAfterMaxFailures$1.evaluate(TestRuleIgnoreAfterMaxFailures.java:64)
	at org.apache.lucene.util.TestRuleIgnoreTestSuites$1.evaluate(TestRuleIgnoreTestSuites.java:54)
	at com.carrotsearch.randomizedtesting.rules.StatementAdapter.evaluate(StatementAdapter.java:36)
	at com.carrotsearch.randomizedtesting.ThreadLeakControl$StatementRunner.run(ThreadLeakControl.java:368)
	at java.base/java.lang.Thread.run(Thread.java:844)


FAILED:  org.apache.lucene.store.TestSimpleFSDirectory.testCreateOutputWithPendingDeletes

Error Message:
C:\Users\jenkins\workspace\Lucene-Solr-master-Windows\lucene\build\core\test\J0\temp\lucene.store.TestSimpleFSDirectory_976D3D73E4F3D4F1-003\tempDir-006\file.txt

Stack Trace:
java.nio.file.AccessDeniedException: C:\Users\jenkins\workspace\Lucene-Solr-master-Windows\lucene\build\core\test\J0\temp\lucene.store.TestSimpleFSDirectory_976D3D73E4F3D4F1-003\tempDir-006\file.txt
	at __randomizedtesting.SeedInfo.seed([976D3D73E4F3D4F1:BEC83E6C77D06BAD]:0)
	at java.base/sun.nio.fs.WindowsException.translateToIOException(WindowsException.java:89)
	at java.base/sun.nio.fs.WindowsException.rethrowAsIOException(WindowsException.java:103)
	at java.base/sun.nio.fs.WindowsException.rethrowAsIOException(WindowsException.java:108)
	at java.base/sun.nio.fs.WindowsFileAttributeViews$Basic.readAttributes(WindowsFileAttributeViews.java:53)
	at java.base/sun.nio.fs.WindowsFileAttributeViews$Basic.readAttributes(WindowsFileAttributeViews.java:38)
	at org.apache.lucene.mockfile.WindowsFS.getKey(WindowsFS.java:55)
	at org.apache.lucene.mockfile.WindowsFS.onClose(WindowsFS.java:77)
	at org.apache.lucene.mockfile.HandleTrackingFS$5.close(HandleTrackingFS.java:249)
	at org.apache.lucene.store.SimpleFSDirectory$SimpleFSIndexInput.close(SimpleFSDirectory.java:119)
	at org.apache.lucene.util.IOUtils.close(IOUtils.java:88)
	at org.apache.lucene.util.IOUtils.close(IOUtils.java:76)
	at org.apache.lucene.store.TestSimpleFSDirectory.testCreateOutputWithPendingDeletes(TestSimpleFSDirectory.java:78)
	at java.base/jdk.internal.reflect.NativeMethodAccessorImpl.invoke0(Native Method)
	at java.base/jdk.internal.reflect.NativeMethodAccessorImpl.invoke(NativeMethodAccessorImpl.java:62)
	at java.base/jdk.internal.reflect.DelegatingMethodAccessorImpl.invoke(DelegatingMethodAccessorImpl.java:43)
	at java.base/java.lang.reflect.Method.invoke(Method.java:564)
	at com.carrotsearch.randomizedtesting.RandomizedRunner.invoke(RandomizedRunner.java:1737)
	at com.carrotsearch.randomizedtesting.RandomizedRunner$8.evaluate(RandomizedRunner.java:934)
	at com.carrotsearch.randomizedtesting.RandomizedRunner$9.evaluate(RandomizedRunner.java:970)
	at com.carrotsearch.randomizedtesting.RandomizedRunner$10.evaluate(RandomizedRunner.java:984)
	at org.apache.lucene.util.TestRuleSetupTeardownChained$1.evaluate(TestRuleSetupTeardownChained.java:49)
	at org.apache.lucene.util.AbstractBeforeAfterRule$1.evaluate(AbstractBeforeAfterRule.java:45)
	at org.apache.lucene.util.TestRuleThreadAndTestName$1.evaluate(TestRuleThreadAndTestName.java:48)
	at org.apache.lucene.util.TestRuleIgnoreAfterMaxFailures$1.evaluate(TestRuleIgnoreAfterMaxFailures.java:64)
	at org.apache.lucene.util.TestRuleMarkFailure$1.evaluate(TestRuleMarkFailure.java:47)
	at com.carrotsearch.randomizedtesting.rules.StatementAdapter.evaluate(StatementAdapter.java:36)
	at com.carrotsearch.randomizedtesting.ThreadLeakControl$StatementRunner.run(ThreadLeakControl.java:368)
	at com.carrotsearch.randomizedtesting.ThreadLeakControl.forkTimeoutingTask(ThreadLeakControl.java:817)
	at com.carrotsearch.randomizedtesting.ThreadLeakControl$3.evaluate(ThreadLeakControl.java:468)
	at com.carrotsearch.randomizedtesting.RandomizedRunner.runSingleTest(RandomizedRunner.java:943)
	at com.carrotsearch.randomizedtesting.RandomizedRunner$5.evaluate(RandomizedRunner.java:829)
	at com.carrotsearch.randomizedtesting.RandomizedRunner$6.evaluate(RandomizedRunner.java:879)
	at com.carrotsearch.randomizedtesting.RandomizedRunner$7.evaluate(RandomizedRunner.java:890)
	at org.apache.lucene.util.AbstractBeforeAfterRule$1.evaluate(AbstractBeforeAfterRule.java:45)
	at com.carrotsearch.randomizedtesting.rules.StatementAdapter.evaluate(StatementAdapter.java:36)
	at org.apache.lucene.util.TestRuleStoreClassName$1.evaluate(TestRuleStoreClassName.java:41)
	at com.carrotsearch.randomizedtesting.rules.NoShadowingOrOverridesOnMethodsRule$1.evaluate(NoShadowingOrOverridesOnMethodsRule.java:40)
	at com.carrotsearch.randomizedtesting.rules.NoShadowingOrOverridesOnMethodsRule$1.evaluate(NoShadowingOrOverridesOnMethodsRule.java:40)
	at com.carrotsearch.randomizedtesting.rules.StatementAdapter.evaluate(StatementAdapter.java:36)
	at com.carrotsearch.randomizedtesting.rules.StatementAdapter.evaluate(StatementAdapter.java:36)
	at org.apache.lucene.util.TestRuleAssertionsRequired$1.evaluate(TestRuleAssertionsRequired.java:53)
	at org.apache.lucene.util.TestRuleMarkFailure$1.evaluate(TestRuleMarkFailure.java:47)
	at org.apache.lucene.util.TestRuleIgnoreAfterMaxFailures$1.evaluate(TestRuleIgnoreAfterMaxFailures.java:64)
	at org.apache.lucene.util.TestRuleIgnoreTestSuites$1.evaluate(TestRuleIgnoreTestSuites.java:54)
	at com.carrotsearch.randomizedtesting.rules.StatementAdapter.evaluate(StatementAdapter.java:36)
	at com.carrotsearch.randomizedtesting.ThreadLeakControl$StatementRunner.run(ThreadLeakControl.java:368)
	at java.base/java.lang.Thread.run(Thread.java:844)


FAILED:  org.apache.lucene.store.TestSimpleFSDirectory.testCreateOutputWithPendingDeletes

Error Message:
C:\Users\jenkins\workspace\Lucene-Solr-master-Windows\lucene\build\core\test\J1\temp\lucene.store.TestSimpleFSDirectory_976D3D73E4F3D4F1-001\tempDir-006\file.txt

Stack Trace:
java.nio.file.AccessDeniedException: C:\Users\jenkins\workspace\Lucene-Solr-master-Windows\lucene\build\core\test\J1\temp\lucene.store.TestSimpleFSDirectory_976D3D73E4F3D4F1-001\tempDir-006\file.txt
	at __randomizedtesting.SeedInfo.seed([976D3D73E4F3D4F1:BEC83E6C77D06BAD]:0)
	at java.base/sun.nio.fs.WindowsException.translateToIOException(WindowsException.java:89)
	at java.base/sun.nio.fs.WindowsException.rethrowAsIOException(WindowsException.java:103)
	at java.base/sun.nio.fs.WindowsException.rethrowAsIOException(WindowsException.java:108)
	at java.base/sun.nio.fs.WindowsFileAttributeViews$Basic.readAttributes(WindowsFileAttributeViews.java:53)
	at java.base/sun.nio.fs.WindowsFileAttributeViews$Basic.readAttributes(WindowsFileAttributeViews.java:38)
	at org.apache.lucene.mockfile.WindowsFS.getKey(WindowsFS.java:55)
	at org.apache.lucene.mockfile.WindowsFS.onClose(WindowsFS.java:77)
	at org.apache.lucene.mockfile.HandleTrackingFS$5.close(HandleTrackingFS.java:249)
	at org.apache.lucene.store.SimpleFSDirectory$SimpleFSIndexInput.close(SimpleFSDirectory.java:119)
	at org.apache.lucene.util.IOUtils.close(IOUtils.java:88)
	at org.apache.lucene.util.IOUtils.close(IOUtils.java:76)
	at org.apache.lucene.store.TestSimpleFSDirectory.testCreateOutputWithPendingDeletes(TestSimpleFSDirectory.java:78)
	at java.base/jdk.internal.reflect.NativeMethodAccessorImpl.invoke0(Native Method)
	at java.base/jdk.internal.reflect.NativeMethodAccessorImpl.invoke(NativeMethodAccessorImpl.java:62)
	at java.base/jdk.internal.reflect.DelegatingMethodAccessorImpl.invoke(DelegatingMethodAccessorImpl.java:43)
	at java.base/java.lang.reflect.Method.invoke(Method.java:564)
	at com.carrotsearch.randomizedtesting.RandomizedRunner.invoke(RandomizedRunner.java:1737)
	at com.carrotsearch.randomizedtesting.RandomizedRunner$8.evaluate(RandomizedRunner.java:934)
	at com.carrotsearch.randomizedtesting.RandomizedRunner$9.evaluate(RandomizedRunner.java:970)
	at com.carrotsearch.randomizedtesting.RandomizedRunner$10.evaluate(RandomizedRunner.java:984)
	at org.apache.lucene.util.TestRuleSetupTeardownChained$1.evaluate(TestRuleSetupTeardownChained.java:49)
	at org.apache.lucene.util.AbstractBeforeAfterRule$1.evaluate(AbstractBeforeAfterRule.java:45)
	at org.apache.lucene.util.TestRuleThreadAndTestName$1.evaluate(TestRuleThreadAndTestName.java:48)
	at org.apache.lucene.util.TestRuleIgnoreAfterMaxFailures$1.evaluate(TestRuleIgnoreAfterMaxFailures.java:64)
	at org.apache.lucene.util.TestRuleMarkFailure$1.evaluate(TestRuleMarkFailure.java:47)
	at com.carrotsearch.randomizedtesting.rules.StatementAdapter.evaluate(StatementAdapter.java:36)
	at com.carrotsearch.randomizedtesting.ThreadLeakControl$StatementRunner.run(ThreadLeakControl.java:368)
	at com.carrotsearch.randomizedtesting.ThreadLeakControl.forkTimeoutingTask(ThreadLeakControl.java:817)
	at com.carrotsearch.randomizedtesting.ThreadLeakControl$3.evaluate(ThreadLeakControl.java:468)
	at com.carrotsearch.randomizedtesting.RandomizedRunner.runSingleTest(RandomizedRunner.java:943)
	at com.carrotsearch.randomizedtesting.RandomizedRunner$5.evaluate(RandomizedRunner.java:829)
	at com.carrotsearch.randomizedtesting.RandomizedRunner$6.evaluate(RandomizedRunner.java:879)
	at com.carrotsearch.randomizedtesting.RandomizedRunner$7.evaluate(RandomizedRunner.java:890)
	at org.apache.lucene.util.AbstractBeforeAfterRule$1.evaluate(AbstractBeforeAfterRule.java:45)
	at com.carrotsearch.randomizedtesting.rules.StatementAdapter.evaluate(StatementAdapter.java:36)
	at org.apache.lucene.util.TestRuleStoreClassName$1.evaluate(TestRuleStoreClassName.java:41)
	at com.carrotsearch.randomizedtesting.rules.NoShadowingOrOverridesOnMethodsRule$1.evaluate(NoShadowingOrOverridesOnMethodsRule.java:40)
	at com.carrotsearch.randomizedtesting.rules.NoShadowingOrOverridesOnMethodsRule$1.evaluate(NoShadowingOrOverridesOnMethodsRule.java:40)
	at com.carrotsearch.randomizedtesting.rules.StatementAdapter.evaluate(StatementAdapter.java:36)
	at com.carrotsearch.randomizedtesting.rules.StatementAdapter.evaluate(StatementAdapter.java:36)
	at org.apache.lucene.util.TestRuleAssertionsRequired$1.evaluate(TestRuleAssertionsRequired.java:53)
	at org.apache.lucene.util.TestRuleMarkFailure$1.evaluate(TestRuleMarkFailure.java:47)
	at org.apache.lucene.util.TestRuleIgnoreAfterMaxFailures$1.evaluate(TestRuleIgnoreAfterMaxFailures.java:64)
	at org.apache.lucene.util.TestRuleIgnoreTestSuites$1.evaluate(TestRuleIgnoreTestSuites.java:54)
	at com.carrotsearch.randomizedtesting.rules.StatementAdapter.evaluate(StatementAdapter.java:36)
	at com.carrotsearch.randomizedtesting.ThreadLeakControl$StatementRunner.run(ThreadLeakControl.java:368)
	at java.base/java.lang.Thread.run(Thread.java:844)


FAILED:  org.apache.lucene.store.TestSimpleFSDirectory.testRenameWithPendingDeletes

Error Message:
C:\Users\jenkins\workspace\Lucene-Solr-master-Windows\lucene\build\core\test\J1\temp\lucene.store.TestSimpleFSDirectory_976D3D73E4F3D4F1-001\tempDir-011\source.txt -> C:\Users\jenkins\workspace\Lucene-Solr-master-Windows\lucene\build\core\test\J1\temp\lucene.store.TestSimpleFSDirectory_976D3D73E4F3D4F1-001\tempDir-011\target.txt

Stack Trace:
java.nio.file.AccessDeniedException: C:\Users\jenkins\workspace\Lucene-Solr-master-Windows\lucene\build\core\test\J1\temp\lucene.store.TestSimpleFSDirectory_976D3D73E4F3D4F1-001\tempDir-011\source.txt -> C:\Users\jenkins\workspace\Lucene-Solr-master-Windows\lucene\build\core\test\J1\temp\lucene.store.TestSimpleFSDirectory_976D3D73E4F3D4F1-001\tempDir-011\target.txt
	at __randomizedtesting.SeedInfo.seed([976D3D73E4F3D4F1:218C880F006588EB]:0)
	at java.base/sun.nio.fs.WindowsException.translateToIOException(WindowsException.java:89)
	at java.base/sun.nio.fs.WindowsException.rethrowAsIOException(WindowsException.java:103)
	at java.base/sun.nio.fs.WindowsFileCopy.move(WindowsFileCopy.java:298)
	at java.base/sun.nio.fs.WindowsFileSystemProvider.move(WindowsFileSystemProvider.java:288)
	at org.apache.lucene.mockfile.FilterFileSystemProvider.move(FilterFileSystemProvider.java:147)
	at org.apache.lucene.mockfile.FilterFileSystemProvider.move(FilterFileSystemProvider.java:147)
	at org.apache.lucene.mockfile.FilterFileSystemProvider.move(FilterFileSystemProvider.java:147)
	at org.apache.lucene.mockfile.FilterFileSystemProvider.move(FilterFileSystemProvider.java:147)
	at org.apache.lucene.mockfile.FilterFileSystemProvider.move(FilterFileSystemProvider.java:147)
	at org.apache.lucene.mockfile.FilterFileSystemProvider.move(FilterFileSystemProvider.java:147)
	at org.apache.lucene.mockfile.WindowsFS.move(WindowsFS.java:129)
	at java.base/java.nio.file.Files.move(Files.java:1413)
	at org.apache.lucene.store.FSDirectory.rename(FSDirectory.java:303)
	at org.apache.lucene.store.TestSimpleFSDirectory.testRenameWithPendingDeletes(TestSimpleFSDirectory.java:54)
	at java.base/jdk.internal.reflect.NativeMethodAccessorImpl.invoke0(Native Method)
	at java.base/jdk.internal.reflect.NativeMethodAccessorImpl.invoke(NativeMethodAccessorImpl.java:62)
	at java.base/jdk.internal.reflect.DelegatingMethodAccessorImpl.invoke(DelegatingMethodAccessorImpl.java:43)
	at java.base/java.lang.reflect.Method.invoke(Method.java:564)
	at com.carrotsearch.randomizedtesting.RandomizedRunner.invoke(RandomizedRunner.java:1737)
	at com.carrotsearch.randomizedtesting.RandomizedRunner$8.evaluate(RandomizedRunner.java:934)
	at com.carrotsearch.randomizedtesting.RandomizedRunner$9.evaluate(RandomizedRunner.java:970)
	at com.carrotsearch.randomizedtesting.RandomizedRunner$10.evaluate(RandomizedRunner.java:984)
	at org.apache.lucene.util.TestRuleSetupTeardownChained$1.evaluate(TestRuleSetupTeardownChained.java:49)
	at org.apache.lucene.util.AbstractBeforeAfterRule$1.evaluate(AbstractBeforeAfterRule.java:45)
	at org.apache.lucene.util.TestRuleThreadAndTestName$1.evaluate(TestRuleThreadAndTestName.java:48)
	at org.apache.lucene.util.TestRuleIgnoreAfterMaxFailures$1.evaluate(TestRuleIgnoreAfterMaxFailures.java:64)
	at org.apache.lucene.util.TestRuleMarkFailure$1.evaluate(TestRuleMarkFailure.java:47)
	at com.carrotsearch.randomizedtesting.rules.StatementAdapter.evaluate(StatementAdapter.java:36)
	at com.carrotsearch.randomizedtesting.ThreadLeakControl$StatementRunner.run(ThreadLeakControl.java:368)
	at com.carrotsearch.randomizedtesting.ThreadLeakControl.forkTimeoutingTask(ThreadLeakControl.java:817)
	at com.carrotsearch.randomizedtesting.ThreadLeakControl$3.evaluate(ThreadLeakControl.java:468)
	at com.carrotsearch.randomizedtesting.RandomizedRunner.runSingleTest(RandomizedRunner.java:943)
	at com.carrotsearch.randomizedtesting.RandomizedRunner$5.evaluate(RandomizedRunner.java:829)
	at com.carrotsearch.randomizedtesting.RandomizedRunner$6.evaluate(RandomizedRunner.java:879)
	at com.carrotsearch.randomizedtesting.RandomizedRunner$7.evaluate(RandomizedRunner.java:890)
	at org.apache.lucene.util.AbstractBeforeAfterRule$1.evaluate(AbstractBeforeAfterRule.java:45)
	at com.carrotsearch.randomizedtesting.rules.StatementAdapter.evaluate(StatementAdapter.java:36)
	at org.apache.lucene.util.TestRuleStoreClassName$1.evaluate(TestRuleStoreClassName.java:41)
	at com.carrotsearch.randomizedtesting.rules.NoShadowingOrOverridesOnMethodsRule$1.evaluate(NoShadowingOrOverridesOnMethodsRule.java:40)
	at com.carrotsearch.randomizedtesting.rules.NoShadowingOrOverridesOnMethodsRule$1.evaluate(NoShadowingOrOverridesOnMethodsRule.java:40)
	at com.carrotsearch.randomizedtesting.rules.StatementAdapter.evaluate(StatementAdapter.java:36)
	at com.carrotsearch.randomizedtesting.rules.StatementAdapter.evaluate(StatementAdapter.java:36)
	at org.apache.lucene.util.TestRuleAssertionsRequired$1.evaluate(TestRuleAssertionsRequired.java:53)
	at org.apache.lucene.util.TestRuleMarkFailure$1.evaluate(TestRuleMarkFailure.java:47)
	at org.apache.lucene.util.TestRuleIgnoreAfterMaxFailures$1.evaluate(TestRuleIgnoreAfterMaxFailures.java:64)
	at org.apache.lucene.util.TestRuleIgnoreTestSuites$1.evaluate(TestRuleIgnoreTestSuites.java:54)
	at com.carrotsearch.randomizedtesting.rules.StatementAdapter.evaluate(StatementAdapter.java:36)
	at com.carrotsearch.randomizedtesting.ThreadLeakControl$StatementRunner.run(ThreadLeakControl.java:368)
	at java.base/java.lang.Thread.run(Thread.java:844)


FAILED:  org.apache.solr.cloud.autoscaling.IndexSizeTriggerTest.testTrigger

Error Message:
should have fired an event

Stack Trace:
java.lang.AssertionError: should have fired an event
	at __randomizedtesting.SeedInfo.seed([BD27A07E696D2F3B:DEEC96FCF0A25C16]:0)
	at org.junit.Assert.fail(Assert.java:93)
	at org.junit.Assert.assertTrue(Assert.java:43)
	at org.junit.Assert.assertNotNull(Assert.java:526)
	at org.apache.solr.cloud.autoscaling.IndexSizeTriggerTest.testTrigger(IndexSizeTriggerTest.java:184)
	at java.base/jdk.internal.reflect.NativeMethodAccessorImpl.invoke0(Native Method)
	at java.base/jdk.internal.reflect.NativeMethodAccessorImpl.invoke(NativeMethodAccessorImpl.java:62)
	at java.base/jdk.internal.reflect.DelegatingMethodAccessorImpl.invoke(DelegatingMethodAccessorImpl.java:43)
	at java.base/java.lang.reflect.Method.invoke(Method.java:564)
	at com.carrotsearch.randomizedtesting.RandomizedRunner.invoke(RandomizedRunner.java:1737)
	at com.carrotsearch.randomizedtesting.RandomizedRunner$8.evaluate(RandomizedRunner.java:934)
	at com.carrotsearch.randomizedtesting.RandomizedRunner$9.evaluate(RandomizedRunner.java:970)
	at com.carrotsearch.randomizedtesting.RandomizedRunner$10.evaluate(RandomizedRunner.java:984)
	at com.carrotsearch.randomizedtesting.rules.SystemPropertiesRestoreRule$1.evaluate(SystemPropertiesRestoreRule.java:57)
	at org.apache.lucene.util.TestRuleSetupTeardownChained$1.evaluate(TestRuleSetupTeardownChained.java:49)
	at org.apache.lucene.util.AbstractBeforeAfterRule$1.evaluate(AbstractBeforeAfterRule.java:45)
	at org.apache.lucene.util.TestRuleThreadAndTestName$1.evaluate(TestRuleThreadAndTestName.java:48)
	at org.apache.lucene.util.TestRuleIgnoreAfterMaxFailures$1.evaluate(TestRuleIgnoreAfterMaxFailures.java:64)
	at org.apache.lucene.util.TestRuleMarkFailure$1.evaluate(TestRuleMarkFailure.java:47)
	at com.carrotsearch.randomizedtesting.rules.StatementAdapter.evaluate(StatementAdapter.java:36)
	at com.carrotsearch.randomizedtesting.ThreadLeakControl$StatementRunner.run(ThreadLeakControl.java:368)
	at com.carrotsearch.randomizedtesting.ThreadLeakControl.forkTimeoutingTask(ThreadLeakControl.java:817)
	at com.carrotsearch.randomizedtesting.ThreadLeakControl$3.evaluate(ThreadLeakControl.java:468)
	at com.carrotsearch.randomizedtesting.RandomizedRunner.runSingleTest(RandomizedRunner.java:943)
	at com.carrotsearch.randomizedtesting.RandomizedRunner$5.evaluate(RandomizedRunner.java:829)
	at com.carrotsearch.randomizedtesting.RandomizedRunner$6.evaluate(RandomizedRunner.java:879)
	at com.carrotsearch.randomizedtesting.RandomizedRunner$7.evaluate(RandomizedRunner.java:890)
	at com.carrotsearch.randomizedtesting.rules.StatementAdapter.evaluate(StatementAdapter.java:36)
	at com.carrotsearch.randomizedtesting.rules.SystemPropertiesRestoreRule$1.evaluate(SystemPropertiesRestoreRule.java:57)
	at org.apache.lucene.util.AbstractBeforeAfterRule$1.evaluate(AbstractBeforeAfterRule.java:45)
	at com.carrotsearch.randomizedtesting.rules.StatementAdapter.evaluate(StatementAdapter.java:36)
	at org.apache.lucene.util.TestRuleStoreClassName$1.evaluate(TestRuleStoreClassName.java:41)
	at com.carrotsearch.randomizedtesting.rules.NoShadowingOrOverridesOnMethodsRule$1.evaluate(NoShadowingOrOverridesOnMethodsRule.java:40)
	at com.carrotsearch.randomizedtesting.rules.NoShadowingOrOverridesOnMethodsRule$1.evaluate(NoShadowingOrOverridesOnMethodsRule.java:40)
	at com.carrotsearch.randomizedtesting.rules.StatementAdapter.evaluate(StatementAdapter.java:36)
	at com.carrotsearch.randomizedtesting.rules.StatementAdapter.evaluate(StatementAdapter.java:36)
	at org.apache.lucene.util.TestRuleAssertionsRequired$1.evaluate(TestRuleAssertionsRequired.java:53)
	at org.apache.lucene.util.TestRuleMarkFailure$1.evaluate(TestRuleMarkFailure.java:47)
	at org.apache.lucene.util.TestRuleIgnoreAfterMaxFailures$1.evaluate(TestRuleIgnoreAfterMaxFailures.java:64)
	at org.apache.lucene.util.TestRuleIgnoreTestSuites$1.evaluate(TestRuleIgnoreTestSuites.java:54)
	at com.carrotsearch.randomizedtesting.rules.StatementAdapter.evaluate(StatementAdapter.java:36)
	at com.carrotsearch.randomizedtesting.ThreadLeakControl$StatementRunner.run(ThreadLeakControl.java:368)
	at java.base/java.lang.Thread.run(Thread.java:844)


FAILED:  org.apache.solr.cloud.autoscaling.IndexSizeTriggerTest.testSplitIntegration

Error Message:
did not finish processing in time

Stack Trace:
java.lang.AssertionError: did not finish processing in time
	at __randomizedtesting.SeedInfo.seed([BD27A07E696D2F3B:84A9193E4692E6C5]:0)
	at org.junit.Assert.fail(Assert.java:93)
	at org.junit.Assert.assertTrue(Assert.java:43)
	at org.apache.solr.cloud.autoscaling.IndexSizeTriggerTest.testSplitIntegration(IndexSizeTriggerTest.java:309)
	at java.base/jdk.internal.reflect.NativeMethodAccessorImpl.invoke0(Native Method)
	at java.base/jdk.internal.reflect.NativeMethodAccessorImpl.invoke(NativeMethodAccessorImpl.java:62)
	at java.base/jdk.internal.reflect.DelegatingMethodAccessorImpl.invoke(DelegatingMethodAccessorImpl.java:43)
	at java.base/java.lang.reflect.Method.invoke(Method.java:564)
	at com.carrotsearch.randomizedtesting.RandomizedRunner.invoke(RandomizedRunner.java:1737)
	at com.carrotsearch.randomizedtesting.RandomizedRunner$8.evaluate(RandomizedRunner.java:934)
	at com.carrotsearch.randomizedtesting.RandomizedRunner$9.evaluate(RandomizedRunner.java:970)
	at com.carrotsearch.randomizedtesting.RandomizedRunner$10.evaluate(RandomizedRunner.java:984)
	at com.carrotsearch.randomizedtesting.rules.SystemPropertiesRestoreRule$1.evaluate(SystemPropertiesRestoreRule.java:57)
	at org.apache.lucene.util.TestRuleSetupTeardownChained$1.evaluate(TestRuleSetupTeardownChained.java:49)
	at org.apache.lucene.util.AbstractBeforeAfterRule$1.evaluate(AbstractBeforeAfterRule.java:45)
	at org.apache.lucene.util.TestRuleThreadAndTestName$1.evaluate(TestRuleThreadAndTestName.java:48)
	at org.apache.lucene.util.TestRuleIgnoreAfterMaxFailures$1.evaluate(TestRuleIgnoreAfterMaxFailures.java:64)
	at org.apache.lucene.util.TestRuleMarkFailure$1.evaluate(TestRuleMarkFailure.java:47)
	at com.carrotsearch.randomizedtesting.rules.StatementAdapter.evaluate(StatementAdapter.java:36)
	at com.carrotsearch.randomizedtesting.ThreadLeakControl$StatementRunner.run(ThreadLeakControl.java:368)
	at com.carrotsearch.randomizedtesting.ThreadLeakControl.forkTimeoutingTask(ThreadLeakControl.java:817)
	at com.carrotsearch.randomizedtesting.ThreadLeakControl$3.evaluate(ThreadLeakControl.java:468)
	at com.carrotsearch.randomizedtesting.RandomizedRunner.runSingleTest(RandomizedRunner.java:943)
	at com.carrotsearch.randomizedtesting.RandomizedRunner$5.evaluate(RandomizedRunner.java:829)
	at com.carrotsearch.randomizedtesting.RandomizedRunner$6.evaluate(RandomizedRunner.java:879)
	at com.carrotsearch.randomizedtesting.RandomizedRunner$7.evaluate(RandomizedRunner.java:890)
	at com.carrotsearch.randomizedtesting.rules.StatementAdapter.evaluate(StatementAdapter.java:36)
	at com.carrotsearch.randomizedtesting.rules.SystemPropertiesRestoreRule$1.evaluate(SystemPropertiesRestoreRule.java:57)
	at org.apache.lucene.util.AbstractBeforeAfterRule$1.evaluate(AbstractBeforeAfterRule.java:45)
	at com.carrotsearch.randomizedtesting.rules.StatementAdapter.evaluate(StatementAdapter.java:36)
	at org.apache.lucene.util.TestRuleStoreClassName$1.evaluate(TestRuleStoreClassName.java:41)
	at com.carrotsearch.randomizedtesting.rules.NoShadowingOrOverridesOnMethodsRule$1.evaluate(NoShadowingOrOverridesOnMethodsRule.java:40)
	at com.carrotsearch.randomizedtesting.rules.NoShadowingOrOverridesOnMethodsRule$1.evaluate(NoShadowingOrOverridesOnMethodsRule.java:40)
	at com.carrotsearch.randomizedtesting.rules.StatementAdapter.evaluate(StatementAdapter.java:36)
	at com.carrotsearch.randomizedtesting.rules.StatementAdapter.evaluate(StatementAdapter.java:36)
	at org.apache.lucene.util.TestRuleAssertionsRequired$1.evaluate(TestRuleAssertionsRequired.java:53)
	at org.apache.lucene.util.TestRuleMarkFailure$1.evaluate(TestRuleMarkFailure.java:47)
	at org.apache.lucene.util.TestRuleIgnoreAfterMaxFailures$1.evaluate(TestRuleIgnoreAfterMaxFailures.java:64)
	at org.apache.lucene.util.TestRuleIgnoreTestSuites$1.evaluate(TestRuleIgnoreTestSuites.java:54)
	at com.carrotsearch.randomizedtesting.rules.StatementAdapter.evaluate(StatementAdapter.java:36)
	at com.carrotsearch.randomizedtesting.ThreadLeakControl$StatementRunner.run(ThreadLeakControl.java:368)
	at java.base/java.lang.Thread.run(Thread.java:844)


FAILED:  org.apache.solr.cloud.autoscaling.IndexSizeTriggerTest.testMergeIntegration

Error Message:
did not finish processing in time

Stack Trace:
java.lang.AssertionError: did not finish processing in time
	at __randomizedtesting.SeedInfo.seed([BD27A07E696D2F3B:EE9EE2CE8B7CBAC1]:0)
	at org.junit.Assert.fail(Assert.java:93)
	at org.junit.Assert.assertTrue(Assert.java:43)
	at org.apache.solr.cloud.autoscaling.IndexSizeTriggerTest.testMergeIntegration(IndexSizeTriggerTest.java:425)
	at java.base/jdk.internal.reflect.NativeMethodAccessorImpl.invoke0(Native Method)
	at java.base/jdk.internal.reflect.NativeMethodAccessorImpl.invoke(NativeMethodAccessorImpl.java:62)
	at java.base/jdk.internal.reflect.DelegatingMethodAccessorImpl.invoke(DelegatingMethodAccessorImpl.java:43)
	at java.base/java.lang.reflect.Method.invoke(Method.java:564)
	at com.carrotsearch.randomizedtesting.RandomizedRunner.invoke(RandomizedRunner.java:1737)
	at com.carrotsearch.randomizedtesting.RandomizedRunner$8.evaluate(RandomizedRunner.java:934)
	at com.carrotsearch.randomizedtesting.RandomizedRunner$9.evaluate(RandomizedRunner.java:970)
	at com.carrotsearch.randomizedtesting.RandomizedRunner$10.evaluate(RandomizedRunner.java:984)
	at com.carrotsearch.randomizedtesting.rules.SystemPropertiesRestoreRule$1.evaluate(SystemPropertiesRestoreRule.java:57)
	at org.apache.lucene.util.TestRuleSetupTeardownChained$1.evaluate(TestRuleSetupTeardownChained.java:49)
	at org.apache.lucene.util.AbstractBeforeAfterRule$1.evaluate(AbstractBeforeAfterRule.java:45)
	at org.apache.lucene.util.TestRuleThreadAndTestName$1.evaluate(TestRuleThreadAndTestName.java:48)
	at org.apache.lucene.util.TestRuleIgnoreAfterMaxFailures$1.evaluate(TestRuleIgnoreAfterMaxFailures.java:64)
	at org.apache.lucene.util.TestRuleMarkFailure$1.evaluate(TestRuleMarkFailure.java:47)
	at com.carrotsearch.randomizedtesting.rules.StatementAdapter.evaluate(StatementAdapter.java:36)
	at com.carrotsearch.randomizedtesting.ThreadLeakControl$StatementRunner.run(ThreadLeakControl.java:368)
	at com.carrotsearch.randomizedtesting.ThreadLeakControl.forkTimeoutingTask(ThreadLeakControl.java:817)
	at com.carrotsearch.randomizedtesting.ThreadLeakControl$3.evaluate(ThreadLeakControl.java:468)
	at com.carrotsearch.randomizedtesting.RandomizedRunner.runSingleTest(RandomizedRunner.java:943)
	at com.carrotsearch.randomizedtesting.RandomizedRunner$5.evaluate(RandomizedRunner.java:829)
	at com.carrotsearch.randomizedtesting.RandomizedRunner$6.evaluate(RandomizedRunner.java:879)
	at com.carrotsearch.randomizedtesting.RandomizedRunner$7.evaluate(RandomizedRunner.java:890)
	at com.carrotsearch.randomizedtesting.rules.StatementAdapter.evaluate(StatementAdapter.java:36)
	at com.carrotsearch.randomizedtesting.rules.SystemPropertiesRestoreRule$1.evaluate(SystemPropertiesRestoreRule.java:57)
	at org.apache.lucene.util.AbstractBeforeAfterRule$1.evaluate(AbstractBeforeAfterRule.java:45)
	at com.carrotsearch.randomizedtesting.rules.StatementAdapter.evaluate(StatementAdapter.java:36)
	at org.apache.lucene.util.TestRuleStoreClassName$1.evaluate(TestRuleStoreClassName.java:41)
	at com.carrotsearch.randomizedtesting.rules.NoShadowingOrOverridesOnMethodsRule$1.evaluate(NoShadowingOrOverridesOnMethodsRule.java:40)
	at com.carrotsearch.randomizedtesting.rules.NoShadowingOrOverridesOnMethodsRule$1.evaluate(NoShadowingOrOverridesOnMethodsRule.java:40)
	at com.carrotsearch.randomizedtesting.rules.StatementAdapter.evaluate(StatementAdapter.java:36)
	at com.carrotsearch.randomizedtesting.rules.StatementAdapter.evaluate(StatementAdapter.java:36)
	at org.apache.lucene.util.TestRuleAssertionsRequired$1.evaluate(TestRuleAssertionsRequired.java:53)
	at org.apache.lucene.util.TestRuleMarkFailure$1.evaluate(TestRuleMarkFailure.java:47)
	at org.apache.lucene.util.TestRuleIgnoreAfterMaxFailures$1.evaluate(TestRuleIgnoreAfterMaxFailures.java:64)
	at org.apache.lucene.util.TestRuleIgnoreTestSuites$1.evaluate(TestRuleIgnoreTestSuites.java:54)
	at com.carrotsearch.randomizedtesting.rules.StatementAdapter.evaluate(StatementAdapter.java:36)
	at com.carrotsearch.randomizedtesting.ThreadLeakControl$StatementRunner.run(ThreadLeakControl.java:368)
	at java.base/java.lang.Thread.run(Thread.java:844)


FAILED:  org.apache.solr.cloud.autoscaling.IndexSizeTriggerTest.testTrigger

Error Message:
should have fired an event

Stack Trace:
java.lang.AssertionError: should have fired an event
	at __randomizedtesting.SeedInfo.seed([BD27A07E696D2F3B:DEEC96FCF0A25C16]:0)
	at org.junit.Assert.fail(Assert.java:93)
	at org.junit.Assert.assertTrue(Assert.java:43)
	at org.junit.Assert.assertNotNull(Assert.java:526)
	at org.apache.solr.cloud.autoscaling.IndexSizeTriggerTest.testTrigger(IndexSizeTriggerTest.java:184)
	at java.base/jdk.internal.reflect.NativeMethodAccessorImpl.invoke0(Native Method)
	at java.base/jdk.internal.reflect.NativeMethodAccessorImpl.invoke(NativeMethodAccessorImpl.java:62)
	at java.base/jdk.internal.reflect.DelegatingMethodAccessorImpl.invoke(DelegatingMethodAccessorImpl.java:43)
	at java.base/java.lang.reflect.Method.invoke(Method.java:564)
	at com.carrotsearch.randomizedtesting.RandomizedRunner.invoke(RandomizedRunner.java:1737)
	at com.carrotsearch.randomizedtesting.RandomizedRunner$8.evaluate(RandomizedRunner.java:934)
	at com.carrotsearch.randomizedtesting.RandomizedRunner$9.evaluate(RandomizedRunner.java:970)
	at com.carrotsearch.randomizedtesting.RandomizedRunner$10.evaluate(RandomizedRunner.java:984)
	at com.carrotsearch.randomizedtesting.rules.SystemPropertiesRestoreRule$1.evaluate(SystemPropertiesRestoreRule.java:57)
	at org.apache.lucene.util.TestRuleSetupTeardownChained$1.evaluate(TestRuleSetupTeardownChained.java:49)
	at org.apache.lucene.util.AbstractBeforeAfterRule$1.evaluate(AbstractBeforeAfterRule.java:45)
	at org.apache.lucene.util.TestRuleThreadAndTestName$1.evaluate(TestRuleThreadAndTestName.java:48)
	at org.apache.lucene.util.TestRuleIgnoreAfterMaxFailures$1.evaluate(TestRuleIgnoreAfterMaxFailures.java:64)
	at org.apache.lucene.util.TestRuleMarkFailure$1.evaluate(TestRuleMarkFailure.java:47)
	at com.carrotsearch.randomizedtesting.rules.StatementAdapter.evaluate(StatementAdapter.java:36)
	at com.carrotsearch.randomizedtesting.ThreadLeakControl$StatementRunner.run(ThreadLeakControl.java:368)
	at com.carrotsearch.randomizedtesting.ThreadLeakControl.forkTimeoutingTask(ThreadLeakControl.java:817)
	at com.carrotsearch.randomizedtesting.ThreadLeakControl$3.evaluate(ThreadLeakControl.java:468)
	at com.carrotsearch.randomizedtesting.RandomizedRunner.runSingleTest(RandomizedRunner.java:943)
	at com.carrotsearch.randomizedtesting.RandomizedRunner$5.evaluate(RandomizedRunner.java:829)
	at com.carrotsearch.randomizedtesting.RandomizedRunner$6.evaluate(RandomizedRunner.java:879)
	at com.carrotsearch.randomizedtesting.RandomizedRunner$7.evaluate(RandomizedRunner.java:890)
	at com.carrotsearch.randomizedtesting.rules.StatementAdapter.evaluate(StatementAdapter.java:36)
	at com.carrotsearch.randomizedtesting.rules.SystemPropertiesRestoreRule$1.evaluate(SystemPropertiesRestoreRule.java:57)
	at org.apache.lucene.util.AbstractBeforeAfterRule$1.evaluate(AbstractBeforeAfterRule.java:45)
	at com.carrotsearch.randomizedtesting.rules.StatementAdapter.evaluate(StatementAdapter.java:36)
	at org.apache.lucene.util.TestRuleStoreClassName$1.evaluate(TestRuleStoreClassName.java:41)
	at com.carrotsearch.randomizedtesting.rules.NoShadowingOrOverridesOnMethodsRule$1.evaluate(NoShadowingOrOverridesOnMethodsRule.java:40)
	at com.carrotsearch.randomizedtesting.rules.NoShadowingOrOverridesOnMethodsRule$1.evaluate(NoShadowingOrOverridesOnMethodsRule.java:40)
	at com.carrotsearch.randomizedtesting.rules.StatementAdapter.evaluate(StatementAdapter.java:36)
	at com.carrotsearch.randomizedtesting.rules.StatementAdapter.evaluate(StatementAdapter.java:36)
	at org.apache.lucene.util.TestRuleAssertionsRequired$1.evaluate(TestRuleAssertionsRequired.java:53)
	at org.apache.lucene.util.TestRuleMarkFailure$1.evaluate(TestRuleMarkFailure.java:47)
	at org.apache.lucene.util.TestRuleIgnoreAfterMaxFailures$1.evaluate(TestRuleIgnoreAfterMaxFailures.java:64)
	at org.apache.lucene.util.TestRuleIgnoreTestSuites$1.evaluate(TestRuleIgnoreTestSuites.java:54)
	at com.carrotsearch.randomizedtesting.rules.StatementAdapter.evaluate(StatementAdapter.java:36)
	at com.carrotsearch.randomizedtesting.ThreadLeakControl$StatementRunner.run(ThreadLeakControl.java:368)
	at java.base/java.lang.Thread.run(Thread.java:844)


FAILED:  org.apache.solr.cloud.autoscaling.IndexSizeTriggerTest.testSplitIntegration

Error Message:
events: [CapturedEvent{timestamp=751722768587900, stage=STARTED, actionName='null', event={   "id":"2abaedb4959acTboy73r3pk5s75y1hnueckpe9i",   "source":"index_size_trigger2",   "eventTime":751717445097900,   "eventType":"INDEXSIZE",   "properties":{     "__start__":1,     "aboveSize":{"testSplitIntegration_collection":["{\"core_node1\":{\n    \"core\":\"testSplitIntegration_collection_shard1_replica_n1\",\n    \"leader\":\"true\",\n    \"SEARCHER.searcher.maxDoc\":25,\n    \"SEARCHER.searcher.deletedDocs\":0,\n    \"INDEX.sizeInBytes\":1,\n    \"__docs__\":25,\n    \"violationType\":\"aboveDocs\",\n    \"node_name\":\"127.0.0.1:10003_solr\",\n    \"state\":\"active\",\n    \"type\":\"NRT\",\n    \"SEARCHER.searcher.numDocs\":25,\n    \"__bytes__\":1,\n    \"shard\":\"shard1\",\n    \"collection\":\"testSplitIntegration_collection\"}}"]},     "belowSize":{},     "_enqueue_time_":751722691742900,     "requestedOps":["Op{action=SPLITSHARD, hints={COLL_SHARD=[{\n  \"first\":\"testSplitIntegration_collection\",\n  \"second\":\"shard1\"}]}}"]}}, context={}, config={   "trigger":"index_size_trigger2",   "stage":[     "STARTED",     "ABORTED",     "SUCCEEDED",     "FAILED"],   "afterAction":[     "compute_plan",     "execute_plan"],   "class":"org.apache.solr.cloud.autoscaling.IndexSizeTriggerTest$CapturingTriggerListener",   "beforeAction":[     "compute_plan",     "execute_plan"]}, message='null'}, CapturedEvent{timestamp=751724386427900, stage=BEFORE_ACTION, actionName='compute_plan', event={   "id":"2abaedb4959acTboy73r3pk5s75y1hnueckpe9i",   "source":"index_size_trigger2",   "eventTime":751717445097900,   "eventType":"INDEXSIZE",   "properties":{     "__start__":1,     "aboveSize":{"testSplitIntegration_collection":["{\"core_node1\":{\n    \"core\":\"testSplitIntegration_collection_shard1_replica_n1\",\n    \"leader\":\"true\",\n    \"SEARCHER.searcher.maxDoc\":25,\n    \"SEARCHER.searcher.deletedDocs\":0,\n    \"INDEX.sizeInBytes\":1,\n    \"__docs__\":25,\n    \"violationType\":\"aboveDocs\",\n    \"node_name\":\"127.0.0.1:10003_solr\",\n    \"state\":\"active\",\n    \"type\":\"NRT\",\n    \"SEARCHER.searcher.numDocs\":25,\n    \"__bytes__\":1,\n    \"shard\":\"shard1\",\n    \"collection\":\"testSplitIntegration_collection\"}}"]},     "belowSize":{},     "_enqueue_time_":751722691742900,     "requestedOps":["Op{action=SPLITSHARD, hints={COLL_SHARD=[{\n  \"first\":\"testSplitIntegration_collection\",\n  \"second\":\"shard1\"}]}}"]}}, context={properties.BEFORE_ACTION=[compute_plan], source=index_size_trigger2}, config={   "trigger":"index_size_trigger2",   "stage":[     "STARTED",     "ABORTED",     "SUCCEEDED",     "FAILED"],   "afterAction":[     "compute_plan",     "execute_plan"],   "class":"org.apache.solr.cloud.autoscaling.IndexSizeTriggerTest$CapturingTriggerListener",   "beforeAction":[     "compute_plan",     "execute_plan"]}, message='null'}, CapturedEvent{timestamp=751725553767900, stage=AFTER_ACTION, actionName='compute_plan', event={   "id":"2abaedb4959acTboy73r3pk5s75y1hnueckpe9i",   "source":"index_size_trigger2",   "eventTime":751717445097900,   "eventType":"INDEXSIZE",   "properties":{     "__start__":1,     "aboveSize":{"testSplitIntegration_collection":["{\"core_node1\":{\n    \"core\":\"testSplitIntegration_collection_shard1_replica_n1\",\n    \"leader\":\"true\",\n    \"SEARCHER.searcher.maxDoc\":25,\n    \"SEARCHER.searcher.deletedDocs\":0,\n    \"INDEX.sizeInBytes\":1,\n    \"__docs__\":25,\n    \"violationType\":\"aboveDocs\",\n    \"node_name\":\"127.0.0.1:10003_solr\",\n    \"state\":\"active\",\n    \"type\":\"NRT\",\n    \"SEARCHER.searcher.numDocs\":25,\n    \"__bytes__\":1,\n    \"shard\":\"shard1\",\n    \"collection\":\"testSplitIntegration_collection\"}}"]},     "belowSize":{},     "_enqueue_time_":751722691742900,     "requestedOps":["Op{action=SPLITSHARD, hints={COLL_SHARD=[{\n  \"first\":\"testSplitIntegration_collection\",\n  \"second\":\"shard1\"}]}}"]}}, context={properties.operations=[{class=org.apache.solr.client.solrj.request.CollectionAdminRequest$SplitShard, method=GET, params.action=SPLITSHARD, params.collection=testSplitIntegration_collection, params.shard=shard1}], properties.BEFORE_ACTION=[compute_plan], source=index_size_trigger2, properties.AFTER_ACTION=[compute_plan]}, config={   "trigger":"index_size_trigger2",   "stage":[     "STARTED",     "ABORTED",     "SUCCEEDED",     "FAILED"],   "afterAction":[     "compute_plan",     "execute_plan"],   "class":"org.apache.solr.cloud.autoscaling.IndexSizeTriggerTest$CapturingTriggerListener",   "beforeAction":[     "compute_plan",     "execute_plan"]}, message='null'}, CapturedEvent{timestamp=751725588922900, stage=BEFORE_ACTION, actionName='execute_plan', event={   "id":"2abaedb4959acTboy73r3pk5s75y1hnueckpe9i",   "source":"index_size_trigger2",   "eventTime":751717445097900,   "eventType":"INDEXSIZE",   "properties":{     "__start__":1,     "aboveSize":{"testSplitIntegration_collection":["{\"core_node1\":{\n    \"core\":\"testSplitIntegration_collection_shard1_replica_n1\",\n    \"leader\":\"true\",\n    \"SEARCHER.searcher.maxDoc\":25,\n    \"SEARCHER.searcher.deletedDocs\":0,\n    \"INDEX.sizeInBytes\":1,\n    \"__docs__\":25,\n    \"violationType\":\"aboveDocs\",\n    \"node_name\":\"127.0.0.1:10003_solr\",\n    \"state\":\"active\",\n    \"type\":\"NRT\",\n    \"SEARCHER.searcher.numDocs\":25,\n    \"__bytes__\":1,\n    \"shard\":\"shard1\",\n    \"collection\":\"testSplitIntegration_collection\"}}"]},     "belowSize":{},     "_enqueue_time_":751722691742900,     "requestedOps":["Op{action=SPLITSHARD, hints={COLL_SHARD=[{\n  \"first\":\"testSplitIntegration_collection\",\n  \"second\":\"shard1\"}]}}"]}}, context={properties.operations=[{class=org.apache.solr.client.solrj.request.CollectionAdminRequest$SplitShard, method=GET, params.action=SPLITSHARD, params.collection=testSplitIntegration_collection, params.shard=shard1}], properties.BEFORE_ACTION=[compute_plan, execute_plan], source=index_size_trigger2, properties.AFTER_ACTION=[compute_plan]}, config={   "trigger":"index_size_trigger2",   "stage":[     "STARTED",     "ABORTED",     "SUCCEEDED",     "FAILED"],   "afterAction":[     "compute_plan",     "execute_plan"],   "class":"org.apache.solr.cloud.autoscaling.IndexSizeTriggerTest$CapturingTriggerListener",   "beforeAction":[     "compute_plan",     "execute_plan"]}, message='null'}, CapturedEvent{timestamp=751733045187900, stage=AFTER_ACTION, actionName='execute_plan', event={   "id":"2abaedb4959acTboy73r3pk5s75y1hnueckpe9i",   "source":"index_size_trigger2",   "eventTime":751717445097900,   "eventType":"INDEXSIZE",   "properties":{     "__start__":1,     "aboveSize":{"testSplitIntegration_collection":["{\"core_node1\":{\n    \"core\":\"testSplitIntegration_collection_shard1_replica_n1\",\n    \"leader\":\"true\",\n    \"SEARCHER.searcher.maxDoc\":25,\n    \"SEARCHER.searcher.deletedDocs\":0,\n    \"INDEX.sizeInBytes\":1,\n    \"__docs__\":25,\n    \"violationType\":\"aboveDocs\",\n    \"node_name\":\"127.0.0.1:10003_solr\",\n    \"state\":\"active\",\n    \"type\":\"NRT\",\n    \"SEARCHER.searcher.numDocs\":25,\n    \"__bytes__\":1,\n    \"shard\":\"shard1\",\n    \"collection\":\"testSplitIntegration_collection\"}}"]},     "belowSize":{},     "_enqueue_time_":751722691742900,     "requestedOps":["Op{action=SPLITSHARD, hints={COLL_SHARD=[{\n  \"first\":\"testSplitIntegration_collection\",\n  \"second\":\"shard1\"}]}}"]}}, context={properties.operations=[{class=org.apache.solr.client.solrj.request.CollectionAdminRequest$SplitShard, method=GET, params.action=SPLITSHARD, params.async=index_size_trigger2/2abaedb4959acTboy73r3pk5s75y1hnueckpe9i/0, params.waitForFinalState=true, params.collection=testSplitIntegration_collection, params.shard=shard1}], properties.BEFORE_ACTION=[compute_plan, execute_plan], properties.responses=[{status={state=completed,msg=found [index_size_trigger2/2abaedb4959acTboy73r3pk5s75y1hnueckpe9i/0] in completed tasks},success=}], source=index_size_trigger2, properties.AFTER_ACTION=[compute_plan, execute_plan]}, config={   "trigger":"index_size_trigger2",   "stage":[     "STARTED",     "ABORTED",     "SUCCEEDED",     "FAILED"],   "afterAction":[     "compute_plan",     "execute_plan"],   "class":"org.apache.solr.cloud.autoscaling.IndexSizeTriggerTest$CapturingTriggerListener",   "beforeAction":[     "compute_plan",     "execute_plan"]}, message='null'}, CapturedEvent{timestamp=751733326837900, stage=SUCCEEDED, actionName='null', event={   "id":"2abaedb4959acTboy73r3pk5s75y1hnueckpe9i",   "source":"index_size_trigger2",   "eventTime":751717445097900,   "eventType":"INDEXSIZE",   "properties":{     "__start__":1,     "aboveSize":{"testSplitIntegration_collection":["{\"core_node1\":{\n    \"core\":\"testSplitIntegration_collection_shard1_replica_n1\",\n    \"leader\":\"true\",\n    \"SEARCHER.searcher.maxDoc\":25,\n    \"SEARCHER.searcher.deletedDocs\":0,\n    \"INDEX.sizeInBytes\":1,\n    \"__docs__\":25,\n    \"violationType\":\"aboveDocs\",\n    \"node_name\":\"127.0.0.1:10003_solr\",\n    \"state\":\"active\",\n    \"type\":\"NRT\",\n    \"SEARCHER.searcher.numDocs\":25,\n    \"__bytes__\":1,\n    \"shard\":\"shard1\",\n    \"collection\":\"testSplitIntegration_collection\"}}"]},     "belowSize":{},     "_enqueue_time_":751722691742900,     "requestedOps":["Op{action=SPLITSHARD, hints={COLL_SHARD=[{\n  \"first\":\"testSplitIntegration_collection\",\n  \"second\":\"shard1\"}]}}"]}}, context={}, config={   "trigger":"index_size_trigger2",   "stage":[     "STARTED",     "ABORTED",     "SUCCEEDED",     "FAILED"],   "afterAction":[     "compute_plan",     "execute_plan"],   "class":"org.apache.solr.cloud.autoscaling.IndexSizeTriggerTest$CapturingTriggerListener",   "beforeAction":[     "compute_plan",     "execute_plan"]}, message='null'}, CapturedEvent{timestamp=751743830417900, stage=STARTED, actionName='null', event={   "id":"2abb3df16af94Tboy73r3pk5s75y1hnueckpe9l",   "source":"index_size_trigger2",   "eventTime":751738983722900,   "eventType":"INDEXSIZE",   "properties":{     "__start__":1,     "aboveSize":{"testSplitIntegration_collection":["{\"core_node3\":{\n    \"core\":\"testSplitIntegration_collection_shard2_replica_n3\",\n    \"leader\":\"true\",\n    \"SEARCHER.searcher.maxDoc\":25,\n    \"SEARCHER.searcher.deletedDocs\":0,\n    \"INDEX.sizeInBytes\":1,\n    \"__docs__\":25,\n    \"violationType\":\"aboveDocs\",\n    \"node_name\":\"127.0.0.1:10003_solr\",\n    \"state\":\"active\",\n    \"type\":\"NRT\",\n    \"SEARCHER.searcher.numDocs\":25,\n    \"__bytes__\":1,\n    \"shard\":\"shard2\",\n    \"collection\":\"testSplitIntegration_collection\"}}"]},     "belowSize":{},     "_enqueue_time_":751743817792900,     "requestedOps":["Op{action=SPLITSHARD, hints={COLL_SHARD=[{\n  \"first\":\"testSplitIntegration_collection\",\n  \"second\":\"shard2\"}]}}"]}}, context={}, config={   "trigger":"index_size_trigger2",   "stage":[     "STARTED",     "ABORTED",     "SUCCEEDED",     "FAILED"],   "afterAction":[     "compute_plan",     "execute_plan"],   "class":"org.apache.solr.cloud.autoscaling.IndexSizeTriggerTest$CapturingTriggerListener",   "beforeAction":[     "compute_plan",     "execute_plan"]}, message='null'}, CapturedEvent{timestamp=751743917457900, stage=BEFORE_ACTION, actionName='compute_plan', event={   "id":"2abb3df16af94Tboy73r3pk5s75y1hnueckpe9l",   "source":"index_size_trigger2",   "eventTime":751738983722900,   "eventType":"INDEXSIZE",   "properties":{     "__start__":1,     "aboveSize":{"testSplitIntegration_collection":["{\"core_node3\":{\n    \"core\":\"testSplitIntegration_collection_shard2_replica_n3\",\n    \"leader\":\"true\",\n    \"SEARCHER.searcher.maxDoc\":25,\n    \"SEARCHER.searcher.deletedDocs\":0,\n    \"INDEX.sizeInBytes\":1,\n    \"__docs__\":25,\n    \"violationType\":\"aboveDocs\",\n    \"node_name\":\"127.0.0.1:10003_solr\",\n    \"state\":\"active\",\n    \"type\":\"NRT\",\n    \"SEARCHER.searcher.numDocs\":25,\n    \"__bytes__\":1,\n    \"shard\":\"shard2\",\n    \"collection\":\"testSplitIntegration_collection\"}}"]},     "belowSize":{},     "_enqueue_time_":751743817792900,     "requestedOps":["Op{action=SPLITSHARD, hints={COLL_SHARD=[{\n  \"first\":\"testSplitIntegration_collection\",\n  \"second\":\"shard2\"}]}}"]}}, context={properties.BEFORE_ACTION=[compute_plan], source=index_size_trigger2}, config={   "trigger":"index_size_trigger2",   "stage":[     "STARTED",     "ABORTED",     "SUCCEEDED",     "FAILED"],   "afterAction":[     "compute_plan",     "execute_plan"],   "class":"org.apache.solr.cloud.autoscaling.IndexSizeTriggerTest$CapturingTriggerListener",   "beforeAction":[     "compute_plan",     "execute_plan"]}, message='null'}, CapturedEvent{timestamp=751744004512900, stage=AFTER_ACTION, actionName='compute_plan', event={   "id":"2abb3df16af94Tboy73r3pk5s75y1hnueckpe9l",   "source":"index_size_trigger2",   "eventTime":751738983722900,   "eventType":"INDEXSIZE",   "properties":{     "__start__":1,     "aboveSize":{"testSplitIntegration_collection":["{\"core_node3\":{\n    \"core\":\"testSplitIntegration_collection_shard2_replica_n3\",\n    \"leader\":\"true\",\n    \"SEARCHER.searcher.maxDoc\":25,\n    \"SEARCHER.searcher.deletedDocs\":0,\n    \"INDEX.sizeInBytes\":1,\n    \"__docs__\":25,\n    \"violationType\":\"aboveDocs\",\n    \"node_name\":\"127.0.0.1:10003_solr\",\n    \"state\":\"active\",\n    \"type\":\"NRT\",\n    \"SEARCHER.searcher.numDocs\":25,\n    \"__bytes__\":1,\n    \"shard\":\"shard2\",\n    \"collection\":\"testSplitIntegration_collection\"}}"]},     "belowSize":{},     "_enqueue_time_":751743817792900,     "requestedOps":["Op{action=SPLITSHARD, hints={COLL_SHARD=[{\n  \"first\":\"testSplitIntegration_collection\",\n  \"second\":\"shard2\"}]}}"]}}, context={properties.operations=[{class=org.apache.solr.client.solrj.request.CollectionAdminRequest$SplitShard, method=GET, params.action=SPLITSHARD, params.collection=testSplitIntegration_collection, params.shard=shard2}], properties.BEFORE_ACTION=[compute_plan], source=index_size_trigger2, properties.AFTER_ACTION=[compute_plan]}, config={   "trigger":"index_size_trigger2",   "stage":[     "STARTED",     "ABORTED",     "SUCCEEDED",     "FAILED"],   "afterAction":[     "compute_plan",     "execute_plan"],   "class":"org.apache.solr.cloud.autoscaling.IndexSizeTriggerTest$CapturingTriggerListener",   "beforeAction":[     "compute_plan",     "execute_plan"]}, message='null'}, CapturedEvent{timestamp=751744021707900, stage=BEFORE_ACTION, actionName='execute_plan', event={   "id":"2abb3df16af94Tboy73r3pk5s75y1hnueckpe9l",   "source":"index_size_trigger2",   "eventTime":751738983722900,   "eventType":"INDEXSIZE",   "properties":{     "__start__":1,     "aboveSize":{"testSplitIntegration_collection":["{\"core_node3\":{\n    \"core\":\"testSplitIntegration_collection_shard2_replica_n3\",\n    \"leader\":\"true\",\n    \"SEARCHER.searcher.maxDoc\":25,\n    \"SEARCHER.searcher.deletedDocs\":0,\n    \"INDEX.sizeInBytes\":1,\n    \"__docs__\":25,\n    \"violationType\":\"aboveDocs\",\n    \"node_name\":\"127.0.0.1:10003_solr\",\n    \"state\":\"active\",\n    \"type\":\"NRT\",\n    \"SEARCHER.searcher.numDocs\":25,\n    \"__bytes__\":1,\n    \"shard\":\"shard2\",\n    \"collection\":\"testSplitIntegration_collection\"}}"]},     "belowSize":{},     "_enqueue_time_":751743817792900,     "requestedOps":["Op{action=SPLITSHARD, hints={COLL_SHARD=[{\n  \"first\":\"testSplitIntegration_collection\",\n  \"second\":\"shard2\"}]}}"]}}, context={properties.operations=[{class=org.apache.solr.client.solrj.request.CollectionAdminRequest$SplitShard, method=GET, params.action=SPLITSHARD, params.collection=testSplitIntegration_collection, params.shard=shard2}], properties.BEFORE_ACTION=[compute_plan, execute_plan], source=index_size_trigger2, properties.AFTER_ACTION=[compute_plan]}, config={   "trigger":"index_size_trigger2",   "stage":[     "STARTED",     "ABORTED",     "SUCCEEDED",     "FAILED"],   "afterAction":[     "compute_plan",     "execute_plan"],   "class":"org.apache.solr.cloud.autoscaling.IndexSizeTriggerTest$CapturingTriggerListener",   "beforeAction":[     "compute_plan",     "execute_plan"]}, message='null'}, CapturedEvent{timestamp=751751787047900, stage=AFTER_ACTION, actionName='execute_plan', event={   "id":"2abb3df16af94Tboy73r3pk5s75y1hnueckpe9l",   "source":"index_size_trigger2",   "eventTime":751738983722900,   "eventType":"INDEXSIZE",   "properties":{     "__start__":1,     "aboveSize":{"testSplitIntegration_collection":["{\"core_node3\":{\n    \"core\":\"testSplitIntegration_collection_shard2_replica_n3\",\n    \"leader\":\"true\",\n    \"SEARCHER.searcher.maxDoc\":25,\n    \"SEARCHER.searcher.deletedDocs\":0,\n    \"INDEX.sizeInBytes\":1,\n    \"__docs__\":25,\n    \"violationType\":\"aboveDocs\",\n    \"node_name\":\"127.0.0.1:10003_solr\",\n    \"state\":\"active\",\n    \"type\":\"NRT\",\n    \"SEARCHER.searcher.numDocs\":25,\n    \"__bytes__\":1,\n    \"shard\":\"shard2\",\n    \"collection\":\"testSplitIntegration_collection\"}}"]},     "belowSize":{},     "_enqueue_time_":751743817792900,     "requestedOps":["Op{action=SPLITSHARD, hints={COLL_SHARD=[{\n  \"first\":\"testSplitIntegration_collection\",\n  \"second\":\"shard2\"}]}}"]}}, context={properties.operations=[{class=org.apache.solr.client.solrj.request.CollectionAdminRequest$SplitShard, method=GET, params.action=SPLITSHARD, params.async=index_size_trigger2/2abb3df16af94Tboy73r3pk5s75y1hnueckpe9l/0, params.waitForFinalState=true, params.collection=testSplitIntegration_collection, params.shard=shard2}], properties.BEFORE_ACTION=[compute_plan, execute_plan], properties.responses=[{status={state=completed,msg=found [index_size_trigger2/2abb3df16af94Tboy73r3pk5s75y1hnueckpe9l/0] in completed tasks},success=}], source=index_size_trigger2, properties.AFTER_ACTION=[compute_plan, execute_plan]}, config={   "trigger":"index_size_trigger2",   "stage":[     "STARTED",     "ABORTED",     "SUCCEEDED",     "FAILED"],   "afterAction":[     "compute_plan",     "execute_plan"],   "class":"org.apache.solr.cloud.autoscaling.IndexSizeTriggerTest$CapturingTriggerListener",   "beforeAction":[     "compute_plan",     "execute_plan"]}, message='null'}, CapturedEvent{timestamp=751751865487900, stage=SUCCEEDED, actionName='null', event={   "id":"2abb3df16af94Tboy73r3pk5s75y1hnueckpe9l",   "source":"index_size_trigger2",   "eventTime":751738983722900,   "eventType":"INDEXSIZE",   "properties":{     "__start__":1,     "aboveSize":{"testSplitIntegration_collection":["{\"core_node3\":{\n    \"core\":\"testSplitIntegration_collection_shard2_replica_n3\",\n    \"leader\":\"true\",\n    \"SEARCHER.searcher.maxDoc\":25,\n    \"SEARCHER.searcher.deletedDocs\":0,\n    \"INDEX.sizeInBytes\":1,\n    \"__docs__\":25,\n    \"violationType\":\"aboveDocs\",\n    \"node_name\":\"127.0.0.1:10003_solr\",\n    \"state\":\"active\",\n    \"type\":\"NRT\",\n    \"SEARCHER.searcher.numDocs\":25,\n    \"__bytes__\":1,\n    \"shard\":\"shard2\",\n    \"collection\":\"testSplitIntegration_collection\"}}"]},     "belowSize":{},     "_enqueue_time_":751743817792900,     "requestedOps":["Op{action=SPLITSHARD, hints={COLL_SHARD=[{\n  \"first\":\"testSplitIntegration_collection\",\n  \"second\":\"shard2\"}]}}"]}}, context={}, config={   "trigger":"index_size_trigger2",   "stage":[     "STARTED",     "ABORTED",     "SUCCEEDED",     "FAILED"],   "afterAction":[     "compute_plan",     "execute_plan"],   "class":"org.apache.solr.cloud.autoscaling.IndexSizeTriggerTest$CapturingTriggerListener",   "beforeAction":[     "compute_plan",     "execute_plan"]}, message='null'}] expected:<6> but was:<12>

Stack Trace:
java.lang.AssertionError: events: [CapturedEvent{timestamp=751722768587900, stage=STARTED, actionName='null', event={
  "id":"2abaedb4959acTboy73r3pk5s75y1hnueckpe9i",
  "source":"index_size_trigger2",
  "eventTime":751717445097900,
  "eventType":"INDEXSIZE",
  "properties":{
    "__start__":1,
    "aboveSize":{"testSplitIntegration_collection":["{\"core_node1\":{\n    \"core\":\"testSplitIntegration_collection_shard1_replica_n1\",\n    \"leader\":\"true\",\n    \"SEARCHER.searcher.maxDoc\":25,\n    \"SEARCHER.searcher.deletedDocs\":0,\n    \"INDEX.sizeInBytes\":1,\n    \"__docs__\":25,\n    \"violationType\":\"aboveDocs\",\n    \"node_name\":\"127.0.0.1:10003_solr\",\n    \"state\":\"active\",\n    \"type\":\"NRT\",\n    \"SEARCHER.searcher.numDocs\":25,\n    \"__bytes__\":1,\n    \"shard\":\"shard1\",\n    \"collection\":\"testSplitIntegration_collection\"}}"]},
    "belowSize":{},
    "_enqueue_time_":751722691742900,
    "requestedOps":["Op{action=SPLITSHARD, hints={COLL_SHARD=[{\n  \"first\":\"testSplitIntegration_collection\",\n  \"second\":\"shard1\"}]}}"]}}, context={}, config={
  "trigger":"index_size_trigger2",
  "stage":[
    "STARTED",
    "ABORTED",
    "SUCCEEDED",
    "FAILED"],
  "afterAction":[
    "compute_plan",
    "execute_plan"],
  "class":"org.apache.solr.cloud.autoscaling.IndexSizeTriggerTest$CapturingTriggerListener",
  "beforeAction":[
    "compute_plan",
    "execute_plan"]}, message='null'}, CapturedEvent{timestamp=751724386427900, stage=BEFORE_ACTION, actionName='compute_plan', event={
  "id":"2abaedb4959acTboy73r3pk5s75y1hnueckpe9i",
  "source":"index_size_trigger2",
  "eventTime":751717445097900,
  "eventType":"INDEXSIZE",
  "properties":{
    "__start__":1,
    "aboveSize":{"testSplitIntegration_collection":["{\"core_node1\":{\n    \"core\":\"testSplitIntegration_collection_shard1_replica_n1\",\n    \"leader\":\"true\",\n    \"SEARCHER.searcher.maxDoc\":25,\n    \"SEARCHER.searcher.deletedDocs\":0,\n    \"INDEX.sizeInBytes\":1,\n    \"__docs__\":25,\n    \"violationType\":\"aboveDocs\",\n    \"node_name\":\"127.0.0.1:10003_solr\",\n    \"state\":\"active\",\n    \"type\":\"NRT\",\n    \"SEARCHER.searcher.numDocs\":25,\n    \"__bytes__\":1,\n    \"shard\":\"shard1\",\n    \"collection\":\"testSplitIntegration_collection\"}}"]},
    "belowSize":{},
    "_enqueue_time_":751722691742900,
    "requestedOps":["Op{action=SPLITSHARD, hints={COLL_SHARD=[{\n  \"first\":\"testSplitIntegration_collection\",\n  \"second\":\"shard1\"}]}}"]}}, context={properties.BEFORE_ACTION=[compute_plan], source=index_size_trigger2}, config={
  "trigger":"index_size_trigger2",
  "stage":[
    "STARTED",
    "ABORTED",
    "SUCCEEDED",
    "FAILED"],
  "afterAction":[
    "compute_plan",
    "execute_plan"],
  "class":"org.apache.solr.cloud.autoscaling.IndexSizeTriggerTest$CapturingTriggerListener",
  "beforeAction":[
    "compute_plan",
    "execute_plan"]}, message='null'}, CapturedEvent{timestamp=751725553767900, stage=AFTER_ACTION, actionName='compute_plan', event={
  "id":"2abaedb4959acTboy73r3pk5s75y1hnueckpe9i",
  "source":"index_size_trigger2",
  "eventTime":751717445097900,
  "eventType":"INDEXSIZE",
  "properties":{
    "__start__":1,
    "aboveSize":{"testSplitIntegration_collection":["{\"core_node1\":{\n    \"core\":\"testSplitIntegration_collection_shard1_replica_n1\",\n    \"leader\":\"true\",\n    \"SEARCHER.searcher.maxDoc\":25,\n    \"SEARCHER.searcher.deletedDocs\":0,\n    \"INDEX.sizeInBytes\":1,\n    \"__docs__\":25,\n    \"violationType\":\"aboveDocs\",\n    \"node_name\":\"127.0.0.1:10003_solr\",\n    \"state\":\"active\",\n    \"type\":\"NRT\",\n    \"SEARCHER.searcher.numDocs\":25,\n    \"__bytes__\":1,\n    \"shard\":\"shard1\",\n    \"collection\":\"testSplitIntegration_collection\"}}"]},
    "belowSize":{},
    "_enqueue_time_":751722691742900,
    "requestedOps":["Op{action=SPLITSHARD, hints={COLL_SHARD=[{\n  \"first\":\"testSplitIntegration_collection\",\n  \"second\":\"shard1\"}]}}"]}}, context={properties.operations=[{class=org.apache.solr.client.solrj.request.CollectionAdminRequest$SplitShard, method=GET, params.action=SPLITSHARD, params.collection=testSplitIntegration_collection, params.shard=shard1}], properties.BEFORE_ACTION=[compute_plan], source=index_size_trigger2, properties.AFTER_ACTION=[compute_plan]}, config={
  "trigger":"index_size_trigger2",
  "stage":[
    "STARTED",
    "ABORTED",
    "SUCCEEDED",
    "FAILED"],
  "afterAction":[
    "compute_plan",
    "execute_plan"],
  "class":"org.apache.solr.cloud.autoscaling.IndexSizeTriggerTest$CapturingTriggerListener",
  "beforeAction":[
    "compute_plan",
    "execute_plan"]}, message='null'}, CapturedEvent{timestamp=751725588922900, stage=BEFORE_ACTION, actionName='execute_plan', event={
  "id":"2abaedb4959acTboy73r3pk5s75y1hnueckpe9i",
  "source":"index_size_trigger2",
  "eventTime":751717445097900,
  "eventType":"INDEXSIZE",
  "properties":{
    "__start__":1,
    "aboveSize":{"testSplitIntegration_collection":["{\"core_node1\":{\n    \"core\":\"testSplitIntegration_collection_shard1_replica_n1\",\n    \"leader\":\"true\",\n    \"SEARCHER.searcher.maxDoc\":25,\n    \"SEARCHER.searcher.deletedDocs\":0,\n    \"INDEX.sizeInBytes\":1,\n    \"__docs__\":25,\n    \"violationType\":\"aboveDocs\",\n    \"node_name\":\"127.0.0.1:10003_solr\",\n    \"state\":\"active\",\n    \"type\":\"NRT\",\n    \"SEARCHER.searcher.numDocs\":25,\n    \"__bytes__\":1,\n    \"shard\":\"shard1\",\n    \"collection\":\"testSplitIntegration_collection\"}}"]},
    "belowSize":{},
    "_enqueue_time_":751722691742900,
    "requestedOps":["Op{action=SPLITSHARD, hints={COLL_SHARD=[{\n  \"first\":\"testSplitIntegration_collection\",\n  \"second\":\"shard1\"}]}}"]}}, context={properties.operations=[{class=org.apache.solr.client.solrj.request.CollectionAdminRequest$SplitShard, method=GET, params.action=SPLITSHARD, params.collection=testSplitIntegration_collection, params.shard=shard1}], pr

[...truncated too long message...]

.s.m.SolrMetricManager Closing metric reporters for registry=solr.jvm, tag=null
   [junit4]   2> 44767 INFO  (jetty-closer-43-thread-1) [    ] o.a.s.m.r.SolrJmxReporter Closing reporter [org.apache.solr.metrics.reporters.SolrJmxReporter@328e8b86: rootName = solr_50472, domain = solr.jvm, service url = null, agent id = null] for registry solr.jvm / com.codahale.metrics.MetricRegistry@4d4c7c5
   [junit4]   2> 44767 INFO  (jetty-closer-43-thread-1) [    ] o.a.s.m.SolrMetricManager Closing metric reporters for registry=solr.jetty, tag=null
   [junit4]   2> 44767 INFO  (jetty-closer-43-thread-1) [    ] o.a.s.m.r.SolrJmxReporter Closing reporter [org.apache.solr.metrics.reporters.SolrJmxReporter@101c93c8: rootName = solr_50472, domain = solr.jetty, service url = null, agent id = null] for registry solr.jetty / com.codahale.metrics.MetricRegistry@530a8f61
   [junit4]   2> 44786 INFO  (jetty-closer-43-thread-1) [    ] o.a.s.c.ZkController Remove node as live in ZooKeeper:/live_nodes/127.0.0.1:50472_solr
   [junit4]   2> 44786 INFO  (jetty-closer-43-thread-2) [    ] o.a.s.c.ZkController Remove node as live in ZooKeeper:/live_nodes/127.0.0.1:50467_solr
   [junit4]   2> 44788 INFO  (jetty-closer-43-thread-1) [    ] o.a.s.m.SolrMetricManager Closing metric reporters for registry=solr.cluster, tag=null
   [junit4]   2> 44788 INFO  (jetty-closer-43-thread-2) [    ] o.a.s.m.SolrMetricManager Closing metric reporters for registry=solr.cluster, tag=null
   [junit4]   2> 44795 INFO  (jetty-closer-43-thread-1) [    ] o.a.s.c.TransientSolrCoreCacheDefault Allocating transient cache for 2147483647 transient cores
   [junit4]   2> 44796 INFO  (zkCallback-60-thread-1) [    ] o.a.s.c.c.ZkStateReader Updated live nodes from ZooKeeper... (2) -> (0)
   [junit4]   2> 44796 INFO  (zkCallback-69-thread-1) [    ] o.a.s.c.c.ZkStateReader Updated live nodes from ZooKeeper... (2) -> (0)
   [junit4]   2> 44797 INFO  (zkCallback-58-thread-1) [    ] o.a.s.c.c.ZkStateReader Updated live nodes from ZooKeeper... (2) -> (0)
   [junit4]   2> 44797 INFO  (jetty-closer-43-thread-2) [    ] o.a.s.c.Overseer Overseer (id=72106826190684165-127.0.0.1:50467_solr-n_0000000000) closing
   [junit4]   2> 44806 WARN  (OverseerAutoScalingTriggerThread-72106826190684165-127.0.0.1:50467_solr-n_0000000000) [    ] o.a.s.c.a.OverseerTriggerThread OverseerTriggerThread woken up but we are closed, exiting.
   [junit4]   2> 44808 INFO  (OverseerStateUpdate-72106826190684165-127.0.0.1:50467_solr-n_0000000000) [    ] o.a.s.c.Overseer Overseer Loop exiting : 127.0.0.1:50467_solr
   [junit4]   2> 44810 DEBUG (jetty-closer-43-thread-2) [    ] o.a.s.c.a.ScheduledTriggers Shutting down scheduled thread pool executor now
   [junit4]   2> 44810 DEBUG (jetty-closer-43-thread-2) [    ] o.a.s.c.a.ScheduledTriggers Shutting down action executor now
   [junit4]   2> 44810 DEBUG (jetty-closer-43-thread-2) [    ] o.a.s.c.a.ScheduledTriggers Awaiting termination for action executor
   [junit4]   2> 44811 DEBUG (jetty-closer-43-thread-2) [    ] o.a.s.c.a.ScheduledTriggers Awaiting termination for scheduled thread pool executor
   [junit4]   2> 44811 INFO  (zkCallback-74-thread-1) [    ] o.a.s.c.c.ZkStateReader Updated live nodes from ZooKeeper... (2) -> (0)
   [junit4]   2> 44813 DEBUG (jetty-closer-43-thread-2) [    ] o.a.s.c.a.ScheduledTriggers ScheduledTriggers closed completely
   [junit4]   2> 44813 DEBUG (jetty-closer-43-thread-2) [    ] o.a.s.c.a.OverseerTriggerThread OverseerTriggerThread has been closed explicitly
   [junit4]   2> 44854 INFO  (jetty-closer-43-thread-1) [    ] o.e.j.s.h.ContextHandler Stopped o.e.j.s.ServletContextHandler@7e7c5121{/solr,null,UNAVAILABLE}
   [junit4]   2> 44854 INFO  (jetty-closer-43-thread-1) [    ] o.e.j.s.session node0 Stopped scavenging
   [junit4]   2> 44868 INFO  (jetty-closer-43-thread-2) [    ] o.e.j.s.h.ContextHandler Stopped o.e.j.s.ServletContextHandler@5bcc160{/solr,null,UNAVAILABLE}
   [junit4]   2> 44868 INFO  (jetty-closer-43-thread-2) [    ] o.e.j.s.session node0 Stopped scavenging
   [junit4]   2> 44871 ERROR (SUITE-IndexSizeTriggerTest-seed#[BD27A07E696D2F3B]-worker) [    ] o.a.z.s.ZooKeeperServer ZKShutdownHandler is not registered, so ZooKeeper server won't take any action on ERROR or SHUTDOWN server state changes
   [junit4]   2> 44872 INFO  (SUITE-IndexSizeTriggerTest-seed#[BD27A07E696D2F3B]-worker) [    ] o.a.s.c.ZkTestServer connecting to 127.0.0.1:50463 50463
   [junit4]   2> 44873 INFO  (Thread-21) [    ] o.a.s.c.ZkTestServer connecting to 127.0.0.1:50463 50463
   [junit4]   2> 44873 WARN  (Thread-21) [    ] o.a.s.c.ZkTestServer Watch limit violations: 
   [junit4]   2> Maximum concurrent create/delete watches above limit:
   [junit4]   2> 
   [junit4]   2> 	5	/solr/aliases.json
   [junit4]   2> 	5	/solr/clusterprops.json
   [junit4]   2> 	2	/solr/security.json
   [junit4]   2> 
   [junit4]   2> Maximum concurrent data watches above limit:
   [junit4]   2> 
   [junit4]   2> 	5	/solr/clusterstate.json
   [junit4]   2> 
   [junit4]   2> Maximum concurrent children watches above limit:
   [junit4]   2> 
   [junit4]   2> 	5	/solr/live_nodes
   [junit4]   2> 	5	/solr/collections
   [junit4]   2> 
   [junit4]   2> NOTE: leaving temporary files on disk at: C:\Users\jenkins\workspace\Lucene-Solr-master-Windows\solr\build\solr-core\test\J0\temp\solr.cloud.autoscaling.IndexSizeTriggerTest_BD27A07E696D2F3B-002
   [junit4]   2> May 17, 2018 1:49:47 PM com.carrotsearch.randomizedtesting.ThreadLeakControl checkThreadLeaks
   [junit4]   2> WARNING: Will linger awaiting termination of 5 leaked thread(s).
   [junit4]   2> NOTE: test params are: codec=Asserting(Lucene70): {}, docValues:{}, maxPointsInLeafNode=715, maxMBSortInHeap=5.919631261807018, sim=Asserting(org.apache.lucene.search.similarities.AssertingSimilarity@6eeab9eb), locale=en-FK, timezone=America/Maceio
   [junit4]   2> NOTE: Windows 10 10.0 amd64/Oracle Corporation 10 (64-bit)/cpus=3,threads=1,free=35578664,total=100663296
   [junit4]   2> NOTE: All tests run in this JVM: [IndexSizeTriggerTest, IndexSizeTriggerTest]
   [junit4] Completed [5/5 (4!)] on J0 in 8.22s, 4 tests, 3 failures <<< FAILURES!
   [junit4] 
   [junit4] 
   [junit4] Tests with failures [seed: BD27A07E696D2F3B]:
   [junit4]   - org.apache.solr.cloud.autoscaling.IndexSizeTriggerTest.testTrigger
   [junit4]   - org.apache.solr.cloud.autoscaling.IndexSizeTriggerTest.testTrigger
   [junit4]   - org.apache.solr.cloud.autoscaling.IndexSizeTriggerTest.testSplitIntegration
   [junit4]   - org.apache.solr.cloud.autoscaling.IndexSizeTriggerTest.testSplitIntegration
   [junit4]   - org.apache.solr.cloud.autoscaling.IndexSizeTriggerTest.testMergeIntegration
   [junit4]   - org.apache.solr.cloud.autoscaling.IndexSizeTriggerTest.testTrigger
   [junit4]   - org.apache.solr.cloud.autoscaling.IndexSizeTriggerTest.testTrigger
   [junit4]   - org.apache.solr.cloud.autoscaling.IndexSizeTriggerTest.testSplitIntegration
   [junit4]   - org.apache.solr.cloud.autoscaling.IndexSizeTriggerTest.testSplitIntegration
   [junit4]   - org.apache.solr.cloud.autoscaling.IndexSizeTriggerTest.testMergeIntegration
   [junit4] 
   [junit4] 
   [junit4] JVM J0:     1.79 ..    46.51 =    44.71s
   [junit4] JVM J1:     1.79 ..    44.56 =    42.76s
   [junit4] Execution time total: 46 seconds
   [junit4] Tests summary: 5 suites, 20 tests, 10 failures, 5 ignored (1 assumption)

BUILD FAILED
C:\Users\jenkins\workspace\Lucene-Solr-master-Windows\lucene\common-build.xml:1568: The following error occurred while executing this line:
C:\Users\jenkins\workspace\Lucene-Solr-master-Windows\lucene\common-build.xml:1092: There were test failures: 5 suites, 20 tests, 10 failures, 5 ignored (1 assumption) [seed: BD27A07E696D2F3B]

Total time: 51 seconds

[repro] Setting last failure code to 1

[repro] Failures:
[repro]   4/5 failed: org.apache.solr.cloud.autoscaling.IndexSizeTriggerTest
[repro]   5/5 failed: org.apache.lucene.store.TestSimpleFSDirectory
[repro] Exiting with code 1

C:\Users\jenkins\workspace\Lucene-Solr-master-Windows>IF EXIST lucene\build move /y lucene\build lucene\build.repro 
        1 dir(s) moved.

C:\Users\jenkins\workspace\Lucene-Solr-master-Windows>IF EXIST solr\build move /y solr\build solr\build.repro 
        1 dir(s) moved.

C:\Users\jenkins\workspace\Lucene-Solr-master-Windows>IF EXIST lucene\build.orig move /y lucene\build.orig lucene\build 
        1 dir(s) moved.

C:\Users\jenkins\workspace\Lucene-Solr-master-Windows>IF EXIST solr\build.orig move /y solr\build.orig solr\build 
        1 dir(s) moved.

C:\Users\jenkins\workspace\Lucene-Solr-master-Windows>exit 0 
Archiving artifacts
Setting ANT_1_8_2_HOME=C:\Users\jenkins\tools\hudson.tasks.Ant_AntInstallation\ANT_1.8.2
[WARNINGS] Parsing warnings in console log with parser Java Compiler (javac)
Setting ANT_1_8_2_HOME=C:\Users\jenkins\tools\hudson.tasks.Ant_AntInstallation\ANT_1.8.2
Setting ANT_1_8_2_HOME=C:\Users\jenkins\tools\hudson.tasks.Ant_AntInstallation\ANT_1.8.2
<Git Blamer> Using GitBlamer to create author and commit information for all warnings.
<Git Blamer> GIT_COMMIT=88f8718f1bfe0e5aeddc6f960cc74513a89c0610, workspace=C:\Users\jenkins\workspace\Lucene-Solr-master-Windows
[WARNINGS] Computing warning deltas based on reference build #7319
Recording test results
Setting ANT_1_8_2_HOME=C:\Users\jenkins\tools\hudson.tasks.Ant_AntInstallation\ANT_1.8.2
Build step 'Publish JUnit test result report' changed build result to UNSTABLE
Email was triggered for: Unstable (Test Failures)
Sending email for trigger: Unstable (Test Failures)
Setting ANT_1_8_2_HOME=C:\Users\jenkins\tools\hudson.tasks.Ant_AntInstallation\ANT_1.8.2
Setting ANT_1_8_2_HOME=C:\Users\jenkins\tools\hudson.tasks.Ant_AntInstallation\ANT_1.8.2
Setting ANT_1_8_2_HOME=C:\Users\jenkins\tools\hudson.tasks.Ant_AntInstallation\ANT_1.8.2
Setting ANT_1_8_2_HOME=C:\Users\jenkins\tools\hudson.tasks.Ant_AntInstallation\ANT_1.8.2

Mime
View raw message